The Swift Package Index logo.Swift Package Index

Track the adoption of Swift 6 strict concurrency checks for data race safety. How many packages are Ready for Swift 6?

Build Information

Failed to build KoalaActivityIndicator, reference 1.0.6 (96bc29), with Swift 6.1 for macOS (SPM) on 26 Apr 2025 09:46:36 UTC.

Build Command

env DEVELOPER_DIR=/Applications/Xcode-16.3.0.app xcrun swift build --arch arm64

Build Log

========================================
RunAll
========================================
Builder version: 4.61.0
Interrupt handler set up.
========================================
Checkout
========================================
Clone URL: https://github.com/Rajaikumar-iOSDev/KoalaActivityIndicator.git
Reference: 1.0.6
Initialized empty Git repository in /Users/admin/builder/spi-builder-workspace/.git/
From https://github.com/Rajaikumar-iOSDev/KoalaActivityIndicator
 * tag               1.0.6      -> FETCH_HEAD
HEAD is now at 96bc29c Merge remote-tracking branch 'refs/remotes/origin/main'
Cloned https://github.com/Rajaikumar-iOSDev/KoalaActivityIndicator.git
Revision (git rev-parse @):
96bc29c67e1e6d6a1a850c51961cbbfc649fdfda
SUCCESS checkout https://github.com/Rajaikumar-iOSDev/KoalaActivityIndicator.git at 1.0.6
========================================
ResolveProductDependencies
========================================
Resolving dependencies ...
{
  "identity": ".resolve-product-dependencies",
  "name": "resolve-dependencies",
  "url": "/Users/admin/builder/spi-builder-workspace/.resolve-product-dependencies",
  "version": "unspecified",
  "path": "/Users/admin/builder/spi-builder-workspace/.resolve-product-dependencies",
  "dependencies": [
    {
      "identity": "koalaactivityindicator",
      "name": "KoalaActivityIndicator",
      "url": "https://github.com/Rajaikumar-iOSDev/KoalaActivityIndicator.git",
      "version": "unspecified",
      "path": "/Users/admin/builder/spi-builder-workspace/.resolve-product-dependencies/.build/checkouts/KoalaActivityIndicator",
      "dependencies": [
      ]
    }
  ]
}
Fetching https://github.com/Rajaikumar-iOSDev/KoalaActivityIndicator.git
[1/111] Fetching koalaactivityindicator
Fetched https://github.com/Rajaikumar-iOSDev/KoalaActivityIndicator.git from cache (0.74s)
Creating working copy for https://github.com/Rajaikumar-iOSDev/KoalaActivityIndicator.git
Working copy of https://github.com/Rajaikumar-iOSDev/KoalaActivityIndicator.git resolved at 1.0.6 (96bc29c)
warning: '.resolve-product-dependencies': dependency 'koalaactivityindicator' is not used by any target
Found 0 product dependencies
========================================
Build
========================================
Selected platform:         macosSpm
Swift version:             6.1
Building package at path:  $PWD
https://github.com/Rajaikumar-iOSDev/KoalaActivityIndicator.git
https://github.com/Rajaikumar-iOSDev/KoalaActivityIndicator.git
{
  "dependencies" : [
  ],
  "manifest_display_name" : "KoalaActivityIndicator",
  "name" : "KoalaActivityIndicator",
  "path" : "/Users/admin/builder/spi-builder-workspace",
  "platforms" : [
  ],
  "products" : [
    {
      "name" : "KoalaActivityIndicator",
      "targets" : [
        "KoalaActivityIndicator"
      ],
      "type" : {
        "library" : [
          "automatic"
        ]
      }
    }
  ],
  "targets" : [
    {
      "c99name" : "KoalaActivityIndicator",
      "module_type" : "SwiftTarget",
      "name" : "KoalaActivityIndicator",
      "path" : "Sources/KoalaActivityIndicator",
      "product_memberships" : [
        "KoalaActivityIndicator"
      ],
      "resources" : [
        {
          "path" : "/Users/admin/builder/spi-builder-workspace/Sources/KoalaActivityIndicator/Koala Assets.xcassets",
          "rule" : {
            "process" : {
            }
          }
        }
      ],
      "sources" : [
        "KoalaLoaderView.swift",
        "KoalaScene.swift"
      ],
      "type" : "library"
    }
  ],
  "tools_version" : "5.3"
}
Running build ...
env DEVELOPER_DIR=/Applications/Xcode-16.3.0.app xcrun swift build --arch arm64 -Xswiftc -Xfrontend -Xswiftc -stats-output-dir -Xswiftc -Xfrontend -Xswiftc .stats -Xswiftc -strict-concurrency=complete -Xswiftc -enable-upcoming-feature -Xswiftc StrictConcurrency -Xswiftc -enable-upcoming-feature -Xswiftc DisableOutwardActorInference -Xswiftc -enable-upcoming-feature -Xswiftc GlobalActorIsolatedTypesUsability -Xswiftc -enable-upcoming-feature -Xswiftc InferSendableFromCaptures
Building for debugging...
[0/3] Write sources
[1/3] Copying Koala Assets.xcassets
[2/3] Write swift-version-2F0A5646E1D333AE.txt
[4/7] Compiling KoalaActivityIndicator resource_bundle_accessor.swift
/Users/admin/builder/spi-builder-workspace/Sources/KoalaActivityIndicator/KoalaLoaderView.swift:9:8: error: no such module 'UIKit'
 7 |
 8 | import Foundation
 9 | import UIKit
   |        `- error: no such module 'UIKit'
10 | import SpriteKit
11 | public class KoalaLoaderView:SKView{
[5/7] Compiling KoalaActivityIndicator KoalaScene.swift
/Users/admin/builder/spi-builder-workspace/Sources/KoalaActivityIndicator/KoalaLoaderView.swift:9:8: error: no such module 'UIKit'
 7 |
 8 | import Foundation
 9 | import UIKit
   |        `- error: no such module 'UIKit'
10 | import SpriteKit
11 | public class KoalaLoaderView:SKView{
error: emit-module command failed with exit code 1 (use -v to see invocation)
[6/7] Emitting module KoalaActivityIndicator
/Users/admin/builder/spi-builder-workspace/Sources/KoalaActivityIndicator/KoalaLoaderView.swift:9:8: error: no such module 'UIKit'
 7 |
 8 | import Foundation
 9 | import UIKit
   |        `- error: no such module 'UIKit'
10 | import SpriteKit
11 | public class KoalaLoaderView:SKView{
[7/7] Compiling KoalaActivityIndicator KoalaLoaderView.swift
/Users/admin/builder/spi-builder-workspace/Sources/KoalaActivityIndicator/KoalaLoaderView.swift:9:8: error: no such module 'UIKit'
 7 |
 8 | import Foundation
 9 | import UIKit
   |        `- error: no such module 'UIKit'
10 | import SpriteKit
11 | public class KoalaLoaderView:SKView{
Running build ...
env DEVELOPER_DIR=/Applications/Xcode-16.3.0.app xcrun swift build --arch arm64
[0/1] Planning build
Building for debugging...
[0/1] Write swift-version-2F0A5646E1D333AE.txt
[2/5] Compiling KoalaActivityIndicator resource_bundle_accessor.swift
/Users/admin/builder/spi-builder-workspace/Sources/KoalaActivityIndicator/KoalaLoaderView.swift:9:8: error: no such module 'UIKit'
 7 |
 8 | import Foundation
 9 | import UIKit
   |        `- error: no such module 'UIKit'
10 | import SpriteKit
11 | public class KoalaLoaderView:SKView{
[3/5] Compiling KoalaActivityIndicator KoalaScene.swift
/Users/admin/builder/spi-builder-workspace/Sources/KoalaActivityIndicator/KoalaLoaderView.swift:9:8: error: no such module 'UIKit'
 7 |
 8 | import Foundation
 9 | import UIKit
   |        `- error: no such module 'UIKit'
10 | import SpriteKit
11 | public class KoalaLoaderView:SKView{
error: emit-module command failed with exit code 1 (use -v to see invocation)
[4/5] Emitting module KoalaActivityIndicator
/Users/admin/builder/spi-builder-workspace/Sources/KoalaActivityIndicator/KoalaLoaderView.swift:9:8: error: no such module 'UIKit'
 7 |
 8 | import Foundation
 9 | import UIKit
   |        `- error: no such module 'UIKit'
10 | import SpriteKit
11 | public class KoalaLoaderView:SKView{
[5/5] Compiling KoalaActivityIndicator KoalaLoaderView.swift
/Users/admin/builder/spi-builder-workspace/Sources/KoalaActivityIndicator/KoalaLoaderView.swift:9:8: error: no such module 'UIKit'
 7 |
 8 | import Foundation
 9 | import UIKit
   |        `- error: no such module 'UIKit'
10 | import SpriteKit
11 | public class KoalaLoaderView:SKView{
BUILD FAILURE 6.1 macosSpm