The Swift Package Index logo.Swift Package Index

Track the adoption of Swift 6 strict concurrency checks for data race safety. How many packages are Ready for Swift 6?

Build Information

Failed to build RemoteImage, reference 0.3.0 (7aa6d7), with Swift 6.1 for macOS (Xcode) using Xcode 16.3 on 28 Apr 2025 02:44:32 UTC.

Build Command

env DEVELOPER_DIR=/Applications/Xcode-16.3.0.app xcrun xcodebuild -IDEClonedSourcePackagesDirPathOverride=$PWD/.dependencies -skipMacroValidation -skipPackagePluginValidation -derivedDataPath $PWD/.derivedData build -scheme RemoteImage -destination platform=macOS,arch=arm64

Build Log

========================================
RunAll
========================================
Builder version: 4.61.0
Interrupt handler set up.
========================================
Checkout
========================================
Clone URL: https://github.com/insub4067/RemoteImage.git
Reference: 0.3.0
Initialized empty Git repository in /Users/admin/builder/spi-builder-workspace/.git/
From https://github.com/insub4067/RemoteImage
 * tag               0.3.0      -> FETCH_HEAD
HEAD is now at 7aa6d7a refactor : CacheManager class -> actor
Cloned https://github.com/insub4067/RemoteImage.git
Revision (git rev-parse @):
7aa6d7a252b49c9a4385fd8ce9b7e2b05a70397f
SUCCESS checkout https://github.com/insub4067/RemoteImage.git at 0.3.0
========================================
Build
========================================
Selected platform:         macosXcodebuild
Swift version:             6.1
Building package at path:  $PWD
https://github.com/insub4067/RemoteImage.git
https://github.com/insub4067/RemoteImage.git
{
  "dependencies" : [
  ],
  "manifest_display_name" : "RemoteImage",
  "name" : "RemoteImage",
  "path" : "/Users/admin/builder/spi-builder-workspace",
  "platforms" : [
    {
      "name" : "ios",
      "version" : "15.0"
    }
  ],
  "products" : [
    {
      "name" : "RemoteImage",
      "targets" : [
        "RemoteImage"
      ],
      "type" : {
        "library" : [
          "automatic"
        ]
      }
    }
  ],
  "targets" : [
    {
      "c99name" : "RemoteImageTests",
      "module_type" : "SwiftTarget",
      "name" : "RemoteImageTests",
      "path" : "Tests/RemoteImageTests",
      "sources" : [
        "RemoteImageTests.swift"
      ],
      "target_dependencies" : [
        "RemoteImage"
      ],
      "type" : "test"
    },
    {
      "c99name" : "RemoteImage",
      "module_type" : "SwiftTarget",
      "name" : "RemoteImage",
      "path" : "Sources/RemoteImage",
      "product_memberships" : [
        "RemoteImage"
      ],
      "sources" : [
        "CacheManager/CacheManager.swift",
        "CacheManager/DiskManager.swift",
        "CacheManager/ImageCacheable.swift",
        "CacheManager/MemoryManager.swift",
        "Extension/UIImage+.swift",
        "UI/RemoteImage.swift",
        "UI/UIImageView+remoteImage.swift",
        "UseCase/GetImageUseCase.swift"
      ],
      "type" : "library"
    }
  ],
  "tools_version" : "5.4"
}
Command line invocation:
    /Applications/Xcode-16.3.0.app/Contents/Developer/usr/bin/xcodebuild -IDEClonedSourcePackagesDirPathOverride=/Users/admin/builder/spi-builder-workspace/.dependencies -resolvePackageDependencies
Resolve Package Graph
Resolved source packages:
  RemoteImage: /Users/admin/builder/spi-builder-workspace
resolved source packages: RemoteImage
{
  "dependencies" : [
  ],
  "manifest_display_name" : "RemoteImage",
  "name" : "RemoteImage",
  "path" : "/Users/admin/builder/spi-builder-workspace",
  "platforms" : [
    {
      "name" : "ios",
      "version" : "15.0"
    }
  ],
  "products" : [
    {
      "name" : "RemoteImage",
      "targets" : [
        "RemoteImage"
      ],
      "type" : {
        "library" : [
          "automatic"
        ]
      }
    }
  ],
  "targets" : [
    {
      "c99name" : "RemoteImageTests",
      "module_type" : "SwiftTarget",
      "name" : "RemoteImageTests",
      "path" : "Tests/RemoteImageTests",
      "sources" : [
        "RemoteImageTests.swift"
      ],
      "target_dependencies" : [
        "RemoteImage"
      ],
      "type" : "test"
    },
    {
      "c99name" : "RemoteImage",
      "module_type" : "SwiftTarget",
      "name" : "RemoteImage",
      "path" : "Sources/RemoteImage",
      "product_memberships" : [
        "RemoteImage"
      ],
      "sources" : [
        "CacheManager/CacheManager.swift",
        "CacheManager/DiskManager.swift",
        "CacheManager/ImageCacheable.swift",
        "CacheManager/MemoryManager.swift",
        "Extension/UIImage+.swift",
        "UI/RemoteImage.swift",
        "UI/UIImageView+remoteImage.swift",
        "UseCase/GetImageUseCase.swift"
      ],
      "type" : "library"
    }
  ],
  "tools_version" : "5.4"
}
{
  "workspace" : {
    "name" : "spi-builder-workspace",
    "schemes" : [
      "RemoteImage"
    ]
  }
}
Running build ...
env DEVELOPER_DIR=/Applications/Xcode-16.3.0.app xcrun xcodebuild -IDEClonedSourcePackagesDirPathOverride=$PWD/.dependencies -skipMacroValidation -skipPackagePluginValidation -derivedDataPath $PWD/.derivedData build -scheme RemoteImage -destination platform=macOS,arch=arm64 OTHER_SWIFT_FLAGS=-stats-output-dir .stats -strict-concurrency=complete -enable-upcoming-feature StrictConcurrency -enable-upcoming-feature DisableOutwardActorInference -enable-upcoming-feature GlobalActorIsolatedTypesUsability -enable-upcoming-feature InferSendableFromCaptures
Command line invocation:
    /Applications/Xcode-16.3.0.app/Contents/Developer/usr/bin/xcodebuild -IDEClonedSourcePackagesDirPathOverride=/Users/admin/builder/spi-builder-workspace/.dependencies -skipMacroValidation -skipPackagePluginValidation -derivedDataPath /Users/admin/builder/spi-builder-workspace/.derivedData build -scheme RemoteImage -destination platform=macOS,arch=arm64 "OTHER_SWIFT_FLAGS=-stats-output-dir .stats -strict-concurrency=complete -enable-upcoming-feature StrictConcurrency -enable-upcoming-feature DisableOutwardActorInference -enable-upcoming-feature GlobalActorIsolatedTypesUsability -enable-upcoming-feature InferSendableFromCaptures"
Build settings from command line:
    OTHER_SWIFT_FLAGS = -stats-output-dir .stats -strict-concurrency=complete -enable-upcoming-feature StrictConcurrency -enable-upcoming-feature DisableOutwardActorInference -enable-upcoming-feature GlobalActorIsolatedTypesUsability -enable-upcoming-feature InferSendableFromCaptures
Resolve Package Graph
Resolved source packages:
  RemoteImage: /Users/admin/builder/spi-builder-workspace
ComputePackagePrebuildTargetDependencyGraph
Prepare packages
CreateBuildRequest
SendProjectDescription
CreateBuildOperation
ComputeTargetDependencyGraph
note: Building targets in dependency order
note: Target dependency graph (2 targets)
    Target 'RemoteImage' in project 'RemoteImage'
        ➜ Explicit dependency on target 'RemoteImage' in project 'RemoteImage'
    Target 'RemoteImage' in project 'RemoteImage' (no dependencies)
GatherProvisioningInputs
CreateBuildDescription
ExecuteExternalTool /Applications/Xcode-16.3.0.app/Contents/Developer/Toolchains/XcodeDefault.xctoolchain/usr/bin/clang -v -E -dM -isysroot /Applications/Xcode-16.3.0.app/Contents/Developer/Platforms/MacOSX.platform/Developer/SDKs/MacOSX15.4.sdk -x c -c /dev/null
ExecuteExternalTool /Applications/Xcode-16.3.0.app/Contents/Developer/Toolchains/XcodeDefault.xctoolchain/usr/bin/swiftc --version
ExecuteExternalTool /Applications/Xcode-16.3.0.app/Contents/Developer/Toolchains/XcodeDefault.xctoolchain/usr/bin/ld -version_details
Build description signature: 94f24a2fd4477898ffdda82612a3e475
Build description path: /Users/admin/builder/spi-builder-workspace/.derivedData/Build/Intermediates.noindex/XCBuildData/94f24a2fd4477898ffdda82612a3e475.xcbuilddata
ClangStatCache /Applications/Xcode-16.3.0.app/Contents/Developer/Toolchains/XcodeDefault.xctoolchain/usr/bin/clang-stat-cache /Applications/Xcode-16.3.0.app/Contents/Developer/Platforms/MacOSX.platform/Developer/SDKs/MacOSX15.4.sdk /Users/admin/builder/spi-builder-workspace/.derivedData/SDKStatCaches.noindex/macosx15.4-24E241-8287b8f5db97e746a1562fbca0c9d29b.sdkstatcache
    cd /Users/admin/builder/spi-builder-workspace/.swiftpm/xcode
    /Applications/Xcode-16.3.0.app/Contents/Developer/Toolchains/XcodeDefault.xctoolchain/usr/bin/clang-stat-cache /Applications/Xcode-16.3.0.app/Contents/Developer/Platforms/MacOSX.platform/Developer/SDKs/MacOSX15.4.sdk -o /Users/admin/builder/spi-builder-workspace/.derivedData/SDKStatCaches.noindex/macosx15.4-24E241-8287b8f5db97e746a1562fbca0c9d29b.sdkstatcache
CreateBuildDirectory /Users/admin/builder/spi-builder-workspace/.derivedData/Build/Products
    cd /Users/admin/builder/spi-builder-workspace/.swiftpm/xcode
    builtin-create-build-directory /Users/admin/builder/spi-builder-workspace/.derivedData/Build/Products
CreateBuildDirectory /Users/admin/builder/spi-builder-workspace/.derivedData/Build/Intermediates.noindex
    cd /Users/admin/builder/spi-builder-workspace/.swiftpm/xcode
    builtin-create-build-directory /Users/admin/builder/spi-builder-workspace/.derivedData/Build/Intermediates.noindex
CreateBuildDirectory /Users/admin/builder/spi-builder-workspace/.derivedData/Build/Intermediates.noindex/EagerLinkingTBDs/Debug
    cd /Users/admin/builder/spi-builder-workspace/.swiftpm/xcode
    builtin-create-build-directory /Users/admin/builder/spi-builder-workspace/.derivedData/Build/Intermediates.noindex/EagerLinkingTBDs/Debug
CreateBuildDirectory /Users/admin/builder/spi-builder-workspace/.derivedData/Build/Products/Debug
    cd /Users/admin/builder/spi-builder-workspace/.swiftpm/xcode
    builtin-create-build-directory /Users/admin/builder/spi-builder-workspace/.derivedData/Build/Products/Debug
CreateBuildDirectory /Users/admin/builder/spi-builder-workspace/.derivedData/Build/Products/Debug/PackageFrameworks
    cd /Users/admin/builder/spi-builder-workspace/.swiftpm/xcode
    builtin-create-build-directory /Users/admin/builder/spi-builder-workspace/.derivedData/Build/Products/Debug/PackageFrameworks
WriteAuxiliaryFile /Users/admin/builder/spi-builder-workspace/.derivedData/Build/Intermediates.noindex/RemoteImage.build/Debug/RemoteImage.build/RemoteImage.DependencyStaticMetadataFileList (in target 'RemoteImage' from project 'RemoteImage')
    cd /Users/admin/builder/spi-builder-workspace
    write-file /Users/admin/builder/spi-builder-workspace/.derivedData/Build/Intermediates.noindex/RemoteImage.build/Debug/RemoteImage.build/RemoteImage.DependencyStaticMetadataFileList
WriteAuxiliaryFile /Users/admin/builder/spi-builder-workspace/.derivedData/Build/Intermediates.noindex/RemoteImage.build/Debug/RemoteImage.build/RemoteImage.DependencyMetadataFileList (in target 'RemoteImage' from project 'RemoteImage')
    cd /Users/admin/builder/spi-builder-workspace
    write-file /Users/admin/builder/spi-builder-workspace/.derivedData/Build/Intermediates.noindex/RemoteImage.build/Debug/RemoteImage.build/RemoteImage.DependencyMetadataFileList
WriteAuxiliaryFile /Users/admin/builder/spi-builder-workspace/.derivedData/Build/Intermediates.noindex/RemoteImage.build/Debug/RemoteImage.build/RemoteImage.modulemap (in target 'RemoteImage' from project 'RemoteImage')
    cd /Users/admin/builder/spi-builder-workspace
    write-file /Users/admin/builder/spi-builder-workspace/.derivedData/Build/Intermediates.noindex/RemoteImage.build/Debug/RemoteImage.build/RemoteImage.modulemap
WriteAuxiliaryFile /Users/admin/builder/spi-builder-workspace/.derivedData/Build/Intermediates.noindex/RemoteImage.build/Debug/RemoteImage.build/Objects-normal/arm64/RemoteImage-OutputFileMap.json (in target 'RemoteImage' from project 'RemoteImage')
    cd /Users/admin/builder/spi-builder-workspace
    write-file /Users/admin/builder/spi-builder-workspace/.derivedData/Build/Intermediates.noindex/RemoteImage.build/Debug/RemoteImage.build/Objects-normal/arm64/RemoteImage-OutputFileMap.json
WriteAuxiliaryFile /Users/admin/builder/spi-builder-workspace/.derivedData/Build/Intermediates.noindex/RemoteImage.build/Debug/RemoteImage.build/Objects-normal/arm64/RemoteImage_const_extract_protocols.json (in target 'RemoteImage' from project 'RemoteImage')
    cd /Users/admin/builder/spi-builder-workspace
    write-file /Users/admin/builder/spi-builder-workspace/.derivedData/Build/Intermediates.noindex/RemoteImage.build/Debug/RemoteImage.build/Objects-normal/arm64/RemoteImage_const_extract_protocols.json
WriteAuxiliaryFile /Users/admin/builder/spi-builder-workspace/.derivedData/Build/Intermediates.noindex/RemoteImage.build/Debug/RemoteImage.build/Objects-normal/arm64/RemoteImage.LinkFileList (in target 'RemoteImage' from project 'RemoteImage')
    cd /Users/admin/builder/spi-builder-workspace
    write-file /Users/admin/builder/spi-builder-workspace/.derivedData/Build/Intermediates.noindex/RemoteImage.build/Debug/RemoteImage.build/Objects-normal/arm64/RemoteImage.LinkFileList
WriteAuxiliaryFile /Users/admin/builder/spi-builder-workspace/.derivedData/Build/Intermediates.noindex/RemoteImage.build/Debug/RemoteImage.build/Objects-normal/arm64/RemoteImage.SwiftFileList (in target 'RemoteImage' from project 'RemoteImage')
    cd /Users/admin/builder/spi-builder-workspace
    write-file /Users/admin/builder/spi-builder-workspace/.derivedData/Build/Intermediates.noindex/RemoteImage.build/Debug/RemoteImage.build/Objects-normal/arm64/RemoteImage.SwiftFileList
WriteAuxiliaryFile /Users/admin/builder/spi-builder-workspace/.derivedData/Build/Intermediates.noindex/RemoteImage.build/Debug/RemoteImage.build/Objects-normal/arm64/RemoteImage.SwiftConstValuesFileList (in target 'RemoteImage' from project 'RemoteImage')
    cd /Users/admin/builder/spi-builder-workspace
    write-file /Users/admin/builder/spi-builder-workspace/.derivedData/Build/Intermediates.noindex/RemoteImage.build/Debug/RemoteImage.build/Objects-normal/arm64/RemoteImage.SwiftConstValuesFileList
Copy /Users/admin/builder/spi-builder-workspace/.derivedData/Build/Intermediates.noindex/GeneratedModuleMaps/RemoteImage.modulemap /Users/admin/builder/spi-builder-workspace/.derivedData/Build/Intermediates.noindex/RemoteImage.build/Debug/RemoteImage.build/RemoteImage.modulemap (in target 'RemoteImage' from project 'RemoteImage')
    cd /Users/admin/builder/spi-builder-workspace
    builtin-copy -exclude .DS_Store -exclude CVS -exclude .svn -exclude .git -exclude .hg -resolve-src-symlinks /Users/admin/builder/spi-builder-workspace/.derivedData/Build/Intermediates.noindex/RemoteImage.build/Debug/RemoteImage.build/RemoteImage.modulemap /Users/admin/builder/spi-builder-workspace/.derivedData/Build/Intermediates.noindex/GeneratedModuleMaps
SwiftDriver RemoteImage normal arm64 com.apple.xcode.tools.swift.compiler (in target 'RemoteImage' from project 'RemoteImage')
    cd /Users/admin/builder/spi-builder-workspace/.swiftpm/xcode
    builtin-SwiftDriver -- /Applications/Xcode-16.3.0.app/Contents/Developer/Toolchains/XcodeDefault.xctoolchain/usr/bin/swiftc -module-name RemoteImage -Onone -enforce-exclusivity\=checked @/Users/admin/builder/spi-builder-workspace/.derivedData/Build/Intermediates.noindex/RemoteImage.build/Debug/RemoteImage.build/Objects-normal/arm64/RemoteImage.SwiftFileList -DSWIFT_PACKAGE -DDEBUG -stats-output-dir .stats -strict-concurrency\=complete -enable-upcoming-feature StrictConcurrency -enable-upcoming-feature DisableOutwardActorInference -enable-upcoming-feature GlobalActorIsolatedTypesUsability -enable-upcoming-feature InferSendableFromCaptures -plugin-path /Applications/Xcode-16.3.0.app/Contents/Developer/Toolchains/XcodeDefault.xctoolchain/usr/lib/swift/host/plugins/testing -enable-experimental-feature DebugDescriptionMacro -sdk /Applications/Xcode-16.3.0.app/Contents/Developer/Platforms/MacOSX.platform/Developer/SDKs/MacOSX15.4.sdk -target arm64-apple-macos10.13 -g -module-cache-path /Users/admin/builder/spi-builder-workspace/.derivedData/ModuleCache.noindex -Xfrontend -serialize-debugging-options -profile-coverage-mapping -profile-generate -enable-testing -index-store-path /Users/admin/builder/spi-builder-workspace/.derivedData/Index.noindex/DataStore -swift-version 5 -I /Users/admin/builder/spi-builder-workspace/.derivedData/Build/Products/Debug -I /Applications/Xcode-16.3.0.app/Contents/Developer/Platforms/MacOSX.platform/Developer/usr/lib -F /Users/admin/builder/spi-builder-workspace/.derivedData/Build/Products/Debug -F /Applications/Xcode-16.3.0.app/Contents/Developer/Platforms/MacOSX.platform/Developer/Library/Frameworks -c -j10 -enable-batch-mode -incremental -Xcc -ivfsstatcache -Xcc /Users/admin/builder/spi-builder-workspace/.derivedData/SDKStatCaches.noindex/macosx15.4-24E241-8287b8f5db97e746a1562fbca0c9d29b.sdkstatcache -output-file-map /Users/admin/builder/spi-builder-workspace/.derivedData/Build/Intermediates.noindex/RemoteImage.build/Debug/RemoteImage.build/Objects-normal/arm64/RemoteImage-OutputFileMap.json -use-frontend-parseable-output -save-temps -no-color-diagnostics -serialize-diagnostics -emit-dependencies -emit-module -emit-module-path /Users/admin/builder/spi-builder-workspace/.derivedData/Build/Intermediates.noindex/RemoteImage.build/Debug/RemoteImage.build/Objects-normal/arm64/RemoteImage.swiftmodule -validate-clang-modules-once -clang-build-session-file /Users/admin/builder/spi-builder-workspace/.derivedData/ModuleCache.noindex/Session.modulevalidation -Xcc -I/Users/admin/builder/spi-builder-workspace/.derivedData/Build/Intermediates.noindex/RemoteImage.build/Debug/RemoteImage.build/swift-overrides.hmap -emit-const-values -Xfrontend -const-gather-protocols-file -Xfrontend /Users/admin/builder/spi-builder-workspace/.derivedData/Build/Intermediates.noindex/RemoteImage.build/Debug/RemoteImage.build/Objects-normal/arm64/RemoteImage_const_extract_protocols.json -Xcc -I/Users/admin/builder/spi-builder-workspace/.derivedData/Build/Products/Debug/include -Xcc -I/Users/admin/builder/spi-builder-workspace/.derivedData/Build/Intermediates.noindex/RemoteImage.build/Debug/RemoteImage.build/DerivedSources-normal/arm64 -Xcc -I/Users/admin/builder/spi-builder-workspace/.derivedData/Build/Intermediates.noindex/RemoteImage.build/Debug/RemoteImage.build/DerivedSources/arm64 -Xcc -I/Users/admin/builder/spi-builder-workspace/.derivedData/Build/Intermediates.noindex/RemoteImage.build/Debug/RemoteImage.build/DerivedSources -Xcc -DSWIFT_PACKAGE -Xcc -DDEBUG\=1 -emit-objc-header -emit-objc-header-path /Users/admin/builder/spi-builder-workspace/.derivedData/Build/Intermediates.noindex/RemoteImage.build/Debug/RemoteImage.build/Objects-normal/arm64/RemoteImage-Swift.h -working-directory /Users/admin/builder/spi-builder-workspace/.swiftpm/xcode -experimental-emit-module-separately -disable-cmo
SwiftCompile normal arm64 Compiling\ MemoryManager.swift /Users/admin/builder/spi-builder-workspace/Sources/RemoteImage/CacheManager/MemoryManager.swift (in target 'RemoteImage' from project 'RemoteImage')
SwiftCompile normal arm64 /Users/admin/builder/spi-builder-workspace/Sources/RemoteImage/CacheManager/MemoryManager.swift (in target 'RemoteImage' from project 'RemoteImage')
    cd /Users/admin/builder/spi-builder-workspace/.swiftpm/xcode

SwiftCompile normal arm64 Compiling\ DiskManager.swift /Users/admin/builder/spi-builder-workspace/Sources/RemoteImage/CacheManager/DiskManager.swift (in target 'RemoteImage' from project 'RemoteImage')
SwiftCompile normal arm64 /Users/admin/builder/spi-builder-workspace/Sources/RemoteImage/CacheManager/DiskManager.swift (in target 'RemoteImage' from project 'RemoteImage')
    cd /Users/admin/builder/spi-builder-workspace/.swiftpm/xcode

SwiftEmitModule normal arm64 Emitting\ module\ for\ RemoteImage (in target 'RemoteImage' from project 'RemoteImage')
Failed frontend command:
/Applications/Xcode-16.3.0.app/Contents/Developer/Toolchains/XcodeDefault.xctoolchain/usr/bin/swift-frontend -frontend -emit-module -experimental-skip-non-inlinable-function-bodies-without-types /Users/admin/builder/spi-builder-workspace/Sources/RemoteImage/CacheManager/CacheManager.swift /Users/admin/builder/spi-builder-workspace/Sources/RemoteImage/CacheManager/DiskManager.swift /Users/admin/builder/spi-builder-workspace/Sources/RemoteImage/CacheManager/ImageCacheable.swift /Users/admin/builder/spi-builder-workspace/Sources/RemoteImage/CacheManager/MemoryManager.swift /Users/admin/builder/spi-builder-workspace/Sources/RemoteImage/Extension/UIImage+.swift /Users/admin/builder/spi-builder-workspace/Sources/RemoteImage/UI/RemoteImage.swift /Users/admin/builder/spi-builder-workspace/Sources/RemoteImage/UI/UIImageView+remoteImage.swift /Users/admin/builder/spi-builder-workspace/Sources/RemoteImage/UseCase/GetImageUseCase.swift -target arm64-apple-macos10.13 -Xllvm -aarch64-use-tbi -enable-objc-interop -sdk /Applications/Xcode-16.3.0.app/Contents/Developer/Platforms/MacOSX.platform/Developer/SDKs/MacOSX15.4.sdk -I /Users/admin/builder/spi-builder-workspace/.derivedData/Build/Products/Debug -I /Applications/Xcode-16.3.0.app/Contents/Developer/Platforms/MacOSX.platform/Developer/usr/lib -F /Users/admin/builder/spi-builder-workspace/.derivedData/Build/Products/Debug -F /Applications/Xcode-16.3.0.app/Contents/Developer/Platforms/MacOSX.platform/Developer/Library/Frameworks -no-color-diagnostics -enable-testing -g -debug-info-format\=dwarf -dwarf-version\=4 -module-cache-path /Users/admin/builder/spi-builder-workspace/.derivedData/ModuleCache.noindex -profile-generate -profile-coverage-mapping -swift-version 5 -enforce-exclusivity\=checked -stats-output-dir /Users/admin/builder/spi-builder-workspace/.swiftpm/xcode/.stats -Onone -D SWIFT_PACKAGE -D DEBUG -serialize-debugging-options -const-gather-protocols-file /Users/admin/builder/spi-builder-workspace/.derivedData/Build/Intermediates.noindex/RemoteImage.build/Debug/RemoteImage.build/Objects-normal/arm64/RemoteImage_const_extract_protocols.json -enable-upcoming-feature StrictConcurrency -enable-upcoming-feature DisableOutwardActorInference -enable-upcoming-feature GlobalActorIsolatedTypesUsability -enable-upcoming-feature InferSendableFromCaptures -enable-experimental-feature DebugDescriptionMacro -strict-concurrency\=complete -empty-abi-descriptor -plugin-path /Applications/Xcode-16.3.0.app/Contents/Developer/Toolchains/XcodeDefault.xctoolchain/usr/lib/swift/host/plugins/testing -validate-clang-modules-once -clang-build-session-file /Users/admin/builder/spi-builder-workspace/.derivedData/ModuleCache.noindex/Session.modulevalidation -Xcc -working-directory -Xcc /Users/admin/builder/spi-builder-workspace/.swiftpm/xcode -resource-dir /Applications/Xcode-16.3.0.app/Contents/Developer/Toolchains/XcodeDefault.xctoolchain/usr/lib/swift -enable-anonymous-context-mangled-names -file-compilation-dir /Users/admin/builder/spi-builder-workspace/.swiftpm/xcode -Xcc -ivfsstatcache -Xcc /Users/admin/builder/spi-builder-workspace/.derivedData/SDKStatCaches.noindex/macosx15.4-24E241-8287b8f5db97e746a1562fbca0c9d29b.sdkstatcache -Xcc -I/Users/admin/builder/spi-builder-workspace/.derivedData/Build/Intermediates.noindex/RemoteImage.build/Debug/RemoteImage.build/swift-overrides.hmap -Xcc -I/Users/admin/builder/spi-builder-workspace/.derivedData/Build/Products/Debug/include -Xcc -I/Users/admin/builder/spi-builder-workspace/.derivedData/Build/Intermediates.noindex/RemoteImage.build/Debug/RemoteImage.build/DerivedSources-normal/arm64 -Xcc -I/Users/admin/builder/spi-builder-workspace/.derivedData/Build/Intermediates.noindex/RemoteImage.build/Debug/RemoteImage.build/DerivedSources/arm64 -Xcc -I/Users/admin/builder/spi-builder-workspace/.derivedData/Build/Intermediates.noindex/RemoteImage.build/Debug/RemoteImage.build/DerivedSources -Xcc -DSWIFT_PACKAGE -Xcc -DDEBUG\=1 -module-name RemoteImage -frontend-parseable-output -disable-clang-spi -target-sdk-version 15.4 -target-sdk-name macosx15.4 -external-plugin-path /Applications/Xcode-16.3.0.app/Contents/Developer/Platforms/MacOSX.platform/Developer/usr/lib/swift/host/plugins\#/Applications/Xcode-16.3.0.app/Contents/Developer/Platforms/MacOSX.platform/Developer/usr/bin/swift-plugin-server -external-plugin-path /Applications/Xcode-16.3.0.app/Contents/Developer/Platforms/MacOSX.platform/Developer/usr/local/lib/swift/host/plugins\#/Applications/Xcode-16.3.0.app/Contents/Developer/Platforms/MacOSX.platform/Developer/usr/bin/swift-plugin-server -in-process-plugin-server-path /Applications/Xcode-16.3.0.app/Contents/Developer/Toolchains/XcodeDefault.xctoolchain/usr/lib/swift/host/libSwiftInProcPluginServer.dylib -plugin-path /Applications/Xcode-16.3.0.app/Contents/Developer/Toolchains/XcodeDefault.xctoolchain/usr/lib/swift/host/plugins -plugin-path /Applications/Xcode-16.3.0.app/Contents/Developer/Toolchains/XcodeDefault.xctoolchain/usr/local/lib/swift/host/plugins -emit-module-doc-path /Users/admin/builder/spi-builder-workspace/.derivedData/Build/Intermediates.noindex/RemoteImage.build/Debug/RemoteImage.build/Objects-normal/arm64/RemoteImage.swiftdoc -emit-module-source-info-path /Users/admin/builder/spi-builder-workspace/.derivedData/Build/Intermediates.noindex/RemoteImage.build/Debug/RemoteImage.build/Objects-normal/arm64/RemoteImage.swiftsourceinfo -emit-objc-header-path /Users/admin/builder/spi-builder-workspace/.derivedData/Build/Intermediates.noindex/RemoteImage.build/Debug/RemoteImage.build/Objects-normal/arm64/RemoteImage-Swift.h -serialize-diagnostics-path /Users/admin/builder/spi-builder-workspace/.derivedData/Build/Intermediates.noindex/RemoteImage.build/Debug/RemoteImage.build/Objects-normal/arm64/RemoteImage-master-emit-module.dia -emit-dependencies-path /Users/admin/builder/spi-builder-workspace/.derivedData/Build/Intermediates.noindex/RemoteImage.build/Debug/RemoteImage.build/Objects-normal/arm64/RemoteImage-master-emit-module.d -o /Users/admin/builder/spi-builder-workspace/.derivedData/Build/Intermediates.noindex/RemoteImage.build/Debug/RemoteImage.build/Objects-normal/arm64/RemoteImage.swiftmodule -emit-abi-descriptor-path /Users/admin/builder/spi-builder-workspace/.derivedData/Build/Intermediates.noindex/RemoteImage.build/Debug/RemoteImage.build/Objects-normal/arm64/RemoteImage.abi.json
EmitSwiftModule normal arm64 (in target 'RemoteImage' from project 'RemoteImage')
    cd /Users/admin/builder/spi-builder-workspace/.swiftpm/xcode

/Users/admin/builder/spi-builder-workspace/Sources/RemoteImage/UI/RemoteImage.swift:20:32: error: cannot find type 'UIImage' in scope
    @State private  var image: UIImage? = .none
                               ^~~~~~~
/Users/admin/builder/spi-builder-workspace/Sources/RemoteImage/UI/RemoteImage.swift:13:27: error: cannot find 'GetImageUseCase' in scope
    private let useCase = GetImageUseCase()
                          ^~~~~~~~~~~~~~~
/Users/admin/builder/spi-builder-workspace/Sources/RemoteImage/UI/RemoteImage.swift:16:28: error: cannot find type 'RemoteImageParamter' in scope
    private let parameter: RemoteImageParamter
                           ^~~~~~~~~~~~~~~~~~~
/Users/admin/builder/spi-builder-workspace/Sources/RemoteImage/UI/RemoteImage.swift:17:27: error: 'Image' is only available in macOS 10.15 or newer
    private let content: (Image) -> Content
                          ^
/Users/admin/builder/spi-builder-workspace/Sources/RemoteImage/UI/RemoteImage.swift:11:15: note: add @available attribute to enclosing generic struct
public struct RemoteImage<Content: View, Placeholder: View>: View {
              ^
/Users/admin/builder/spi-builder-workspace/Sources/RemoteImage/UI/RemoteImage.swift:20:6: error: 'State' is only available in macOS 10.15 or newer
    @State private  var image: UIImage? = .none
     ^
/Users/admin/builder/spi-builder-workspace/Sources/RemoteImage/UI/RemoteImage.swift:11:15: note: add @available attribute to enclosing generic struct
public struct RemoteImage<Content: View, Placeholder: View>: View {
              ^
/Users/admin/builder/spi-builder-workspace/Sources/RemoteImage/UI/RemoteImage.swift:24:20: error: cannot find type 'RemoteImageParamter' in scope
        parameter: RemoteImageParamter = .init(),
                   ^~~~~~~~~~~~~~~~~~~
/Users/admin/builder/spi-builder-workspace/Sources/RemoteImage/UI/RemoteImage.swift:25:29: error: 'Image' is only available in macOS 10.15 or newer
        content: @escaping (Image) -> Content,
                            ^
/Users/admin/builder/spi-builder-workspace/Sources/RemoteImage/UI/RemoteImage.swift:22:12: note: add @available attribute to enclosing initializer
    public init(
           ^
/Users/admin/builder/spi-builder-workspace/Sources/RemoteImage/UI/RemoteImage.swift:11:15: note: add @available attribute to enclosing generic struct
public struct RemoteImage<Content: View, Placeholder: View>: View {
              ^
/Users/admin/builder/spi-builder-workspace/Sources/RemoteImage/UI/RemoteImage.swift:34:27: error: 'View' is only available in macOS 10.15 or newer
    public var body: some View {
                          ^
/Users/admin/builder/spi-builder-workspace/Sources/RemoteImage/UI/RemoteImage.swift:34:16: note: add @available attribute to enclosing property
    public var body: some View {
               ^
/Users/admin/builder/spi-builder-workspace/Sources/RemoteImage/UI/RemoteImage.swift:11:15: note: add @available attribute to enclosing generic struct
public struct RemoteImage<Content: View, Placeholder: View>: View {
              ^
/Users/admin/builder/spi-builder-workspace/Sources/RemoteImage/UI/RemoteImage.swift:11:36: error: 'View' is only available in macOS 10.15 or newer
public struct RemoteImage<Content: View, Placeholder: View>: View {
                                   ^
/Users/admin/builder/spi-builder-workspace/Sources/RemoteImage/UI/RemoteImage.swift:11:15: note: add @available attribute to enclosing generic struct
public struct RemoteImage<Content: View, Placeholder: View>: View {
              ^
/Users/admin/builder/spi-builder-workspace/Sources/RemoteImage/UI/RemoteImage.swift:11:55: error: 'View' is only available in macOS 10.15 or newer
public struct RemoteImage<Content: View, Placeholder: View>: View {
                                                      ^
/Users/admin/builder/spi-builder-workspace/Sources/RemoteImage/UI/RemoteImage.swift:11:15: note: add @available attribute to enclosing generic struct
public struct RemoteImage<Content: View, Placeholder: View>: View {
              ^
SwiftCompile normal arm64 Compiling\ RemoteImage.swift /Users/admin/builder/spi-builder-workspace/Sources/RemoteImage/UI/RemoteImage.swift (in target 'RemoteImage' from project 'RemoteImage')
SwiftCompile normal arm64 /Users/admin/builder/spi-builder-workspace/Sources/RemoteImage/UI/RemoteImage.swift (in target 'RemoteImage' from project 'RemoteImage')
    cd /Users/admin/builder/spi-builder-workspace/.swiftpm/xcode

SwiftCompile normal arm64 Compiling\ GetImageUseCase.swift /Users/admin/builder/spi-builder-workspace/Sources/RemoteImage/UseCase/GetImageUseCase.swift (in target 'RemoteImage' from project 'RemoteImage')
SwiftCompile normal arm64 /Users/admin/builder/spi-builder-workspace/Sources/RemoteImage/UseCase/GetImageUseCase.swift (in target 'RemoteImage' from project 'RemoteImage')
    cd /Users/admin/builder/spi-builder-workspace/.swiftpm/xcode

SwiftCompile normal arm64 Compiling\ UIImage+.swift /Users/admin/builder/spi-builder-workspace/Sources/RemoteImage/Extension/UIImage+.swift (in target 'RemoteImage' from project 'RemoteImage')
SwiftCompile normal arm64 /Users/admin/builder/spi-builder-workspace/Sources/RemoteImage/Extension/UIImage+.swift (in target 'RemoteImage' from project 'RemoteImage')
    cd /Users/admin/builder/spi-builder-workspace/.swiftpm/xcode

SwiftCompile normal arm64 Compiling\ UIImageView+remoteImage.swift /Users/admin/builder/spi-builder-workspace/Sources/RemoteImage/UI/UIImageView+remoteImage.swift (in target 'RemoteImage' from project 'RemoteImage')
SwiftCompile normal arm64 /Users/admin/builder/spi-builder-workspace/Sources/RemoteImage/UI/UIImageView+remoteImage.swift (in target 'RemoteImage' from project 'RemoteImage')
    cd /Users/admin/builder/spi-builder-workspace/.swiftpm/xcode

SwiftCompile normal arm64 Compiling\ CacheManager.swift /Users/admin/builder/spi-builder-workspace/Sources/RemoteImage/CacheManager/CacheManager.swift (in target 'RemoteImage' from project 'RemoteImage')
SwiftCompile normal arm64 /Users/admin/builder/spi-builder-workspace/Sources/RemoteImage/CacheManager/CacheManager.swift (in target 'RemoteImage' from project 'RemoteImage')
    cd /Users/admin/builder/spi-builder-workspace/.swiftpm/xcode

SwiftCompile normal arm64 Compiling\ ImageCacheable.swift /Users/admin/builder/spi-builder-workspace/Sources/RemoteImage/CacheManager/ImageCacheable.swift (in target 'RemoteImage' from project 'RemoteImage')
SwiftCompile normal arm64 /Users/admin/builder/spi-builder-workspace/Sources/RemoteImage/CacheManager/ImageCacheable.swift (in target 'RemoteImage' from project 'RemoteImage')
    cd /Users/admin/builder/spi-builder-workspace/.swiftpm/xcode

--- xcodebuild: WARNING: Using the first of multiple matching destinations:
{ platform:macOS, arch:arm64, id:f769b1355279f82bbd70139b931e1037ad0b423a, name:My Mac }
{ platform:macOS, arch:arm64, variant:Mac Catalyst, id:f769b1355279f82bbd70139b931e1037ad0b423a, name:My Mac }
{ platform:macOS, arch:arm64, variant:DriverKit, id:f769b1355279f82bbd70139b931e1037ad0b423a, name:My Mac }
{ platform:macOS, arch:arm64, variant:Designed for [iPad,iPhone], id:f769b1355279f82bbd70139b931e1037ad0b423a, name:My Mac }
** BUILD FAILED **
The following build commands failed:
	SwiftEmitModule normal arm64 Emitting\ module\ for\ RemoteImage (in target 'RemoteImage' from project 'RemoteImage')
	EmitSwiftModule normal arm64 (in target 'RemoteImage' from project 'RemoteImage')
	Building workspace spi-builder-workspace with scheme RemoteImage
(3 failures)
Command line invocation:
    /Applications/Xcode-16.3.0.app/Contents/Developer/usr/bin/xcodebuild -IDEClonedSourcePackagesDirPathOverride=/Users/admin/builder/spi-builder-workspace/.dependencies -resolvePackageDependencies
Resolve Package Graph
Resolved source packages:
  RemoteImage: /Users/admin/builder/spi-builder-workspace
resolved source packages: RemoteImage
{
  "dependencies" : [
  ],
  "manifest_display_name" : "RemoteImage",
  "name" : "RemoteImage",
  "path" : "/Users/admin/builder/spi-builder-workspace",
  "platforms" : [
    {
      "name" : "ios",
      "version" : "15.0"
    }
  ],
  "products" : [
    {
      "name" : "RemoteImage",
      "targets" : [
        "RemoteImage"
      ],
      "type" : {
        "library" : [
          "automatic"
        ]
      }
    }
  ],
  "targets" : [
    {
      "c99name" : "RemoteImageTests",
      "module_type" : "SwiftTarget",
      "name" : "RemoteImageTests",
      "path" : "Tests/RemoteImageTests",
      "sources" : [
        "RemoteImageTests.swift"
      ],
      "target_dependencies" : [
        "RemoteImage"
      ],
      "type" : "test"
    },
    {
      "c99name" : "RemoteImage",
      "module_type" : "SwiftTarget",
      "name" : "RemoteImage",
      "path" : "Sources/RemoteImage",
      "product_memberships" : [
        "RemoteImage"
      ],
      "sources" : [
        "CacheManager/CacheManager.swift",
        "CacheManager/DiskManager.swift",
        "CacheManager/ImageCacheable.swift",
        "CacheManager/MemoryManager.swift",
        "Extension/UIImage+.swift",
        "UI/RemoteImage.swift",
        "UI/UIImageView+remoteImage.swift",
        "UseCase/GetImageUseCase.swift"
      ],
      "type" : "library"
    }
  ],
  "tools_version" : "5.4"
}
{
  "workspace" : {
    "name" : "spi-builder-workspace",
    "schemes" : [
      "RemoteImage"
    ]
  }
}
Running build ...
env DEVELOPER_DIR=/Applications/Xcode-16.3.0.app xcrun xcodebuild -IDEClonedSourcePackagesDirPathOverride=$PWD/.dependencies -skipMacroValidation -skipPackagePluginValidation -derivedDataPath $PWD/.derivedData build -scheme RemoteImage -destination platform=macOS,arch=arm64
Command line invocation:
    /Applications/Xcode-16.3.0.app/Contents/Developer/usr/bin/xcodebuild -IDEClonedSourcePackagesDirPathOverride=/Users/admin/builder/spi-builder-workspace/.dependencies -skipMacroValidation -skipPackagePluginValidation -derivedDataPath /Users/admin/builder/spi-builder-workspace/.derivedData build -scheme RemoteImage -destination platform=macOS,arch=arm64
Resolve Package Graph
Resolved source packages:
  RemoteImage: /Users/admin/builder/spi-builder-workspace
ComputePackagePrebuildTargetDependencyGraph
Prepare packages
CreateBuildRequest
SendProjectDescription
CreateBuildOperation
ComputeTargetDependencyGraph
note: Building targets in dependency order
note: Target dependency graph (2 targets)
    Target 'RemoteImage' in project 'RemoteImage'
        ➜ Explicit dependency on target 'RemoteImage' in project 'RemoteImage'
    Target 'RemoteImage' in project 'RemoteImage' (no dependencies)
GatherProvisioningInputs
CreateBuildDescription
ExecuteExternalTool /Applications/Xcode-16.3.0.app/Contents/Developer/Toolchains/XcodeDefault.xctoolchain/usr/bin/clang -v -E -dM -isysroot /Applications/Xcode-16.3.0.app/Contents/Developer/Platforms/MacOSX.platform/Developer/SDKs/MacOSX15.4.sdk -x c -c /dev/null
ExecuteExternalTool /Applications/Xcode-16.3.0.app/Contents/Developer/Toolchains/XcodeDefault.xctoolchain/usr/bin/swiftc --version
ExecuteExternalTool /Applications/Xcode-16.3.0.app/Contents/Developer/Toolchains/XcodeDefault.xctoolchain/usr/bin/ld -version_details
Build description signature: 7aee7b54ba820ccad09a9899d18fb265
Build description path: /Users/admin/builder/spi-builder-workspace/.derivedData/Build/Intermediates.noindex/XCBuildData/7aee7b54ba820ccad09a9899d18fb265.xcbuilddata
ClangStatCache /Applications/Xcode-16.3.0.app/Contents/Developer/Toolchains/XcodeDefault.xctoolchain/usr/bin/clang-stat-cache /Applications/Xcode-16.3.0.app/Contents/Developer/Platforms/MacOSX.platform/Developer/SDKs/MacOSX15.4.sdk /Users/admin/builder/spi-builder-workspace/.derivedData/SDKStatCaches.noindex/macosx15.4-24E241-8287b8f5db97e746a1562fbca0c9d29b.sdkstatcache
    cd /Users/admin/builder/spi-builder-workspace/.swiftpm/xcode
    /Applications/Xcode-16.3.0.app/Contents/Developer/Toolchains/XcodeDefault.xctoolchain/usr/bin/clang-stat-cache /Applications/Xcode-16.3.0.app/Contents/Developer/Platforms/MacOSX.platform/Developer/SDKs/MacOSX15.4.sdk -o /Users/admin/builder/spi-builder-workspace/.derivedData/SDKStatCaches.noindex/macosx15.4-24E241-8287b8f5db97e746a1562fbca0c9d29b.sdkstatcache
SwiftDriver RemoteImage normal arm64 com.apple.xcode.tools.swift.compiler (in target 'RemoteImage' from project 'RemoteImage')
    cd /Users/admin/builder/spi-builder-workspace/.swiftpm/xcode
    builtin-SwiftDriver -- /Applications/Xcode-16.3.0.app/Contents/Developer/Toolchains/XcodeDefault.xctoolchain/usr/bin/swiftc -module-name RemoteImage -Onone -enforce-exclusivity\=checked @/Users/admin/builder/spi-builder-workspace/.derivedData/Build/Intermediates.noindex/RemoteImage.build/Debug/RemoteImage.build/Objects-normal/arm64/RemoteImage.SwiftFileList -DSWIFT_PACKAGE -DDEBUG -DXcode -plugin-path /Applications/Xcode-16.3.0.app/Contents/Developer/Toolchains/XcodeDefault.xctoolchain/usr/lib/swift/host/plugins/testing -enable-experimental-feature DebugDescriptionMacro -sdk /Applications/Xcode-16.3.0.app/Contents/Developer/Platforms/MacOSX.platform/Developer/SDKs/MacOSX15.4.sdk -target arm64-apple-macos10.13 -g -module-cache-path /Users/admin/builder/spi-builder-workspace/.derivedData/ModuleCache.noindex -Xfrontend -serialize-debugging-options -profile-coverage-mapping -profile-generate -enable-testing -index-store-path /Users/admin/builder/spi-builder-workspace/.derivedData/Index.noindex/DataStore -swift-version 5 -I /Users/admin/builder/spi-builder-workspace/.derivedData/Build/Products/Debug -I /Applications/Xcode-16.3.0.app/Contents/Developer/Platforms/MacOSX.platform/Developer/usr/lib -F /Users/admin/builder/spi-builder-workspace/.derivedData/Build/Products/Debug -F /Applications/Xcode-16.3.0.app/Contents/Developer/Platforms/MacOSX.platform/Developer/Library/Frameworks -c -j10 -enable-batch-mode -incremental -Xcc -ivfsstatcache -Xcc /Users/admin/builder/spi-builder-workspace/.derivedData/SDKStatCaches.noindex/macosx15.4-24E241-8287b8f5db97e746a1562fbca0c9d29b.sdkstatcache -output-file-map /Users/admin/builder/spi-builder-workspace/.derivedData/Build/Intermediates.noindex/RemoteImage.build/Debug/RemoteImage.build/Objects-normal/arm64/RemoteImage-OutputFileMap.json -use-frontend-parseable-output -save-temps -no-color-diagnostics -serialize-diagnostics -emit-dependencies -emit-module -emit-module-path /Users/admin/builder/spi-builder-workspace/.derivedData/Build/Intermediates.noindex/RemoteImage.build/Debug/RemoteImage.build/Objects-normal/arm64/RemoteImage.swiftmodule -validate-clang-modules-once -clang-build-session-file /Users/admin/builder/spi-builder-workspace/.derivedData/ModuleCache.noindex/Session.modulevalidation -Xcc -I/Users/admin/builder/spi-builder-workspace/.derivedData/Build/Intermediates.noindex/RemoteImage.build/Debug/RemoteImage.build/swift-overrides.hmap -emit-const-values -Xfrontend -const-gather-protocols-file -Xfrontend /Users/admin/builder/spi-builder-workspace/.derivedData/Build/Intermediates.noindex/RemoteImage.build/Debug/RemoteImage.build/Objects-normal/arm64/RemoteImage_const_extract_protocols.json -Xcc -I/Users/admin/builder/spi-builder-workspace/.derivedData/Build/Products/Debug/include -Xcc -I/Users/admin/builder/spi-builder-workspace/.derivedData/Build/Intermediates.noindex/RemoteImage.build/Debug/RemoteImage.build/DerivedSources-normal/arm64 -Xcc -I/Users/admin/builder/spi-builder-workspace/.derivedData/Build/Intermediates.noindex/RemoteImage.build/Debug/RemoteImage.build/DerivedSources/arm64 -Xcc -I/Users/admin/builder/spi-builder-workspace/.derivedData/Build/Intermediates.noindex/RemoteImage.build/Debug/RemoteImage.build/DerivedSources -Xcc -DSWIFT_PACKAGE -Xcc -DDEBUG\=1 -emit-objc-header -emit-objc-header-path /Users/admin/builder/spi-builder-workspace/.derivedData/Build/Intermediates.noindex/RemoteImage.build/Debug/RemoteImage.build/Objects-normal/arm64/RemoteImage-Swift.h -working-directory /Users/admin/builder/spi-builder-workspace/.swiftpm/xcode -experimental-emit-module-separately -disable-cmo
SwiftCompile normal arm64 Compiling\ ImageCacheable.swift /Users/admin/builder/spi-builder-workspace/Sources/RemoteImage/CacheManager/ImageCacheable.swift (in target 'RemoteImage' from project 'RemoteImage')
SwiftCompile normal arm64 /Users/admin/builder/spi-builder-workspace/Sources/RemoteImage/CacheManager/ImageCacheable.swift (in target 'RemoteImage' from project 'RemoteImage')
    cd /Users/admin/builder/spi-builder-workspace/.swiftpm/xcode

SwiftCompile normal arm64 Compiling\ CacheManager.swift /Users/admin/builder/spi-builder-workspace/Sources/RemoteImage/CacheManager/CacheManager.swift (in target 'RemoteImage' from project 'RemoteImage')
SwiftCompile normal arm64 /Users/admin/builder/spi-builder-workspace/Sources/RemoteImage/CacheManager/CacheManager.swift (in target 'RemoteImage' from project 'RemoteImage')
    cd /Users/admin/builder/spi-builder-workspace/.swiftpm/xcode

SwiftCompile normal arm64 Compiling\ MemoryManager.swift /Users/admin/builder/spi-builder-workspace/Sources/RemoteImage/CacheManager/MemoryManager.swift (in target 'RemoteImage' from project 'RemoteImage')
SwiftCompile normal arm64 /Users/admin/builder/spi-builder-workspace/Sources/RemoteImage/CacheManager/MemoryManager.swift (in target 'RemoteImage' from project 'RemoteImage')
    cd /Users/admin/builder/spi-builder-workspace/.swiftpm/xcode

SwiftCompile normal arm64 Compiling\ DiskManager.swift /Users/admin/builder/spi-builder-workspace/Sources/RemoteImage/CacheManager/DiskManager.swift (in target 'RemoteImage' from project 'RemoteImage')
SwiftCompile normal arm64 /Users/admin/builder/spi-builder-workspace/Sources/RemoteImage/CacheManager/DiskManager.swift (in target 'RemoteImage' from project 'RemoteImage')
    cd /Users/admin/builder/spi-builder-workspace/.swiftpm/xcode

SwiftCompile normal arm64 Compiling\ UIImage+.swift /Users/admin/builder/spi-builder-workspace/Sources/RemoteImage/Extension/UIImage+.swift (in target 'RemoteImage' from project 'RemoteImage')
SwiftCompile normal arm64 /Users/admin/builder/spi-builder-workspace/Sources/RemoteImage/Extension/UIImage+.swift (in target 'RemoteImage' from project 'RemoteImage')
    cd /Users/admin/builder/spi-builder-workspace/.swiftpm/xcode

SwiftCompile normal arm64 Compiling\ RemoteImage.swift /Users/admin/builder/spi-builder-workspace/Sources/RemoteImage/UI/RemoteImage.swift (in target 'RemoteImage' from project 'RemoteImage')
SwiftCompile normal arm64 /Users/admin/builder/spi-builder-workspace/Sources/RemoteImage/UI/RemoteImage.swift (in target 'RemoteImage' from project 'RemoteImage')
    cd /Users/admin/builder/spi-builder-workspace/.swiftpm/xcode

SwiftEmitModule normal arm64 Emitting\ module\ for\ RemoteImage (in target 'RemoteImage' from project 'RemoteImage')
Failed frontend command:
/Applications/Xcode-16.3.0.app/Contents/Developer/Toolchains/XcodeDefault.xctoolchain/usr/bin/swift-frontend -frontend -emit-module -experimental-skip-non-inlinable-function-bodies-without-types /Users/admin/builder/spi-builder-workspace/Sources/RemoteImage/CacheManager/CacheManager.swift /Users/admin/builder/spi-builder-workspace/Sources/RemoteImage/CacheManager/DiskManager.swift /Users/admin/builder/spi-builder-workspace/Sources/RemoteImage/CacheManager/ImageCacheable.swift /Users/admin/builder/spi-builder-workspace/Sources/RemoteImage/CacheManager/MemoryManager.swift /Users/admin/builder/spi-builder-workspace/Sources/RemoteImage/Extension/UIImage+.swift /Users/admin/builder/spi-builder-workspace/Sources/RemoteImage/UI/RemoteImage.swift /Users/admin/builder/spi-builder-workspace/Sources/RemoteImage/UI/UIImageView+remoteImage.swift /Users/admin/builder/spi-builder-workspace/Sources/RemoteImage/UseCase/GetImageUseCase.swift -target arm64-apple-macos10.13 -Xllvm -aarch64-use-tbi -enable-objc-interop -sdk /Applications/Xcode-16.3.0.app/Contents/Developer/Platforms/MacOSX.platform/Developer/SDKs/MacOSX15.4.sdk -I /Users/admin/builder/spi-builder-workspace/.derivedData/Build/Products/Debug -I /Applications/Xcode-16.3.0.app/Contents/Developer/Platforms/MacOSX.platform/Developer/usr/lib -F /Users/admin/builder/spi-builder-workspace/.derivedData/Build/Products/Debug -F /Applications/Xcode-16.3.0.app/Contents/Developer/Platforms/MacOSX.platform/Developer/Library/Frameworks -no-color-diagnostics -enable-testing -g -debug-info-format\=dwarf -dwarf-version\=4 -module-cache-path /Users/admin/builder/spi-builder-workspace/.derivedData/ModuleCache.noindex -profile-generate -profile-coverage-mapping -swift-version 5 -enforce-exclusivity\=checked -Onone -D SWIFT_PACKAGE -D DEBUG -D Xcode -serialize-debugging-options -const-gather-protocols-file /Users/admin/builder/spi-builder-workspace/.derivedData/Build/Intermediates.noindex/RemoteImage.build/Debug/RemoteImage.build/Objects-normal/arm64/RemoteImage_const_extract_protocols.json -enable-experimental-feature DebugDescriptionMacro -empty-abi-descriptor -plugin-path /Applications/Xcode-16.3.0.app/Contents/Developer/Toolchains/XcodeDefault.xctoolchain/usr/lib/swift/host/plugins/testing -validate-clang-modules-once -clang-build-session-file /Users/admin/builder/spi-builder-workspace/.derivedData/ModuleCache.noindex/Session.modulevalidation -Xcc -working-directory -Xcc /Users/admin/builder/spi-builder-workspace/.swiftpm/xcode -resource-dir /Applications/Xcode-16.3.0.app/Contents/Developer/Toolchains/XcodeDefault.xctoolchain/usr/lib/swift -enable-anonymous-context-mangled-names -file-compilation-dir /Users/admin/builder/spi-builder-workspace/.swiftpm/xcode -Xcc -ivfsstatcache -Xcc /Users/admin/builder/spi-builder-workspace/.derivedData/SDKStatCaches.noindex/macosx15.4-24E241-8287b8f5db97e746a1562fbca0c9d29b.sdkstatcache -Xcc -I/Users/admin/builder/spi-builder-workspace/.derivedData/Build/Intermediates.noindex/RemoteImage.build/Debug/RemoteImage.build/swift-overrides.hmap -Xcc -I/Users/admin/builder/spi-builder-workspace/.derivedData/Build/Products/Debug/include -Xcc -I/Users/admin/builder/spi-builder-workspace/.derivedData/Build/Intermediates.noindex/RemoteImage.build/Debug/RemoteImage.build/DerivedSources-normal/arm64 -Xcc -I/Users/admin/builder/spi-builder-workspace/.derivedData/Build/Intermediates.noindex/RemoteImage.build/Debug/RemoteImage.build/DerivedSources/arm64 -Xcc -I/Users/admin/builder/spi-builder-workspace/.derivedData/Build/Intermediates.noindex/RemoteImage.build/Debug/RemoteImage.build/DerivedSources -Xcc -DSWIFT_PACKAGE -Xcc -DDEBUG\=1 -module-name RemoteImage -frontend-parseable-output -disable-clang-spi -target-sdk-version 15.4 -target-sdk-name macosx15.4 -external-plugin-path /Applications/Xcode-16.3.0.app/Contents/Developer/Platforms/MacOSX.platform/Developer/usr/lib/swift/host/plugins\#/Applications/Xcode-16.3.0.app/Contents/Developer/Platforms/MacOSX.platform/Developer/usr/bin/swift-plugin-server -external-plugin-path /Applications/Xcode-16.3.0.app/Contents/Developer/Platforms/MacOSX.platform/Developer/usr/local/lib/swift/host/plugins\#/Applications/Xcode-16.3.0.app/Contents/Developer/Platforms/MacOSX.platform/Developer/usr/bin/swift-plugin-server -in-process-plugin-server-path /Applications/Xcode-16.3.0.app/Contents/Developer/Toolchains/XcodeDefault.xctoolchain/usr/lib/swift/host/libSwiftInProcPluginServer.dylib -plugin-path /Applications/Xcode-16.3.0.app/Contents/Developer/Toolchains/XcodeDefault.xctoolchain/usr/lib/swift/host/plugins -plugin-path /Applications/Xcode-16.3.0.app/Contents/Developer/Toolchains/XcodeDefault.xctoolchain/usr/local/lib/swift/host/plugins -emit-module-doc-path /Users/admin/builder/spi-builder-workspace/.derivedData/Build/Intermediates.noindex/RemoteImage.build/Debug/RemoteImage.build/Objects-normal/arm64/RemoteImage.swiftdoc -emit-module-source-info-path /Users/admin/builder/spi-builder-workspace/.derivedData/Build/Intermediates.noindex/RemoteImage.build/Debug/RemoteImage.build/Objects-normal/arm64/RemoteImage.swiftsourceinfo -emit-objc-header-path /Users/admin/builder/spi-builder-workspace/.derivedData/Build/Intermediates.noindex/RemoteImage.build/Debug/RemoteImage.build/Objects-normal/arm64/RemoteImage-Swift.h -serialize-diagnostics-path /Users/admin/builder/spi-builder-workspace/.derivedData/Build/Intermediates.noindex/RemoteImage.build/Debug/RemoteImage.build/Objects-normal/arm64/RemoteImage-master-emit-module.dia -emit-dependencies-path /Users/admin/builder/spi-builder-workspace/.derivedData/Build/Intermediates.noindex/RemoteImage.build/Debug/RemoteImage.build/Objects-normal/arm64/RemoteImage-master-emit-module.d -o /Users/admin/builder/spi-builder-workspace/.derivedData/Build/Intermediates.noindex/RemoteImage.build/Debug/RemoteImage.build/Objects-normal/arm64/RemoteImage.swiftmodule -emit-abi-descriptor-path /Users/admin/builder/spi-builder-workspace/.derivedData/Build/Intermediates.noindex/RemoteImage.build/Debug/RemoteImage.build/Objects-normal/arm64/RemoteImage.abi.json
EmitSwiftModule normal arm64 (in target 'RemoteImage' from project 'RemoteImage')
    cd /Users/admin/builder/spi-builder-workspace/.swiftpm/xcode

/Users/admin/builder/spi-builder-workspace/Sources/RemoteImage/UI/RemoteImage.swift:20:32: error: cannot find type 'UIImage' in scope
    @State private  var image: UIImage? = .none
                               ^~~~~~~
/Users/admin/builder/spi-builder-workspace/Sources/RemoteImage/UI/RemoteImage.swift:13:27: error: cannot find 'GetImageUseCase' in scope
    private let useCase = GetImageUseCase()
                          ^~~~~~~~~~~~~~~
/Users/admin/builder/spi-builder-workspace/Sources/RemoteImage/UI/RemoteImage.swift:16:28: error: cannot find type 'RemoteImageParamter' in scope
    private let parameter: RemoteImageParamter
                           ^~~~~~~~~~~~~~~~~~~
/Users/admin/builder/spi-builder-workspace/Sources/RemoteImage/UI/RemoteImage.swift:17:27: error: 'Image' is only available in macOS 10.15 or newer
    private let content: (Image) -> Content
                          ^
/Users/admin/builder/spi-builder-workspace/Sources/RemoteImage/UI/RemoteImage.swift:11:15: note: add @available attribute to enclosing generic struct
public struct RemoteImage<Content: View, Placeholder: View>: View {
              ^
/Users/admin/builder/spi-builder-workspace/Sources/RemoteImage/UI/RemoteImage.swift:20:6: error: 'State' is only available in macOS 10.15 or newer
    @State private  var image: UIImage? = .none
     ^
/Users/admin/builder/spi-builder-workspace/Sources/RemoteImage/UI/RemoteImage.swift:11:15: note: add @available attribute to enclosing generic struct
public struct RemoteImage<Content: View, Placeholder: View>: View {
              ^
/Users/admin/builder/spi-builder-workspace/Sources/RemoteImage/UI/RemoteImage.swift:24:20: error: cannot find type 'RemoteImageParamter' in scope
        parameter: RemoteImageParamter = .init(),
                   ^~~~~~~~~~~~~~~~~~~
/Users/admin/builder/spi-builder-workspace/Sources/RemoteImage/UI/RemoteImage.swift:25:29: error: 'Image' is only available in macOS 10.15 or newer
        content: @escaping (Image) -> Content,
                            ^
/Users/admin/builder/spi-builder-workspace/Sources/RemoteImage/UI/RemoteImage.swift:22:12: note: add @available attribute to enclosing initializer
    public init(
           ^
/Users/admin/builder/spi-builder-workspace/Sources/RemoteImage/UI/RemoteImage.swift:11:15: note: add @available attribute to enclosing generic struct
public struct RemoteImage<Content: View, Placeholder: View>: View {
              ^
/Users/admin/builder/spi-builder-workspace/Sources/RemoteImage/UI/RemoteImage.swift:34:27: error: 'View' is only available in macOS 10.15 or newer
    public var body: some View {
                          ^
/Users/admin/builder/spi-builder-workspace/Sources/RemoteImage/UI/RemoteImage.swift:34:16: note: add @available attribute to enclosing property
    public var body: some View {
               ^
/Users/admin/builder/spi-builder-workspace/Sources/RemoteImage/UI/RemoteImage.swift:11:15: note: add @available attribute to enclosing generic struct
public struct RemoteImage<Content: View, Placeholder: View>: View {
              ^
/Users/admin/builder/spi-builder-workspace/Sources/RemoteImage/UI/RemoteImage.swift:11:36: error: 'View' is only available in macOS 10.15 or newer
public struct RemoteImage<Content: View, Placeholder: View>: View {
                                   ^
/Users/admin/builder/spi-builder-workspace/Sources/RemoteImage/UI/RemoteImage.swift:11:15: note: add @available attribute to enclosing generic struct
public struct RemoteImage<Content: View, Placeholder: View>: View {
              ^
/Users/admin/builder/spi-builder-workspace/Sources/RemoteImage/UI/RemoteImage.swift:11:55: error: 'View' is only available in macOS 10.15 or newer
public struct RemoteImage<Content: View, Placeholder: View>: View {
                                                      ^
/Users/admin/builder/spi-builder-workspace/Sources/RemoteImage/UI/RemoteImage.swift:11:15: note: add @available attribute to enclosing generic struct
public struct RemoteImage<Content: View, Placeholder: View>: View {
              ^
SwiftCompile normal arm64 Compiling\ GetImageUseCase.swift /Users/admin/builder/spi-builder-workspace/Sources/RemoteImage/UseCase/GetImageUseCase.swift (in target 'RemoteImage' from project 'RemoteImage')
SwiftCompile normal arm64 /Users/admin/builder/spi-builder-workspace/Sources/RemoteImage/UseCase/GetImageUseCase.swift (in target 'RemoteImage' from project 'RemoteImage')
    cd /Users/admin/builder/spi-builder-workspace/.swiftpm/xcode

SwiftCompile normal arm64 Compiling\ UIImageView+remoteImage.swift /Users/admin/builder/spi-builder-workspace/Sources/RemoteImage/UI/UIImageView+remoteImage.swift (in target 'RemoteImage' from project 'RemoteImage')
SwiftCompile normal arm64 /Users/admin/builder/spi-builder-workspace/Sources/RemoteImage/UI/UIImageView+remoteImage.swift (in target 'RemoteImage' from project 'RemoteImage')
    cd /Users/admin/builder/spi-builder-workspace/.swiftpm/xcode

--- xcodebuild: WARNING: Using the first of multiple matching destinations:
{ platform:macOS, arch:arm64, id:f769b1355279f82bbd70139b931e1037ad0b423a, name:My Mac }
{ platform:macOS, arch:arm64, variant:Mac Catalyst, id:f769b1355279f82bbd70139b931e1037ad0b423a, name:My Mac }
{ platform:macOS, arch:arm64, variant:DriverKit, id:f769b1355279f82bbd70139b931e1037ad0b423a, name:My Mac }
{ platform:macOS, arch:arm64, variant:Designed for [iPad,iPhone], id:f769b1355279f82bbd70139b931e1037ad0b423a, name:My Mac }
** BUILD FAILED **
The following build commands failed:
	SwiftEmitModule normal arm64 Emitting\ module\ for\ RemoteImage (in target 'RemoteImage' from project 'RemoteImage')
	EmitSwiftModule normal arm64 (in target 'RemoteImage' from project 'RemoteImage')
	Building workspace spi-builder-workspace with scheme RemoteImage
(3 failures)
BUILD FAILURE 6.1 macosXcodebuild