The Swift Package Index logo.Swift Package Index

Track the adoption of Swift 6 strict concurrency checks for data race safety. How many packages are Ready for Swift 6?

Build Information

Failed to build MIDIKit, reference main (690260), with Swift 5.9 for Linux on 10 Feb 2025 00:32:55 UTC.

Build Command

bash -c docker run --pull=always --rm -v "checkouts-4609320-1":/host -w "$PWD" registry.gitlab.com/finestructure/spi-images:basic-5.9-latest swift build --triple x86_64-unknown-linux-gnu 2>&1

Build Log

========================================
RunAll
========================================
Builder version: 4.60.1
Interrupt handler set up.
========================================
Checkout
========================================
Clone URL: https://github.com/orchetect/MIDIKit.git
Reference: main
Initialized empty Git repository in /host/spi-builder-workspace/.git/
hint: Using 'master' as the name for the initial branch. This default branch name
hint: is subject to change. To configure the initial branch name to use in all
hint: of your new repositories, which will suppress this warning, call:
hint:
hint: 	git config --global init.defaultBranch <name>
hint:
hint: Names commonly chosen instead of 'master' are 'main', 'trunk' and
hint: 'development'. The just-created branch can be renamed via this command:
hint:
hint: 	git branch -m <name>
From https://github.com/orchetect/MIDIKit
 * branch            main       -> FETCH_HEAD
 * [new branch]      main       -> origin/main
HEAD is now at 6902607 MIDIKitSync: `MTCReceiver` & `MTCDecoder`: Updated inline docs (#232)
Cloned https://github.com/orchetect/MIDIKit.git
Revision (git rev-parse @):
6902607ec98a4b8b54cac6d2a4d89fd860284819
SPI manifest file found: $PWD/.spi.yml
SUCCESS checkout https://github.com/orchetect/MIDIKit.git at main
========================================
Build
========================================
Selected platform:         linux
Swift version:             5.9
Building package at path:  $PWD
https://github.com/orchetect/MIDIKit.git
Running build ...
bash -c docker run --pull=always --rm -v "checkouts-4609320-1":/host -w "$PWD" registry.gitlab.com/finestructure/spi-images:basic-5.9-latest swift build --triple x86_64-unknown-linux-gnu 2>&1
basic-5.9-latest: Pulling from finestructure/spi-images
Digest: sha256:e6feefcc5d5d2f301fe47477cfe0928fc3b12c59579fdacf1d387095b6fee662
Status: Image is up to date for registry.gitlab.com/finestructure/spi-images:basic-5.9-latest
Fetching https://github.com/orchetect/TimecodeKit
[1/23092] Fetching timecodekit
Fetched https://github.com/orchetect/TimecodeKit (1.21s)
Computing version for https://github.com/orchetect/TimecodeKit
Computed https://github.com/orchetect/TimecodeKit at 2.3.3 (0.36s)
Creating working copy for https://github.com/orchetect/TimecodeKit
Working copy of https://github.com/orchetect/TimecodeKit resolved at 2.3.3
Building for debugging...
[0/4] Copying PrivacyInfo.xcprivacy
error: emit-module command failed with exit code 1 (use -v to see invocation)
[3/97] Emitting module MIDIKitInternals
/host/spi-builder-workspace/Sources/MIDIKitInternals/Core MIDI/IO Constants.swift:7:8: error: no such module 'CoreMIDI'
import CoreMIDI
       ^
[4/99] Compiling TimecodeKitCore Timecode.swift
/host/spi-builder-workspace/.build/checkouts/TimecodeKit/Sources/TimecodeKitCore/Timecode/Protocol Adoptions/Comparable.swift:7:8: error: no such module 'Darwin'
import Darwin
       ^
[5/99] Compiling TimecodeKitCore UpperLimit.swift
/host/spi-builder-workspace/.build/checkouts/TimecodeKit/Sources/TimecodeKitCore/Timecode/Protocol Adoptions/Comparable.swift:7:8: error: no such module 'Darwin'
import Darwin
       ^
[6/99] Compiling TimecodeKitCore TimecodeFrameRate CompatibleGroup.swift
/host/spi-builder-workspace/.build/checkouts/TimecodeKit/Sources/TimecodeKitCore/Timecode/Protocol Adoptions/Comparable.swift:7:8: error: no such module 'Darwin'
import Darwin
       ^
[7/99] Compiling TimecodeKitCore TimecodeFrameRate Conversions.swift
/host/spi-builder-workspace/.build/checkouts/TimecodeKit/Sources/TimecodeKitCore/Timecode/Protocol Adoptions/Comparable.swift:7:8: error: no such module 'Darwin'
import Darwin
       ^
[8/99] Compiling TimecodeKitCore TimecodeFrameRate Formats.swift
/host/spi-builder-workspace/.build/checkouts/TimecodeKit/Sources/TimecodeKitCore/Timecode/Protocol Adoptions/Comparable.swift:7:8: error: no such module 'Darwin'
import Darwin
       ^
[9/99] Compiling TimecodeKitCore TimecodeFrameRate Properties.swift
/host/spi-builder-workspace/.build/checkouts/TimecodeKit/Sources/TimecodeKitCore/Timecode/Protocol Adoptions/Comparable.swift:7:8: error: no such module 'Darwin'
import Darwin
       ^
[10/99] Compiling TimecodeKitCore TimecodeFrameRate.swift
/host/spi-builder-workspace/.build/checkouts/TimecodeKit/Sources/TimecodeKitCore/Timecode/Protocol Adoptions/Comparable.swift:7:8: error: no such module 'Darwin'
import Darwin
       ^
[11/99] Compiling TimecodeKitCore TimecodeInterval Rational CMTime.swift
/host/spi-builder-workspace/.build/checkouts/TimecodeKit/Sources/TimecodeKitCore/Timecode/Protocol Adoptions/Comparable.swift:7:8: error: no such module 'Darwin'
import Darwin
       ^
[12/99] Compiling TimecodeKitCore TimecodeInterval Rational.swift
/host/spi-builder-workspace/.build/checkouts/TimecodeKit/Sources/TimecodeKitCore/Timecode/Protocol Adoptions/Comparable.swift:7:8: error: no such module 'Darwin'
import Darwin
       ^
[13/99] Compiling TimecodeKitCore TimecodeInterval Real Time.swift
/host/spi-builder-workspace/.build/checkouts/TimecodeKit/Sources/TimecodeKitCore/Timecode/Protocol Adoptions/Comparable.swift:7:8: error: no such module 'Darwin'
import Darwin
       ^
[14/99] Compiling TimecodeKitCore TimecodeInterval Unary Operators.swift
/host/spi-builder-workspace/.build/checkouts/TimecodeKit/Sources/TimecodeKitCore/Timecode/Protocol Adoptions/Comparable.swift:7:8: error: no such module 'Darwin'
import Darwin
       ^
[15/99] Compiling TimecodeKitCore TimecodeInterval.swift
/host/spi-builder-workspace/.build/checkouts/TimecodeKit/Sources/TimecodeKitCore/Timecode/Protocol Adoptions/Comparable.swift:7:8: error: no such module 'Darwin'
import Darwin
       ^
[16/99] Compiling TimecodeKitCore TimecodeKitCore.swift
/host/spi-builder-workspace/.build/checkouts/TimecodeKit/Sources/TimecodeKitCore/Timecode/Protocol Adoptions/Comparable.swift:7:8: error: no such module 'Darwin'
import Darwin
       ^
[17/99] Compiling TimecodeKitCore TimecodeTransformer.swift
/host/spi-builder-workspace/.build/checkouts/TimecodeKit/Sources/TimecodeKitCore/Timecode/Protocol Adoptions/Comparable.swift:7:8: error: no such module 'Darwin'
import Darwin
       ^
[18/99] Compiling TimecodeKitCore CharacterSet.swift
/host/spi-builder-workspace/.build/checkouts/TimecodeKit/Sources/TimecodeKitCore/Timecode/Protocol Adoptions/Comparable.swift:7:8: error: no such module 'Darwin'
import Darwin
       ^
[19/99] Compiling TimecodeKitCore Decimal.swift
/host/spi-builder-workspace/.build/checkouts/TimecodeKit/Sources/TimecodeKitCore/Timecode/Protocol Adoptions/Comparable.swift:7:8: error: no such module 'Darwin'
import Darwin
       ^
[20/99] Compiling TimecodeKitCore FloatingPoint and Darwin.swift
/host/spi-builder-workspace/.build/checkouts/TimecodeKit/Sources/TimecodeKitCore/Timecode/Protocol Adoptions/Comparable.swift:7:8: error: no such module 'Darwin'
import Darwin
       ^
[21/99] Compiling TimecodeKitCore FloatingPoint and Foundation.swift
/host/spi-builder-workspace/.build/checkouts/TimecodeKit/Sources/TimecodeKitCore/Timecode/Protocol Adoptions/Comparable.swift:7:8: error: no such module 'Darwin'
import Darwin
       ^
[22/99] Compiling TimecodeKitCore FloatingPoint.swift
/host/spi-builder-workspace/.build/checkouts/TimecodeKit/Sources/TimecodeKitCore/Timecode/Protocol Adoptions/Comparable.swift:7:8: error: no such module 'Darwin'
import Darwin
       ^
[23/99] Compiling TimecodeKitCore FloatingPointPowerComputable.swift
/host/spi-builder-workspace/.build/checkouts/TimecodeKit/Sources/TimecodeKitCore/Timecode/Protocol Adoptions/Comparable.swift:7:8: error: no such module 'Darwin'
import Darwin
       ^
[24/109] Compiling TimecodeKitCore Timecode Operators.swift
/host/spi-builder-workspace/.build/checkouts/TimecodeKit/Sources/TimecodeKitCore/Timecode/Protocol Adoptions/Comparable.swift:7:8: error: no such module 'Darwin'
import Darwin
       ^
[25/109] Compiling MIDIKitInternals Threading.swift
/host/spi-builder-workspace/.build/checkouts/TimecodeKit/Sources/TimecodeKitCore/Timecode/Protocol Adoptions/Comparable.swift:7:8: error: no such module 'Darwin'
import Darwin
       ^
[26/109] Compiling MIDIKitInternals resource_bundle_accessor.swift
/host/spi-builder-workspace/.build/checkouts/TimecodeKit/Sources/TimecodeKitCore/Timecode/Protocol Adoptions/Comparable.swift:7:8: error: no such module 'Darwin'
import Darwin
       ^
[27/109] Compiling TimecodeKitCore Comparable.swift
/host/spi-builder-workspace/.build/checkouts/TimecodeKit/Sources/TimecodeKitCore/Timecode/Protocol Adoptions/Comparable.swift:7:8: error: no such module 'Darwin'
import Darwin
       ^
[28/109] Compiling TimecodeKitCore CustomStringConvertible.swift
/host/spi-builder-workspace/.build/checkouts/TimecodeKit/Sources/TimecodeKitCore/Timecode/Protocol Adoptions/Comparable.swift:7:8: error: no such module 'Darwin'
import Darwin
       ^
[29/109] Compiling TimecodeKitCore Hashable.swift
/host/spi-builder-workspace/.build/checkouts/TimecodeKit/Sources/TimecodeKitCore/Timecode/Protocol Adoptions/Comparable.swift:7:8: error: no such module 'Darwin'
import Darwin
       ^
[30/109] Compiling TimecodeKitCore Identifiable.swift
/host/spi-builder-workspace/.build/checkouts/TimecodeKit/Sources/TimecodeKitCore/Timecode/Protocol Adoptions/Comparable.swift:7:8: error: no such module 'Darwin'
import Darwin
       ^
[31/109] Compiling TimecodeKitCore Sendable.swift
/host/spi-builder-workspace/.build/checkouts/TimecodeKit/Sources/TimecodeKitCore/Timecode/Protocol Adoptions/Comparable.swift:7:8: error: no such module 'Darwin'
import Darwin
       ^
[32/109] Compiling TimecodeKitCore Strideable.swift
/host/spi-builder-workspace/.build/checkouts/TimecodeKit/Sources/TimecodeKitCore/Timecode/Protocol Adoptions/Comparable.swift:7:8: error: no such module 'Darwin'
import Darwin
       ^
[33/109] Compiling TimecodeKitCore Timecode Source Protocols.swift
/host/spi-builder-workspace/.build/checkouts/TimecodeKit/Sources/TimecodeKitCore/Timecode/Protocol Adoptions/Comparable.swift:7:8: error: no such module 'Darwin'
import Darwin
       ^
[34/109] Compiling TimecodeKitCore Timecode Math Internal.swift
/host/spi-builder-workspace/Sources/MIDIKitInternals/Core MIDI/IO Constants.swift:7:8: error: no such module 'CoreMIDI'
import CoreMIDI
       ^
[35/109] Compiling TimecodeKitCore Timecode Math Public.swift
/host/spi-builder-workspace/Sources/MIDIKitInternals/Core MIDI/IO Constants.swift:7:8: error: no such module 'CoreMIDI'
import CoreMIDI
       ^
/host/spi-builder-workspace/Sources/MIDIKitInternals/Core MIDI/IO Constants.swift:7:8: error: no such module 'CoreMIDI'
import CoreMIDI
       ^
[37/109] Compiling TimecodeKitCore ComponentRanges.swift
/host/spi-builder-workspace/.build/checkouts/TimecodeKit/Sources/TimecodeKitCore/Timecode/Protocol Adoptions/Comparable.swift:7:8: error: no such module 'Darwin'
import Darwin
       ^
[38/109] Compiling TimecodeKitCore Components.swift
/host/spi-builder-workspace/.build/checkouts/TimecodeKit/Sources/TimecodeKitCore/Timecode/Protocol Adoptions/Comparable.swift:7:8: error: no such module 'Darwin'
import Darwin
       ^
[39/109] Compiling TimecodeKitCore NSItemProvider.swift
/host/spi-builder-workspace/.build/checkouts/TimecodeKit/Sources/TimecodeKitCore/Timecode/Protocol Adoptions/Comparable.swift:7:8: error: no such module 'Darwin'
import Darwin
       ^
[40/109] Compiling TimecodeKitCore Transferable.swift
/host/spi-builder-workspace/.build/checkouts/TimecodeKit/Sources/TimecodeKitCore/Timecode/Protocol Adoptions/Comparable.swift:7:8: error: no such module 'Darwin'
import Darwin
       ^
[41/109] Compiling TimecodeKitCore UTType.swift
/host/spi-builder-workspace/.build/checkouts/TimecodeKit/Sources/TimecodeKitCore/Timecode/Protocol Adoptions/Comparable.swift:7:8: error: no such module 'Darwin'
import Darwin
       ^
[42/109] Compiling TimecodeKitCore Errors.swift
/host/spi-builder-workspace/.build/checkouts/TimecodeKit/Sources/TimecodeKitCore/Timecode/Protocol Adoptions/Comparable.swift:7:8: error: no such module 'Darwin'
import Darwin
       ^
[43/109] Compiling TimecodeKitCore FrameCount Value.swift
/host/spi-builder-workspace/.build/checkouts/TimecodeKit/Sources/TimecodeKitCore/Timecode/Protocol Adoptions/Comparable.swift:7:8: error: no such module 'Darwin'
import Darwin
       ^
[44/109] Compiling TimecodeKitCore FrameCount.swift
/host/spi-builder-workspace/.build/checkouts/TimecodeKit/Sources/TimecodeKitCore/Timecode/Protocol Adoptions/Comparable.swift:7:8: error: no such module 'Darwin'
import Darwin
       ^
/host/spi-builder-workspace/.build/checkouts/TimecodeKit/Sources/TimecodeKitCore/Timecode/Protocol Adoptions/Comparable.swift:7:8: error: no such module 'Darwin'
import Darwin
       ^
/host/spi-builder-workspace/.build/checkouts/TimecodeKit/Sources/TimecodeKitCore/Timecode/Protocol Adoptions/Comparable.swift:7:8: error: no such module 'Darwin'
import Darwin
       ^
[47/109] Compiling TimecodeKitCore Component.swift
/host/spi-builder-workspace/Sources/MIDIKitInternals/Core MIDI/IO Constants.swift:7:8: error: no such module 'CoreMIDI'
import CoreMIDI
       ^
/host/spi-builder-workspace/Sources/MIDIKitInternals/Core MIDI/IO Constants.swift:7:8: error: no such module 'CoreMIDI'
import CoreMIDI
       ^
/host/spi-builder-workspace/Sources/MIDIKitInternals/Core MIDI/IO Constants.swift:7:8: error: no such module 'CoreMIDI'
import CoreMIDI
       ^
[50/109] Compiling TimecodeKitCore CMTimeRange Extensions.swift
/host/spi-builder-workspace/Sources/MIDIKitInternals/Core MIDI/IO Constants.swift:7:8: error: no such module 'CoreMIDI'
import CoreMIDI
       ^
[51/109] Compiling TimecodeKitCore FeetAndFrames.swift
/host/spi-builder-workspace/Sources/MIDIKitInternals/Core MIDI/IO Constants.swift:7:8: error: no such module 'CoreMIDI'
import CoreMIDI
       ^
[52/109] Compiling TimecodeKitCore Fraction CMTime.swift
/host/spi-builder-workspace/Sources/MIDIKitInternals/Core MIDI/IO Constants.swift:7:8: error: no such module 'CoreMIDI'
import CoreMIDI
       ^
[53/109] Compiling TimecodeKitCore Fraction.swift
/host/spi-builder-workspace/Sources/MIDIKitInternals/Core MIDI/IO Constants.swift:7:8: error: no such module 'CoreMIDI'
import CoreMIDI
       ^
[54/109] Compiling TimecodeKitCore FrameRateProtocol Properties.swift
/host/spi-builder-workspace/Sources/MIDIKitInternals/Core MIDI/IO Constants.swift:7:8: error: no such module 'CoreMIDI'
import CoreMIDI
       ^
[55/109] Compiling TimecodeKitCore FrameRateProtocol.swift
/host/spi-builder-workspace/Sources/MIDIKitInternals/Core MIDI/IO Constants.swift:7:8: error: no such module 'CoreMIDI'
import CoreMIDI
       ^
/host/spi-builder-workspace/Sources/MIDIKitInternals/Core MIDI/IO Constants.swift:7:8: error: no such module 'CoreMIDI'
import CoreMIDI
       ^
/host/spi-builder-workspace/Sources/MIDIKitInternals/Core MIDI/IO Constants.swift:7:8: error: no such module 'CoreMIDI'
import CoreMIDI
       ^
[58/109] Compiling TimecodeKitCore Timecode Components.swift
/host/spi-builder-workspace/.build/checkouts/TimecodeKit/Sources/TimecodeKitCore/Timecode/Protocol Adoptions/Comparable.swift:7:8: error: no such module 'Darwin'
import Darwin
       ^
[59/109] Compiling TimecodeKitCore Timecode FeetAndFrames.swift
/host/spi-builder-workspace/.build/checkouts/TimecodeKit/Sources/TimecodeKitCore/Timecode/Protocol Adoptions/Comparable.swift:7:8: error: no such module 'Darwin'
import Darwin
       ^
[60/109] Compiling TimecodeKitCore Timecode FrameCount Value.swift
/host/spi-builder-workspace/.build/checkouts/TimecodeKit/Sources/TimecodeKitCore/Timecode/Protocol Adoptions/Comparable.swift:7:8: error: no such module 'Darwin'
import Darwin
       ^
[61/109] Compiling TimecodeKitCore Timecode FrameCount.swift
/host/spi-builder-workspace/.build/checkouts/TimecodeKit/Sources/TimecodeKitCore/Timecode/Protocol Adoptions/Comparable.swift:7:8: error: no such module 'Darwin'
import Darwin
       ^
[62/109] Compiling TimecodeKitCore Timecode Random.swift
/host/spi-builder-workspace/.build/checkouts/TimecodeKit/Sources/TimecodeKitCore/Timecode/Protocol Adoptions/Comparable.swift:7:8: error: no such module 'Darwin'
import Darwin
       ^
[63/109] Compiling TimecodeKitCore Timecode Rational CMTime.swift
/host/spi-builder-workspace/.build/checkouts/TimecodeKit/Sources/TimecodeKitCore/Timecode/Protocol Adoptions/Comparable.swift:7:8: error: no such module 'Darwin'
import Darwin
       ^
[64/109] Compiling TimecodeKitCore Timecode Rational.swift
/host/spi-builder-workspace/.build/checkouts/TimecodeKit/Sources/TimecodeKitCore/Timecode/Protocol Adoptions/Comparable.swift:7:8: error: no such module 'Darwin'
import Darwin
       ^
[65/109] Compiling TimecodeKitCore Timecode Real Time.swift
/host/spi-builder-workspace/.build/checkouts/TimecodeKit/Sources/TimecodeKitCore/Timecode/Protocol Adoptions/Comparable.swift:7:8: error: no such module 'Darwin'
import Darwin
       ^
[66/109] Compiling TimecodeKitCore Timecode Samples.swift
/host/spi-builder-workspace/.build/checkouts/TimecodeKit/Sources/TimecodeKitCore/Timecode/Protocol Adoptions/Comparable.swift:7:8: error: no such module 'Darwin'
import Darwin
       ^
[67/109] Compiling TimecodeKitCore Timecode String.swift
/host/spi-builder-workspace/.build/checkouts/TimecodeKit/Sources/TimecodeKitCore/Timecode/Protocol Adoptions/Comparable.swift:7:8: error: no such module 'Darwin'
import Darwin
       ^
[68/109] Compiling TimecodeKitCore Timecode TimecodeInterval.swift
/host/spi-builder-workspace/.build/checkouts/TimecodeKit/Sources/TimecodeKitCore/Timecode/Protocol Adoptions/Comparable.swift:7:8: error: no such module 'Darwin'
import Darwin
       ^
[69/109] Compiling TimecodeKitCore Timecode Zero.swift
/host/spi-builder-workspace/.build/checkouts/TimecodeKit/Sources/TimecodeKitCore/Timecode/Protocol Adoptions/Comparable.swift:7:8: error: no such module 'Darwin'
import Darwin
       ^
[70/109] Compiling TimecodeKitCore StringFormat.swift
/host/spi-builder-workspace/.build/checkouts/TimecodeKit/Sources/TimecodeKitCore/Timecode/Protocol Adoptions/Comparable.swift:7:8: error: no such module 'Darwin'
import Darwin
       ^
[71/109] Compiling TimecodeKitCore StringFormatOption.swift
/host/spi-builder-workspace/.build/checkouts/TimecodeKit/Sources/TimecodeKitCore/Timecode/Protocol Adoptions/Comparable.swift:7:8: error: no such module 'Darwin'
import Darwin
       ^
[72/109] Compiling TimecodeKitCore SubFramesBase.swift
/host/spi-builder-workspace/.build/checkouts/TimecodeKit/Sources/TimecodeKitCore/Timecode/Protocol Adoptions/Comparable.swift:7:8: error: no such module 'Darwin'
import Darwin
       ^
[73/109] Compiling TimecodeKitCore Timecode Conversion.swift
/host/spi-builder-workspace/.build/checkouts/TimecodeKit/Sources/TimecodeKitCore/Timecode/Protocol Adoptions/Comparable.swift:7:8: error: no such module 'Darwin'
import Darwin
       ^
[74/109] Compiling TimecodeKitCore Timecode Properties.swift
/host/spi-builder-workspace/.build/checkouts/TimecodeKit/Sources/TimecodeKitCore/Timecode/Protocol Adoptions/Comparable.swift:7:8: error: no such module 'Darwin'
import Darwin
       ^
[75/109] Compiling TimecodeKitCore Timecode Validation.swift
/host/spi-builder-workspace/.build/checkouts/TimecodeKit/Sources/TimecodeKitCore/Timecode/Protocol Adoptions/Comparable.swift:7:8: error: no such module 'Darwin'
import Darwin
       ^
[76/109] Compiling TimecodeKitCore Timecode init.swift
/host/spi-builder-workspace/.build/checkouts/TimecodeKit/Sources/TimecodeKitCore/Timecode/Protocol Adoptions/Comparable.swift:7:8: error: no such module 'Darwin'
import Darwin
       ^
[77/109] Compiling TimecodeKitCore Timecode set.swift
/host/spi-builder-workspace/.build/checkouts/TimecodeKit/Sources/TimecodeKitCore/Timecode/Protocol Adoptions/Comparable.swift:7:8: error: no such module 'Darwin'
import Darwin
       ^
error: emit-module command failed with exit code 1 (use -v to see invocation)
[78/109] Emitting module TimecodeKitCore
/host/spi-builder-workspace/.build/checkouts/TimecodeKit/Sources/TimecodeKitCore/Timecode/Protocol Adoptions/Comparable.swift:7:8: error: no such module 'Darwin'
import Darwin
       ^
[79/109] Compiling TimecodeKitCore TimecodeKitCore-API-2.3.0.swift
/host/spi-builder-workspace/.build/checkouts/TimecodeKit/Sources/TimecodeKitCore/Timecode/Protocol Adoptions/Comparable.swift:7:8: error: no such module 'Darwin'
import Darwin
       ^
[80/109] Compiling TimecodeKitCore TimecodeKitCore-API-2.3.1.swift
/host/spi-builder-workspace/.build/checkouts/TimecodeKit/Sources/TimecodeKitCore/Timecode/Protocol Adoptions/Comparable.swift:7:8: error: no such module 'Darwin'
import Darwin
       ^
[81/109] Compiling TimecodeKitCore TimecodeKitCore-API-2.3.2.swift
/host/spi-builder-workspace/.build/checkouts/TimecodeKit/Sources/TimecodeKitCore/Timecode/Protocol Adoptions/Comparable.swift:7:8: error: no such module 'Darwin'
import Darwin
       ^
/host/spi-builder-workspace/.build/checkouts/TimecodeKit/Sources/TimecodeKitCore/Timecode/Protocol Adoptions/Comparable.swift:7:8: error: no such module 'Darwin'
import Darwin
       ^
/host/spi-builder-workspace/.build/checkouts/TimecodeKit/Sources/TimecodeKitCore/Timecode/Protocol Adoptions/Comparable.swift:7:8: error: no such module 'Darwin'
import Darwin
       ^
/host/spi-builder-workspace/.build/checkouts/TimecodeKit/Sources/TimecodeKitCore/Timecode/Protocol Adoptions/Comparable.swift:7:8: error: no such module 'Darwin'
import Darwin
       ^
/host/spi-builder-workspace/.build/checkouts/TimecodeKit/Sources/TimecodeKitCore/Timecode/Protocol Adoptions/Comparable.swift:7:8: error: no such module 'Darwin'
import Darwin
       ^
/host/spi-builder-workspace/.build/checkouts/TimecodeKit/Sources/TimecodeKitCore/Timecode/Protocol Adoptions/Comparable.swift:7:8: error: no such module 'Darwin'
import Darwin
       ^
/host/spi-builder-workspace/.build/checkouts/TimecodeKit/Sources/TimecodeKitCore/Timecode/Protocol Adoptions/Comparable.swift:7:8: error: no such module 'Darwin'
import Darwin
       ^
/host/spi-builder-workspace/.build/checkouts/TimecodeKit/Sources/TimecodeKitCore/Timecode/Protocol Adoptions/Comparable.swift:7:8: error: no such module 'Darwin'
import Darwin
       ^
/host/spi-builder-workspace/Sources/MIDIKitInternals/Core MIDI/IO Constants.swift:7:8: error: no such module 'CoreMIDI'
import CoreMIDI
       ^
/host/spi-builder-workspace/Sources/MIDIKitInternals/Core MIDI/IO Constants.swift:7:8: error: no such module 'CoreMIDI'
import CoreMIDI
       ^
/host/spi-builder-workspace/Sources/MIDIKitInternals/Core MIDI/IO Constants.swift:7:8: error: no such module 'CoreMIDI'
import CoreMIDI
       ^
/host/spi-builder-workspace/Sources/MIDIKitInternals/Core MIDI/IO Constants.swift:7:8: error: no such module 'CoreMIDI'
import CoreMIDI
       ^
/host/spi-builder-workspace/Sources/MIDIKitInternals/Core MIDI/IO Constants.swift:7:8: error: no such module 'CoreMIDI'
import CoreMIDI
       ^
/host/spi-builder-workspace/Sources/MIDIKitInternals/Core MIDI/IO Constants.swift:7:8: error: no such module 'CoreMIDI'
import CoreMIDI
       ^
/host/spi-builder-workspace/Sources/MIDIKitInternals/Core MIDI/IO Constants.swift:7:8: error: no such module 'CoreMIDI'
import CoreMIDI
       ^
/host/spi-builder-workspace/Sources/MIDIKitInternals/Core MIDI/IO Constants.swift:7:8: error: no such module 'CoreMIDI'
import CoreMIDI
       ^
/host/spi-builder-workspace/Sources/MIDIKitInternals/Core MIDI/IO Constants.swift:7:8: error: no such module 'CoreMIDI'
import CoreMIDI
       ^
[98/109] Compiling TimecodeKitCore Integers.swift
/host/spi-builder-workspace/.build/checkouts/TimecodeKit/Sources/TimecodeKitCore/Timecode/Protocol Adoptions/Comparable.swift:7:8: error: no such module 'Darwin'
import Darwin
       ^
[99/109] Compiling TimecodeKitCore NSAttributedString.swift
/host/spi-builder-workspace/.build/checkouts/TimecodeKit/Sources/TimecodeKitCore/Timecode/Protocol Adoptions/Comparable.swift:7:8: error: no such module 'Darwin'
import Darwin
       ^
[100/109] Compiling TimecodeKitCore Ranges.swift
/host/spi-builder-workspace/.build/checkouts/TimecodeKit/Sources/TimecodeKitCore/Timecode/Protocol Adoptions/Comparable.swift:7:8: error: no such module 'Darwin'
import Darwin
       ^
[101/109] Compiling TimecodeKitCore String and NSRegularExpression.swift
/host/spi-builder-workspace/.build/checkouts/TimecodeKit/Sources/TimecodeKitCore/Timecode/Protocol Adoptions/Comparable.swift:7:8: error: no such module 'Darwin'
import Darwin
       ^
[102/109] Compiling TimecodeKitCore RangeAttribute.swift
/host/spi-builder-workspace/.build/checkouts/TimecodeKit/Sources/TimecodeKitCore/Timecode/Protocol Adoptions/Comparable.swift:7:8: error: no such module 'Darwin'
import Darwin
       ^
[103/109] Compiling TimecodeKitCore URL.swift
/host/spi-builder-workspace/.build/checkouts/TimecodeKit/Sources/TimecodeKitCore/Timecode/Protocol Adoptions/Comparable.swift:7:8: error: no such module 'Darwin'
import Darwin
       ^
[104/109] Compiling TimecodeKitCore VideoFrameRate Conversions.swift
/host/spi-builder-workspace/.build/checkouts/TimecodeKit/Sources/TimecodeKitCore/Timecode/Protocol Adoptions/Comparable.swift:7:8: error: no such module 'Darwin'
import Darwin
       ^
[105/109] Compiling TimecodeKitCore VideoFrameRate Properties.swift
/host/spi-builder-workspace/.build/checkouts/TimecodeKit/Sources/TimecodeKitCore/Timecode/Protocol Adoptions/Comparable.swift:7:8: error: no such module 'Darwin'
import Darwin
       ^
[106/109] Compiling TimecodeKitCore VideoFrameRate String Extensions.swift
/host/spi-builder-workspace/.build/checkouts/TimecodeKit/Sources/TimecodeKitCore/Timecode/Protocol Adoptions/Comparable.swift:7:8: error: no such module 'Darwin'
import Darwin
       ^
[107/109] Compiling TimecodeKitCore VideoFrameRate.swift
/host/spi-builder-workspace/.build/checkouts/TimecodeKit/Sources/TimecodeKitCore/Timecode/Protocol Adoptions/Comparable.swift:7:8: error: no such module 'Darwin'
import Darwin
       ^
error: fatalError
BUILD FAILURE 5.9 linux