The Swift Package Index logo.Swift Package Index

Track the adoption of Swift 6 strict concurrency checks for data race safety. How many packages are Ready for Swift 6?

Build Information

Failed to build JoinedText, reference main (a2a6f0), with Swift 6.1 for tvOS using Xcode 16.3 on 26 Apr 2025 14:32:32 UTC.

Build Command

env DEVELOPER_DIR=/Applications/Xcode-16.3.0.app xcrun xcodebuild -IDEClonedSourcePackagesDirPathOverride=$PWD/.dependencies -skipMacroValidation -skipPackagePluginValidation -derivedDataPath $PWD/.derivedData build -scheme JoinedText -destination generic/platform=tvOS

Build Log

SwiftCompile normal arm64 /Users/admin/builder/spi-builder-workspace/.dependencies/checkouts/ViewInspector/Sources/ViewInspector/SwiftUI/Alert.swift (in target 'ViewInspector' from project 'ViewInspector')
    cd /Users/admin/builder/spi-builder-workspace/.swiftpm/xcode

SwiftCompile normal arm64 /Users/admin/builder/spi-builder-workspace/.dependencies/checkouts/ViewInspector/Sources/ViewInspector/SwiftUI/AngularGradient.swift (in target 'ViewInspector' from project 'ViewInspector')
    cd /Users/admin/builder/spi-builder-workspace/.swiftpm/xcode

SwiftCompile normal arm64 /Users/admin/builder/spi-builder-workspace/.dependencies/checkouts/ViewInspector/Sources/ViewInspector/SwiftUI/AnyView.swift (in target 'ViewInspector' from project 'ViewInspector')
    cd /Users/admin/builder/spi-builder-workspace/.swiftpm/xcode

SwiftCompile normal arm64 /Users/admin/builder/spi-builder-workspace/.dependencies/checkouts/ViewInspector/Sources/ViewInspector/SwiftUI/AsyncImage.swift (in target 'ViewInspector' from project 'ViewInspector')
    cd /Users/admin/builder/spi-builder-workspace/.swiftpm/xcode

SwiftCompile normal arm64 /Users/admin/builder/spi-builder-workspace/.dependencies/checkouts/ViewInspector/Sources/ViewInspector/SwiftUI/Button.swift (in target 'ViewInspector' from project 'ViewInspector')
    cd /Users/admin/builder/spi-builder-workspace/.swiftpm/xcode

SwiftCompile normal arm64 /Users/admin/builder/spi-builder-workspace/.dependencies/checkouts/ViewInspector/Sources/ViewInspector/SwiftUI/Canvas.swift (in target 'ViewInspector' from project 'ViewInspector')
    cd /Users/admin/builder/spi-builder-workspace/.swiftpm/xcode

SwiftCompile normal arm64 /Users/admin/builder/spi-builder-workspace/.dependencies/checkouts/ViewInspector/Sources/ViewInspector/SwiftUI/ClassifiedView.swift (in target 'ViewInspector' from project 'ViewInspector')
    cd /Users/admin/builder/spi-builder-workspace/.swiftpm/xcode

SwiftCompile normal arm64 /Users/admin/builder/spi-builder-workspace/.dependencies/checkouts/ViewInspector/Sources/ViewInspector/SwiftUI/Color.swift (in target 'ViewInspector' from project 'ViewInspector')
    cd /Users/admin/builder/spi-builder-workspace/.swiftpm/xcode

SwiftCompile normal arm64 /Users/admin/builder/spi-builder-workspace/.dependencies/checkouts/ViewInspector/Sources/ViewInspector/SwiftUI/ColorPicker.swift (in target 'ViewInspector' from project 'ViewInspector')
    cd /Users/admin/builder/spi-builder-workspace/.swiftpm/xcode

SwiftCompile normal arm64 /Users/admin/builder/spi-builder-workspace/.dependencies/checkouts/ViewInspector/Sources/ViewInspector/SwiftUI/ConditionalContent.swift (in target 'ViewInspector' from project 'ViewInspector')
    cd /Users/admin/builder/spi-builder-workspace/.swiftpm/xcode

SwiftCompile normal arm64 /Users/admin/builder/spi-builder-workspace/.dependencies/checkouts/ViewInspector/Sources/ViewInspector/SwiftUI/ConfirmationDialog.swift (in target 'ViewInspector' from project 'ViewInspector')
    cd /Users/admin/builder/spi-builder-workspace/.swiftpm/xcode

SwiftCompile normal arm64 /Users/admin/builder/spi-builder-workspace/.dependencies/checkouts/ViewInspector/Sources/ViewInspector/SwiftUI/ContentUnavailableView.swift (in target 'ViewInspector' from project 'ViewInspector')
    cd /Users/admin/builder/spi-builder-workspace/.swiftpm/xcode

SwiftCompile normal arm64 /Users/admin/builder/spi-builder-workspace/.dependencies/checkouts/ViewInspector/Sources/ViewInspector/SwiftUI/ControlGroup.swift (in target 'ViewInspector' from project 'ViewInspector')
    cd /Users/admin/builder/spi-builder-workspace/.swiftpm/xcode

SwiftCompile normal arm64 Compiling\ EventsModifiers.swift,\ GestureModifiers.swift,\ InteractionModifiers.swift,\ NavigationBarModifiers.swift,\ PositioningModifiers.swift,\ PreviewModifiers.swift,\ SizingModifiers.swift,\ TextInputModifiers.swift,\ TransformingModifiers.swift,\ TransitiveModifiers.swift,\ VisualEffectModifiers.swift,\ PopupPresenter.swift,\ ActionSheet.swift /Users/admin/builder/spi-builder-workspace/.dependencies/checkouts/ViewInspector/Sources/ViewInspector/Modifiers/EventsModifiers.swift /Users/admin/builder/spi-builder-workspace/.dependencies/checkouts/ViewInspector/Sources/ViewInspector/Modifiers/GestureModifiers.swift /Users/admin/builder/spi-builder-workspace/.dependencies/checkouts/ViewInspector/Sources/ViewInspector/Modifiers/InteractionModifiers.swift /Users/admin/builder/spi-builder-workspace/.dependencies/checkouts/ViewInspector/Sources/ViewInspector/Modifiers/NavigationBarModifiers.swift /Users/admin/builder/spi-builder-workspace/.dependencies/checkouts/ViewInspector/Sources/ViewInspector/Modifiers/PositioningModifiers.swift /Users/admin/builder/spi-builder-workspace/.dependencies/checkouts/ViewInspector/Sources/ViewInspector/Modifiers/PreviewModifiers.swift /Users/admin/builder/spi-builder-workspace/.dependencies/checkouts/ViewInspector/Sources/ViewInspector/Modifiers/SizingModifiers.swift /Users/admin/builder/spi-builder-workspace/.dependencies/checkouts/ViewInspector/Sources/ViewInspector/Modifiers/TextInputModifiers.swift /Users/admin/builder/spi-builder-workspace/.dependencies/checkouts/ViewInspector/Sources/ViewInspector/Modifiers/TransformingModifiers.swift /Users/admin/builder/spi-builder-workspace/.dependencies/checkouts/ViewInspector/Sources/ViewInspector/Modifiers/TransitiveModifiers.swift /Users/admin/builder/spi-builder-workspace/.dependencies/checkouts/ViewInspector/Sources/ViewInspector/Modifiers/VisualEffectModifiers.swift /Users/admin/builder/spi-builder-workspace/.dependencies/checkouts/ViewInspector/Sources/ViewInspector/PopupPresenter.swift /Users/admin/builder/spi-builder-workspace/.dependencies/checkouts/ViewInspector/Sources/ViewInspector/SwiftUI/ActionSheet.swift (in target 'ViewInspector' from project 'ViewInspector')
SwiftCompile normal arm64 /Users/admin/builder/spi-builder-workspace/.dependencies/checkouts/ViewInspector/Sources/ViewInspector/Modifiers/EventsModifiers.swift (in target 'ViewInspector' from project 'ViewInspector')
    cd /Users/admin/builder/spi-builder-workspace/.swiftpm/xcode

SwiftCompile normal arm64 /Users/admin/builder/spi-builder-workspace/.dependencies/checkouts/ViewInspector/Sources/ViewInspector/Modifiers/GestureModifiers.swift (in target 'ViewInspector' from project 'ViewInspector')
    cd /Users/admin/builder/spi-builder-workspace/.swiftpm/xcode

SwiftCompile normal arm64 /Users/admin/builder/spi-builder-workspace/.dependencies/checkouts/ViewInspector/Sources/ViewInspector/Modifiers/InteractionModifiers.swift (in target 'ViewInspector' from project 'ViewInspector')
    cd /Users/admin/builder/spi-builder-workspace/.swiftpm/xcode

SwiftCompile normal arm64 /Users/admin/builder/spi-builder-workspace/.dependencies/checkouts/ViewInspector/Sources/ViewInspector/Modifiers/NavigationBarModifiers.swift (in target 'ViewInspector' from project 'ViewInspector')
    cd /Users/admin/builder/spi-builder-workspace/.swiftpm/xcode

SwiftCompile normal arm64 /Users/admin/builder/spi-builder-workspace/.dependencies/checkouts/ViewInspector/Sources/ViewInspector/Modifiers/PositioningModifiers.swift (in target 'ViewInspector' from project 'ViewInspector')
    cd /Users/admin/builder/spi-builder-workspace/.swiftpm/xcode

SwiftCompile normal arm64 /Users/admin/builder/spi-builder-workspace/.dependencies/checkouts/ViewInspector/Sources/ViewInspector/Modifiers/PreviewModifiers.swift (in target 'ViewInspector' from project 'ViewInspector')
    cd /Users/admin/builder/spi-builder-workspace/.swiftpm/xcode

SwiftCompile normal arm64 /Users/admin/builder/spi-builder-workspace/.dependencies/checkouts/ViewInspector/Sources/ViewInspector/Modifiers/SizingModifiers.swift (in target 'ViewInspector' from project 'ViewInspector')
    cd /Users/admin/builder/spi-builder-workspace/.swiftpm/xcode

SwiftCompile normal arm64 /Users/admin/builder/spi-builder-workspace/.dependencies/checkouts/ViewInspector/Sources/ViewInspector/Modifiers/TextInputModifiers.swift (in target 'ViewInspector' from project 'ViewInspector')
    cd /Users/admin/builder/spi-builder-workspace/.swiftpm/xcode

SwiftCompile normal arm64 /Users/admin/builder/spi-builder-workspace/.dependencies/checkouts/ViewInspector/Sources/ViewInspector/Modifiers/TransformingModifiers.swift (in target 'ViewInspector' from project 'ViewInspector')
    cd /Users/admin/builder/spi-builder-workspace/.swiftpm/xcode

SwiftCompile normal arm64 /Users/admin/builder/spi-builder-workspace/.dependencies/checkouts/ViewInspector/Sources/ViewInspector/Modifiers/TransitiveModifiers.swift (in target 'ViewInspector' from project 'ViewInspector')
    cd /Users/admin/builder/spi-builder-workspace/.swiftpm/xcode

SwiftCompile normal arm64 /Users/admin/builder/spi-builder-workspace/.dependencies/checkouts/ViewInspector/Sources/ViewInspector/Modifiers/VisualEffectModifiers.swift (in target 'ViewInspector' from project 'ViewInspector')
    cd /Users/admin/builder/spi-builder-workspace/.swiftpm/xcode

SwiftCompile normal arm64 /Users/admin/builder/spi-builder-workspace/.dependencies/checkouts/ViewInspector/Sources/ViewInspector/PopupPresenter.swift (in target 'ViewInspector' from project 'ViewInspector')
    cd /Users/admin/builder/spi-builder-workspace/.swiftpm/xcode

SwiftCompile normal arm64 /Users/admin/builder/spi-builder-workspace/.dependencies/checkouts/ViewInspector/Sources/ViewInspector/SwiftUI/ActionSheet.swift (in target 'ViewInspector' from project 'ViewInspector')
    cd /Users/admin/builder/spi-builder-workspace/.swiftpm/xcode

SwiftCompile normal arm64 Compiling\ BaseTypes.swift,\ ContentExtraction.swift,\ EnvironmentInjection.swift,\ InspectableView+RandomAccessCollection.swift,\ InspectableView.swift,\ InspectionEmissary.swift,\ Inspector.swift,\ LazyGroup.swift,\ AccessibilityModifiers.swift,\ AnimationModifiers.swift,\ ConfigurationModifiers.swift,\ CustomStyleModifiers.swift,\ EnvironmentModifiers.swift /Users/admin/builder/spi-builder-workspace/.dependencies/checkouts/ViewInspector/Sources/ViewInspector/BaseTypes.swift /Users/admin/builder/spi-builder-workspace/.dependencies/checkouts/ViewInspector/Sources/ViewInspector/ContentExtraction.swift /Users/admin/builder/spi-builder-workspace/.dependencies/checkouts/ViewInspector/Sources/ViewInspector/EnvironmentInjection.swift /Users/admin/builder/spi-builder-workspace/.dependencies/checkouts/ViewInspector/Sources/ViewInspector/InspectableView+RandomAccessCollection.swift /Users/admin/builder/spi-builder-workspace/.dependencies/checkouts/ViewInspector/Sources/ViewInspector/InspectableView.swift /Users/admin/builder/spi-builder-workspace/.dependencies/checkouts/ViewInspector/Sources/ViewInspector/InspectionEmissary.swift /Users/admin/builder/spi-builder-workspace/.dependencies/checkouts/ViewInspector/Sources/ViewInspector/Inspector.swift /Users/admin/builder/spi-builder-workspace/.dependencies/checkouts/ViewInspector/Sources/ViewInspector/LazyGroup.swift /Users/admin/builder/spi-builder-workspace/.dependencies/checkouts/ViewInspector/Sources/ViewInspector/Modifiers/AccessibilityModifiers.swift /Users/admin/builder/spi-builder-workspace/.dependencies/checkouts/ViewInspector/Sources/ViewInspector/Modifiers/AnimationModifiers.swift /Users/admin/builder/spi-builder-workspace/.dependencies/checkouts/ViewInspector/Sources/ViewInspector/Modifiers/ConfigurationModifiers.swift /Users/admin/builder/spi-builder-workspace/.dependencies/checkouts/ViewInspector/Sources/ViewInspector/Modifiers/CustomStyleModifiers.swift /Users/admin/builder/spi-builder-workspace/.dependencies/checkouts/ViewInspector/Sources/ViewInspector/Modifiers/EnvironmentModifiers.swift (in target 'ViewInspector' from project 'ViewInspector')
SwiftCompile normal arm64 /Users/admin/builder/spi-builder-workspace/.dependencies/checkouts/ViewInspector/Sources/ViewInspector/BaseTypes.swift (in target 'ViewInspector' from project 'ViewInspector')
    cd /Users/admin/builder/spi-builder-workspace/.swiftpm/xcode

SwiftCompile normal arm64 /Users/admin/builder/spi-builder-workspace/.dependencies/checkouts/ViewInspector/Sources/ViewInspector/ContentExtraction.swift (in target 'ViewInspector' from project 'ViewInspector')
    cd /Users/admin/builder/spi-builder-workspace/.swiftpm/xcode

SwiftCompile normal arm64 /Users/admin/builder/spi-builder-workspace/.dependencies/checkouts/ViewInspector/Sources/ViewInspector/EnvironmentInjection.swift (in target 'ViewInspector' from project 'ViewInspector')
    cd /Users/admin/builder/spi-builder-workspace/.swiftpm/xcode

SwiftCompile normal arm64 /Users/admin/builder/spi-builder-workspace/.dependencies/checkouts/ViewInspector/Sources/ViewInspector/InspectableView+RandomAccessCollection.swift (in target 'ViewInspector' from project 'ViewInspector')
    cd /Users/admin/builder/spi-builder-workspace/.swiftpm/xcode

SwiftCompile normal arm64 /Users/admin/builder/spi-builder-workspace/.dependencies/checkouts/ViewInspector/Sources/ViewInspector/InspectableView.swift (in target 'ViewInspector' from project 'ViewInspector')
    cd /Users/admin/builder/spi-builder-workspace/.swiftpm/xcode

SwiftCompile normal arm64 /Users/admin/builder/spi-builder-workspace/.dependencies/checkouts/ViewInspector/Sources/ViewInspector/InspectionEmissary.swift (in target 'ViewInspector' from project 'ViewInspector')
    cd /Users/admin/builder/spi-builder-workspace/.swiftpm/xcode

SwiftCompile normal arm64 /Users/admin/builder/spi-builder-workspace/.dependencies/checkouts/ViewInspector/Sources/ViewInspector/Inspector.swift (in target 'ViewInspector' from project 'ViewInspector')
    cd /Users/admin/builder/spi-builder-workspace/.swiftpm/xcode

SwiftCompile normal arm64 /Users/admin/builder/spi-builder-workspace/.dependencies/checkouts/ViewInspector/Sources/ViewInspector/LazyGroup.swift (in target 'ViewInspector' from project 'ViewInspector')
    cd /Users/admin/builder/spi-builder-workspace/.swiftpm/xcode

SwiftCompile normal arm64 /Users/admin/builder/spi-builder-workspace/.dependencies/checkouts/ViewInspector/Sources/ViewInspector/Modifiers/AccessibilityModifiers.swift (in target 'ViewInspector' from project 'ViewInspector')
    cd /Users/admin/builder/spi-builder-workspace/.swiftpm/xcode

SwiftCompile normal arm64 /Users/admin/builder/spi-builder-workspace/.dependencies/checkouts/ViewInspector/Sources/ViewInspector/Modifiers/AnimationModifiers.swift (in target 'ViewInspector' from project 'ViewInspector')
    cd /Users/admin/builder/spi-builder-workspace/.swiftpm/xcode

SwiftCompile normal arm64 /Users/admin/builder/spi-builder-workspace/.dependencies/checkouts/ViewInspector/Sources/ViewInspector/Modifiers/ConfigurationModifiers.swift (in target 'ViewInspector' from project 'ViewInspector')
    cd /Users/admin/builder/spi-builder-workspace/.swiftpm/xcode

SwiftCompile normal arm64 /Users/admin/builder/spi-builder-workspace/.dependencies/checkouts/ViewInspector/Sources/ViewInspector/Modifiers/CustomStyleModifiers.swift (in target 'ViewInspector' from project 'ViewInspector')
    cd /Users/admin/builder/spi-builder-workspace/.swiftpm/xcode

SwiftCompile normal arm64 /Users/admin/builder/spi-builder-workspace/.dependencies/checkouts/ViewInspector/Sources/ViewInspector/Modifiers/EnvironmentModifiers.swift (in target 'ViewInspector' from project 'ViewInspector')
    cd /Users/admin/builder/spi-builder-workspace/.swiftpm/xcode

SwiftEmitModule normal arm64 Emitting\ module\ for\ ViewInspector (in target 'ViewInspector' from project 'ViewInspector')
EmitSwiftModule normal arm64 (in target 'ViewInspector' from project 'ViewInspector')
    cd /Users/admin/builder/spi-builder-workspace/.swiftpm/xcode

SwiftCompile normal arm64 Compiling\ Spacer.swift,\ Stepper.swift,\ StyleConfiguration.swift,\ SubscriptionView.swift,\ TabView.swift,\ Text.swift,\ TextAttributes.swift,\ TextEditor.swift,\ TextField.swift,\ TimelineView.swift,\ Toggle.swift,\ Toolbar.swift /Users/admin/builder/spi-builder-workspace/.dependencies/checkouts/ViewInspector/Sources/ViewInspector/SwiftUI/Spacer.swift /Users/admin/builder/spi-builder-workspace/.dependencies/checkouts/ViewInspector/Sources/ViewInspector/SwiftUI/Stepper.swift /Users/admin/builder/spi-builder-workspace/.dependencies/checkouts/ViewInspector/Sources/ViewInspector/SwiftUI/StyleConfiguration.swift /Users/admin/builder/spi-builder-workspace/.dependencies/checkouts/ViewInspector/Sources/ViewInspector/SwiftUI/SubscriptionView.swift /Users/admin/builder/spi-builder-workspace/.dependencies/checkouts/ViewInspector/Sources/ViewInspector/SwiftUI/TabView.swift /Users/admin/builder/spi-builder-workspace/.dependencies/checkouts/ViewInspector/Sources/ViewInspector/SwiftUI/Text.swift /Users/admin/builder/spi-builder-workspace/.dependencies/checkouts/ViewInspector/Sources/ViewInspector/SwiftUI/TextAttributes.swift /Users/admin/builder/spi-builder-workspace/.dependencies/checkouts/ViewInspector/Sources/ViewInspector/SwiftUI/TextEditor.swift /Users/admin/builder/spi-builder-workspace/.dependencies/checkouts/ViewInspector/Sources/ViewInspector/SwiftUI/TextField.swift /Users/admin/builder/spi-builder-workspace/.dependencies/checkouts/ViewInspector/Sources/ViewInspector/SwiftUI/TimelineView.swift /Users/admin/builder/spi-builder-workspace/.dependencies/checkouts/ViewInspector/Sources/ViewInspector/SwiftUI/Toggle.swift /Users/admin/builder/spi-builder-workspace/.dependencies/checkouts/ViewInspector/Sources/ViewInspector/SwiftUI/Toolbar.swift (in target 'ViewInspector' from project 'ViewInspector')
SwiftCompile normal arm64 /Users/admin/builder/spi-builder-workspace/.dependencies/checkouts/ViewInspector/Sources/ViewInspector/SwiftUI/Spacer.swift (in target 'ViewInspector' from project 'ViewInspector')
    cd /Users/admin/builder/spi-builder-workspace/.swiftpm/xcode

SwiftCompile normal arm64 /Users/admin/builder/spi-builder-workspace/.dependencies/checkouts/ViewInspector/Sources/ViewInspector/SwiftUI/Stepper.swift (in target 'ViewInspector' from project 'ViewInspector')
    cd /Users/admin/builder/spi-builder-workspace/.swiftpm/xcode

SwiftCompile normal arm64 /Users/admin/builder/spi-builder-workspace/.dependencies/checkouts/ViewInspector/Sources/ViewInspector/SwiftUI/StyleConfiguration.swift (in target 'ViewInspector' from project 'ViewInspector')
    cd /Users/admin/builder/spi-builder-workspace/.swiftpm/xcode

SwiftCompile normal arm64 /Users/admin/builder/spi-builder-workspace/.dependencies/checkouts/ViewInspector/Sources/ViewInspector/SwiftUI/SubscriptionView.swift (in target 'ViewInspector' from project 'ViewInspector')
    cd /Users/admin/builder/spi-builder-workspace/.swiftpm/xcode

SwiftCompile normal arm64 /Users/admin/builder/spi-builder-workspace/.dependencies/checkouts/ViewInspector/Sources/ViewInspector/SwiftUI/TabView.swift (in target 'ViewInspector' from project 'ViewInspector')
    cd /Users/admin/builder/spi-builder-workspace/.swiftpm/xcode

SwiftCompile normal arm64 /Users/admin/builder/spi-builder-workspace/.dependencies/checkouts/ViewInspector/Sources/ViewInspector/SwiftUI/Text.swift (in target 'ViewInspector' from project 'ViewInspector')
    cd /Users/admin/builder/spi-builder-workspace/.swiftpm/xcode

SwiftCompile normal arm64 /Users/admin/builder/spi-builder-workspace/.dependencies/checkouts/ViewInspector/Sources/ViewInspector/SwiftUI/TextAttributes.swift (in target 'ViewInspector' from project 'ViewInspector')
    cd /Users/admin/builder/spi-builder-workspace/.swiftpm/xcode

SwiftCompile normal arm64 /Users/admin/builder/spi-builder-workspace/.dependencies/checkouts/ViewInspector/Sources/ViewInspector/SwiftUI/TextEditor.swift (in target 'ViewInspector' from project 'ViewInspector')
    cd /Users/admin/builder/spi-builder-workspace/.swiftpm/xcode

SwiftCompile normal arm64 /Users/admin/builder/spi-builder-workspace/.dependencies/checkouts/ViewInspector/Sources/ViewInspector/SwiftUI/TextField.swift (in target 'ViewInspector' from project 'ViewInspector')
    cd /Users/admin/builder/spi-builder-workspace/.swiftpm/xcode

SwiftCompile normal arm64 /Users/admin/builder/spi-builder-workspace/.dependencies/checkouts/ViewInspector/Sources/ViewInspector/SwiftUI/TimelineView.swift (in target 'ViewInspector' from project 'ViewInspector')
    cd /Users/admin/builder/spi-builder-workspace/.swiftpm/xcode

SwiftCompile normal arm64 /Users/admin/builder/spi-builder-workspace/.dependencies/checkouts/ViewInspector/Sources/ViewInspector/SwiftUI/Toggle.swift (in target 'ViewInspector' from project 'ViewInspector')
    cd /Users/admin/builder/spi-builder-workspace/.swiftpm/xcode

SwiftCompile normal arm64 /Users/admin/builder/spi-builder-workspace/.dependencies/checkouts/ViewInspector/Sources/ViewInspector/SwiftUI/Toolbar.swift (in target 'ViewInspector' from project 'ViewInspector')
    cd /Users/admin/builder/spi-builder-workspace/.swiftpm/xcode

SwiftCompile normal arm64 Compiling\ CustomView.swift,\ CustomViewModifier.swift,\ DatePicker.swift,\ DelayedPreferenceView.swift,\ DisclosureGroup.swift,\ Divider.swift,\ EditButton.swift,\ EllipticalGradient.swift,\ EmptyView.swift,\ EquatableView.swift,\ ForEach.swift,\ Form.swift,\ GeometryReader.swift /Users/admin/builder/spi-builder-workspace/.dependencies/checkouts/ViewInspector/Sources/ViewInspector/SwiftUI/CustomView.swift /Users/admin/builder/spi-builder-workspace/.dependencies/checkouts/ViewInspector/Sources/ViewInspector/SwiftUI/CustomViewModifier.swift /Users/admin/builder/spi-builder-workspace/.dependencies/checkouts/ViewInspector/Sources/ViewInspector/SwiftUI/DatePicker.swift /Users/admin/builder/spi-builder-workspace/.dependencies/checkouts/ViewInspector/Sources/ViewInspector/SwiftUI/DelayedPreferenceView.swift /Users/admin/builder/spi-builder-workspace/.dependencies/checkouts/ViewInspector/Sources/ViewInspector/SwiftUI/DisclosureGroup.swift /Users/admin/builder/spi-builder-workspace/.dependencies/checkouts/ViewInspector/Sources/ViewInspector/SwiftUI/Divider.swift /Users/admin/builder/spi-builder-workspace/.dependencies/checkouts/ViewInspector/Sources/ViewInspector/SwiftUI/EditButton.swift /Users/admin/builder/spi-builder-workspace/.dependencies/checkouts/ViewInspector/Sources/ViewInspector/SwiftUI/EllipticalGradient.swift /Users/admin/builder/spi-builder-workspace/.dependencies/checkouts/ViewInspector/Sources/ViewInspector/SwiftUI/EmptyView.swift /Users/admin/builder/spi-builder-workspace/.dependencies/checkouts/ViewInspector/Sources/ViewInspector/SwiftUI/EquatableView.swift /Users/admin/builder/spi-builder-workspace/.dependencies/checkouts/ViewInspector/Sources/ViewInspector/SwiftUI/ForEach.swift /Users/admin/builder/spi-builder-workspace/.dependencies/checkouts/ViewInspector/Sources/ViewInspector/SwiftUI/Form.swift /Users/admin/builder/spi-builder-workspace/.dependencies/checkouts/ViewInspector/Sources/ViewInspector/SwiftUI/GeometryReader.swift (in target 'ViewInspector' from project 'ViewInspector')
SwiftCompile normal arm64 /Users/admin/builder/spi-builder-workspace/.dependencies/checkouts/ViewInspector/Sources/ViewInspector/SwiftUI/CustomView.swift (in target 'ViewInspector' from project 'ViewInspector')
    cd /Users/admin/builder/spi-builder-workspace/.swiftpm/xcode

SwiftCompile normal arm64 /Users/admin/builder/spi-builder-workspace/.dependencies/checkouts/ViewInspector/Sources/ViewInspector/SwiftUI/CustomViewModifier.swift (in target 'ViewInspector' from project 'ViewInspector')
    cd /Users/admin/builder/spi-builder-workspace/.swiftpm/xcode

SwiftCompile normal arm64 /Users/admin/builder/spi-builder-workspace/.dependencies/checkouts/ViewInspector/Sources/ViewInspector/SwiftUI/DatePicker.swift (in target 'ViewInspector' from project 'ViewInspector')
    cd /Users/admin/builder/spi-builder-workspace/.swiftpm/xcode

SwiftCompile normal arm64 /Users/admin/builder/spi-builder-workspace/.dependencies/checkouts/ViewInspector/Sources/ViewInspector/SwiftUI/DelayedPreferenceView.swift (in target 'ViewInspector' from project 'ViewInspector')
    cd /Users/admin/builder/spi-builder-workspace/.swiftpm/xcode

SwiftCompile normal arm64 /Users/admin/builder/spi-builder-workspace/.dependencies/checkouts/ViewInspector/Sources/ViewInspector/SwiftUI/DisclosureGroup.swift (in target 'ViewInspector' from project 'ViewInspector')
    cd /Users/admin/builder/spi-builder-workspace/.swiftpm/xcode

SwiftCompile normal arm64 /Users/admin/builder/spi-builder-workspace/.dependencies/checkouts/ViewInspector/Sources/ViewInspector/SwiftUI/Divider.swift (in target 'ViewInspector' from project 'ViewInspector')
    cd /Users/admin/builder/spi-builder-workspace/.swiftpm/xcode

SwiftCompile normal arm64 /Users/admin/builder/spi-builder-workspace/.dependencies/checkouts/ViewInspector/Sources/ViewInspector/SwiftUI/EditButton.swift (in target 'ViewInspector' from project 'ViewInspector')
    cd /Users/admin/builder/spi-builder-workspace/.swiftpm/xcode

SwiftCompile normal arm64 /Users/admin/builder/spi-builder-workspace/.dependencies/checkouts/ViewInspector/Sources/ViewInspector/SwiftUI/EllipticalGradient.swift (in target 'ViewInspector' from project 'ViewInspector')
    cd /Users/admin/builder/spi-builder-workspace/.swiftpm/xcode

SwiftCompile normal arm64 /Users/admin/builder/spi-builder-workspace/.dependencies/checkouts/ViewInspector/Sources/ViewInspector/SwiftUI/EmptyView.swift (in target 'ViewInspector' from project 'ViewInspector')
    cd /Users/admin/builder/spi-builder-workspace/.swiftpm/xcode

SwiftCompile normal arm64 /Users/admin/builder/spi-builder-workspace/.dependencies/checkouts/ViewInspector/Sources/ViewInspector/SwiftUI/EquatableView.swift (in target 'ViewInspector' from project 'ViewInspector')
    cd /Users/admin/builder/spi-builder-workspace/.swiftpm/xcode

SwiftCompile normal arm64 /Users/admin/builder/spi-builder-workspace/.dependencies/checkouts/ViewInspector/Sources/ViewInspector/SwiftUI/ForEach.swift (in target 'ViewInspector' from project 'ViewInspector')
    cd /Users/admin/builder/spi-builder-workspace/.swiftpm/xcode

SwiftCompile normal arm64 /Users/admin/builder/spi-builder-workspace/.dependencies/checkouts/ViewInspector/Sources/ViewInspector/SwiftUI/Form.swift (in target 'ViewInspector' from project 'ViewInspector')
    cd /Users/admin/builder/spi-builder-workspace/.swiftpm/xcode

SwiftCompile normal arm64 /Users/admin/builder/spi-builder-workspace/.dependencies/checkouts/ViewInspector/Sources/ViewInspector/SwiftUI/GeometryReader.swift (in target 'ViewInspector' from project 'ViewInspector')
    cd /Users/admin/builder/spi-builder-workspace/.swiftpm/xcode

SwiftCompile normal arm64 Compiling\ LazyHStack.swift,\ LazyVGrid.swift,\ LazyVStack.swift,\ LinearGradient.swift,\ Link.swift,\ List.swift,\ LocationButton.swift,\ Map.swift,\ MapAnnotation.swift,\ Menu.swift,\ MenuButton.swift,\ MultiDatePicker.swift /Users/admin/builder/spi-builder-workspace/.dependencies/checkouts/ViewInspector/Sources/ViewInspector/SwiftUI/LazyHStack.swift /Users/admin/builder/spi-builder-workspace/.dependencies/checkouts/ViewInspector/Sources/ViewInspector/SwiftUI/LazyVGrid.swift /Users/admin/builder/spi-builder-workspace/.dependencies/checkouts/ViewInspector/Sources/ViewInspector/SwiftUI/LazyVStack.swift /Users/admin/builder/spi-builder-workspace/.dependencies/checkouts/ViewInspector/Sources/ViewInspector/SwiftUI/LinearGradient.swift /Users/admin/builder/spi-builder-workspace/.dependencies/checkouts/ViewInspector/Sources/ViewInspector/SwiftUI/Link.swift /Users/admin/builder/spi-builder-workspace/.dependencies/checkouts/ViewInspector/Sources/ViewInspector/SwiftUI/List.swift /Users/admin/builder/spi-builder-workspace/.dependencies/checkouts/ViewInspector/Sources/ViewInspector/SwiftUI/LocationButton.swift /Users/admin/builder/spi-builder-workspace/.dependencies/checkouts/ViewInspector/Sources/ViewInspector/SwiftUI/Map.swift /Users/admin/builder/spi-builder-workspace/.dependencies/checkouts/ViewInspector/Sources/ViewInspector/SwiftUI/MapAnnotation.swift /Users/admin/builder/spi-builder-workspace/.dependencies/checkouts/ViewInspector/Sources/ViewInspector/SwiftUI/Menu.swift /Users/admin/builder/spi-builder-workspace/.dependencies/checkouts/ViewInspector/Sources/ViewInspector/SwiftUI/MenuButton.swift /Users/admin/builder/spi-builder-workspace/.dependencies/checkouts/ViewInspector/Sources/ViewInspector/SwiftUI/MultiDatePicker.swift (in target 'ViewInspector' from project 'ViewInspector')
SwiftCompile normal arm64 /Users/admin/builder/spi-builder-workspace/.dependencies/checkouts/ViewInspector/Sources/ViewInspector/SwiftUI/LazyHStack.swift (in target 'ViewInspector' from project 'ViewInspector')
    cd /Users/admin/builder/spi-builder-workspace/.swiftpm/xcode

SwiftCompile normal arm64 /Users/admin/builder/spi-builder-workspace/.dependencies/checkouts/ViewInspector/Sources/ViewInspector/SwiftUI/LazyVGrid.swift (in target 'ViewInspector' from project 'ViewInspector')
    cd /Users/admin/builder/spi-builder-workspace/.swiftpm/xcode

SwiftCompile normal arm64 /Users/admin/builder/spi-builder-workspace/.dependencies/checkouts/ViewInspector/Sources/ViewInspector/SwiftUI/LazyVStack.swift (in target 'ViewInspector' from project 'ViewInspector')
    cd /Users/admin/builder/spi-builder-workspace/.swiftpm/xcode

SwiftCompile normal arm64 /Users/admin/builder/spi-builder-workspace/.dependencies/checkouts/ViewInspector/Sources/ViewInspector/SwiftUI/LinearGradient.swift (in target 'ViewInspector' from project 'ViewInspector')
    cd /Users/admin/builder/spi-builder-workspace/.swiftpm/xcode

SwiftCompile normal arm64 /Users/admin/builder/spi-builder-workspace/.dependencies/checkouts/ViewInspector/Sources/ViewInspector/SwiftUI/Link.swift (in target 'ViewInspector' from project 'ViewInspector')
    cd /Users/admin/builder/spi-builder-workspace/.swiftpm/xcode

SwiftCompile normal arm64 /Users/admin/builder/spi-builder-workspace/.dependencies/checkouts/ViewInspector/Sources/ViewInspector/SwiftUI/List.swift (in target 'ViewInspector' from project 'ViewInspector')
    cd /Users/admin/builder/spi-builder-workspace/.swiftpm/xcode

SwiftCompile normal arm64 /Users/admin/builder/spi-builder-workspace/.dependencies/checkouts/ViewInspector/Sources/ViewInspector/SwiftUI/LocationButton.swift (in target 'ViewInspector' from project 'ViewInspector')
    cd /Users/admin/builder/spi-builder-workspace/.swiftpm/xcode

SwiftCompile normal arm64 /Users/admin/builder/spi-builder-workspace/.dependencies/checkouts/ViewInspector/Sources/ViewInspector/SwiftUI/Map.swift (in target 'ViewInspector' from project 'ViewInspector')
    cd /Users/admin/builder/spi-builder-workspace/.swiftpm/xcode

SwiftCompile normal arm64 /Users/admin/builder/spi-builder-workspace/.dependencies/checkouts/ViewInspector/Sources/ViewInspector/SwiftUI/MapAnnotation.swift (in target 'ViewInspector' from project 'ViewInspector')
    cd /Users/admin/builder/spi-builder-workspace/.swiftpm/xcode

SwiftCompile normal arm64 /Users/admin/builder/spi-builder-workspace/.dependencies/checkouts/ViewInspector/Sources/ViewInspector/SwiftUI/Menu.swift (in target 'ViewInspector' from project 'ViewInspector')
    cd /Users/admin/builder/spi-builder-workspace/.swiftpm/xcode

SwiftCompile normal arm64 /Users/admin/builder/spi-builder-workspace/.dependencies/checkouts/ViewInspector/Sources/ViewInspector/SwiftUI/MenuButton.swift (in target 'ViewInspector' from project 'ViewInspector')
    cd /Users/admin/builder/spi-builder-workspace/.swiftpm/xcode

SwiftCompile normal arm64 /Users/admin/builder/spi-builder-workspace/.dependencies/checkouts/ViewInspector/Sources/ViewInspector/SwiftUI/MultiDatePicker.swift (in target 'ViewInspector' from project 'ViewInspector')
    cd /Users/admin/builder/spi-builder-workspace/.swiftpm/xcode

SwiftDriverJobDiscovery normal arm64 Emitting module for JoinedText (in target 'JoinedText' from project 'JoinedText')
SwiftDriver\ Compilation\ Requirements JoinedText normal arm64 com.apple.xcode.tools.swift.compiler (in target 'JoinedText' from project 'JoinedText')
    cd /Users/admin/builder/spi-builder-workspace/.swiftpm/xcode
    builtin-Swift-Compilation-Requirements -- /Applications/Xcode-16.3.0.app/Contents/Developer/Toolchains/XcodeDefault.xctoolchain/usr/bin/swiftc -module-name JoinedText -Onone -enforce-exclusivity\=checked @/Users/admin/builder/spi-builder-workspace/.derivedData/Build/Intermediates.noindex/JoinedText.build/Debug-appletvos/JoinedText.build/Objects-normal/arm64/JoinedText.SwiftFileList -DSWIFT_PACKAGE -DDEBUG -stats-output-dir .stats -strict-concurrency\=complete -enable-upcoming-feature StrictConcurrency -enable-upcoming-feature DisableOutwardActorInference -enable-upcoming-feature GlobalActorIsolatedTypesUsability -enable-upcoming-feature InferSendableFromCaptures -plugin-path /Applications/Xcode-16.3.0.app/Contents/Developer/Toolchains/XcodeDefault.xctoolchain/usr/lib/swift/host/plugins/testing -enable-experimental-feature DebugDescriptionMacro -sdk /Applications/Xcode-16.3.0.app/Contents/Developer/Platforms/AppleTVOS.platform/Developer/SDKs/AppleTVOS18.4.sdk -target arm64-apple-tvos13.0 -g -module-cache-path /Users/admin/builder/spi-builder-workspace/.derivedData/ModuleCache.noindex -Xfrontend -serialize-debugging-options -profile-coverage-mapping -profile-generate -enable-testing -index-store-path /Users/admin/builder/spi-builder-workspace/.derivedData/Index.noindex/DataStore -swift-version 5 -I /Users/admin/builder/spi-builder-workspace/.derivedData/Build/Products/Debug-appletvos -I /Applications/Xcode-16.3.0.app/Contents/Developer/Platforms/AppleTVOS.platform/Developer/usr/lib -F /Users/admin/builder/spi-builder-workspace/.derivedData/Build/Products/Debug-appletvos -F /Applications/Xcode-16.3.0.app/Contents/Developer/Platforms/AppleTVOS.platform/Developer/Library/Frameworks -F /Applications/Xcode-16.3.0.app/Contents/Developer/Platforms/AppleTVOS.platform/Developer/SDKs/AppleTVOS18.4.sdk/Developer/Library/Frameworks -c -j10 -enable-batch-mode -incremental -Xcc -ivfsstatcache -Xcc /Users/admin/builder/spi-builder-workspace/.derivedData/SDKStatCaches.noindex/appletvos18.4-22L251-271d326055c85f9856fa135c41255102.sdkstatcache -output-file-map /Users/admin/builder/spi-builder-workspace/.derivedData/Build/Intermediates.noindex/JoinedText.build/Debug-appletvos/JoinedText.build/Objects-normal/arm64/JoinedText-OutputFileMap.json -use-frontend-parseable-output -save-temps -no-color-diagnostics -serialize-diagnostics -emit-dependencies -emit-module -emit-module-path /Users/admin/builder/spi-builder-workspace/.derivedData/Build/Intermediates.noindex/JoinedText.build/Debug-appletvos/JoinedText.build/Objects-normal/arm64/JoinedText.swiftmodule -validate-clang-modules-once -clang-build-session-file /Users/admin/builder/spi-builder-workspace/.derivedData/ModuleCache.noindex/Session.modulevalidation -Xcc -I/Users/admin/builder/spi-builder-workspace/.derivedData/Build/Intermediates.noindex/JoinedText.build/Debug-appletvos/JoinedText.build/swift-overrides.hmap -emit-const-values -Xfrontend -const-gather-protocols-file -Xfrontend /Users/admin/builder/spi-builder-workspace/.derivedData/Build/Intermediates.noindex/JoinedText.build/Debug-appletvos/JoinedText.build/Objects-normal/arm64/JoinedText_const_extract_protocols.json -Xcc -I/Users/admin/builder/spi-builder-workspace/.derivedData/Build/Products/Debug-appletvos/include -Xcc -I/Users/admin/builder/spi-builder-workspace/.derivedData/Build/Intermediates.noindex/JoinedText.build/Debug-appletvos/JoinedText.build/DerivedSources-normal/arm64 -Xcc -I/Users/admin/builder/spi-builder-workspace/.derivedData/Build/Intermediates.noindex/JoinedText.build/Debug-appletvos/JoinedText.build/DerivedSources/arm64 -Xcc -I/Users/admin/builder/spi-builder-workspace/.derivedData/Build/Intermediates.noindex/JoinedText.build/Debug-appletvos/JoinedText.build/DerivedSources -Xcc -DSWIFT_PACKAGE -Xcc -DDEBUG\=1 -emit-objc-header -emit-objc-header-path /Users/admin/builder/spi-builder-workspace/.derivedData/Build/Intermediates.noindex/JoinedText.build/Debug-appletvos/JoinedText.build/Objects-normal/arm64/JoinedText-Swift.h -working-directory /Users/admin/builder/spi-builder-workspace/.swiftpm/xcode -experimental-emit-module-separately -disable-cmo
SwiftDriverJobDiscovery normal arm64 Compiling TextBuilder.swift (in target 'JoinedText' from project 'JoinedText')
SwiftCompile normal arm64 Compiling\ Gesture.swift,\ Grid.swift,\ Group.swift,\ GroupBox.swift,\ HSplitView.swift,\ HStack.swift,\ HelpView.swift,\ IDView.swift,\ Image.swift,\ Label.swift,\ LabeledContent.swift,\ LazyHGrid.swift /Users/admin/builder/spi-builder-workspace/.dependencies/checkouts/ViewInspector/Sources/ViewInspector/SwiftUI/Gesture.swift /Users/admin/builder/spi-builder-workspace/.dependencies/checkouts/ViewInspector/Sources/ViewInspector/SwiftUI/Grid.swift /Users/admin/builder/spi-builder-workspace/.dependencies/checkouts/ViewInspector/Sources/ViewInspector/SwiftUI/Group.swift /Users/admin/builder/spi-builder-workspace/.dependencies/checkouts/ViewInspector/Sources/ViewInspector/SwiftUI/GroupBox.swift /Users/admin/builder/spi-builder-workspace/.dependencies/checkouts/ViewInspector/Sources/ViewInspector/SwiftUI/HSplitView.swift /Users/admin/builder/spi-builder-workspace/.dependencies/checkouts/ViewInspector/Sources/ViewInspector/SwiftUI/HStack.swift /Users/admin/builder/spi-builder-workspace/.dependencies/checkouts/ViewInspector/Sources/ViewInspector/SwiftUI/HelpView.swift /Users/admin/builder/spi-builder-workspace/.dependencies/checkouts/ViewInspector/Sources/ViewInspector/SwiftUI/IDView.swift /Users/admin/builder/spi-builder-workspace/.dependencies/checkouts/ViewInspector/Sources/ViewInspector/SwiftUI/Image.swift /Users/admin/builder/spi-builder-workspace/.dependencies/checkouts/ViewInspector/Sources/ViewInspector/SwiftUI/Label.swift /Users/admin/builder/spi-builder-workspace/.dependencies/checkouts/ViewInspector/Sources/ViewInspector/SwiftUI/LabeledContent.swift /Users/admin/builder/spi-builder-workspace/.dependencies/checkouts/ViewInspector/Sources/ViewInspector/SwiftUI/LazyHGrid.swift (in target 'ViewInspector' from project 'ViewInspector')
SwiftCompile normal arm64 /Users/admin/builder/spi-builder-workspace/.dependencies/checkouts/ViewInspector/Sources/ViewInspector/SwiftUI/Gesture.swift (in target 'ViewInspector' from project 'ViewInspector')
    cd /Users/admin/builder/spi-builder-workspace/.swiftpm/xcode

SwiftCompile normal arm64 /Users/admin/builder/spi-builder-workspace/.dependencies/checkouts/ViewInspector/Sources/ViewInspector/SwiftUI/Grid.swift (in target 'ViewInspector' from project 'ViewInspector')
    cd /Users/admin/builder/spi-builder-workspace/.swiftpm/xcode

SwiftCompile normal arm64 /Users/admin/builder/spi-builder-workspace/.dependencies/checkouts/ViewInspector/Sources/ViewInspector/SwiftUI/Group.swift (in target 'ViewInspector' from project 'ViewInspector')
    cd /Users/admin/builder/spi-builder-workspace/.swiftpm/xcode

SwiftCompile normal arm64 /Users/admin/builder/spi-builder-workspace/.dependencies/checkouts/ViewInspector/Sources/ViewInspector/SwiftUI/GroupBox.swift (in target 'ViewInspector' from project 'ViewInspector')
    cd /Users/admin/builder/spi-builder-workspace/.swiftpm/xcode

SwiftCompile normal arm64 /Users/admin/builder/spi-builder-workspace/.dependencies/checkouts/ViewInspector/Sources/ViewInspector/SwiftUI/HSplitView.swift (in target 'ViewInspector' from project 'ViewInspector')
    cd /Users/admin/builder/spi-builder-workspace/.swiftpm/xcode

SwiftCompile normal arm64 /Users/admin/builder/spi-builder-workspace/.dependencies/checkouts/ViewInspector/Sources/ViewInspector/SwiftUI/HStack.swift (in target 'ViewInspector' from project 'ViewInspector')
    cd /Users/admin/builder/spi-builder-workspace/.swiftpm/xcode

SwiftCompile normal arm64 /Users/admin/builder/spi-builder-workspace/.dependencies/checkouts/ViewInspector/Sources/ViewInspector/SwiftUI/HelpView.swift (in target 'ViewInspector' from project 'ViewInspector')
    cd /Users/admin/builder/spi-builder-workspace/.swiftpm/xcode

SwiftCompile normal arm64 /Users/admin/builder/spi-builder-workspace/.dependencies/checkouts/ViewInspector/Sources/ViewInspector/SwiftUI/IDView.swift (in target 'ViewInspector' from project 'ViewInspector')
    cd /Users/admin/builder/spi-builder-workspace/.swiftpm/xcode

SwiftCompile normal arm64 /Users/admin/builder/spi-builder-workspace/.dependencies/checkouts/ViewInspector/Sources/ViewInspector/SwiftUI/Image.swift (in target 'ViewInspector' from project 'ViewInspector')
    cd /Users/admin/builder/spi-builder-workspace/.swiftpm/xcode

SwiftCompile normal arm64 /Users/admin/builder/spi-builder-workspace/.dependencies/checkouts/ViewInspector/Sources/ViewInspector/SwiftUI/Label.swift (in target 'ViewInspector' from project 'ViewInspector')
    cd /Users/admin/builder/spi-builder-workspace/.swiftpm/xcode

SwiftCompile normal arm64 /Users/admin/builder/spi-builder-workspace/.dependencies/checkouts/ViewInspector/Sources/ViewInspector/SwiftUI/LabeledContent.swift (in target 'ViewInspector' from project 'ViewInspector')
    cd /Users/admin/builder/spi-builder-workspace/.swiftpm/xcode

SwiftCompile normal arm64 /Users/admin/builder/spi-builder-workspace/.dependencies/checkouts/ViewInspector/Sources/ViewInspector/SwiftUI/LazyHGrid.swift (in target 'ViewInspector' from project 'ViewInspector')
    cd /Users/admin/builder/spi-builder-workspace/.swiftpm/xcode

SwiftCompile normal arm64 Compiling\ ProgressView.swift,\ RadialGradient.swift,\ SafeAreaInset.swift,\ ScrollView.swift,\ ScrollViewReader.swift,\ Section.swift,\ SecureField.swift,\ Shape.swift,\ ShareLink.swift,\ Sheet.swift,\ SignInWithAppleButton.swift,\ Slider.swift /Users/admin/builder/spi-builder-workspace/.dependencies/checkouts/ViewInspector/Sources/ViewInspector/SwiftUI/ProgressView.swift /Users/admin/builder/spi-builder-workspace/.dependencies/checkouts/ViewInspector/Sources/ViewInspector/SwiftUI/RadialGradient.swift /Users/admin/builder/spi-builder-workspace/.dependencies/checkouts/ViewInspector/Sources/ViewInspector/SwiftUI/SafeAreaInset.swift /Users/admin/builder/spi-builder-workspace/.dependencies/checkouts/ViewInspector/Sources/ViewInspector/SwiftUI/ScrollView.swift /Users/admin/builder/spi-builder-workspace/.dependencies/checkouts/ViewInspector/Sources/ViewInspector/SwiftUI/ScrollViewReader.swift /Users/admin/builder/spi-builder-workspace/.dependencies/checkouts/ViewInspector/Sources/ViewInspector/SwiftUI/Section.swift /Users/admin/builder/spi-builder-workspace/.dependencies/checkouts/ViewInspector/Sources/ViewInspector/SwiftUI/SecureField.swift /Users/admin/builder/spi-builder-workspace/.dependencies/checkouts/ViewInspector/Sources/ViewInspector/SwiftUI/Shape.swift /Users/admin/builder/spi-builder-workspace/.dependencies/checkouts/ViewInspector/Sources/ViewInspector/SwiftUI/ShareLink.swift /Users/admin/builder/spi-builder-workspace/.dependencies/checkouts/ViewInspector/Sources/ViewInspector/SwiftUI/Sheet.swift /Users/admin/builder/spi-builder-workspace/.dependencies/checkouts/ViewInspector/Sources/ViewInspector/SwiftUI/SignInWithAppleButton.swift /Users/admin/builder/spi-builder-workspace/.dependencies/checkouts/ViewInspector/Sources/ViewInspector/SwiftUI/Slider.swift (in target 'ViewInspector' from project 'ViewInspector')
SwiftCompile normal arm64 /Users/admin/builder/spi-builder-workspace/.dependencies/checkouts/ViewInspector/Sources/ViewInspector/SwiftUI/ProgressView.swift (in target 'ViewInspector' from project 'ViewInspector')
    cd /Users/admin/builder/spi-builder-workspace/.swiftpm/xcode

SwiftCompile normal arm64 /Users/admin/builder/spi-builder-workspace/.dependencies/checkouts/ViewInspector/Sources/ViewInspector/SwiftUI/RadialGradient.swift (in target 'ViewInspector' from project 'ViewInspector')
    cd /Users/admin/builder/spi-builder-workspace/.swiftpm/xcode

SwiftCompile normal arm64 /Users/admin/builder/spi-builder-workspace/.dependencies/checkouts/ViewInspector/Sources/ViewInspector/SwiftUI/SafeAreaInset.swift (in target 'ViewInspector' from project 'ViewInspector')
    cd /Users/admin/builder/spi-builder-workspace/.swiftpm/xcode

SwiftCompile normal arm64 /Users/admin/builder/spi-builder-workspace/.dependencies/checkouts/ViewInspector/Sources/ViewInspector/SwiftUI/ScrollView.swift (in target 'ViewInspector' from project 'ViewInspector')
    cd /Users/admin/builder/spi-builder-workspace/.swiftpm/xcode

SwiftCompile normal arm64 /Users/admin/builder/spi-builder-workspace/.dependencies/checkouts/ViewInspector/Sources/ViewInspector/SwiftUI/ScrollViewReader.swift (in target 'ViewInspector' from project 'ViewInspector')
    cd /Users/admin/builder/spi-builder-workspace/.swiftpm/xcode

SwiftCompile normal arm64 /Users/admin/builder/spi-builder-workspace/.dependencies/checkouts/ViewInspector/Sources/ViewInspector/SwiftUI/Section.swift (in target 'ViewInspector' from project 'ViewInspector')
    cd /Users/admin/builder/spi-builder-workspace/.swiftpm/xcode

SwiftCompile normal arm64 /Users/admin/builder/spi-builder-workspace/.dependencies/checkouts/ViewInspector/Sources/ViewInspector/SwiftUI/SecureField.swift (in target 'ViewInspector' from project 'ViewInspector')
    cd /Users/admin/builder/spi-builder-workspace/.swiftpm/xcode

SwiftCompile normal arm64 /Users/admin/builder/spi-builder-workspace/.dependencies/checkouts/ViewInspector/Sources/ViewInspector/SwiftUI/Shape.swift (in target 'ViewInspector' from project 'ViewInspector')
    cd /Users/admin/builder/spi-builder-workspace/.swiftpm/xcode

SwiftCompile normal arm64 /Users/admin/builder/spi-builder-workspace/.dependencies/checkouts/ViewInspector/Sources/ViewInspector/SwiftUI/ShareLink.swift (in target 'ViewInspector' from project 'ViewInspector')
    cd /Users/admin/builder/spi-builder-workspace/.swiftpm/xcode

SwiftCompile normal arm64 /Users/admin/builder/spi-builder-workspace/.dependencies/checkouts/ViewInspector/Sources/ViewInspector/SwiftUI/Sheet.swift (in target 'ViewInspector' from project 'ViewInspector')
    cd /Users/admin/builder/spi-builder-workspace/.swiftpm/xcode

SwiftCompile normal arm64 /Users/admin/builder/spi-builder-workspace/.dependencies/checkouts/ViewInspector/Sources/ViewInspector/SwiftUI/SignInWithAppleButton.swift (in target 'ViewInspector' from project 'ViewInspector')
    cd /Users/admin/builder/spi-builder-workspace/.swiftpm/xcode

SwiftCompile normal arm64 /Users/admin/builder/spi-builder-workspace/.dependencies/checkouts/ViewInspector/Sources/ViewInspector/SwiftUI/Slider.swift (in target 'ViewInspector' from project 'ViewInspector')
    cd /Users/admin/builder/spi-builder-workspace/.swiftpm/xcode

SwiftDriverJobDiscovery normal arm64 Compiling Sequence+JoinedText.swift (in target 'JoinedText' from project 'JoinedText')
SwiftCompile normal arm64 Compiling\ TouchBar.swift,\ TreeView.swift,\ TupleView.swift,\ UnaryViewAdaptor.swift,\ VSplitView.swift,\ VStack.swift,\ VideoPlayer.swift,\ ViewThatFits.swift,\ ZStack.swift,\ ViewHosting.swift,\ ViewSearch.swift,\ ViewSearchIndex.swift /Users/admin/builder/spi-builder-workspace/.dependencies/checkouts/ViewInspector/Sources/ViewInspector/SwiftUI/TouchBar.swift /Users/admin/builder/spi-builder-workspace/.dependencies/checkouts/ViewInspector/Sources/ViewInspector/SwiftUI/TreeView.swift /Users/admin/builder/spi-builder-workspace/.dependencies/checkouts/ViewInspector/Sources/ViewInspector/SwiftUI/TupleView.swift /Users/admin/builder/spi-builder-workspace/.dependencies/checkouts/ViewInspector/Sources/ViewInspector/SwiftUI/UnaryViewAdaptor.swift /Users/admin/builder/spi-builder-workspace/.dependencies/checkouts/ViewInspector/Sources/ViewInspector/SwiftUI/VSplitView.swift /Users/admin/builder/spi-builder-workspace/.dependencies/checkouts/ViewInspector/Sources/ViewInspector/SwiftUI/VStack.swift /Users/admin/builder/spi-builder-workspace/.dependencies/checkouts/ViewInspector/Sources/ViewInspector/SwiftUI/VideoPlayer.swift /Users/admin/builder/spi-builder-workspace/.dependencies/checkouts/ViewInspector/Sources/ViewInspector/SwiftUI/ViewThatFits.swift /Users/admin/builder/spi-builder-workspace/.dependencies/checkouts/ViewInspector/Sources/ViewInspector/SwiftUI/ZStack.swift /Users/admin/builder/spi-builder-workspace/.dependencies/checkouts/ViewInspector/Sources/ViewInspector/ViewHosting.swift /Users/admin/builder/spi-builder-workspace/.dependencies/checkouts/ViewInspector/Sources/ViewInspector/ViewSearch.swift /Users/admin/builder/spi-builder-workspace/.dependencies/checkouts/ViewInspector/Sources/ViewInspector/ViewSearchIndex.swift (in target 'ViewInspector' from project 'ViewInspector')
SwiftCompile normal arm64 /Users/admin/builder/spi-builder-workspace/.dependencies/checkouts/ViewInspector/Sources/ViewInspector/SwiftUI/TouchBar.swift (in target 'ViewInspector' from project 'ViewInspector')
    cd /Users/admin/builder/spi-builder-workspace/.swiftpm/xcode

SwiftCompile normal arm64 /Users/admin/builder/spi-builder-workspace/.dependencies/checkouts/ViewInspector/Sources/ViewInspector/SwiftUI/TreeView.swift (in target 'ViewInspector' from project 'ViewInspector')
    cd /Users/admin/builder/spi-builder-workspace/.swiftpm/xcode

SwiftCompile normal arm64 /Users/admin/builder/spi-builder-workspace/.dependencies/checkouts/ViewInspector/Sources/ViewInspector/SwiftUI/TupleView.swift (in target 'ViewInspector' from project 'ViewInspector')
    cd /Users/admin/builder/spi-builder-workspace/.swiftpm/xcode

SwiftCompile normal arm64 /Users/admin/builder/spi-builder-workspace/.dependencies/checkouts/ViewInspector/Sources/ViewInspector/SwiftUI/UnaryViewAdaptor.swift (in target 'ViewInspector' from project 'ViewInspector')
    cd /Users/admin/builder/spi-builder-workspace/.swiftpm/xcode

SwiftCompile normal arm64 /Users/admin/builder/spi-builder-workspace/.dependencies/checkouts/ViewInspector/Sources/ViewInspector/SwiftUI/VSplitView.swift (in target 'ViewInspector' from project 'ViewInspector')
    cd /Users/admin/builder/spi-builder-workspace/.swiftpm/xcode

SwiftCompile normal arm64 /Users/admin/builder/spi-builder-workspace/.dependencies/checkouts/ViewInspector/Sources/ViewInspector/SwiftUI/VStack.swift (in target 'ViewInspector' from project 'ViewInspector')
    cd /Users/admin/builder/spi-builder-workspace/.swiftpm/xcode

SwiftCompile normal arm64 /Users/admin/builder/spi-builder-workspace/.dependencies/checkouts/ViewInspector/Sources/ViewInspector/SwiftUI/VideoPlayer.swift (in target 'ViewInspector' from project 'ViewInspector')
    cd /Users/admin/builder/spi-builder-workspace/.swiftpm/xcode

SwiftCompile normal arm64 /Users/admin/builder/spi-builder-workspace/.dependencies/checkouts/ViewInspector/Sources/ViewInspector/SwiftUI/ViewThatFits.swift (in target 'ViewInspector' from project 'ViewInspector')
    cd /Users/admin/builder/spi-builder-workspace/.swiftpm/xcode

SwiftCompile normal arm64 /Users/admin/builder/spi-builder-workspace/.dependencies/checkouts/ViewInspector/Sources/ViewInspector/SwiftUI/ZStack.swift (in target 'ViewInspector' from project 'ViewInspector')
    cd /Users/admin/builder/spi-builder-workspace/.swiftpm/xcode

SwiftCompile normal arm64 /Users/admin/builder/spi-builder-workspace/.dependencies/checkouts/ViewInspector/Sources/ViewInspector/ViewHosting.swift (in target 'ViewInspector' from project 'ViewInspector')
    cd /Users/admin/builder/spi-builder-workspace/.swiftpm/xcode

SwiftCompile normal arm64 /Users/admin/builder/spi-builder-workspace/.dependencies/checkouts/ViewInspector/Sources/ViewInspector/ViewSearch.swift (in target 'ViewInspector' from project 'ViewInspector')
    cd /Users/admin/builder/spi-builder-workspace/.swiftpm/xcode

SwiftCompile normal arm64 /Users/admin/builder/spi-builder-workspace/.dependencies/checkouts/ViewInspector/Sources/ViewInspector/ViewSearchIndex.swift (in target 'ViewInspector' from project 'ViewInspector')
    cd /Users/admin/builder/spi-builder-workspace/.swiftpm/xcode

SwiftDriverJobDiscovery normal arm64 Compiling Text+Builder.swift (in target 'JoinedText' from project 'JoinedText')
SwiftMergeGeneratedHeaders /Users/admin/builder/spi-builder-workspace/.derivedData/Build/Intermediates.noindex/GeneratedModuleMaps-appletvos/JoinedText-Swift.h /Users/admin/builder/spi-builder-workspace/.derivedData/Build/Intermediates.noindex/JoinedText.build/Debug-appletvos/JoinedText.build/Objects-normal/arm64/JoinedText-Swift.h (in target 'JoinedText' from project 'JoinedText')
    cd /Users/admin/builder/spi-builder-workspace
    builtin-swiftHeaderTool -arch arm64 /Users/admin/builder/spi-builder-workspace/.derivedData/Build/Intermediates.noindex/JoinedText.build/Debug-appletvos/JoinedText.build/Objects-normal/arm64/JoinedText-Swift.h -o /Users/admin/builder/spi-builder-workspace/.derivedData/Build/Intermediates.noindex/GeneratedModuleMaps-appletvos/JoinedText-Swift.h
SwiftDriverJobDiscovery normal arm64 Compiling CustomView.swift, CustomViewModifier.swift, DatePicker.swift, DelayedPreferenceView.swift, DisclosureGroup.swift, Divider.swift, EditButton.swift, EllipticalGradient.swift, EmptyView.swift, EquatableView.swift, ForEach.swift, Form.swift, GeometryReader.swift (in target 'ViewInspector' from project 'ViewInspector')
Copy /Users/admin/builder/spi-builder-workspace/.derivedData/Build/Products/Debug-appletvos/JoinedText.swiftmodule/arm64-apple-tvos.swiftmodule /Users/admin/builder/spi-builder-workspace/.derivedData/Build/Intermediates.noindex/JoinedText.build/Debug-appletvos/JoinedText.build/Objects-normal/arm64/JoinedText.swiftmodule (in target 'JoinedText' from project 'JoinedText')
    cd /Users/admin/builder/spi-builder-workspace
    builtin-copy -exclude .DS_Store -exclude CVS -exclude .svn -exclude .git -exclude .hg -resolve-src-symlinks -rename /Users/admin/builder/spi-builder-workspace/.derivedData/Build/Intermediates.noindex/JoinedText.build/Debug-appletvos/JoinedText.build/Objects-normal/arm64/JoinedText.swiftmodule /Users/admin/builder/spi-builder-workspace/.derivedData/Build/Products/Debug-appletvos/JoinedText.swiftmodule/arm64-apple-tvos.swiftmodule
Copy /Users/admin/builder/spi-builder-workspace/.derivedData/Build/Products/Debug-appletvos/JoinedText.swiftmodule/arm64-apple-tvos.swiftdoc /Users/admin/builder/spi-builder-workspace/.derivedData/Build/Intermediates.noindex/JoinedText.build/Debug-appletvos/JoinedText.build/Objects-normal/arm64/JoinedText.swiftdoc (in target 'JoinedText' from project 'JoinedText')
    cd /Users/admin/builder/spi-builder-workspace
    builtin-copy -exclude .DS_Store -exclude CVS -exclude .svn -exclude .git -exclude .hg -resolve-src-symlinks -rename /Users/admin/builder/spi-builder-workspace/.derivedData/Build/Intermediates.noindex/JoinedText.build/Debug-appletvos/JoinedText.build/Objects-normal/arm64/JoinedText.swiftdoc /Users/admin/builder/spi-builder-workspace/.derivedData/Build/Products/Debug-appletvos/JoinedText.swiftmodule/arm64-apple-tvos.swiftdoc
Copy /Users/admin/builder/spi-builder-workspace/.derivedData/Build/Products/Debug-appletvos/JoinedText.swiftmodule/arm64-apple-tvos.abi.json /Users/admin/builder/spi-builder-workspace/.derivedData/Build/Intermediates.noindex/JoinedText.build/Debug-appletvos/JoinedText.build/Objects-normal/arm64/JoinedText.abi.json (in target 'JoinedText' from project 'JoinedText')
    cd /Users/admin/builder/spi-builder-workspace
    builtin-copy -exclude .DS_Store -exclude CVS -exclude .svn -exclude .git -exclude .hg -resolve-src-symlinks -rename /Users/admin/builder/spi-builder-workspace/.derivedData/Build/Intermediates.noindex/JoinedText.build/Debug-appletvos/JoinedText.build/Objects-normal/arm64/JoinedText.abi.json /Users/admin/builder/spi-builder-workspace/.derivedData/Build/Products/Debug-appletvos/JoinedText.swiftmodule/arm64-apple-tvos.abi.json
Copy /Users/admin/builder/spi-builder-workspace/.derivedData/Build/Products/Debug-appletvos/JoinedText.swiftmodule/Project/arm64-apple-tvos.swiftsourceinfo /Users/admin/builder/spi-builder-workspace/.derivedData/Build/Intermediates.noindex/JoinedText.build/Debug-appletvos/JoinedText.build/Objects-normal/arm64/JoinedText.swiftsourceinfo (in target 'JoinedText' from project 'JoinedText')
    cd /Users/admin/builder/spi-builder-workspace
    builtin-copy -exclude .DS_Store -exclude CVS -exclude .svn -exclude .git -exclude .hg -resolve-src-symlinks -rename /Users/admin/builder/spi-builder-workspace/.derivedData/Build/Intermediates.noindex/JoinedText.build/Debug-appletvos/JoinedText.build/Objects-normal/arm64/JoinedText.swiftsourceinfo /Users/admin/builder/spi-builder-workspace/.derivedData/Build/Products/Debug-appletvos/JoinedText.swiftmodule/Project/arm64-apple-tvos.swiftsourceinfo
SwiftCompile normal arm64 Compiling\ NavigationDestination.swift,\ NavigationLink.swift,\ NavigationSplitView.swift,\ NavigationStack.swift,\ NavigationView.swift,\ OptionalContent.swift,\ OutlineGroup.swift,\ Overlay.swift,\ PasteButton.swift,\ Picker.swift,\ Popover.swift,\ PopoverContent.swift /Users/admin/builder/spi-builder-workspace/.dependencies/checkouts/ViewInspector/Sources/ViewInspector/SwiftUI/NavigationDestination.swift /Users/admin/builder/spi-builder-workspace/.dependencies/checkouts/ViewInspector/Sources/ViewInspector/SwiftUI/NavigationLink.swift /Users/admin/builder/spi-builder-workspace/.dependencies/checkouts/ViewInspector/Sources/ViewInspector/SwiftUI/NavigationSplitView.swift /Users/admin/builder/spi-builder-workspace/.dependencies/checkouts/ViewInspector/Sources/ViewInspector/SwiftUI/NavigationStack.swift /Users/admin/builder/spi-builder-workspace/.dependencies/checkouts/ViewInspector/Sources/ViewInspector/SwiftUI/NavigationView.swift /Users/admin/builder/spi-builder-workspace/.dependencies/checkouts/ViewInspector/Sources/ViewInspector/SwiftUI/OptionalContent.swift /Users/admin/builder/spi-builder-workspace/.dependencies/checkouts/ViewInspector/Sources/ViewInspector/SwiftUI/OutlineGroup.swift /Users/admin/builder/spi-builder-workspace/.dependencies/checkouts/ViewInspector/Sources/ViewInspector/SwiftUI/Overlay.swift /Users/admin/builder/spi-builder-workspace/.dependencies/checkouts/ViewInspector/Sources/ViewInspector/SwiftUI/PasteButton.swift /Users/admin/builder/spi-builder-workspace/.dependencies/checkouts/ViewInspector/Sources/ViewInspector/SwiftUI/Picker.swift /Users/admin/builder/spi-builder-workspace/.dependencies/checkouts/ViewInspector/Sources/ViewInspector/SwiftUI/Popover.swift /Users/admin/builder/spi-builder-workspace/.dependencies/checkouts/ViewInspector/Sources/ViewInspector/SwiftUI/PopoverContent.swift (in target 'ViewInspector' from project 'ViewInspector')
SwiftCompile normal arm64 /Users/admin/builder/spi-builder-workspace/.dependencies/checkouts/ViewInspector/Sources/ViewInspector/SwiftUI/NavigationDestination.swift (in target 'ViewInspector' from project 'ViewInspector')
    cd /Users/admin/builder/spi-builder-workspace/.swiftpm/xcode

SwiftCompile normal arm64 /Users/admin/builder/spi-builder-workspace/.dependencies/checkouts/ViewInspector/Sources/ViewInspector/SwiftUI/NavigationLink.swift (in target 'ViewInspector' from project 'ViewInspector')
    cd /Users/admin/builder/spi-builder-workspace/.swiftpm/xcode

SwiftCompile normal arm64 /Users/admin/builder/spi-builder-workspace/.dependencies/checkouts/ViewInspector/Sources/ViewInspector/SwiftUI/NavigationSplitView.swift (in target 'ViewInspector' from project 'ViewInspector')
    cd /Users/admin/builder/spi-builder-workspace/.swiftpm/xcode

SwiftCompile normal arm64 /Users/admin/builder/spi-builder-workspace/.dependencies/checkouts/ViewInspector/Sources/ViewInspector/SwiftUI/NavigationStack.swift (in target 'ViewInspector' from project 'ViewInspector')
    cd /Users/admin/builder/spi-builder-workspace/.swiftpm/xcode

SwiftCompile normal arm64 /Users/admin/builder/spi-builder-workspace/.dependencies/checkouts/ViewInspector/Sources/ViewInspector/SwiftUI/NavigationView.swift (in target 'ViewInspector' from project 'ViewInspector')
    cd /Users/admin/builder/spi-builder-workspace/.swiftpm/xcode

SwiftCompile normal arm64 /Users/admin/builder/spi-builder-workspace/.dependencies/checkouts/ViewInspector/Sources/ViewInspector/SwiftUI/OptionalContent.swift (in target 'ViewInspector' from project 'ViewInspector')
    cd /Users/admin/builder/spi-builder-workspace/.swiftpm/xcode

SwiftCompile normal arm64 /Users/admin/builder/spi-builder-workspace/.dependencies/checkouts/ViewInspector/Sources/ViewInspector/SwiftUI/OutlineGroup.swift (in target 'ViewInspector' from project 'ViewInspector')
    cd /Users/admin/builder/spi-builder-workspace/.swiftpm/xcode

SwiftCompile normal arm64 /Users/admin/builder/spi-builder-workspace/.dependencies/checkouts/ViewInspector/Sources/ViewInspector/SwiftUI/Overlay.swift (in target 'ViewInspector' from project 'ViewInspector')
    cd /Users/admin/builder/spi-builder-workspace/.swiftpm/xcode

SwiftCompile normal arm64 /Users/admin/builder/spi-builder-workspace/.dependencies/checkouts/ViewInspector/Sources/ViewInspector/SwiftUI/PasteButton.swift (in target 'ViewInspector' from project 'ViewInspector')
    cd /Users/admin/builder/spi-builder-workspace/.swiftpm/xcode

SwiftCompile normal arm64 /Users/admin/builder/spi-builder-workspace/.dependencies/checkouts/ViewInspector/Sources/ViewInspector/SwiftUI/Picker.swift (in target 'ViewInspector' from project 'ViewInspector')
    cd /Users/admin/builder/spi-builder-workspace/.swiftpm/xcode

SwiftCompile normal arm64 /Users/admin/builder/spi-builder-workspace/.dependencies/checkouts/ViewInspector/Sources/ViewInspector/SwiftUI/Popover.swift (in target 'ViewInspector' from project 'ViewInspector')
    cd /Users/admin/builder/spi-builder-workspace/.swiftpm/xcode

SwiftCompile normal arm64 /Users/admin/builder/spi-builder-workspace/.dependencies/checkouts/ViewInspector/Sources/ViewInspector/SwiftUI/PopoverContent.swift (in target 'ViewInspector' from project 'ViewInspector')
    cd /Users/admin/builder/spi-builder-workspace/.swiftpm/xcode

SwiftDriver\ Compilation JoinedText normal arm64 com.apple.xcode.tools.swift.compiler (in target 'JoinedText' from project 'JoinedText')
    cd /Users/admin/builder/spi-builder-workspace/.swiftpm/xcode
    builtin-Swift-Compilation -- /Applications/Xcode-16.3.0.app/Contents/Developer/Toolchains/XcodeDefault.xctoolchain/usr/bin/swiftc -module-name JoinedText -Onone -enforce-exclusivity\=checked @/Users/admin/builder/spi-builder-workspace/.derivedData/Build/Intermediates.noindex/JoinedText.build/Debug-appletvos/JoinedText.build/Objects-normal/arm64/JoinedText.SwiftFileList -DSWIFT_PACKAGE -DDEBUG -stats-output-dir .stats -strict-concurrency\=complete -enable-upcoming-feature StrictConcurrency -enable-upcoming-feature DisableOutwardActorInference -enable-upcoming-feature GlobalActorIsolatedTypesUsability -enable-upcoming-feature InferSendableFromCaptures -plugin-path /Applications/Xcode-16.3.0.app/Contents/Developer/Toolchains/XcodeDefault.xctoolchain/usr/lib/swift/host/plugins/testing -enable-experimental-feature DebugDescriptionMacro -sdk /Applications/Xcode-16.3.0.app/Contents/Developer/Platforms/AppleTVOS.platform/Developer/SDKs/AppleTVOS18.4.sdk -target arm64-apple-tvos13.0 -g -module-cache-path /Users/admin/builder/spi-builder-workspace/.derivedData/ModuleCache.noindex -Xfrontend -serialize-debugging-options -profile-coverage-mapping -profile-generate -enable-testing -index-store-path /Users/admin/builder/spi-builder-workspace/.derivedData/Index.noindex/DataStore -swift-version 5 -I /Users/admin/builder/spi-builder-workspace/.derivedData/Build/Products/Debug-appletvos -I /Applications/Xcode-16.3.0.app/Contents/Developer/Platforms/AppleTVOS.platform/Developer/usr/lib -F /Users/admin/builder/spi-builder-workspace/.derivedData/Build/Products/Debug-appletvos -F /Applications/Xcode-16.3.0.app/Contents/Developer/Platforms/AppleTVOS.platform/Developer/Library/Frameworks -F /Applications/Xcode-16.3.0.app/Contents/Developer/Platforms/AppleTVOS.platform/Developer/SDKs/AppleTVOS18.4.sdk/Developer/Library/Frameworks -c -j10 -enable-batch-mode -incremental -Xcc -ivfsstatcache -Xcc /Users/admin/builder/spi-builder-workspace/.derivedData/SDKStatCaches.noindex/appletvos18.4-22L251-271d326055c85f9856fa135c41255102.sdkstatcache -output-file-map /Users/admin/builder/spi-builder-workspace/.derivedData/Build/Intermediates.noindex/JoinedText.build/Debug-appletvos/JoinedText.build/Objects-normal/arm64/JoinedText-OutputFileMap.json -use-frontend-parseable-output -save-temps -no-color-diagnostics -serialize-diagnostics -emit-dependencies -emit-module -emit-module-path /Users/admin/builder/spi-builder-workspace/.derivedData/Build/Intermediates.noindex/JoinedText.build/Debug-appletvos/JoinedText.build/Objects-normal/arm64/JoinedText.swiftmodule -validate-clang-modules-once -clang-build-session-file /Users/admin/builder/spi-builder-workspace/.derivedData/ModuleCache.noindex/Session.modulevalidation -Xcc -I/Users/admin/builder/spi-builder-workspace/.derivedData/Build/Intermediates.noindex/JoinedText.build/Debug-appletvos/JoinedText.build/swift-overrides.hmap -emit-const-values -Xfrontend -const-gather-protocols-file -Xfrontend /Users/admin/builder/spi-builder-workspace/.derivedData/Build/Intermediates.noindex/JoinedText.build/Debug-appletvos/JoinedText.build/Objects-normal/arm64/JoinedText_const_extract_protocols.json -Xcc -I/Users/admin/builder/spi-builder-workspace/.derivedData/Build/Products/Debug-appletvos/include -Xcc -I/Users/admin/builder/spi-builder-workspace/.derivedData/Build/Intermediates.noindex/JoinedText.build/Debug-appletvos/JoinedText.build/DerivedSources-normal/arm64 -Xcc -I/Users/admin/builder/spi-builder-workspace/.derivedData/Build/Intermediates.noindex/JoinedText.build/Debug-appletvos/JoinedText.build/DerivedSources/arm64 -Xcc -I/Users/admin/builder/spi-builder-workspace/.derivedData/Build/Intermediates.noindex/JoinedText.build/Debug-appletvos/JoinedText.build/DerivedSources -Xcc -DSWIFT_PACKAGE -Xcc -DDEBUG\=1 -emit-objc-header -emit-objc-header-path /Users/admin/builder/spi-builder-workspace/.derivedData/Build/Intermediates.noindex/JoinedText.build/Debug-appletvos/JoinedText.build/Objects-normal/arm64/JoinedText-Swift.h -working-directory /Users/admin/builder/spi-builder-workspace/.swiftpm/xcode -experimental-emit-module-separately -disable-cmo
SwiftDriverJobDiscovery normal arm64 Compiling LazyHStack.swift, LazyVGrid.swift, LazyVStack.swift, LinearGradient.swift, Link.swift, List.swift, LocationButton.swift, Map.swift, MapAnnotation.swift, Menu.swift, MenuButton.swift, MultiDatePicker.swift (in target 'ViewInspector' from project 'ViewInspector')
SwiftDriverJobDiscovery normal arm64 Emitting module for ViewInspector (in target 'ViewInspector' from project 'ViewInspector')
SwiftDriver\ Compilation\ Requirements ViewInspector normal arm64 com.apple.xcode.tools.swift.compiler (in target 'ViewInspector' from project 'ViewInspector')
    cd /Users/admin/builder/spi-builder-workspace/.swiftpm/xcode
    builtin-Swift-Compilation-Requirements -- /Applications/Xcode-16.3.0.app/Contents/Developer/Toolchains/XcodeDefault.xctoolchain/usr/bin/swiftc -module-name ViewInspector -Onone -enforce-exclusivity\=checked @/Users/admin/builder/spi-builder-workspace/.derivedData/Build/Intermediates.noindex/ViewInspector.build/Debug-appletvos/ViewInspector.build/Objects-normal/arm64/ViewInspector.SwiftFileList -DSWIFT_PACKAGE -DDEBUG -stats-output-dir .stats -strict-concurrency\=complete -enable-upcoming-feature StrictConcurrency -enable-upcoming-feature DisableOutwardActorInference -enable-upcoming-feature GlobalActorIsolatedTypesUsability -enable-upcoming-feature InferSendableFromCaptures -plugin-path /Applications/Xcode-16.3.0.app/Contents/Developer/Toolchains/XcodeDefault.xctoolchain/usr/lib/swift/host/plugins/testing -enable-experimental-feature DebugDescriptionMacro -sdk /Applications/Xcode-16.3.0.app/Contents/Developer/Platforms/AppleTVOS.platform/Developer/SDKs/AppleTVOS18.4.sdk -target arm64-apple-tvos13.0 -g -module-cache-path /Users/admin/builder/spi-builder-workspace/.derivedData/ModuleCache.noindex -Xfrontend -serialize-debugging-options -profile-coverage-mapping -profile-generate -enable-testing -suppress-warnings -index-store-path /Users/admin/builder/spi-builder-workspace/.derivedData/Index.noindex/DataStore -swift-version 5 -I /Users/admin/builder/spi-builder-workspace/.derivedData/Build/Products/Debug-appletvos -I /Applications/Xcode-16.3.0.app/Contents/Developer/Platforms/AppleTVOS.platform/Developer/usr/lib -F /Users/admin/builder/spi-builder-workspace/.derivedData/Build/Products/Debug-appletvos -F /Applications/Xcode-16.3.0.app/Contents/Developer/Platforms/AppleTVOS.platform/Developer/Library/Frameworks -F /Applications/Xcode-16.3.0.app/Contents/Developer/Platforms/AppleTVOS.platform/Developer/SDKs/AppleTVOS18.4.sdk/Developer/Library/Frameworks -emit-localized-strings -emit-localized-strings-path /Users/admin/builder/spi-builder-workspace/.derivedData/Build/Intermediates.noindex/ViewInspector.build/Debug-appletvos/ViewInspector.build/Objects-normal/arm64 -c -j10 -enable-batch-mode -incremental -Xcc -ivfsstatcache -Xcc /Users/admin/builder/spi-builder-workspace/.derivedData/SDKStatCaches.noindex/appletvos18.4-22L251-271d326055c85f9856fa135c41255102.sdkstatcache -output-file-map /Users/admin/builder/spi-builder-workspace/.derivedData/Build/Intermediates.noindex/ViewInspector.build/Debug-appletvos/ViewInspector.build/Objects-normal/arm64/ViewInspector-OutputFileMap.json -use-frontend-parseable-output -save-temps -no-color-diagnostics -serialize-diagnostics -emit-dependencies -emit-module -emit-module-path /Users/admin/builder/spi-builder-workspace/.derivedData/Build/Intermediates.noindex/ViewInspector.build/Debug-appletvos/ViewInspector.build/Objects-normal/arm64/ViewInspector.swiftmodule -validate-clang-modules-once -clang-build-session-file /Users/admin/builder/spi-builder-workspace/.derivedData/ModuleCache.noindex/Session.modulevalidation -package-name viewinspector -Xcc -I/Users/admin/builder/spi-builder-workspace/.derivedData/Build/Intermediates.noindex/ViewInspector.build/Debug-appletvos/ViewInspector.build/swift-overrides.hmap -emit-const-values -Xfrontend -const-gather-protocols-file -Xfrontend /Users/admin/builder/spi-builder-workspace/.derivedData/Build/Intermediates.noindex/ViewInspector.build/Debug-appletvos/ViewInspector.build/Objects-normal/arm64/ViewInspector_const_extract_protocols.json -Xcc -I/Users/admin/builder/spi-builder-workspace/.derivedData/Build/Products/Debug-appletvos/include -Xcc -I/Users/admin/builder/spi-builder-workspace/.derivedData/Build/Intermediates.noindex/ViewInspector.build/Debug-appletvos/ViewInspector.build/DerivedSources-normal/arm64 -Xcc -I/Users/admin/builder/spi-builder-workspace/.derivedData/Build/Intermediates.noindex/ViewInspector.build/Debug-appletvos/ViewInspector.build/DerivedSources/arm64 -Xcc -I/Users/admin/builder/spi-builder-workspace/.derivedData/Build/Intermediates.noindex/ViewInspector.build/Debug-appletvos/ViewInspector.build/DerivedSources -Xcc -DSWIFT_PACKAGE -Xcc -DDEBUG\=1 -emit-objc-header -emit-objc-header-path /Users/admin/builder/spi-builder-workspace/.derivedData/Build/Intermediates.noindex/ViewInspector.build/Debug-appletvos/ViewInspector.build/Objects-normal/arm64/ViewInspector-Swift.h -working-directory /Users/admin/builder/spi-builder-workspace/.swiftpm/xcode -experimental-emit-module-separately -disable-cmo
Ld /Users/admin/builder/spi-builder-workspace/.derivedData/Build/Products/Debug-appletvos/JoinedText.o normal (in target 'JoinedText' from project 'JoinedText')
    cd /Users/admin/builder/spi-builder-workspace
    /Applications/Xcode-16.3.0.app/Contents/Developer/Toolchains/XcodeDefault.xctoolchain/usr/bin/clang -Xlinker -reproducible -target arm64-apple-tvos13.0 -r -isysroot /Applications/Xcode-16.3.0.app/Contents/Developer/Platforms/AppleTVOS.platform/Developer/SDKs/AppleTVOS18.4.sdk -O0 -L/Users/admin/builder/spi-builder-workspace/.derivedData/Build/Intermediates.noindex/EagerLinkingTBDs/Debug-appletvos -L/Users/admin/builder/spi-builder-workspace/.derivedData/Build/Products/Debug-appletvos -L/Applications/Xcode-16.3.0.app/Contents/Developer/Platforms/AppleTVOS.platform/Developer/usr/lib -F/Users/admin/builder/spi-builder-workspace/.derivedData/Build/Intermediates.noindex/EagerLinkingTBDs/Debug-appletvos -F/Users/admin/builder/spi-builder-workspace/.derivedData/Build/Products/Debug-appletvos -iframework /Applications/Xcode-16.3.0.app/Contents/Developer/Platforms/AppleTVOS.platform/Developer/Library/Frameworks -iframework /Applications/Xcode-16.3.0.app/Contents/Developer/Platforms/AppleTVOS.platform/Developer/SDKs/AppleTVOS18.4.sdk/Developer/Library/Frameworks -filelist /Users/admin/builder/spi-builder-workspace/.derivedData/Build/Intermediates.noindex/JoinedText.build/Debug-appletvos/JoinedText.build/Objects-normal/arm64/JoinedText.LinkFileList -nostdlib -Xlinker -object_path_lto -Xlinker /Users/admin/builder/spi-builder-workspace/.derivedData/Build/Intermediates.noindex/JoinedText.build/Debug-appletvos/JoinedText.build/Objects-normal/arm64/JoinedText_lto.o -rdynamic -Xlinker -no_deduplicate -Xlinker -debug_variant -Xlinker -dependency_info -Xlinker /Users/admin/builder/spi-builder-workspace/.derivedData/Build/Intermediates.noindex/JoinedText.build/Debug-appletvos/JoinedText.build/Objects-normal/arm64/JoinedText_dependency_info.dat -fobjc-link-runtime -L/Applications/Xcode-16.3.0.app/Contents/Developer/Toolchains/XcodeDefault.xctoolchain/usr/lib/swift/appletvos -L/usr/lib/swift -Xlinker -add_ast_path -Xlinker /Users/admin/builder/spi-builder-workspace/.derivedData/Build/Intermediates.noindex/JoinedText.build/Debug-appletvos/JoinedText.build/Objects-normal/arm64/JoinedText.swiftmodule -o /Users/admin/builder/spi-builder-workspace/.derivedData/Build/Products/Debug-appletvos/JoinedText.o
SwiftMergeGeneratedHeaders /Users/admin/builder/spi-builder-workspace/.derivedData/Build/Intermediates.noindex/GeneratedModuleMaps-appletvos/ViewInspector-Swift.h /Users/admin/builder/spi-builder-workspace/.derivedData/Build/Intermediates.noindex/ViewInspector.build/Debug-appletvos/ViewInspector.build/Objects-normal/arm64/ViewInspector-Swift.h (in target 'ViewInspector' from project 'ViewInspector')
    cd /Users/admin/builder/spi-builder-workspace/.dependencies/checkouts/ViewInspector
    builtin-swiftHeaderTool -arch arm64 /Users/admin/builder/spi-builder-workspace/.derivedData/Build/Intermediates.noindex/ViewInspector.build/Debug-appletvos/ViewInspector.build/Objects-normal/arm64/ViewInspector-Swift.h -o /Users/admin/builder/spi-builder-workspace/.derivedData/Build/Intermediates.noindex/GeneratedModuleMaps-appletvos/ViewInspector-Swift.h
Copy /Users/admin/builder/spi-builder-workspace/.derivedData/Build/Products/Debug-appletvos/ViewInspector.swiftmodule/arm64-apple-tvos.swiftmodule /Users/admin/builder/spi-builder-workspace/.derivedData/Build/Intermediates.noindex/ViewInspector.build/Debug-appletvos/ViewInspector.build/Objects-normal/arm64/ViewInspector.swiftmodule (in target 'ViewInspector' from project 'ViewInspector')
    cd /Users/admin/builder/spi-builder-workspace/.dependencies/checkouts/ViewInspector
    builtin-copy -exclude .DS_Store -exclude CVS -exclude .svn -exclude .git -exclude .hg -resolve-src-symlinks -rename /Users/admin/builder/spi-builder-workspace/.derivedData/Build/Intermediates.noindex/ViewInspector.build/Debug-appletvos/ViewInspector.build/Objects-normal/arm64/ViewInspector.swiftmodule /Users/admin/builder/spi-builder-workspace/.derivedData/Build/Products/Debug-appletvos/ViewInspector.swiftmodule/arm64-apple-tvos.swiftmodule
Copy /Users/admin/builder/spi-builder-workspace/.derivedData/Build/Products/Debug-appletvos/ViewInspector.swiftmodule/arm64-apple-tvos.swiftdoc /Users/admin/builder/spi-builder-workspace/.derivedData/Build/Intermediates.noindex/ViewInspector.build/Debug-appletvos/ViewInspector.build/Objects-normal/arm64/ViewInspector.swiftdoc (in target 'ViewInspector' from project 'ViewInspector')
    cd /Users/admin/builder/spi-builder-workspace/.dependencies/checkouts/ViewInspector
    builtin-copy -exclude .DS_Store -exclude CVS -exclude .svn -exclude .git -exclude .hg -resolve-src-symlinks -rename /Users/admin/builder/spi-builder-workspace/.derivedData/Build/Intermediates.noindex/ViewInspector.build/Debug-appletvos/ViewInspector.build/Objects-normal/arm64/ViewInspector.swiftdoc /Users/admin/builder/spi-builder-workspace/.derivedData/Build/Products/Debug-appletvos/ViewInspector.swiftmodule/arm64-apple-tvos.swiftdoc
Copy /Users/admin/builder/spi-builder-workspace/.derivedData/Build/Products/Debug-appletvos/ViewInspector.swiftmodule/arm64-apple-tvos.abi.json /Users/admin/builder/spi-builder-workspace/.derivedData/Build/Intermediates.noindex/ViewInspector.build/Debug-appletvos/ViewInspector.build/Objects-normal/arm64/ViewInspector.abi.json (in target 'ViewInspector' from project 'ViewInspector')
    cd /Users/admin/builder/spi-builder-workspace/.dependencies/checkouts/ViewInspector
    builtin-copy -exclude .DS_Store -exclude CVS -exclude .svn -exclude .git -exclude .hg -resolve-src-symlinks -rename /Users/admin/builder/spi-builder-workspace/.derivedData/Build/Intermediates.noindex/ViewInspector.build/Debug-appletvos/ViewInspector.build/Objects-normal/arm64/ViewInspector.abi.json /Users/admin/builder/spi-builder-workspace/.derivedData/Build/Products/Debug-appletvos/ViewInspector.swiftmodule/arm64-apple-tvos.abi.json
Copy /Users/admin/builder/spi-builder-workspace/.derivedData/Build/Products/Debug-appletvos/ViewInspector.swiftmodule/Project/arm64-apple-tvos.swiftsourceinfo /Users/admin/builder/spi-builder-workspace/.derivedData/Build/Intermediates.noindex/ViewInspector.build/Debug-appletvos/ViewInspector.build/Objects-normal/arm64/ViewInspector.swiftsourceinfo (in target 'ViewInspector' from project 'ViewInspector')
    cd /Users/admin/builder/spi-builder-workspace/.dependencies/checkouts/ViewInspector
    builtin-copy -exclude .DS_Store -exclude CVS -exclude .svn -exclude .git -exclude .hg -resolve-src-symlinks -rename /Users/admin/builder/spi-builder-workspace/.derivedData/Build/Intermediates.noindex/ViewInspector.build/Debug-appletvos/ViewInspector.build/Objects-normal/arm64/ViewInspector.swiftsourceinfo /Users/admin/builder/spi-builder-workspace/.derivedData/Build/Products/Debug-appletvos/ViewInspector.swiftmodule/Project/arm64-apple-tvos.swiftsourceinfo
SwiftDriver JoinedTextTests normal arm64 com.apple.xcode.tools.swift.compiler (in target 'JoinedTextTests' from project 'JoinedText')
    cd /Users/admin/builder/spi-builder-workspace/.swiftpm/xcode
    builtin-SwiftDriver -- /Applications/Xcode-16.3.0.app/Contents/Developer/Toolchains/XcodeDefault.xctoolchain/usr/bin/swiftc -module-name JoinedTextTests -Onone -enforce-exclusivity\=checked @/Users/admin/builder/spi-builder-workspace/.derivedData/Build/Intermediates.noindex/JoinedText.build/Debug-appletvos/JoinedTextTests.build/Objects-normal/arm64/JoinedTextTests.SwiftFileList -DSWIFT_PACKAGE -DDEBUG -stats-output-dir .stats -strict-concurrency\=complete -enable-upcoming-feature StrictConcurrency -enable-upcoming-feature DisableOutwardActorInference -enable-upcoming-feature GlobalActorIsolatedTypesUsability -enable-upcoming-feature InferSendableFromCaptures -plugin-path /Applications/Xcode-16.3.0.app/Contents/Developer/Toolchains/XcodeDefault.xctoolchain/usr/lib/swift/host/plugins/testing -enable-experimental-feature DebugDescriptionMacro -sdk /Applications/Xcode-16.3.0.app/Contents/Developer/Platforms/AppleTVOS.platform/Developer/SDKs/AppleTVOS18.4.sdk -target arm64-apple-tvos13.0 -g -module-cache-path /Users/admin/builder/spi-builder-workspace/.derivedData/ModuleCache.noindex -Xfrontend -serialize-debugging-options -profile-coverage-mapping -profile-generate -enable-testing -index-store-path /Users/admin/builder/spi-builder-workspace/.derivedData/Index.noindex/DataStore -swift-version 5 -I /Users/admin/builder/spi-builder-workspace/.derivedData/Build/Products/Debug-appletvos -I /Applications/Xcode-16.3.0.app/Contents/Developer/Platforms/AppleTVOS.platform/Developer/usr/lib -F /Users/admin/builder/spi-builder-workspace/.derivedData/Build/Products/Debug-appletvos/PackageFrameworks -F /Users/admin/builder/spi-builder-workspace/.derivedData/Build/Products/Debug-appletvos/PackageFrameworks -F /Users/admin/builder/spi-builder-workspace/.derivedData/Build/Products/Debug-appletvos -F /Applications/Xcode-16.3.0.app/Contents/Developer/Platforms/AppleTVOS.platform/Developer/Library/Frameworks -F /Applications/Xcode-16.3.0.app/Contents/Developer/Platforms/AppleTVOS.platform/Developer/SDKs/AppleTVOS18.4.sdk/Developer/Library/Frameworks -c -j10 -enable-batch-mode -incremental -Xcc -ivfsstatcache -Xcc /Users/admin/builder/spi-builder-workspace/.derivedData/SDKStatCaches.noindex/appletvos18.4-22L251-271d326055c85f9856fa135c41255102.sdkstatcache -output-file-map /Users/admin/builder/spi-builder-workspace/.derivedData/Build/Intermediates.noindex/JoinedText.build/Debug-appletvos/JoinedTextTests.build/Objects-normal/arm64/JoinedTextTests-OutputFileMap.json -use-frontend-parseable-output -save-temps -no-color-diagnostics -serialize-diagnostics -emit-dependencies -emit-module -emit-module-path /Users/admin/builder/spi-builder-workspace/.derivedData/Build/Intermediates.noindex/JoinedText.build/Debug-appletvos/JoinedTextTests.build/Objects-normal/arm64/JoinedTextTests.swiftmodule -validate-clang-modules-once -clang-build-session-file /Users/admin/builder/spi-builder-workspace/.derivedData/ModuleCache.noindex/Session.modulevalidation -emit-const-values -Xfrontend -const-gather-protocols-file -Xfrontend /Users/admin/builder/spi-builder-workspace/.derivedData/Build/Intermediates.noindex/JoinedText.build/Debug-appletvos/JoinedTextTests.build/Objects-normal/arm64/JoinedTextTests_const_extract_protocols.json -Xcc -I/Users/admin/builder/spi-builder-workspace/.derivedData/Build/Products/Debug-appletvos/include -Xcc -I/Users/admin/builder/spi-builder-workspace/.derivedData/Build/Intermediates.noindex/JoinedText.build/Debug-appletvos/JoinedTextTests.build/DerivedSources-normal/arm64 -Xcc -I/Users/admin/builder/spi-builder-workspace/.derivedData/Build/Intermediates.noindex/JoinedText.build/Debug-appletvos/JoinedTextTests.build/DerivedSources/arm64 -Xcc -I/Users/admin/builder/spi-builder-workspace/.derivedData/Build/Intermediates.noindex/JoinedText.build/Debug-appletvos/JoinedTextTests.build/DerivedSources -Xcc -DSWIFT_PACKAGE -Xcc -DDEBUG\=1 -working-directory /Users/admin/builder/spi-builder-workspace/.swiftpm/xcode -experimental-emit-module-separately -disable-cmo
SwiftEmitModule normal arm64 Emitting\ module\ for\ JoinedTextTests (in target 'JoinedTextTests' from project 'JoinedText')
Failed frontend command:
/Applications/Xcode-16.3.0.app/Contents/Developer/Toolchains/XcodeDefault.xctoolchain/usr/bin/swift-frontend -frontend -emit-module -experimental-skip-non-inlinable-function-bodies-without-types /Users/admin/builder/spi-builder-workspace/Tests/JoinedTextTests/CodeFlowTests.swift /Users/admin/builder/spi-builder-workspace/Tests/JoinedTextTests/TextJoiningTests.swift /Users/admin/builder/spi-builder-workspace/Tests/JoinedTextTests/TextStylingTests.swift /Users/admin/builder/spi-builder-workspace/Tests/JoinedTextTests/XCTestCase+Utils.swift /Users/admin/builder/spi-builder-workspace/Tests/JoinedTextTests/XCTestManifests.swift -target arm64-apple-tvos13.0 -Xllvm -aarch64-use-tbi -enable-objc-interop -stack-check -sdk /Applications/Xcode-16.3.0.app/Contents/Developer/Platforms/AppleTVOS.platform/Developer/SDKs/AppleTVOS18.4.sdk -I /Users/admin/builder/spi-builder-workspace/.derivedData/Build/Products/Debug-appletvos -I /Applications/Xcode-16.3.0.app/Contents/Developer/Platforms/AppleTVOS.platform/Developer/usr/lib -F /Users/admin/builder/spi-builder-workspace/.derivedData/Build/Products/Debug-appletvos/PackageFrameworks -F /Users/admin/builder/spi-builder-workspace/.derivedData/Build/Products/Debug-appletvos/PackageFrameworks -F /Users/admin/builder/spi-builder-workspace/.derivedData/Build/Products/Debug-appletvos -F /Applications/Xcode-16.3.0.app/Contents/Developer/Platforms/AppleTVOS.platform/Developer/Library/Frameworks -F /Applications/Xcode-16.3.0.app/Contents/Developer/Platforms/AppleTVOS.platform/Developer/SDKs/AppleTVOS18.4.sdk/Developer/Library/Frameworks -no-color-diagnostics -enable-testing -g -debug-info-format\=dwarf -dwarf-version\=4 -module-cache-path /Users/admin/builder/spi-builder-workspace/.derivedData/ModuleCache.noindex -profile-generate -profile-coverage-mapping -swift-version 5 -enforce-exclusivity\=checked -stats-output-dir /Users/admin/builder/spi-builder-workspace/.swiftpm/xcode/.stats -Onone -D SWIFT_PACKAGE -D DEBUG -serialize-debugging-options -const-gather-protocols-file /Users/admin/builder/spi-builder-workspace/.derivedData/Build/Intermediates.noindex/JoinedText.build/Debug-appletvos/JoinedTextTests.build/Objects-normal/arm64/JoinedTextTests_const_extract_protocols.json -enable-upcoming-feature StrictConcurrency -enable-upcoming-feature DisableOutwardActorInference -enable-upcoming-feature GlobalActorIsolatedTypesUsability -enable-upcoming-feature InferSendableFromCaptures -enable-experimental-feature DebugDescriptionMacro -strict-concurrency\=complete -empty-abi-descriptor -plugin-path /Applications/Xcode-16.3.0.app/Contents/Developer/Toolchains/XcodeDefault.xctoolchain/usr/lib/swift/host/plugins/testing -validate-clang-modules-once -clang-build-session-file /Users/admin/builder/spi-builder-workspace/.derivedData/ModuleCache.noindex/Session.modulevalidation -Xcc -working-directory -Xcc /Users/admin/builder/spi-builder-workspace/.swiftpm/xcode -resource-dir /Applications/Xcode-16.3.0.app/Contents/Developer/Toolchains/XcodeDefault.xctoolchain/usr/lib/swift -enable-anonymous-context-mangled-names -file-compilation-dir /Users/admin/builder/spi-builder-workspace/.swiftpm/xcode -Xcc -ivfsstatcache -Xcc /Users/admin/builder/spi-builder-workspace/.derivedData/SDKStatCaches.noindex/appletvos18.4-22L251-271d326055c85f9856fa135c41255102.sdkstatcache -Xcc -I/Users/admin/builder/spi-builder-workspace/.derivedData/Build/Products/Debug-appletvos/include -Xcc -I/Users/admin/builder/spi-builder-workspace/.derivedData/Build/Intermediates.noindex/JoinedText.build/Debug-appletvos/JoinedTextTests.build/DerivedSources-normal/arm64 -Xcc -I/Users/admin/builder/spi-builder-workspace/.derivedData/Build/Intermediates.noindex/JoinedText.build/Debug-appletvos/JoinedTextTests.build/DerivedSources/arm64 -Xcc -I/Users/admin/builder/spi-builder-workspace/.derivedData/Build/Intermediates.noindex/JoinedText.build/Debug-appletvos/JoinedTextTests.build/DerivedSources -Xcc -DSWIFT_PACKAGE -Xcc -DDEBUG\=1 -module-name JoinedTextTests -frontend-parseable-output -disable-clang-spi -target-sdk-version 18.4 -target-sdk-name appletvos18.4 -external-plugin-path /Applications/Xcode-16.3.0.app/Contents/Developer/Platforms/AppleTVOS.platform/Developer/usr/lib/swift/host/plugins\#/Applications/Xcode-16.3.0.app/Contents/Developer/Platforms/AppleTVOS.platform/Developer/usr/bin/swift-plugin-server -external-plugin-path /Applications/Xcode-16.3.0.app/Contents/Developer/Platforms/AppleTVOS.platform/Developer/usr/local/lib/swift/host/plugins\#/Applications/Xcode-16.3.0.app/Contents/Developer/Platforms/AppleTVOS.platform/Developer/usr/bin/swift-plugin-server -in-process-plugin-server-path /Applications/Xcode-16.3.0.app/Contents/Developer/Toolchains/XcodeDefault.xctoolchain/usr/lib/swift/host/libSwiftInProcPluginServer.dylib -plugin-path /Applications/Xcode-16.3.0.app/Contents/Developer/Toolchains/XcodeDefault.xctoolchain/usr/lib/swift/host/plugins -plugin-path /Applications/Xcode-16.3.0.app/Contents/Developer/Toolchains/XcodeDefault.xctoolchain/usr/local/lib/swift/host/plugins -emit-module-doc-path /Users/admin/builder/spi-builder-workspace/.derivedData/Build/Intermediates.noindex/JoinedText.build/Debug-appletvos/JoinedTextTests.build/Objects-normal/arm64/JoinedTextTests.swiftdoc -emit-module-source-info-path /Users/admin/builder/spi-builder-workspace/.derivedData/Build/Intermediates.noindex/JoinedText.build/Debug-appletvos/JoinedTextTests.build/Objects-normal/arm64/JoinedTextTests.swiftsourceinfo -serialize-diagnostics-path /Users/admin/builder/spi-builder-workspace/.derivedData/Build/Intermediates.noindex/JoinedText.build/Debug-appletvos/JoinedTextTests.build/Objects-normal/arm64/JoinedTextTests-master-emit-module.dia -emit-dependencies-path /Users/admin/builder/spi-builder-workspace/.derivedData/Build/Intermediates.noindex/JoinedText.build/Debug-appletvos/JoinedTextTests.build/Objects-normal/arm64/JoinedTextTests-master-emit-module.d -o /Users/admin/builder/spi-builder-workspace/.derivedData/Build/Intermediates.noindex/JoinedText.build/Debug-appletvos/JoinedTextTests.build/Objects-normal/arm64/JoinedTextTests.swiftmodule -emit-abi-descriptor-path /Users/admin/builder/spi-builder-workspace/.derivedData/Build/Intermediates.noindex/JoinedText.build/Debug-appletvos/JoinedTextTests.build/Objects-normal/arm64/JoinedTextTests.abi.json
EmitSwiftModule normal arm64 (in target 'JoinedTextTests' from project 'JoinedText')
    cd /Users/admin/builder/spi-builder-workspace/.swiftpm/xcode

/Users/admin/builder/spi-builder-workspace/Tests/JoinedTextTests/CodeFlowTests.swift:125:16: warning: static property 'allTests' is not concurrency-safe because it is nonisolated global shared mutable state; this is an error in the Swift 6 language mode
    static var allTests = [
               ^
/Users/admin/builder/spi-builder-workspace/Tests/JoinedTextTests/CodeFlowTests.swift:125:16: note: convert 'allTests' to a 'let' constant to make 'Sendable' shared state immutable
    static var allTests = [
           ~~~ ^
           let
/Users/admin/builder/spi-builder-workspace/Tests/JoinedTextTests/CodeFlowTests.swift:125:16: note: add '@MainActor' to make static property 'allTests' part of global actor 'MainActor'
    static var allTests = [
               ^
    @MainActor
/Users/admin/builder/spi-builder-workspace/Tests/JoinedTextTests/CodeFlowTests.swift:125:16: note: disable concurrency-safety checks if accesses are protected by an external synchronization mechanism
    static var allTests = [
               ^
    nonisolated(unsafe)
/Users/admin/builder/spi-builder-workspace/Tests/JoinedTextTests/TextJoiningTests.swift:61:16: warning: static property 'allTests' is not concurrency-safe because it is nonisolated global shared mutable state; this is an error in the Swift 6 language mode
    static var allTests = [
               ^
/Users/admin/builder/spi-builder-workspace/Tests/JoinedTextTests/TextJoiningTests.swift:61:16: note: convert 'allTests' to a 'let' constant to make 'Sendable' shared state immutable
    static var allTests = [
           ~~~ ^
           let
/Users/admin/builder/spi-builder-workspace/Tests/JoinedTextTests/TextJoiningTests.swift:61:16: note: add '@MainActor' to make static property 'allTests' part of global actor 'MainActor'
    static var allTests = [
               ^
    @MainActor
/Users/admin/builder/spi-builder-workspace/Tests/JoinedTextTests/TextJoiningTests.swift:61:16: note: disable concurrency-safety checks if accesses are protected by an external synchronization mechanism
    static var allTests = [
               ^
    nonisolated(unsafe)
/Users/admin/builder/spi-builder-workspace/Tests/JoinedTextTests/TextStylingTests.swift:44:68: error: 'TextAttributes' is not a member type of generic struct 'ViewInspector.InspectableView<View>'
    func attributes(forSubstring substring: String) throws -> Self.TextAttributes {
                                                              ~~~~ ^
/Users/admin/builder/spi-builder-workspace/.dependencies/checkouts/ViewInspector/Sources/ViewInspector/InspectableView.swift:8:15: note: 'InspectableView' declared here
public struct InspectableView<View> where View: BaseViewType {
              ^
SwiftCompile normal arm64 Compiling\ TextJoiningTests.swift /Users/admin/builder/spi-builder-workspace/Tests/JoinedTextTests/TextJoiningTests.swift (in target 'JoinedTextTests' from project 'JoinedText')
SwiftCompile normal arm64 /Users/admin/builder/spi-builder-workspace/Tests/JoinedTextTests/TextJoiningTests.swift (in target 'JoinedTextTests' from project 'JoinedText')
    cd /Users/admin/builder/spi-builder-workspace/.swiftpm/xcode

SwiftDriverJobDiscovery normal arm64 Compiling Gesture.swift, Grid.swift, Group.swift, GroupBox.swift, HSplitView.swift, HStack.swift, HelpView.swift, IDView.swift, Image.swift, Label.swift, LabeledContent.swift, LazyHGrid.swift (in target 'ViewInspector' from project 'ViewInspector')
SwiftCompile normal arm64 Compiling\ XCTestCase+Utils.swift /Users/admin/builder/spi-builder-workspace/Tests/JoinedTextTests/XCTestCase+Utils.swift (in target 'JoinedTextTests' from project 'JoinedText')
SwiftCompile normal arm64 /Users/admin/builder/spi-builder-workspace/Tests/JoinedTextTests/XCTestCase+Utils.swift (in target 'JoinedTextTests' from project 'JoinedText')
    cd /Users/admin/builder/spi-builder-workspace/.swiftpm/xcode

SwiftCompile normal arm64 Compiling\ CodeFlowTests.swift /Users/admin/builder/spi-builder-workspace/Tests/JoinedTextTests/CodeFlowTests.swift (in target 'JoinedTextTests' from project 'JoinedText')
Command SwiftCompile failed with a nonzero exit code
** BUILD FAILED **
The following build commands failed:
	SwiftEmitModule normal arm64 Emitting\ module\ for\ JoinedTextTests (in target 'JoinedTextTests' from project 'JoinedText')
	EmitSwiftModule normal arm64 (in target 'JoinedTextTests' from project 'JoinedText')
	SwiftCompile normal arm64 Compiling\ CodeFlowTests.swift /Users/admin/builder/spi-builder-workspace/Tests/JoinedTextTests/CodeFlowTests.swift (in target 'JoinedTextTests' from project 'JoinedText')
	Building workspace spi-builder-workspace with scheme JoinedText
(4 failures)
Command line invocation:
    /Applications/Xcode-16.3.0.app/Contents/Developer/usr/bin/xcodebuild -IDEClonedSourcePackagesDirPathOverride=/Users/admin/builder/spi-builder-workspace/.dependencies -resolvePackageDependencies
Resolve Package Graph
Resolved source packages:
  JoinedText: /Users/admin/builder/spi-builder-workspace
  ViewInspector: https://github.com/nalexn/ViewInspector @ 0.10.1
resolved source packages: JoinedText, ViewInspector
{
  "dependencies" : [
    {
      "identity" : "viewinspector",
      "requirement" : {
        "range" : [
          {
            "lower_bound" : "0.4.5",
            "upper_bound" : "1.0.0"
          }
        ]
      },
      "type" : "sourceControl",
      "url" : "https://github.com/nalexn/ViewInspector"
    }
  ],
  "manifest_display_name" : "JoinedText",
  "name" : "JoinedText",
  "path" : "/Users/admin/builder/spi-builder-workspace",
  "platforms" : [
    {
      "name" : "ios",
      "version" : "13.0"
    },
    {
      "name" : "macos",
      "version" : "10.15"
    }
  ],
  "products" : [
    {
      "name" : "JoinedText",
      "targets" : [
        "JoinedText"
      ],
      "type" : {
        "library" : [
          "automatic"
        ]
      }
    }
  ],
  "targets" : [
    {
      "c99name" : "JoinedTextTests",
      "module_type" : "SwiftTarget",
      "name" : "JoinedTextTests",
      "path" : "Tests/JoinedTextTests",
      "product_dependencies" : [
        "ViewInspector"
      ],
      "sources" : [
        "CodeFlowTests.swift",
        "TextJoiningTests.swift",
        "TextStylingTests.swift",
        "XCTestCase+Utils.swift",
        "XCTestManifests.swift"
      ],
      "target_dependencies" : [
        "JoinedText"
      ],
      "type" : "test"
    },
    {
      "c99name" : "JoinedText",
      "module_type" : "SwiftTarget",
      "name" : "JoinedText",
      "path" : "Sources/JoinedText",
      "product_memberships" : [
        "JoinedText"
      ],
      "sources" : [
        "Sequence+JoinedText.swift",
        "Text+Builder.swift",
        "TextBuilder.swift"
      ],
      "type" : "library"
    }
  ],
  "tools_version" : "5.2"
}
{
  "workspace" : {
    "name" : "spi-builder-workspace",
    "schemes" : [
      "JoinedText"
    ]
  }
}
Running build ...
env DEVELOPER_DIR=/Applications/Xcode-16.3.0.app xcrun xcodebuild -IDEClonedSourcePackagesDirPathOverride=$PWD/.dependencies -skipMacroValidation -skipPackagePluginValidation -derivedDataPath $PWD/.derivedData build -scheme JoinedText -destination generic/platform=tvOS
Command line invocation:
    /Applications/Xcode-16.3.0.app/Contents/Developer/usr/bin/xcodebuild -IDEClonedSourcePackagesDirPathOverride=/Users/admin/builder/spi-builder-workspace/.dependencies -skipMacroValidation -skipPackagePluginValidation -derivedDataPath /Users/admin/builder/spi-builder-workspace/.derivedData build -scheme JoinedText -destination generic/platform=tvOS
Resolve Package Graph
Resolved source packages:
  JoinedText: /Users/admin/builder/spi-builder-workspace
  ViewInspector: https://github.com/nalexn/ViewInspector @ 0.10.1
ComputePackagePrebuildTargetDependencyGraph
Prepare packages
CreateBuildRequest
SendProjectDescription
CreateBuildOperation
ComputeTargetDependencyGraph
note: Building targets in dependency order
note: Target dependency graph (5 targets)
    Target 'JoinedTextTests' in project 'JoinedText'
        ➜ Explicit dependency on target 'JoinedText' in project 'JoinedText'
        ➜ Explicit dependency on target 'ViewInspector' in project 'ViewInspector'
    Target 'ViewInspector' in project 'ViewInspector'
        ➜ Explicit dependency on target 'ViewInspector' in project 'ViewInspector'
    Target 'ViewInspector' in project 'ViewInspector' (no dependencies)
    Target 'JoinedText' in project 'JoinedText'
        ➜ Explicit dependency on target 'JoinedText' in project 'JoinedText'
    Target 'JoinedText' in project 'JoinedText' (no dependencies)
GatherProvisioningInputs
CreateBuildDescription
ExecuteExternalTool /Applications/Xcode-16.3.0.app/Contents/Developer/Toolchains/XcodeDefault.xctoolchain/usr/bin/swiftc --version
ExecuteExternalTool /Applications/Xcode-16.3.0.app/Contents/Developer/Toolchains/XcodeDefault.xctoolchain/usr/bin/clang -v -E -dM -isysroot /Applications/Xcode-16.3.0.app/Contents/Developer/Platforms/AppleTVOS.platform/Developer/SDKs/AppleTVOS18.4.sdk -x c -c /dev/null
ExecuteExternalTool /Applications/Xcode-16.3.0.app/Contents/Developer/Toolchains/XcodeDefault.xctoolchain/usr/bin/ld -version_details
Build description signature: 0c9d54ff7e5650a3f04979297fe1ddd8
Build description path: /Users/admin/builder/spi-builder-workspace/.derivedData/Build/Intermediates.noindex/XCBuildData/0c9d54ff7e5650a3f04979297fe1ddd8.xcbuilddata
ClangStatCache /Applications/Xcode-16.3.0.app/Contents/Developer/Toolchains/XcodeDefault.xctoolchain/usr/bin/clang-stat-cache /Applications/Xcode-16.3.0.app/Contents/Developer/Platforms/AppleTVOS.platform/Developer/SDKs/AppleTVOS18.4.sdk /Users/admin/builder/spi-builder-workspace/.derivedData/SDKStatCaches.noindex/appletvos18.4-22L251-271d326055c85f9856fa135c41255102.sdkstatcache
    cd /Users/admin/builder/spi-builder-workspace/.swiftpm/xcode
    /Applications/Xcode-16.3.0.app/Contents/Developer/Toolchains/XcodeDefault.xctoolchain/usr/bin/clang-stat-cache /Applications/Xcode-16.3.0.app/Contents/Developer/Platforms/AppleTVOS.platform/Developer/SDKs/AppleTVOS18.4.sdk -o /Users/admin/builder/spi-builder-workspace/.derivedData/SDKStatCaches.noindex/appletvos18.4-22L251-271d326055c85f9856fa135c41255102.sdkstatcache
SwiftDriver JoinedText normal arm64 com.apple.xcode.tools.swift.compiler (in target 'JoinedText' from project 'JoinedText')
    cd /Users/admin/builder/spi-builder-workspace/.swiftpm/xcode
    builtin-SwiftDriver -- /Applications/Xcode-16.3.0.app/Contents/Developer/Toolchains/XcodeDefault.xctoolchain/usr/bin/swiftc -module-name JoinedText -Onone -enforce-exclusivity\=checked @/Users/admin/builder/spi-builder-workspace/.derivedData/Build/Intermediates.noindex/JoinedText.build/Debug-appletvos/JoinedText.build/Objects-normal/arm64/JoinedText.SwiftFileList -DSWIFT_PACKAGE -DDEBUG -DXcode -plugin-path /Applications/Xcode-16.3.0.app/Contents/Developer/Toolchains/XcodeDefault.xctoolchain/usr/lib/swift/host/plugins/testing -enable-experimental-feature DebugDescriptionMacro -sdk /Applications/Xcode-16.3.0.app/Contents/Developer/Platforms/AppleTVOS.platform/Developer/SDKs/AppleTVOS18.4.sdk -target arm64-apple-tvos13.0 -g -module-cache-path /Users/admin/builder/spi-builder-workspace/.derivedData/ModuleCache.noindex -Xfrontend -serialize-debugging-options -profile-coverage-mapping -profile-generate -enable-testing -index-store-path /Users/admin/builder/spi-builder-workspace/.derivedData/Index.noindex/DataStore -swift-version 5 -I /Users/admin/builder/spi-builder-workspace/.derivedData/Build/Products/Debug-appletvos -I /Applications/Xcode-16.3.0.app/Contents/Developer/Platforms/AppleTVOS.platform/Developer/usr/lib -F /Users/admin/builder/spi-builder-workspace/.derivedData/Build/Products/Debug-appletvos -F /Applications/Xcode-16.3.0.app/Contents/Developer/Platforms/AppleTVOS.platform/Developer/Library/Frameworks -F /Applications/Xcode-16.3.0.app/Contents/Developer/Platforms/AppleTVOS.platform/Developer/SDKs/AppleTVOS18.4.sdk/Developer/Library/Frameworks -c -j10 -enable-batch-mode -incremental -Xcc -ivfsstatcache -Xcc /Users/admin/builder/spi-builder-workspace/.derivedData/SDKStatCaches.noindex/appletvos18.4-22L251-271d326055c85f9856fa135c41255102.sdkstatcache -output-file-map /Users/admin/builder/spi-builder-workspace/.derivedData/Build/Intermediates.noindex/JoinedText.build/Debug-appletvos/JoinedText.build/Objects-normal/arm64/JoinedText-OutputFileMap.json -use-frontend-parseable-output -save-temps -no-color-diagnostics -serialize-diagnostics -emit-dependencies -emit-module -emit-module-path /Users/admin/builder/spi-builder-workspace/.derivedData/Build/Intermediates.noindex/JoinedText.build/Debug-appletvos/JoinedText.build/Objects-normal/arm64/JoinedText.swiftmodule -validate-clang-modules-once -clang-build-session-file /Users/admin/builder/spi-builder-workspace/.derivedData/ModuleCache.noindex/Session.modulevalidation -Xcc -I/Users/admin/builder/spi-builder-workspace/.derivedData/Build/Intermediates.noindex/JoinedText.build/Debug-appletvos/JoinedText.build/swift-overrides.hmap -emit-const-values -Xfrontend -const-gather-protocols-file -Xfrontend /Users/admin/builder/spi-builder-workspace/.derivedData/Build/Intermediates.noindex/JoinedText.build/Debug-appletvos/JoinedText.build/Objects-normal/arm64/JoinedText_const_extract_protocols.json -Xcc -I/Users/admin/builder/spi-builder-workspace/.derivedData/Build/Products/Debug-appletvos/include -Xcc -I/Users/admin/builder/spi-builder-workspace/.derivedData/Build/Intermediates.noindex/JoinedText.build/Debug-appletvos/JoinedText.build/DerivedSources-normal/arm64 -Xcc -I/Users/admin/builder/spi-builder-workspace/.derivedData/Build/Intermediates.noindex/JoinedText.build/Debug-appletvos/JoinedText.build/DerivedSources/arm64 -Xcc -I/Users/admin/builder/spi-builder-workspace/.derivedData/Build/Intermediates.noindex/JoinedText.build/Debug-appletvos/JoinedText.build/DerivedSources -Xcc -DSWIFT_PACKAGE -Xcc -DDEBUG\=1 -emit-objc-header -emit-objc-header-path /Users/admin/builder/spi-builder-workspace/.derivedData/Build/Intermediates.noindex/JoinedText.build/Debug-appletvos/JoinedText.build/Objects-normal/arm64/JoinedText-Swift.h -working-directory /Users/admin/builder/spi-builder-workspace/.swiftpm/xcode -experimental-emit-module-separately -disable-cmo
SwiftDriver ViewInspector normal arm64 com.apple.xcode.tools.swift.compiler (in target 'ViewInspector' from project 'ViewInspector')
    cd /Users/admin/builder/spi-builder-workspace/.swiftpm/xcode
    builtin-SwiftDriver -- /Applications/Xcode-16.3.0.app/Contents/Developer/Toolchains/XcodeDefault.xctoolchain/usr/bin/swiftc -module-name ViewInspector -Onone -enforce-exclusivity\=checked @/Users/admin/builder/spi-builder-workspace/.derivedData/Build/Intermediates.noindex/ViewInspector.build/Debug-appletvos/ViewInspector.build/Objects-normal/arm64/ViewInspector.SwiftFileList -DSWIFT_PACKAGE -DDEBUG -DXcode -plugin-path /Applications/Xcode-16.3.0.app/Contents/Developer/Toolchains/XcodeDefault.xctoolchain/usr/lib/swift/host/plugins/testing -enable-experimental-feature DebugDescriptionMacro -sdk /Applications/Xcode-16.3.0.app/Contents/Developer/Platforms/AppleTVOS.platform/Developer/SDKs/AppleTVOS18.4.sdk -target arm64-apple-tvos13.0 -g -module-cache-path /Users/admin/builder/spi-builder-workspace/.derivedData/ModuleCache.noindex -Xfrontend -serialize-debugging-options -profile-coverage-mapping -profile-generate -enable-testing -suppress-warnings -index-store-path /Users/admin/builder/spi-builder-workspace/.derivedData/Index.noindex/DataStore -swift-version 5 -I /Users/admin/builder/spi-builder-workspace/.derivedData/Build/Products/Debug-appletvos -I /Applications/Xcode-16.3.0.app/Contents/Developer/Platforms/AppleTVOS.platform/Developer/usr/lib -F /Users/admin/builder/spi-builder-workspace/.derivedData/Build/Products/Debug-appletvos -F /Applications/Xcode-16.3.0.app/Contents/Developer/Platforms/AppleTVOS.platform/Developer/Library/Frameworks -F /Applications/Xcode-16.3.0.app/Contents/Developer/Platforms/AppleTVOS.platform/Developer/SDKs/AppleTVOS18.4.sdk/Developer/Library/Frameworks -emit-localized-strings -emit-localized-strings-path /Users/admin/builder/spi-builder-workspace/.derivedData/Build/Intermediates.noindex/ViewInspector.build/Debug-appletvos/ViewInspector.build/Objects-normal/arm64 -c -j10 -enable-batch-mode -incremental -Xcc -ivfsstatcache -Xcc /Users/admin/builder/spi-builder-workspace/.derivedData/SDKStatCaches.noindex/appletvos18.4-22L251-271d326055c85f9856fa135c41255102.sdkstatcache -output-file-map /Users/admin/builder/spi-builder-workspace/.derivedData/Build/Intermediates.noindex/ViewInspector.build/Debug-appletvos/ViewInspector.build/Objects-normal/arm64/ViewInspector-OutputFileMap.json -use-frontend-parseable-output -save-temps -no-color-diagnostics -serialize-diagnostics -emit-dependencies -emit-module -emit-module-path /Users/admin/builder/spi-builder-workspace/.derivedData/Build/Intermediates.noindex/ViewInspector.build/Debug-appletvos/ViewInspector.build/Objects-normal/arm64/ViewInspector.swiftmodule -validate-clang-modules-once -clang-build-session-file /Users/admin/builder/spi-builder-workspace/.derivedData/ModuleCache.noindex/Session.modulevalidation -package-name viewinspector -Xcc -I/Users/admin/builder/spi-builder-workspace/.derivedData/Build/Intermediates.noindex/ViewInspector.build/Debug-appletvos/ViewInspector.build/swift-overrides.hmap -emit-const-values -Xfrontend -const-gather-protocols-file -Xfrontend /Users/admin/builder/spi-builder-workspace/.derivedData/Build/Intermediates.noindex/ViewInspector.build/Debug-appletvos/ViewInspector.build/Objects-normal/arm64/ViewInspector_const_extract_protocols.json -Xcc -I/Users/admin/builder/spi-builder-workspace/.derivedData/Build/Products/Debug-appletvos/include -Xcc -I/Users/admin/builder/spi-builder-workspace/.derivedData/Build/Intermediates.noindex/ViewInspector.build/Debug-appletvos/ViewInspector.build/DerivedSources-normal/arm64 -Xcc -I/Users/admin/builder/spi-builder-workspace/.derivedData/Build/Intermediates.noindex/ViewInspector.build/Debug-appletvos/ViewInspector.build/DerivedSources/arm64 -Xcc -I/Users/admin/builder/spi-builder-workspace/.derivedData/Build/Intermediates.noindex/ViewInspector.build/Debug-appletvos/ViewInspector.build/DerivedSources -Xcc -DSWIFT_PACKAGE -Xcc -DDEBUG\=1 -emit-objc-header -emit-objc-header-path /Users/admin/builder/spi-builder-workspace/.derivedData/Build/Intermediates.noindex/ViewInspector.build/Debug-appletvos/ViewInspector.build/Objects-normal/arm64/ViewInspector-Swift.h -working-directory /Users/admin/builder/spi-builder-workspace/.swiftpm/xcode -experimental-emit-module-separately -disable-cmo
SwiftCompile normal arm64 Compiling\ Sequence+JoinedText.swift /Users/admin/builder/spi-builder-workspace/Sources/JoinedText/Sequence+JoinedText.swift (in target 'JoinedText' from project 'JoinedText')
SwiftCompile normal arm64 /Users/admin/builder/spi-builder-workspace/Sources/JoinedText/Sequence+JoinedText.swift (in target 'JoinedText' from project 'JoinedText')
    cd /Users/admin/builder/spi-builder-workspace/.swiftpm/xcode

SwiftEmitModule normal arm64 Emitting\ module\ for\ JoinedText (in target 'JoinedText' from project 'JoinedText')
EmitSwiftModule normal arm64 (in target 'JoinedText' from project 'JoinedText')
    cd /Users/admin/builder/spi-builder-workspace/.swiftpm/xcode

/Users/admin/builder/spi-builder-workspace/Sources/JoinedText/TextBuilder.swift:33:2: warning: '@_functionBuilder' has been renamed to '@resultBuilder'
@_functionBuilder
 ^~~~~~~~~~~~~~~~
 resultBuilder
SwiftCompile normal arm64 Compiling\ Text+Builder.swift /Users/admin/builder/spi-builder-workspace/Sources/JoinedText/Text+Builder.swift (in target 'JoinedText' from project 'JoinedText')
SwiftCompile normal arm64 /Users/admin/builder/spi-builder-workspace/Sources/JoinedText/Text+Builder.swift (in target 'JoinedText' from project 'JoinedText')
    cd /Users/admin/builder/spi-builder-workspace/.swiftpm/xcode

SwiftCompile normal arm64 Compiling\ TextBuilder.swift /Users/admin/builder/spi-builder-workspace/Sources/JoinedText/TextBuilder.swift (in target 'JoinedText' from project 'JoinedText')
SwiftCompile normal arm64 /Users/admin/builder/spi-builder-workspace/Sources/JoinedText/TextBuilder.swift (in target 'JoinedText' from project 'JoinedText')
    cd /Users/admin/builder/spi-builder-workspace/.swiftpm/xcode

/Users/admin/builder/spi-builder-workspace/Sources/JoinedText/TextBuilder.swift:33:2: warning: '@_functionBuilder' has been renamed to '@resultBuilder'
@_functionBuilder
 ^~~~~~~~~~~~~~~~
 resultBuilder
SwiftCompile normal arm64 Compiling\ Alert.swift,\ AngularGradient.swift,\ AnyView.swift,\ AsyncImage.swift,\ Button.swift,\ Canvas.swift,\ ClassifiedView.swift,\ Color.swift,\ ColorPicker.swift,\ ConditionalContent.swift,\ ConfirmationDialog.swift,\ ContentUnavailableView.swift,\ ControlGroup.swift /Users/admin/builder/spi-builder-workspace/.dependencies/checkouts/ViewInspector/Sources/ViewInspector/SwiftUI/Alert.swift /Users/admin/builder/spi-builder-workspace/.dependencies/checkouts/ViewInspector/Sources/ViewInspector/SwiftUI/AngularGradient.swift /Users/admin/builder/spi-builder-workspace/.dependencies/checkouts/ViewInspector/Sources/ViewInspector/SwiftUI/AnyView.swift /Users/admin/builder/spi-builder-workspace/.dependencies/checkouts/ViewInspector/Sources/ViewInspector/SwiftUI/AsyncImage.swift /Users/admin/builder/spi-builder-workspace/.dependencies/checkouts/ViewInspector/Sources/ViewInspector/SwiftUI/Button.swift /Users/admin/builder/spi-builder-workspace/.dependencies/checkouts/ViewInspector/Sources/ViewInspector/SwiftUI/Canvas.swift /Users/admin/builder/spi-builder-workspace/.dependencies/checkouts/ViewInspector/Sources/ViewInspector/SwiftUI/ClassifiedView.swift /Users/admin/builder/spi-builder-workspace/.dependencies/checkouts/ViewInspector/Sources/ViewInspector/SwiftUI/Color.swift /Users/admin/builder/spi-builder-workspace/.dependencies/checkouts/ViewInspector/Sources/ViewInspector/SwiftUI/ColorPicker.swift /Users/admin/builder/spi-builder-workspace/.dependencies/checkouts/ViewInspector/Sources/ViewInspector/SwiftUI/ConditionalContent.swift /Users/admin/builder/spi-builder-workspace/.dependencies/checkouts/ViewInspector/Sources/ViewInspector/SwiftUI/ConfirmationDialog.swift /Users/admin/builder/spi-builder-workspace/.dependencies/checkouts/ViewInspector/Sources/ViewInspector/SwiftUI/ContentUnavailableView.swift /Users/admin/builder/spi-builder-workspace/.dependencies/checkouts/ViewInspector/Sources/ViewInspector/SwiftUI/ControlGroup.swift (in target 'ViewInspector' from project 'ViewInspector')
SwiftCompile normal arm64 /Users/admin/builder/spi-builder-workspace/.dependencies/checkouts/ViewInspector/Sources/ViewInspector/SwiftUI/Alert.swift (in target 'ViewInspector' from project 'ViewInspector')
    cd /Users/admin/builder/spi-builder-workspace/.swiftpm/xcode

SwiftCompile normal arm64 /Users/admin/builder/spi-builder-workspace/.dependencies/checkouts/ViewInspector/Sources/ViewInspector/SwiftUI/AngularGradient.swift (in target 'ViewInspector' from project 'ViewInspector')
    cd /Users/admin/builder/spi-builder-workspace/.swiftpm/xcode

SwiftCompile normal arm64 /Users/admin/builder/spi-builder-workspace/.dependencies/checkouts/ViewInspector/Sources/ViewInspector/SwiftUI/AnyView.swift (in target 'ViewInspector' from project 'ViewInspector')
    cd /Users/admin/builder/spi-builder-workspace/.swiftpm/xcode

SwiftCompile normal arm64 /Users/admin/builder/spi-builder-workspace/.dependencies/checkouts/ViewInspector/Sources/ViewInspector/SwiftUI/AsyncImage.swift (in target 'ViewInspector' from project 'ViewInspector')
    cd /Users/admin/builder/spi-builder-workspace/.swiftpm/xcode

SwiftCompile normal arm64 /Users/admin/builder/spi-builder-workspace/.dependencies/checkouts/ViewInspector/Sources/ViewInspector/SwiftUI/Button.swift (in target 'ViewInspector' from project 'ViewInspector')
    cd /Users/admin/builder/spi-builder-workspace/.swiftpm/xcode

SwiftCompile normal arm64 /Users/admin/builder/spi-builder-workspace/.dependencies/checkouts/ViewInspector/Sources/ViewInspector/SwiftUI/Canvas.swift (in target 'ViewInspector' from project 'ViewInspector')
    cd /Users/admin/builder/spi-builder-workspace/.swiftpm/xcode

SwiftCompile normal arm64 /Users/admin/builder/spi-builder-workspace/.dependencies/checkouts/ViewInspector/Sources/ViewInspector/SwiftUI/ClassifiedView.swift (in target 'ViewInspector' from project 'ViewInspector')
    cd /Users/admin/builder/spi-builder-workspace/.swiftpm/xcode

SwiftCompile normal arm64 /Users/admin/builder/spi-builder-workspace/.dependencies/checkouts/ViewInspector/Sources/ViewInspector/SwiftUI/Color.swift (in target 'ViewInspector' from project 'ViewInspector')
    cd /Users/admin/builder/spi-builder-workspace/.swiftpm/xcode

SwiftCompile normal arm64 /Users/admin/builder/spi-builder-workspace/.dependencies/checkouts/ViewInspector/Sources/ViewInspector/SwiftUI/ColorPicker.swift (in target 'ViewInspector' from project 'ViewInspector')
    cd /Users/admin/builder/spi-builder-workspace/.swiftpm/xcode

SwiftCompile normal arm64 /Users/admin/builder/spi-builder-workspace/.dependencies/checkouts/ViewInspector/Sources/ViewInspector/SwiftUI/ConditionalContent.swift (in target 'ViewInspector' from project 'ViewInspector')
    cd /Users/admin/builder/spi-builder-workspace/.swiftpm/xcode

SwiftCompile normal arm64 /Users/admin/builder/spi-builder-workspace/.dependencies/checkouts/ViewInspector/Sources/ViewInspector/SwiftUI/ConfirmationDialog.swift (in target 'ViewInspector' from project 'ViewInspector')
    cd /Users/admin/builder/spi-builder-workspace/.swiftpm/xcode

SwiftCompile normal arm64 /Users/admin/builder/spi-builder-workspace/.dependencies/checkouts/ViewInspector/Sources/ViewInspector/SwiftUI/ContentUnavailableView.swift (in target 'ViewInspector' from project 'ViewInspector')
    cd /Users/admin/builder/spi-builder-workspace/.swiftpm/xcode

SwiftCompile normal arm64 /Users/admin/builder/spi-builder-workspace/.dependencies/checkouts/ViewInspector/Sources/ViewInspector/SwiftUI/ControlGroup.swift (in target 'ViewInspector' from project 'ViewInspector')
    cd /Users/admin/builder/spi-builder-workspace/.swiftpm/xcode

SwiftCompile normal arm64 Compiling\ Gesture.swift,\ Grid.swift,\ Group.swift,\ GroupBox.swift,\ HSplitView.swift,\ HStack.swift,\ HelpView.swift,\ IDView.swift,\ Image.swift,\ Label.swift,\ LabeledContent.swift,\ LazyHGrid.swift /Users/admin/builder/spi-builder-workspace/.dependencies/checkouts/ViewInspector/Sources/ViewInspector/SwiftUI/Gesture.swift /Users/admin/builder/spi-builder-workspace/.dependencies/checkouts/ViewInspector/Sources/ViewInspector/SwiftUI/Grid.swift /Users/admin/builder/spi-builder-workspace/.dependencies/checkouts/ViewInspector/Sources/ViewInspector/SwiftUI/Group.swift /Users/admin/builder/spi-builder-workspace/.dependencies/checkouts/ViewInspector/Sources/ViewInspector/SwiftUI/GroupBox.swift /Users/admin/builder/spi-builder-workspace/.dependencies/checkouts/ViewInspector/Sources/ViewInspector/SwiftUI/HSplitView.swift /Users/admin/builder/spi-builder-workspace/.dependencies/checkouts/ViewInspector/Sources/ViewInspector/SwiftUI/HStack.swift /Users/admin/builder/spi-builder-workspace/.dependencies/checkouts/ViewInspector/Sources/ViewInspector/SwiftUI/HelpView.swift /Users/admin/builder/spi-builder-workspace/.dependencies/checkouts/ViewInspector/Sources/ViewInspector/SwiftUI/IDView.swift /Users/admin/builder/spi-builder-workspace/.dependencies/checkouts/ViewInspector/Sources/ViewInspector/SwiftUI/Image.swift /Users/admin/builder/spi-builder-workspace/.dependencies/checkouts/ViewInspector/Sources/ViewInspector/SwiftUI/Label.swift /Users/admin/builder/spi-builder-workspace/.dependencies/checkouts/ViewInspector/Sources/ViewInspector/SwiftUI/LabeledContent.swift /Users/admin/builder/spi-builder-workspace/.dependencies/checkouts/ViewInspector/Sources/ViewInspector/SwiftUI/LazyHGrid.swift (in target 'ViewInspector' from project 'ViewInspector')
SwiftCompile normal arm64 /Users/admin/builder/spi-builder-workspace/.dependencies/checkouts/ViewInspector/Sources/ViewInspector/SwiftUI/Gesture.swift (in target 'ViewInspector' from project 'ViewInspector')
    cd /Users/admin/builder/spi-builder-workspace/.swiftpm/xcode

SwiftCompile normal arm64 /Users/admin/builder/spi-builder-workspace/.dependencies/checkouts/ViewInspector/Sources/ViewInspector/SwiftUI/Grid.swift (in target 'ViewInspector' from project 'ViewInspector')
    cd /Users/admin/builder/spi-builder-workspace/.swiftpm/xcode

SwiftCompile normal arm64 /Users/admin/builder/spi-builder-workspace/.dependencies/checkouts/ViewInspector/Sources/ViewInspector/SwiftUI/Group.swift (in target 'ViewInspector' from project 'ViewInspector')
    cd /Users/admin/builder/spi-builder-workspace/.swiftpm/xcode

SwiftCompile normal arm64 /Users/admin/builder/spi-builder-workspace/.dependencies/checkouts/ViewInspector/Sources/ViewInspector/SwiftUI/GroupBox.swift (in target 'ViewInspector' from project 'ViewInspector')
    cd /Users/admin/builder/spi-builder-workspace/.swiftpm/xcode

SwiftCompile normal arm64 /Users/admin/builder/spi-builder-workspace/.dependencies/checkouts/ViewInspector/Sources/ViewInspector/SwiftUI/HSplitView.swift (in target 'ViewInspector' from project 'ViewInspector')
    cd /Users/admin/builder/spi-builder-workspace/.swiftpm/xcode

SwiftCompile normal arm64 /Users/admin/builder/spi-builder-workspace/.dependencies/checkouts/ViewInspector/Sources/ViewInspector/SwiftUI/HStack.swift (in target 'ViewInspector' from project 'ViewInspector')
    cd /Users/admin/builder/spi-builder-workspace/.swiftpm/xcode

SwiftCompile normal arm64 /Users/admin/builder/spi-builder-workspace/.dependencies/checkouts/ViewInspector/Sources/ViewInspector/SwiftUI/HelpView.swift (in target 'ViewInspector' from project 'ViewInspector')
    cd /Users/admin/builder/spi-builder-workspace/.swiftpm/xcode

SwiftCompile normal arm64 /Users/admin/builder/spi-builder-workspace/.dependencies/checkouts/ViewInspector/Sources/ViewInspector/SwiftUI/IDView.swift (in target 'ViewInspector' from project 'ViewInspector')
    cd /Users/admin/builder/spi-builder-workspace/.swiftpm/xcode

SwiftCompile normal arm64 /Users/admin/builder/spi-builder-workspace/.dependencies/checkouts/ViewInspector/Sources/ViewInspector/SwiftUI/Image.swift (in target 'ViewInspector' from project 'ViewInspector')
    cd /Users/admin/builder/spi-builder-workspace/.swiftpm/xcode

SwiftCompile normal arm64 /Users/admin/builder/spi-builder-workspace/.dependencies/checkouts/ViewInspector/Sources/ViewInspector/SwiftUI/Label.swift (in target 'ViewInspector' from project 'ViewInspector')
    cd /Users/admin/builder/spi-builder-workspace/.swiftpm/xcode

SwiftCompile normal arm64 /Users/admin/builder/spi-builder-workspace/.dependencies/checkouts/ViewInspector/Sources/ViewInspector/SwiftUI/LabeledContent.swift (in target 'ViewInspector' from project 'ViewInspector')
    cd /Users/admin/builder/spi-builder-workspace/.swiftpm/xcode

SwiftCompile normal arm64 /Users/admin/builder/spi-builder-workspace/.dependencies/checkouts/ViewInspector/Sources/ViewInspector/SwiftUI/LazyHGrid.swift (in target 'ViewInspector' from project 'ViewInspector')
    cd /Users/admin/builder/spi-builder-workspace/.swiftpm/xcode

SwiftEmitModule normal arm64 Emitting\ module\ for\ ViewInspector (in target 'ViewInspector' from project 'ViewInspector')
EmitSwiftModule normal arm64 (in target 'ViewInspector' from project 'ViewInspector')
    cd /Users/admin/builder/spi-builder-workspace/.swiftpm/xcode

SwiftCompile normal arm64 Compiling\ Spacer.swift,\ Stepper.swift,\ StyleConfiguration.swift,\ SubscriptionView.swift,\ TabView.swift,\ Text.swift,\ TextAttributes.swift,\ TextEditor.swift,\ TextField.swift,\ TimelineView.swift,\ Toggle.swift,\ Toolbar.swift /Users/admin/builder/spi-builder-workspace/.dependencies/checkouts/ViewInspector/Sources/ViewInspector/SwiftUI/Spacer.swift /Users/admin/builder/spi-builder-workspace/.dependencies/checkouts/ViewInspector/Sources/ViewInspector/SwiftUI/Stepper.swift /Users/admin/builder/spi-builder-workspace/.dependencies/checkouts/ViewInspector/Sources/ViewInspector/SwiftUI/StyleConfiguration.swift /Users/admin/builder/spi-builder-workspace/.dependencies/checkouts/ViewInspector/Sources/ViewInspector/SwiftUI/SubscriptionView.swift /Users/admin/builder/spi-builder-workspace/.dependencies/checkouts/ViewInspector/Sources/ViewInspector/SwiftUI/TabView.swift /Users/admin/builder/spi-builder-workspace/.dependencies/checkouts/ViewInspector/Sources/ViewInspector/SwiftUI/Text.swift /Users/admin/builder/spi-builder-workspace/.dependencies/checkouts/ViewInspector/Sources/ViewInspector/SwiftUI/TextAttributes.swift /Users/admin/builder/spi-builder-workspace/.dependencies/checkouts/ViewInspector/Sources/ViewInspector/SwiftUI/TextEditor.swift /Users/admin/builder/spi-builder-workspace/.dependencies/checkouts/ViewInspector/Sources/ViewInspector/SwiftUI/TextField.swift /Users/admin/builder/spi-builder-workspace/.dependencies/checkouts/ViewInspector/Sources/ViewInspector/SwiftUI/TimelineView.swift /Users/admin/builder/spi-builder-workspace/.dependencies/checkouts/ViewInspector/Sources/ViewInspector/SwiftUI/Toggle.swift /Users/admin/builder/spi-builder-workspace/.dependencies/checkouts/ViewInspector/Sources/ViewInspector/SwiftUI/Toolbar.swift (in target 'ViewInspector' from project 'ViewInspector')
SwiftCompile normal arm64 /Users/admin/builder/spi-builder-workspace/.dependencies/checkouts/ViewInspector/Sources/ViewInspector/SwiftUI/Spacer.swift (in target 'ViewInspector' from project 'ViewInspector')
    cd /Users/admin/builder/spi-builder-workspace/.swiftpm/xcode

SwiftCompile normal arm64 /Users/admin/builder/spi-builder-workspace/.dependencies/checkouts/ViewInspector/Sources/ViewInspector/SwiftUI/Stepper.swift (in target 'ViewInspector' from project 'ViewInspector')
    cd /Users/admin/builder/spi-builder-workspace/.swiftpm/xcode

SwiftCompile normal arm64 /Users/admin/builder/spi-builder-workspace/.dependencies/checkouts/ViewInspector/Sources/ViewInspector/SwiftUI/StyleConfiguration.swift (in target 'ViewInspector' from project 'ViewInspector')
    cd /Users/admin/builder/spi-builder-workspace/.swiftpm/xcode

SwiftCompile normal arm64 /Users/admin/builder/spi-builder-workspace/.dependencies/checkouts/ViewInspector/Sources/ViewInspector/SwiftUI/SubscriptionView.swift (in target 'ViewInspector' from project 'ViewInspector')
    cd /Users/admin/builder/spi-builder-workspace/.swiftpm/xcode

SwiftCompile normal arm64 /Users/admin/builder/spi-builder-workspace/.dependencies/checkouts/ViewInspector/Sources/ViewInspector/SwiftUI/TabView.swift (in target 'ViewInspector' from project 'ViewInspector')
    cd /Users/admin/builder/spi-builder-workspace/.swiftpm/xcode

SwiftCompile normal arm64 /Users/admin/builder/spi-builder-workspace/.dependencies/checkouts/ViewInspector/Sources/ViewInspector/SwiftUI/Text.swift (in target 'ViewInspector' from project 'ViewInspector')
    cd /Users/admin/builder/spi-builder-workspace/.swiftpm/xcode

SwiftCompile normal arm64 /Users/admin/builder/spi-builder-workspace/.dependencies/checkouts/ViewInspector/Sources/ViewInspector/SwiftUI/TextAttributes.swift (in target 'ViewInspector' from project 'ViewInspector')
    cd /Users/admin/builder/spi-builder-workspace/.swiftpm/xcode

SwiftCompile normal arm64 /Users/admin/builder/spi-builder-workspace/.dependencies/checkouts/ViewInspector/Sources/ViewInspector/SwiftUI/TextEditor.swift (in target 'ViewInspector' from project 'ViewInspector')
    cd /Users/admin/builder/spi-builder-workspace/.swiftpm/xcode

SwiftCompile normal arm64 /Users/admin/builder/spi-builder-workspace/.dependencies/checkouts/ViewInspector/Sources/ViewInspector/SwiftUI/TextField.swift (in target 'ViewInspector' from project 'ViewInspector')
    cd /Users/admin/builder/spi-builder-workspace/.swiftpm/xcode

SwiftCompile normal arm64 /Users/admin/builder/spi-builder-workspace/.dependencies/checkouts/ViewInspector/Sources/ViewInspector/SwiftUI/TimelineView.swift (in target 'ViewInspector' from project 'ViewInspector')
    cd /Users/admin/builder/spi-builder-workspace/.swiftpm/xcode

SwiftCompile normal arm64 /Users/admin/builder/spi-builder-workspace/.dependencies/checkouts/ViewInspector/Sources/ViewInspector/SwiftUI/Toggle.swift (in target 'ViewInspector' from project 'ViewInspector')
    cd /Users/admin/builder/spi-builder-workspace/.swiftpm/xcode

SwiftCompile normal arm64 /Users/admin/builder/spi-builder-workspace/.dependencies/checkouts/ViewInspector/Sources/ViewInspector/SwiftUI/Toolbar.swift (in target 'ViewInspector' from project 'ViewInspector')
    cd /Users/admin/builder/spi-builder-workspace/.swiftpm/xcode

SwiftCompile normal arm64 Compiling\ EventsModifiers.swift,\ GestureModifiers.swift,\ InteractionModifiers.swift,\ NavigationBarModifiers.swift,\ PositioningModifiers.swift,\ PreviewModifiers.swift,\ SizingModifiers.swift,\ TextInputModifiers.swift,\ TransformingModifiers.swift,\ TransitiveModifiers.swift,\ VisualEffectModifiers.swift,\ PopupPresenter.swift,\ ActionSheet.swift /Users/admin/builder/spi-builder-workspace/.dependencies/checkouts/ViewInspector/Sources/ViewInspector/Modifiers/EventsModifiers.swift /Users/admin/builder/spi-builder-workspace/.dependencies/checkouts/ViewInspector/Sources/ViewInspector/Modifiers/GestureModifiers.swift /Users/admin/builder/spi-builder-workspace/.dependencies/checkouts/ViewInspector/Sources/ViewInspector/Modifiers/InteractionModifiers.swift /Users/admin/builder/spi-builder-workspace/.dependencies/checkouts/ViewInspector/Sources/ViewInspector/Modifiers/NavigationBarModifiers.swift /Users/admin/builder/spi-builder-workspace/.dependencies/checkouts/ViewInspector/Sources/ViewInspector/Modifiers/PositioningModifiers.swift /Users/admin/builder/spi-builder-workspace/.dependencies/checkouts/ViewInspector/Sources/ViewInspector/Modifiers/PreviewModifiers.swift /Users/admin/builder/spi-builder-workspace/.dependencies/checkouts/ViewInspector/Sources/ViewInspector/Modifiers/SizingModifiers.swift /Users/admin/builder/spi-builder-workspace/.dependencies/checkouts/ViewInspector/Sources/ViewInspector/Modifiers/TextInputModifiers.swift /Users/admin/builder/spi-builder-workspace/.dependencies/checkouts/ViewInspector/Sources/ViewInspector/Modifiers/TransformingModifiers.swift /Users/admin/builder/spi-builder-workspace/.dependencies/checkouts/ViewInspector/Sources/ViewInspector/Modifiers/TransitiveModifiers.swift /Users/admin/builder/spi-builder-workspace/.dependencies/checkouts/ViewInspector/Sources/ViewInspector/Modifiers/VisualEffectModifiers.swift /Users/admin/builder/spi-builder-workspace/.dependencies/checkouts/ViewInspector/Sources/ViewInspector/PopupPresenter.swift /Users/admin/builder/spi-builder-workspace/.dependencies/checkouts/ViewInspector/Sources/ViewInspector/SwiftUI/ActionSheet.swift (in target 'ViewInspector' from project 'ViewInspector')
SwiftCompile normal arm64 /Users/admin/builder/spi-builder-workspace/.dependencies/checkouts/ViewInspector/Sources/ViewInspector/Modifiers/EventsModifiers.swift (in target 'ViewInspector' from project 'ViewInspector')
    cd /Users/admin/builder/spi-builder-workspace/.swiftpm/xcode

SwiftCompile normal arm64 /Users/admin/builder/spi-builder-workspace/.dependencies/checkouts/ViewInspector/Sources/ViewInspector/Modifiers/GestureModifiers.swift (in target 'ViewInspector' from project 'ViewInspector')
    cd /Users/admin/builder/spi-builder-workspace/.swiftpm/xcode

SwiftCompile normal arm64 /Users/admin/builder/spi-builder-workspace/.dependencies/checkouts/ViewInspector/Sources/ViewInspector/Modifiers/InteractionModifiers.swift (in target 'ViewInspector' from project 'ViewInspector')
    cd /Users/admin/builder/spi-builder-workspace/.swiftpm/xcode

SwiftCompile normal arm64 /Users/admin/builder/spi-builder-workspace/.dependencies/checkouts/ViewInspector/Sources/ViewInspector/Modifiers/NavigationBarModifiers.swift (in target 'ViewInspector' from project 'ViewInspector')
    cd /Users/admin/builder/spi-builder-workspace/.swiftpm/xcode

SwiftCompile normal arm64 /Users/admin/builder/spi-builder-workspace/.dependencies/checkouts/ViewInspector/Sources/ViewInspector/Modifiers/PositioningModifiers.swift (in target 'ViewInspector' from project 'ViewInspector')
    cd /Users/admin/builder/spi-builder-workspace/.swiftpm/xcode

SwiftCompile normal arm64 /Users/admin/builder/spi-builder-workspace/.dependencies/checkouts/ViewInspector/Sources/ViewInspector/Modifiers/PreviewModifiers.swift (in target 'ViewInspector' from project 'ViewInspector')
    cd /Users/admin/builder/spi-builder-workspace/.swiftpm/xcode

SwiftCompile normal arm64 /Users/admin/builder/spi-builder-workspace/.dependencies/checkouts/ViewInspector/Sources/ViewInspector/Modifiers/SizingModifiers.swift (in target 'ViewInspector' from project 'ViewInspector')
    cd /Users/admin/builder/spi-builder-workspace/.swiftpm/xcode

SwiftCompile normal arm64 /Users/admin/builder/spi-builder-workspace/.dependencies/checkouts/ViewInspector/Sources/ViewInspector/Modifiers/TextInputModifiers.swift (in target 'ViewInspector' from project 'ViewInspector')
    cd /Users/admin/builder/spi-builder-workspace/.swiftpm/xcode

SwiftCompile normal arm64 /Users/admin/builder/spi-builder-workspace/.dependencies/checkouts/ViewInspector/Sources/ViewInspector/Modifiers/TransformingModifiers.swift (in target 'ViewInspector' from project 'ViewInspector')
    cd /Users/admin/builder/spi-builder-workspace/.swiftpm/xcode

SwiftCompile normal arm64 /Users/admin/builder/spi-builder-workspace/.dependencies/checkouts/ViewInspector/Sources/ViewInspector/Modifiers/TransitiveModifiers.swift (in target 'ViewInspector' from project 'ViewInspector')
    cd /Users/admin/builder/spi-builder-workspace/.swiftpm/xcode

SwiftCompile normal arm64 /Users/admin/builder/spi-builder-workspace/.dependencies/checkouts/ViewInspector/Sources/ViewInspector/Modifiers/VisualEffectModifiers.swift (in target 'ViewInspector' from project 'ViewInspector')
    cd /Users/admin/builder/spi-builder-workspace/.swiftpm/xcode

SwiftCompile normal arm64 /Users/admin/builder/spi-builder-workspace/.dependencies/checkouts/ViewInspector/Sources/ViewInspector/PopupPresenter.swift (in target 'ViewInspector' from project 'ViewInspector')
    cd /Users/admin/builder/spi-builder-workspace/.swiftpm/xcode

SwiftCompile normal arm64 /Users/admin/builder/spi-builder-workspace/.dependencies/checkouts/ViewInspector/Sources/ViewInspector/SwiftUI/ActionSheet.swift (in target 'ViewInspector' from project 'ViewInspector')
    cd /Users/admin/builder/spi-builder-workspace/.swiftpm/xcode

SwiftCompile normal arm64 Compiling\ ProgressView.swift,\ RadialGradient.swift,\ SafeAreaInset.swift,\ ScrollView.swift,\ ScrollViewReader.swift,\ Section.swift,\ SecureField.swift,\ Shape.swift,\ ShareLink.swift,\ Sheet.swift,\ SignInWithAppleButton.swift,\ Slider.swift /Users/admin/builder/spi-builder-workspace/.dependencies/checkouts/ViewInspector/Sources/ViewInspector/SwiftUI/ProgressView.swift /Users/admin/builder/spi-builder-workspace/.dependencies/checkouts/ViewInspector/Sources/ViewInspector/SwiftUI/RadialGradient.swift /Users/admin/builder/spi-builder-workspace/.dependencies/checkouts/ViewInspector/Sources/ViewInspector/SwiftUI/SafeAreaInset.swift /Users/admin/builder/spi-builder-workspace/.dependencies/checkouts/ViewInspector/Sources/ViewInspector/SwiftUI/ScrollView.swift /Users/admin/builder/spi-builder-workspace/.dependencies/checkouts/ViewInspector/Sources/ViewInspector/SwiftUI/ScrollViewReader.swift /Users/admin/builder/spi-builder-workspace/.dependencies/checkouts/ViewInspector/Sources/ViewInspector/SwiftUI/Section.swift /Users/admin/builder/spi-builder-workspace/.dependencies/checkouts/ViewInspector/Sources/ViewInspector/SwiftUI/SecureField.swift /Users/admin/builder/spi-builder-workspace/.dependencies/checkouts/ViewInspector/Sources/ViewInspector/SwiftUI/Shape.swift /Users/admin/builder/spi-builder-workspace/.dependencies/checkouts/ViewInspector/Sources/ViewInspector/SwiftUI/ShareLink.swift /Users/admin/builder/spi-builder-workspace/.dependencies/checkouts/ViewInspector/Sources/ViewInspector/SwiftUI/Sheet.swift /Users/admin/builder/spi-builder-workspace/.dependencies/checkouts/ViewInspector/Sources/ViewInspector/SwiftUI/SignInWithAppleButton.swift /Users/admin/builder/spi-builder-workspace/.dependencies/checkouts/ViewInspector/Sources/ViewInspector/SwiftUI/Slider.swift (in target 'ViewInspector' from project 'ViewInspector')
SwiftCompile normal arm64 /Users/admin/builder/spi-builder-workspace/.dependencies/checkouts/ViewInspector/Sources/ViewInspector/SwiftUI/ProgressView.swift (in target 'ViewInspector' from project 'ViewInspector')
    cd /Users/admin/builder/spi-builder-workspace/.swiftpm/xcode

SwiftCompile normal arm64 /Users/admin/builder/spi-builder-workspace/.dependencies/checkouts/ViewInspector/Sources/ViewInspector/SwiftUI/RadialGradient.swift (in target 'ViewInspector' from project 'ViewInspector')
    cd /Users/admin/builder/spi-builder-workspace/.swiftpm/xcode

SwiftCompile normal arm64 /Users/admin/builder/spi-builder-workspace/.dependencies/checkouts/ViewInspector/Sources/ViewInspector/SwiftUI/SafeAreaInset.swift (in target 'ViewInspector' from project 'ViewInspector')
    cd /Users/admin/builder/spi-builder-workspace/.swiftpm/xcode

SwiftCompile normal arm64 /Users/admin/builder/spi-builder-workspace/.dependencies/checkouts/ViewInspector/Sources/ViewInspector/SwiftUI/ScrollView.swift (in target 'ViewInspector' from project 'ViewInspector')
    cd /Users/admin/builder/spi-builder-workspace/.swiftpm/xcode

SwiftCompile normal arm64 /Users/admin/builder/spi-builder-workspace/.dependencies/checkouts/ViewInspector/Sources/ViewInspector/SwiftUI/ScrollViewReader.swift (in target 'ViewInspector' from project 'ViewInspector')
    cd /Users/admin/builder/spi-builder-workspace/.swiftpm/xcode

SwiftCompile normal arm64 /Users/admin/builder/spi-builder-workspace/.dependencies/checkouts/ViewInspector/Sources/ViewInspector/SwiftUI/Section.swift (in target 'ViewInspector' from project 'ViewInspector')
    cd /Users/admin/builder/spi-builder-workspace/.swiftpm/xcode

SwiftCompile normal arm64 /Users/admin/builder/spi-builder-workspace/.dependencies/checkouts/ViewInspector/Sources/ViewInspector/SwiftUI/SecureField.swift (in target 'ViewInspector' from project 'ViewInspector')
    cd /Users/admin/builder/spi-builder-workspace/.swiftpm/xcode

SwiftCompile normal arm64 /Users/admin/builder/spi-builder-workspace/.dependencies/checkouts/ViewInspector/Sources/ViewInspector/SwiftUI/Shape.swift (in target 'ViewInspector' from project 'ViewInspector')
    cd /Users/admin/builder/spi-builder-workspace/.swiftpm/xcode

SwiftCompile normal arm64 /Users/admin/builder/spi-builder-workspace/.dependencies/checkouts/ViewInspector/Sources/ViewInspector/SwiftUI/ShareLink.swift (in target 'ViewInspector' from project 'ViewInspector')
    cd /Users/admin/builder/spi-builder-workspace/.swiftpm/xcode

SwiftCompile normal arm64 /Users/admin/builder/spi-builder-workspace/.dependencies/checkouts/ViewInspector/Sources/ViewInspector/SwiftUI/Sheet.swift (in target 'ViewInspector' from project 'ViewInspector')
    cd /Users/admin/builder/spi-builder-workspace/.swiftpm/xcode

SwiftCompile normal arm64 /Users/admin/builder/spi-builder-workspace/.dependencies/checkouts/ViewInspector/Sources/ViewInspector/SwiftUI/SignInWithAppleButton.swift (in target 'ViewInspector' from project 'ViewInspector')
    cd /Users/admin/builder/spi-builder-workspace/.swiftpm/xcode

SwiftCompile normal arm64 /Users/admin/builder/spi-builder-workspace/.dependencies/checkouts/ViewInspector/Sources/ViewInspector/SwiftUI/Slider.swift (in target 'ViewInspector' from project 'ViewInspector')
    cd /Users/admin/builder/spi-builder-workspace/.swiftpm/xcode

SwiftCompile normal arm64 Compiling\ LazyHStack.swift,\ LazyVGrid.swift,\ LazyVStack.swift,\ LinearGradient.swift,\ Link.swift,\ List.swift,\ LocationButton.swift,\ Map.swift,\ MapAnnotation.swift,\ Menu.swift,\ MenuButton.swift,\ MultiDatePicker.swift /Users/admin/builder/spi-builder-workspace/.dependencies/checkouts/ViewInspector/Sources/ViewInspector/SwiftUI/LazyHStack.swift /Users/admin/builder/spi-builder-workspace/.dependencies/checkouts/ViewInspector/Sources/ViewInspector/SwiftUI/LazyVGrid.swift /Users/admin/builder/spi-builder-workspace/.dependencies/checkouts/ViewInspector/Sources/ViewInspector/SwiftUI/LazyVStack.swift /Users/admin/builder/spi-builder-workspace/.dependencies/checkouts/ViewInspector/Sources/ViewInspector/SwiftUI/LinearGradient.swift /Users/admin/builder/spi-builder-workspace/.dependencies/checkouts/ViewInspector/Sources/ViewInspector/SwiftUI/Link.swift /Users/admin/builder/spi-builder-workspace/.dependencies/checkouts/ViewInspector/Sources/ViewInspector/SwiftUI/List.swift /Users/admin/builder/spi-builder-workspace/.dependencies/checkouts/ViewInspector/Sources/ViewInspector/SwiftUI/LocationButton.swift /Users/admin/builder/spi-builder-workspace/.dependencies/checkouts/ViewInspector/Sources/ViewInspector/SwiftUI/Map.swift /Users/admin/builder/spi-builder-workspace/.dependencies/checkouts/ViewInspector/Sources/ViewInspector/SwiftUI/MapAnnotation.swift /Users/admin/builder/spi-builder-workspace/.dependencies/checkouts/ViewInspector/Sources/ViewInspector/SwiftUI/Menu.swift /Users/admin/builder/spi-builder-workspace/.dependencies/checkouts/ViewInspector/Sources/ViewInspector/SwiftUI/MenuButton.swift /Users/admin/builder/spi-builder-workspace/.dependencies/checkouts/ViewInspector/Sources/ViewInspector/SwiftUI/MultiDatePicker.swift (in target 'ViewInspector' from project 'ViewInspector')
SwiftCompile normal arm64 /Users/admin/builder/spi-builder-workspace/.dependencies/checkouts/ViewInspector/Sources/ViewInspector/SwiftUI/LazyHStack.swift (in target 'ViewInspector' from project 'ViewInspector')
    cd /Users/admin/builder/spi-builder-workspace/.swiftpm/xcode

SwiftCompile normal arm64 /Users/admin/builder/spi-builder-workspace/.dependencies/checkouts/ViewInspector/Sources/ViewInspector/SwiftUI/LazyVGrid.swift (in target 'ViewInspector' from project 'ViewInspector')
    cd /Users/admin/builder/spi-builder-workspace/.swiftpm/xcode

SwiftCompile normal arm64 /Users/admin/builder/spi-builder-workspace/.dependencies/checkouts/ViewInspector/Sources/ViewInspector/SwiftUI/LazyVStack.swift (in target 'ViewInspector' from project 'ViewInspector')
    cd /Users/admin/builder/spi-builder-workspace/.swiftpm/xcode

SwiftCompile normal arm64 /Users/admin/builder/spi-builder-workspace/.dependencies/checkouts/ViewInspector/Sources/ViewInspector/SwiftUI/LinearGradient.swift (in target 'ViewInspector' from project 'ViewInspector')
    cd /Users/admin/builder/spi-builder-workspace/.swiftpm/xcode

SwiftCompile normal arm64 /Users/admin/builder/spi-builder-workspace/.dependencies/checkouts/ViewInspector/Sources/ViewInspector/SwiftUI/Link.swift (in target 'ViewInspector' from project 'ViewInspector')
    cd /Users/admin/builder/spi-builder-workspace/.swiftpm/xcode

SwiftCompile normal arm64 /Users/admin/builder/spi-builder-workspace/.dependencies/checkouts/ViewInspector/Sources/ViewInspector/SwiftUI/List.swift (in target 'ViewInspector' from project 'ViewInspector')
    cd /Users/admin/builder/spi-builder-workspace/.swiftpm/xcode

SwiftCompile normal arm64 /Users/admin/builder/spi-builder-workspace/.dependencies/checkouts/ViewInspector/Sources/ViewInspector/SwiftUI/LocationButton.swift (in target 'ViewInspector' from project 'ViewInspector')
    cd /Users/admin/builder/spi-builder-workspace/.swiftpm/xcode

SwiftCompile normal arm64 /Users/admin/builder/spi-builder-workspace/.dependencies/checkouts/ViewInspector/Sources/ViewInspector/SwiftUI/Map.swift (in target 'ViewInspector' from project 'ViewInspector')
    cd /Users/admin/builder/spi-builder-workspace/.swiftpm/xcode

SwiftCompile normal arm64 /Users/admin/builder/spi-builder-workspace/.dependencies/checkouts/ViewInspector/Sources/ViewInspector/SwiftUI/MapAnnotation.swift (in target 'ViewInspector' from project 'ViewInspector')
    cd /Users/admin/builder/spi-builder-workspace/.swiftpm/xcode

SwiftCompile normal arm64 /Users/admin/builder/spi-builder-workspace/.dependencies/checkouts/ViewInspector/Sources/ViewInspector/SwiftUI/Menu.swift (in target 'ViewInspector' from project 'ViewInspector')
    cd /Users/admin/builder/spi-builder-workspace/.swiftpm/xcode

SwiftCompile normal arm64 /Users/admin/builder/spi-builder-workspace/.dependencies/checkouts/ViewInspector/Sources/ViewInspector/SwiftUI/MenuButton.swift (in target 'ViewInspector' from project 'ViewInspector')
    cd /Users/admin/builder/spi-builder-workspace/.swiftpm/xcode

SwiftCompile normal arm64 /Users/admin/builder/spi-builder-workspace/.dependencies/checkouts/ViewInspector/Sources/ViewInspector/SwiftUI/MultiDatePicker.swift (in target 'ViewInspector' from project 'ViewInspector')
    cd /Users/admin/builder/spi-builder-workspace/.swiftpm/xcode

SwiftDriverJobDiscovery normal arm64 Emitting module for JoinedText (in target 'JoinedText' from project 'JoinedText')
SwiftDriver\ Compilation\ Requirements JoinedText normal arm64 com.apple.xcode.tools.swift.compiler (in target 'JoinedText' from project 'JoinedText')
    cd /Users/admin/builder/spi-builder-workspace/.swiftpm/xcode
    builtin-Swift-Compilation-Requirements -- /Applications/Xcode-16.3.0.app/Contents/Developer/Toolchains/XcodeDefault.xctoolchain/usr/bin/swiftc -module-name JoinedText -Onone -enforce-exclusivity\=checked @/Users/admin/builder/spi-builder-workspace/.derivedData/Build/Intermediates.noindex/JoinedText.build/Debug-appletvos/JoinedText.build/Objects-normal/arm64/JoinedText.SwiftFileList -DSWIFT_PACKAGE -DDEBUG -DXcode -plugin-path /Applications/Xcode-16.3.0.app/Contents/Developer/Toolchains/XcodeDefault.xctoolchain/usr/lib/swift/host/plugins/testing -enable-experimental-feature DebugDescriptionMacro -sdk /Applications/Xcode-16.3.0.app/Contents/Developer/Platforms/AppleTVOS.platform/Developer/SDKs/AppleTVOS18.4.sdk -target arm64-apple-tvos13.0 -g -module-cache-path /Users/admin/builder/spi-builder-workspace/.derivedData/ModuleCache.noindex -Xfrontend -serialize-debugging-options -profile-coverage-mapping -profile-generate -enable-testing -index-store-path /Users/admin/builder/spi-builder-workspace/.derivedData/Index.noindex/DataStore -swift-version 5 -I /Users/admin/builder/spi-builder-workspace/.derivedData/Build/Products/Debug-appletvos -I /Applications/Xcode-16.3.0.app/Contents/Developer/Platforms/AppleTVOS.platform/Developer/usr/lib -F /Users/admin/builder/spi-builder-workspace/.derivedData/Build/Products/Debug-appletvos -F /Applications/Xcode-16.3.0.app/Contents/Developer/Platforms/AppleTVOS.platform/Developer/Library/Frameworks -F /Applications/Xcode-16.3.0.app/Contents/Developer/Platforms/AppleTVOS.platform/Developer/SDKs/AppleTVOS18.4.sdk/Developer/Library/Frameworks -c -j10 -enable-batch-mode -incremental -Xcc -ivfsstatcache -Xcc /Users/admin/builder/spi-builder-workspace/.derivedData/SDKStatCaches.noindex/appletvos18.4-22L251-271d326055c85f9856fa135c41255102.sdkstatcache -output-file-map /Users/admin/builder/spi-builder-workspace/.derivedData/Build/Intermediates.noindex/JoinedText.build/Debug-appletvos/JoinedText.build/Objects-normal/arm64/JoinedText-OutputFileMap.json -use-frontend-parseable-output -save-temps -no-color-diagnostics -serialize-diagnostics -emit-dependencies -emit-module -emit-module-path /Users/admin/builder/spi-builder-workspace/.derivedData/Build/Intermediates.noindex/JoinedText.build/Debug-appletvos/JoinedText.build/Objects-normal/arm64/JoinedText.swiftmodule -validate-clang-modules-once -clang-build-session-file /Users/admin/builder/spi-builder-workspace/.derivedData/ModuleCache.noindex/Session.modulevalidation -Xcc -I/Users/admin/builder/spi-builder-workspace/.derivedData/Build/Intermediates.noindex/JoinedText.build/Debug-appletvos/JoinedText.build/swift-overrides.hmap -emit-const-values -Xfrontend -const-gather-protocols-file -Xfrontend /Users/admin/builder/spi-builder-workspace/.derivedData/Build/Intermediates.noindex/JoinedText.build/Debug-appletvos/JoinedText.build/Objects-normal/arm64/JoinedText_const_extract_protocols.json -Xcc -I/Users/admin/builder/spi-builder-workspace/.derivedData/Build/Products/Debug-appletvos/include -Xcc -I/Users/admin/builder/spi-builder-workspace/.derivedData/Build/Intermediates.noindex/JoinedText.build/Debug-appletvos/JoinedText.build/DerivedSources-normal/arm64 -Xcc -I/Users/admin/builder/spi-builder-workspace/.derivedData/Build/Intermediates.noindex/JoinedText.build/Debug-appletvos/JoinedText.build/DerivedSources/arm64 -Xcc -I/Users/admin/builder/spi-builder-workspace/.derivedData/Build/Intermediates.noindex/JoinedText.build/Debug-appletvos/JoinedText.build/DerivedSources -Xcc -DSWIFT_PACKAGE -Xcc -DDEBUG\=1 -emit-objc-header -emit-objc-header-path /Users/admin/builder/spi-builder-workspace/.derivedData/Build/Intermediates.noindex/JoinedText.build/Debug-appletvos/JoinedText.build/Objects-normal/arm64/JoinedText-Swift.h -working-directory /Users/admin/builder/spi-builder-workspace/.swiftpm/xcode -experimental-emit-module-separately -disable-cmo
SwiftDriverJobDiscovery normal arm64 Compiling TextBuilder.swift (in target 'JoinedText' from project 'JoinedText')
SwiftCompile normal arm64 Compiling\ NavigationDestination.swift,\ NavigationLink.swift,\ NavigationSplitView.swift,\ NavigationStack.swift,\ NavigationView.swift,\ OptionalContent.swift,\ OutlineGroup.swift,\ Overlay.swift,\ PasteButton.swift,\ Picker.swift,\ Popover.swift,\ PopoverContent.swift /Users/admin/builder/spi-builder-workspace/.dependencies/checkouts/ViewInspector/Sources/ViewInspector/SwiftUI/NavigationDestination.swift /Users/admin/builder/spi-builder-workspace/.dependencies/checkouts/ViewInspector/Sources/ViewInspector/SwiftUI/NavigationLink.swift /Users/admin/builder/spi-builder-workspace/.dependencies/checkouts/ViewInspector/Sources/ViewInspector/SwiftUI/NavigationSplitView.swift /Users/admin/builder/spi-builder-workspace/.dependencies/checkouts/ViewInspector/Sources/ViewInspector/SwiftUI/NavigationStack.swift /Users/admin/builder/spi-builder-workspace/.dependencies/checkouts/ViewInspector/Sources/ViewInspector/SwiftUI/NavigationView.swift /Users/admin/builder/spi-builder-workspace/.dependencies/checkouts/ViewInspector/Sources/ViewInspector/SwiftUI/OptionalContent.swift /Users/admin/builder/spi-builder-workspace/.dependencies/checkouts/ViewInspector/Sources/ViewInspector/SwiftUI/OutlineGroup.swift /Users/admin/builder/spi-builder-workspace/.dependencies/checkouts/ViewInspector/Sources/ViewInspector/SwiftUI/Overlay.swift /Users/admin/builder/spi-builder-workspace/.dependencies/checkouts/ViewInspector/Sources/ViewInspector/SwiftUI/PasteButton.swift /Users/admin/builder/spi-builder-workspace/.dependencies/checkouts/ViewInspector/Sources/ViewInspector/SwiftUI/Picker.swift /Users/admin/builder/spi-builder-workspace/.dependencies/checkouts/ViewInspector/Sources/ViewInspector/SwiftUI/Popover.swift /Users/admin/builder/spi-builder-workspace/.dependencies/checkouts/ViewInspector/Sources/ViewInspector/SwiftUI/PopoverContent.swift (in target 'ViewInspector' from project 'ViewInspector')
SwiftCompile normal arm64 /Users/admin/builder/spi-builder-workspace/.dependencies/checkouts/ViewInspector/Sources/ViewInspector/SwiftUI/NavigationDestination.swift (in target 'ViewInspector' from project 'ViewInspector')
    cd /Users/admin/builder/spi-builder-workspace/.swiftpm/xcode

SwiftCompile normal arm64 /Users/admin/builder/spi-builder-workspace/.dependencies/checkouts/ViewInspector/Sources/ViewInspector/SwiftUI/NavigationLink.swift (in target 'ViewInspector' from project 'ViewInspector')
    cd /Users/admin/builder/spi-builder-workspace/.swiftpm/xcode

SwiftCompile normal arm64 /Users/admin/builder/spi-builder-workspace/.dependencies/checkouts/ViewInspector/Sources/ViewInspector/SwiftUI/NavigationSplitView.swift (in target 'ViewInspector' from project 'ViewInspector')
    cd /Users/admin/builder/spi-builder-workspace/.swiftpm/xcode

SwiftCompile normal arm64 /Users/admin/builder/spi-builder-workspace/.dependencies/checkouts/ViewInspector/Sources/ViewInspector/SwiftUI/NavigationStack.swift (in target 'ViewInspector' from project 'ViewInspector')
    cd /Users/admin/builder/spi-builder-workspace/.swiftpm/xcode

SwiftCompile normal arm64 /Users/admin/builder/spi-builder-workspace/.dependencies/checkouts/ViewInspector/Sources/ViewInspector/SwiftUI/NavigationView.swift (in target 'ViewInspector' from project 'ViewInspector')
    cd /Users/admin/builder/spi-builder-workspace/.swiftpm/xcode

SwiftCompile normal arm64 /Users/admin/builder/spi-builder-workspace/.dependencies/checkouts/ViewInspector/Sources/ViewInspector/SwiftUI/OptionalContent.swift (in target 'ViewInspector' from project 'ViewInspector')
    cd /Users/admin/builder/spi-builder-workspace/.swiftpm/xcode

SwiftCompile normal arm64 /Users/admin/builder/spi-builder-workspace/.dependencies/checkouts/ViewInspector/Sources/ViewInspector/SwiftUI/OutlineGroup.swift (in target 'ViewInspector' from project 'ViewInspector')
    cd /Users/admin/builder/spi-builder-workspace/.swiftpm/xcode

SwiftCompile normal arm64 /Users/admin/builder/spi-builder-workspace/.dependencies/checkouts/ViewInspector/Sources/ViewInspector/SwiftUI/Overlay.swift (in target 'ViewInspector' from project 'ViewInspector')
    cd /Users/admin/builder/spi-builder-workspace/.swiftpm/xcode

SwiftCompile normal arm64 /Users/admin/builder/spi-builder-workspace/.dependencies/checkouts/ViewInspector/Sources/ViewInspector/SwiftUI/PasteButton.swift (in target 'ViewInspector' from project 'ViewInspector')
    cd /Users/admin/builder/spi-builder-workspace/.swiftpm/xcode

SwiftCompile normal arm64 /Users/admin/builder/spi-builder-workspace/.dependencies/checkouts/ViewInspector/Sources/ViewInspector/SwiftUI/Picker.swift (in target 'ViewInspector' from project 'ViewInspector')
    cd /Users/admin/builder/spi-builder-workspace/.swiftpm/xcode

SwiftCompile normal arm64 /Users/admin/builder/spi-builder-workspace/.dependencies/checkouts/ViewInspector/Sources/ViewInspector/SwiftUI/Popover.swift (in target 'ViewInspector' from project 'ViewInspector')
    cd /Users/admin/builder/spi-builder-workspace/.swiftpm/xcode

SwiftCompile normal arm64 /Users/admin/builder/spi-builder-workspace/.dependencies/checkouts/ViewInspector/Sources/ViewInspector/SwiftUI/PopoverContent.swift (in target 'ViewInspector' from project 'ViewInspector')
    cd /Users/admin/builder/spi-builder-workspace/.swiftpm/xcode

SwiftCompile normal arm64 Compiling\ CustomView.swift,\ CustomViewModifier.swift,\ DatePicker.swift,\ DelayedPreferenceView.swift,\ DisclosureGroup.swift,\ Divider.swift,\ EditButton.swift,\ EllipticalGradient.swift,\ EmptyView.swift,\ EquatableView.swift,\ ForEach.swift,\ Form.swift,\ GeometryReader.swift /Users/admin/builder/spi-builder-workspace/.dependencies/checkouts/ViewInspector/Sources/ViewInspector/SwiftUI/CustomView.swift /Users/admin/builder/spi-builder-workspace/.dependencies/checkouts/ViewInspector/Sources/ViewInspector/SwiftUI/CustomViewModifier.swift /Users/admin/builder/spi-builder-workspace/.dependencies/checkouts/ViewInspector/Sources/ViewInspector/SwiftUI/DatePicker.swift /Users/admin/builder/spi-builder-workspace/.dependencies/checkouts/ViewInspector/Sources/ViewInspector/SwiftUI/DelayedPreferenceView.swift /Users/admin/builder/spi-builder-workspace/.dependencies/checkouts/ViewInspector/Sources/ViewInspector/SwiftUI/DisclosureGroup.swift /Users/admin/builder/spi-builder-workspace/.dependencies/checkouts/ViewInspector/Sources/ViewInspector/SwiftUI/Divider.swift /Users/admin/builder/spi-builder-workspace/.dependencies/checkouts/ViewInspector/Sources/ViewInspector/SwiftUI/EditButton.swift /Users/admin/builder/spi-builder-workspace/.dependencies/checkouts/ViewInspector/Sources/ViewInspector/SwiftUI/EllipticalGradient.swift /Users/admin/builder/spi-builder-workspace/.dependencies/checkouts/ViewInspector/Sources/ViewInspector/SwiftUI/EmptyView.swift /Users/admin/builder/spi-builder-workspace/.dependencies/checkouts/ViewInspector/Sources/ViewInspector/SwiftUI/EquatableView.swift /Users/admin/builder/spi-builder-workspace/.dependencies/checkouts/ViewInspector/Sources/ViewInspector/SwiftUI/ForEach.swift /Users/admin/builder/spi-builder-workspace/.dependencies/checkouts/ViewInspector/Sources/ViewInspector/SwiftUI/Form.swift /Users/admin/builder/spi-builder-workspace/.dependencies/checkouts/ViewInspector/Sources/ViewInspector/SwiftUI/GeometryReader.swift (in target 'ViewInspector' from project 'ViewInspector')
SwiftCompile normal arm64 /Users/admin/builder/spi-builder-workspace/.dependencies/checkouts/ViewInspector/Sources/ViewInspector/SwiftUI/CustomView.swift (in target 'ViewInspector' from project 'ViewInspector')
    cd /Users/admin/builder/spi-builder-workspace/.swiftpm/xcode

SwiftCompile normal arm64 /Users/admin/builder/spi-builder-workspace/.dependencies/checkouts/ViewInspector/Sources/ViewInspector/SwiftUI/CustomViewModifier.swift (in target 'ViewInspector' from project 'ViewInspector')
    cd /Users/admin/builder/spi-builder-workspace/.swiftpm/xcode

SwiftCompile normal arm64 /Users/admin/builder/spi-builder-workspace/.dependencies/checkouts/ViewInspector/Sources/ViewInspector/SwiftUI/DatePicker.swift (in target 'ViewInspector' from project 'ViewInspector')
    cd /Users/admin/builder/spi-builder-workspace/.swiftpm/xcode

SwiftCompile normal arm64 /Users/admin/builder/spi-builder-workspace/.dependencies/checkouts/ViewInspector/Sources/ViewInspector/SwiftUI/DelayedPreferenceView.swift (in target 'ViewInspector' from project 'ViewInspector')
    cd /Users/admin/builder/spi-builder-workspace/.swiftpm/xcode

SwiftCompile normal arm64 /Users/admin/builder/spi-builder-workspace/.dependencies/checkouts/ViewInspector/Sources/ViewInspector/SwiftUI/DisclosureGroup.swift (in target 'ViewInspector' from project 'ViewInspector')
    cd /Users/admin/builder/spi-builder-workspace/.swiftpm/xcode

SwiftCompile normal arm64 /Users/admin/builder/spi-builder-workspace/.dependencies/checkouts/ViewInspector/Sources/ViewInspector/SwiftUI/Divider.swift (in target 'ViewInspector' from project 'ViewInspector')
    cd /Users/admin/builder/spi-builder-workspace/.swiftpm/xcode

SwiftCompile normal arm64 /Users/admin/builder/spi-builder-workspace/.dependencies/checkouts/ViewInspector/Sources/ViewInspector/SwiftUI/EditButton.swift (in target 'ViewInspector' from project 'ViewInspector')
    cd /Users/admin/builder/spi-builder-workspace/.swiftpm/xcode

SwiftCompile normal arm64 /Users/admin/builder/spi-builder-workspace/.dependencies/checkouts/ViewInspector/Sources/ViewInspector/SwiftUI/EllipticalGradient.swift (in target 'ViewInspector' from project 'ViewInspector')
    cd /Users/admin/builder/spi-builder-workspace/.swiftpm/xcode

SwiftCompile normal arm64 /Users/admin/builder/spi-builder-workspace/.dependencies/checkouts/ViewInspector/Sources/ViewInspector/SwiftUI/EmptyView.swift (in target 'ViewInspector' from project 'ViewInspector')
    cd /Users/admin/builder/spi-builder-workspace/.swiftpm/xcode

SwiftCompile normal arm64 /Users/admin/builder/spi-builder-workspace/.dependencies/checkouts/ViewInspector/Sources/ViewInspector/SwiftUI/EquatableView.swift (in target 'ViewInspector' from project 'ViewInspector')
    cd /Users/admin/builder/spi-builder-workspace/.swiftpm/xcode

SwiftCompile normal arm64 /Users/admin/builder/spi-builder-workspace/.dependencies/checkouts/ViewInspector/Sources/ViewInspector/SwiftUI/ForEach.swift (in target 'ViewInspector' from project 'ViewInspector')
    cd /Users/admin/builder/spi-builder-workspace/.swiftpm/xcode

SwiftCompile normal arm64 /Users/admin/builder/spi-builder-workspace/.dependencies/checkouts/ViewInspector/Sources/ViewInspector/SwiftUI/Form.swift (in target 'ViewInspector' from project 'ViewInspector')
    cd /Users/admin/builder/spi-builder-workspace/.swiftpm/xcode

SwiftCompile normal arm64 /Users/admin/builder/spi-builder-workspace/.dependencies/checkouts/ViewInspector/Sources/ViewInspector/SwiftUI/GeometryReader.swift (in target 'ViewInspector' from project 'ViewInspector')
    cd /Users/admin/builder/spi-builder-workspace/.swiftpm/xcode

SwiftDriverJobDiscovery normal arm64 Compiling Text+Builder.swift (in target 'JoinedText' from project 'JoinedText')
Copy /Users/admin/builder/spi-builder-workspace/.derivedData/Build/Products/Debug-appletvos/JoinedText.swiftmodule/arm64-apple-tvos.abi.json /Users/admin/builder/spi-builder-workspace/.derivedData/Build/Intermediates.noindex/JoinedText.build/Debug-appletvos/JoinedText.build/Objects-normal/arm64/JoinedText.abi.json (in target 'JoinedText' from project 'JoinedText')
    cd /Users/admin/builder/spi-builder-workspace
    builtin-copy -exclude .DS_Store -exclude CVS -exclude .svn -exclude .git -exclude .hg -resolve-src-symlinks -rename /Users/admin/builder/spi-builder-workspace/.derivedData/Build/Intermediates.noindex/JoinedText.build/Debug-appletvos/JoinedText.build/Objects-normal/arm64/JoinedText.abi.json /Users/admin/builder/spi-builder-workspace/.derivedData/Build/Products/Debug-appletvos/JoinedText.swiftmodule/arm64-apple-tvos.abi.json
SwiftDriverJobDiscovery normal arm64 Compiling Sequence+JoinedText.swift (in target 'JoinedText' from project 'JoinedText')
SwiftCompile normal arm64 Compiling\ BaseTypes.swift,\ ContentExtraction.swift,\ EnvironmentInjection.swift,\ InspectableView+RandomAccessCollection.swift,\ InspectableView.swift,\ InspectionEmissary.swift,\ Inspector.swift,\ LazyGroup.swift,\ AccessibilityModifiers.swift,\ AnimationModifiers.swift,\ ConfigurationModifiers.swift,\ CustomStyleModifiers.swift,\ EnvironmentModifiers.swift /Users/admin/builder/spi-builder-workspace/.dependencies/checkouts/ViewInspector/Sources/ViewInspector/BaseTypes.swift /Users/admin/builder/spi-builder-workspace/.dependencies/checkouts/ViewInspector/Sources/ViewInspector/ContentExtraction.swift /Users/admin/builder/spi-builder-workspace/.dependencies/checkouts/ViewInspector/Sources/ViewInspector/EnvironmentInjection.swift /Users/admin/builder/spi-builder-workspace/.dependencies/checkouts/ViewInspector/Sources/ViewInspector/InspectableView+RandomAccessCollection.swift /Users/admin/builder/spi-builder-workspace/.dependencies/checkouts/ViewInspector/Sources/ViewInspector/InspectableView.swift /Users/admin/builder/spi-builder-workspace/.dependencies/checkouts/ViewInspector/Sources/ViewInspector/InspectionEmissary.swift /Users/admin/builder/spi-builder-workspace/.dependencies/checkouts/ViewInspector/Sources/ViewInspector/Inspector.swift /Users/admin/builder/spi-builder-workspace/.dependencies/checkouts/ViewInspector/Sources/ViewInspector/LazyGroup.swift /Users/admin/builder/spi-builder-workspace/.dependencies/checkouts/ViewInspector/Sources/ViewInspector/Modifiers/AccessibilityModifiers.swift /Users/admin/builder/spi-builder-workspace/.dependencies/checkouts/ViewInspector/Sources/ViewInspector/Modifiers/AnimationModifiers.swift /Users/admin/builder/spi-builder-workspace/.dependencies/checkouts/ViewInspector/Sources/ViewInspector/Modifiers/ConfigurationModifiers.swift /Users/admin/builder/spi-builder-workspace/.dependencies/checkouts/ViewInspector/Sources/ViewInspector/Modifiers/CustomStyleModifiers.swift /Users/admin/builder/spi-builder-workspace/.dependencies/checkouts/ViewInspector/Sources/ViewInspector/Modifiers/EnvironmentModifiers.swift (in target 'ViewInspector' from project 'ViewInspector')
SwiftCompile normal arm64 /Users/admin/builder/spi-builder-workspace/.dependencies/checkouts/ViewInspector/Sources/ViewInspector/BaseTypes.swift (in target 'ViewInspector' from project 'ViewInspector')
    cd /Users/admin/builder/spi-builder-workspace/.swiftpm/xcode

SwiftCompile normal arm64 /Users/admin/builder/spi-builder-workspace/.dependencies/checkouts/ViewInspector/Sources/ViewInspector/ContentExtraction.swift (in target 'ViewInspector' from project 'ViewInspector')
    cd /Users/admin/builder/spi-builder-workspace/.swiftpm/xcode

SwiftCompile normal arm64 /Users/admin/builder/spi-builder-workspace/.dependencies/checkouts/ViewInspector/Sources/ViewInspector/EnvironmentInjection.swift (in target 'ViewInspector' from project 'ViewInspector')
    cd /Users/admin/builder/spi-builder-workspace/.swiftpm/xcode

SwiftCompile normal arm64 /Users/admin/builder/spi-builder-workspace/.dependencies/checkouts/ViewInspector/Sources/ViewInspector/InspectableView+RandomAccessCollection.swift (in target 'ViewInspector' from project 'ViewInspector')
    cd /Users/admin/builder/spi-builder-workspace/.swiftpm/xcode

SwiftCompile normal arm64 /Users/admin/builder/spi-builder-workspace/.dependencies/checkouts/ViewInspector/Sources/ViewInspector/InspectableView.swift (in target 'ViewInspector' from project 'ViewInspector')
    cd /Users/admin/builder/spi-builder-workspace/.swiftpm/xcode

SwiftCompile normal arm64 /Users/admin/builder/spi-builder-workspace/.dependencies/checkouts/ViewInspector/Sources/ViewInspector/InspectionEmissary.swift (in target 'ViewInspector' from project 'ViewInspector')
    cd /Users/admin/builder/spi-builder-workspace/.swiftpm/xcode

SwiftCompile normal arm64 /Users/admin/builder/spi-builder-workspace/.dependencies/checkouts/ViewInspector/Sources/ViewInspector/Inspector.swift (in target 'ViewInspector' from project 'ViewInspector')
    cd /Users/admin/builder/spi-builder-workspace/.swiftpm/xcode

SwiftCompile normal arm64 /Users/admin/builder/spi-builder-workspace/.dependencies/checkouts/ViewInspector/Sources/ViewInspector/LazyGroup.swift (in target 'ViewInspector' from project 'ViewInspector')
    cd /Users/admin/builder/spi-builder-workspace/.swiftpm/xcode

SwiftCompile normal arm64 /Users/admin/builder/spi-builder-workspace/.dependencies/checkouts/ViewInspector/Sources/ViewInspector/Modifiers/AccessibilityModifiers.swift (in target 'ViewInspector' from project 'ViewInspector')
    cd /Users/admin/builder/spi-builder-workspace/.swiftpm/xcode

SwiftCompile normal arm64 /Users/admin/builder/spi-builder-workspace/.dependencies/checkouts/ViewInspector/Sources/ViewInspector/Modifiers/AnimationModifiers.swift (in target 'ViewInspector' from project 'ViewInspector')
    cd /Users/admin/builder/spi-builder-workspace/.swiftpm/xcode

SwiftCompile normal arm64 /Users/admin/builder/spi-builder-workspace/.dependencies/checkouts/ViewInspector/Sources/ViewInspector/Modifiers/ConfigurationModifiers.swift (in target 'ViewInspector' from project 'ViewInspector')
    cd /Users/admin/builder/spi-builder-workspace/.swiftpm/xcode

SwiftCompile normal arm64 /Users/admin/builder/spi-builder-workspace/.dependencies/checkouts/ViewInspector/Sources/ViewInspector/Modifiers/CustomStyleModifiers.swift (in target 'ViewInspector' from project 'ViewInspector')
    cd /Users/admin/builder/spi-builder-workspace/.swiftpm/xcode

SwiftCompile normal arm64 /Users/admin/builder/spi-builder-workspace/.dependencies/checkouts/ViewInspector/Sources/ViewInspector/Modifiers/EnvironmentModifiers.swift (in target 'ViewInspector' from project 'ViewInspector')
    cd /Users/admin/builder/spi-builder-workspace/.swiftpm/xcode

SwiftCompile normal arm64 Compiling\ TouchBar.swift,\ TreeView.swift,\ TupleView.swift,\ UnaryViewAdaptor.swift,\ VSplitView.swift,\ VStack.swift,\ VideoPlayer.swift,\ ViewThatFits.swift,\ ZStack.swift,\ ViewHosting.swift,\ ViewSearch.swift,\ ViewSearchIndex.swift /Users/admin/builder/spi-builder-workspace/.dependencies/checkouts/ViewInspector/Sources/ViewInspector/SwiftUI/TouchBar.swift /Users/admin/builder/spi-builder-workspace/.dependencies/checkouts/ViewInspector/Sources/ViewInspector/SwiftUI/TreeView.swift /Users/admin/builder/spi-builder-workspace/.dependencies/checkouts/ViewInspector/Sources/ViewInspector/SwiftUI/TupleView.swift /Users/admin/builder/spi-builder-workspace/.dependencies/checkouts/ViewInspector/Sources/ViewInspector/SwiftUI/UnaryViewAdaptor.swift /Users/admin/builder/spi-builder-workspace/.dependencies/checkouts/ViewInspector/Sources/ViewInspector/SwiftUI/VSplitView.swift /Users/admin/builder/spi-builder-workspace/.dependencies/checkouts/ViewInspector/Sources/ViewInspector/SwiftUI/VStack.swift /Users/admin/builder/spi-builder-workspace/.dependencies/checkouts/ViewInspector/Sources/ViewInspector/SwiftUI/VideoPlayer.swift /Users/admin/builder/spi-builder-workspace/.dependencies/checkouts/ViewInspector/Sources/ViewInspector/SwiftUI/ViewThatFits.swift /Users/admin/builder/spi-builder-workspace/.dependencies/checkouts/ViewInspector/Sources/ViewInspector/SwiftUI/ZStack.swift /Users/admin/builder/spi-builder-workspace/.dependencies/checkouts/ViewInspector/Sources/ViewInspector/ViewHosting.swift /Users/admin/builder/spi-builder-workspace/.dependencies/checkouts/ViewInspector/Sources/ViewInspector/ViewSearch.swift /Users/admin/builder/spi-builder-workspace/.dependencies/checkouts/ViewInspector/Sources/ViewInspector/ViewSearchIndex.swift (in target 'ViewInspector' from project 'ViewInspector')
SwiftCompile normal arm64 /Users/admin/builder/spi-builder-workspace/.dependencies/checkouts/ViewInspector/Sources/ViewInspector/SwiftUI/TouchBar.swift (in target 'ViewInspector' from project 'ViewInspector')
    cd /Users/admin/builder/spi-builder-workspace/.swiftpm/xcode

SwiftCompile normal arm64 /Users/admin/builder/spi-builder-workspace/.dependencies/checkouts/ViewInspector/Sources/ViewInspector/SwiftUI/TreeView.swift (in target 'ViewInspector' from project 'ViewInspector')
    cd /Users/admin/builder/spi-builder-workspace/.swiftpm/xcode

SwiftCompile normal arm64 /Users/admin/builder/spi-builder-workspace/.dependencies/checkouts/ViewInspector/Sources/ViewInspector/SwiftUI/TupleView.swift (in target 'ViewInspector' from project 'ViewInspector')
    cd /Users/admin/builder/spi-builder-workspace/.swiftpm/xcode

SwiftCompile normal arm64 /Users/admin/builder/spi-builder-workspace/.dependencies/checkouts/ViewInspector/Sources/ViewInspector/SwiftUI/UnaryViewAdaptor.swift (in target 'ViewInspector' from project 'ViewInspector')
    cd /Users/admin/builder/spi-builder-workspace/.swiftpm/xcode

SwiftCompile normal arm64 /Users/admin/builder/spi-builder-workspace/.dependencies/checkouts/ViewInspector/Sources/ViewInspector/SwiftUI/VSplitView.swift (in target 'ViewInspector' from project 'ViewInspector')
    cd /Users/admin/builder/spi-builder-workspace/.swiftpm/xcode

SwiftCompile normal arm64 /Users/admin/builder/spi-builder-workspace/.dependencies/checkouts/ViewInspector/Sources/ViewInspector/SwiftUI/VStack.swift (in target 'ViewInspector' from project 'ViewInspector')
    cd /Users/admin/builder/spi-builder-workspace/.swiftpm/xcode

SwiftCompile normal arm64 /Users/admin/builder/spi-builder-workspace/.dependencies/checkouts/ViewInspector/Sources/ViewInspector/SwiftUI/VideoPlayer.swift (in target 'ViewInspector' from project 'ViewInspector')
    cd /Users/admin/builder/spi-builder-workspace/.swiftpm/xcode

SwiftCompile normal arm64 /Users/admin/builder/spi-builder-workspace/.dependencies/checkouts/ViewInspector/Sources/ViewInspector/SwiftUI/ViewThatFits.swift (in target 'ViewInspector' from project 'ViewInspector')
    cd /Users/admin/builder/spi-builder-workspace/.swiftpm/xcode

SwiftCompile normal arm64 /Users/admin/builder/spi-builder-workspace/.dependencies/checkouts/ViewInspector/Sources/ViewInspector/SwiftUI/ZStack.swift (in target 'ViewInspector' from project 'ViewInspector')
    cd /Users/admin/builder/spi-builder-workspace/.swiftpm/xcode

SwiftCompile normal arm64 /Users/admin/builder/spi-builder-workspace/.dependencies/checkouts/ViewInspector/Sources/ViewInspector/ViewHosting.swift (in target 'ViewInspector' from project 'ViewInspector')
    cd /Users/admin/builder/spi-builder-workspace/.swiftpm/xcode

SwiftCompile normal arm64 /Users/admin/builder/spi-builder-workspace/.dependencies/checkouts/ViewInspector/Sources/ViewInspector/ViewSearch.swift (in target 'ViewInspector' from project 'ViewInspector')
    cd /Users/admin/builder/spi-builder-workspace/.swiftpm/xcode

SwiftCompile normal arm64 /Users/admin/builder/spi-builder-workspace/.dependencies/checkouts/ViewInspector/Sources/ViewInspector/ViewSearchIndex.swift (in target 'ViewInspector' from project 'ViewInspector')
    cd /Users/admin/builder/spi-builder-workspace/.swiftpm/xcode

SwiftDriverJobDiscovery normal arm64 Compiling LazyHStack.swift, LazyVGrid.swift, LazyVStack.swift, LinearGradient.swift, Link.swift, List.swift, LocationButton.swift, Map.swift, MapAnnotation.swift, Menu.swift, MenuButton.swift, MultiDatePicker.swift (in target 'ViewInspector' from project 'ViewInspector')
SwiftDriver\ Compilation JoinedText normal arm64 com.apple.xcode.tools.swift.compiler (in target 'JoinedText' from project 'JoinedText')
    cd /Users/admin/builder/spi-builder-workspace/.swiftpm/xcode
    builtin-Swift-Compilation -- /Applications/Xcode-16.3.0.app/Contents/Developer/Toolchains/XcodeDefault.xctoolchain/usr/bin/swiftc -module-name JoinedText -Onone -enforce-exclusivity\=checked @/Users/admin/builder/spi-builder-workspace/.derivedData/Build/Intermediates.noindex/JoinedText.build/Debug-appletvos/JoinedText.build/Objects-normal/arm64/JoinedText.SwiftFileList -DSWIFT_PACKAGE -DDEBUG -DXcode -plugin-path /Applications/Xcode-16.3.0.app/Contents/Developer/Toolchains/XcodeDefault.xctoolchain/usr/lib/swift/host/plugins/testing -enable-experimental-feature DebugDescriptionMacro -sdk /Applications/Xcode-16.3.0.app/Contents/Developer/Platforms/AppleTVOS.platform/Developer/SDKs/AppleTVOS18.4.sdk -target arm64-apple-tvos13.0 -g -module-cache-path /Users/admin/builder/spi-builder-workspace/.derivedData/ModuleCache.noindex -Xfrontend -serialize-debugging-options -profile-coverage-mapping -profile-generate -enable-testing -index-store-path /Users/admin/builder/spi-builder-workspace/.derivedData/Index.noindex/DataStore -swift-version 5 -I /Users/admin/builder/spi-builder-workspace/.derivedData/Build/Products/Debug-appletvos -I /Applications/Xcode-16.3.0.app/Contents/Developer/Platforms/AppleTVOS.platform/Developer/usr/lib -F /Users/admin/builder/spi-builder-workspace/.derivedData/Build/Products/Debug-appletvos -F /Applications/Xcode-16.3.0.app/Contents/Developer/Platforms/AppleTVOS.platform/Developer/Library/Frameworks -F /Applications/Xcode-16.3.0.app/Contents/Developer/Platforms/AppleTVOS.platform/Developer/SDKs/AppleTVOS18.4.sdk/Developer/Library/Frameworks -c -j10 -enable-batch-mode -incremental -Xcc -ivfsstatcache -Xcc /Users/admin/builder/spi-builder-workspace/.derivedData/SDKStatCaches.noindex/appletvos18.4-22L251-271d326055c85f9856fa135c41255102.sdkstatcache -output-file-map /Users/admin/builder/spi-builder-workspace/.derivedData/Build/Intermediates.noindex/JoinedText.build/Debug-appletvos/JoinedText.build/Objects-normal/arm64/JoinedText-OutputFileMap.json -use-frontend-parseable-output -save-temps -no-color-diagnostics -serialize-diagnostics -emit-dependencies -emit-module -emit-module-path /Users/admin/builder/spi-builder-workspace/.derivedData/Build/Intermediates.noindex/JoinedText.build/Debug-appletvos/JoinedText.build/Objects-normal/arm64/JoinedText.swiftmodule -validate-clang-modules-once -clang-build-session-file /Users/admin/builder/spi-builder-workspace/.derivedData/ModuleCache.noindex/Session.modulevalidation -Xcc -I/Users/admin/builder/spi-builder-workspace/.derivedData/Build/Intermediates.noindex/JoinedText.build/Debug-appletvos/JoinedText.build/swift-overrides.hmap -emit-const-values -Xfrontend -const-gather-protocols-file -Xfrontend /Users/admin/builder/spi-builder-workspace/.derivedData/Build/Intermediates.noindex/JoinedText.build/Debug-appletvos/JoinedText.build/Objects-normal/arm64/JoinedText_const_extract_protocols.json -Xcc -I/Users/admin/builder/spi-builder-workspace/.derivedData/Build/Products/Debug-appletvos/include -Xcc -I/Users/admin/builder/spi-builder-workspace/.derivedData/Build/Intermediates.noindex/JoinedText.build/Debug-appletvos/JoinedText.build/DerivedSources-normal/arm64 -Xcc -I/Users/admin/builder/spi-builder-workspace/.derivedData/Build/Intermediates.noindex/JoinedText.build/Debug-appletvos/JoinedText.build/DerivedSources/arm64 -Xcc -I/Users/admin/builder/spi-builder-workspace/.derivedData/Build/Intermediates.noindex/JoinedText.build/Debug-appletvos/JoinedText.build/DerivedSources -Xcc -DSWIFT_PACKAGE -Xcc -DDEBUG\=1 -emit-objc-header -emit-objc-header-path /Users/admin/builder/spi-builder-workspace/.derivedData/Build/Intermediates.noindex/JoinedText.build/Debug-appletvos/JoinedText.build/Objects-normal/arm64/JoinedText-Swift.h -working-directory /Users/admin/builder/spi-builder-workspace/.swiftpm/xcode -experimental-emit-module-separately -disable-cmo
SwiftDriverJobDiscovery normal arm64 Emitting module for ViewInspector (in target 'ViewInspector' from project 'ViewInspector')
SwiftDriver\ Compilation\ Requirements ViewInspector normal arm64 com.apple.xcode.tools.swift.compiler (in target 'ViewInspector' from project 'ViewInspector')
    cd /Users/admin/builder/spi-builder-workspace/.swiftpm/xcode
    builtin-Swift-Compilation-Requirements -- /Applications/Xcode-16.3.0.app/Contents/Developer/Toolchains/XcodeDefault.xctoolchain/usr/bin/swiftc -module-name ViewInspector -Onone -enforce-exclusivity\=checked @/Users/admin/builder/spi-builder-workspace/.derivedData/Build/Intermediates.noindex/ViewInspector.build/Debug-appletvos/ViewInspector.build/Objects-normal/arm64/ViewInspector.SwiftFileList -DSWIFT_PACKAGE -DDEBUG -DXcode -plugin-path /Applications/Xcode-16.3.0.app/Contents/Developer/Toolchains/XcodeDefault.xctoolchain/usr/lib/swift/host/plugins/testing -enable-experimental-feature DebugDescriptionMacro -sdk /Applications/Xcode-16.3.0.app/Contents/Developer/Platforms/AppleTVOS.platform/Developer/SDKs/AppleTVOS18.4.sdk -target arm64-apple-tvos13.0 -g -module-cache-path /Users/admin/builder/spi-builder-workspace/.derivedData/ModuleCache.noindex -Xfrontend -serialize-debugging-options -profile-coverage-mapping -profile-generate -enable-testing -suppress-warnings -index-store-path /Users/admin/builder/spi-builder-workspace/.derivedData/Index.noindex/DataStore -swift-version 5 -I /Users/admin/builder/spi-builder-workspace/.derivedData/Build/Products/Debug-appletvos -I /Applications/Xcode-16.3.0.app/Contents/Developer/Platforms/AppleTVOS.platform/Developer/usr/lib -F /Users/admin/builder/spi-builder-workspace/.derivedData/Build/Products/Debug-appletvos -F /Applications/Xcode-16.3.0.app/Contents/Developer/Platforms/AppleTVOS.platform/Developer/Library/Frameworks -F /Applications/Xcode-16.3.0.app/Contents/Developer/Platforms/AppleTVOS.platform/Developer/SDKs/AppleTVOS18.4.sdk/Developer/Library/Frameworks -emit-localized-strings -emit-localized-strings-path /Users/admin/builder/spi-builder-workspace/.derivedData/Build/Intermediates.noindex/ViewInspector.build/Debug-appletvos/ViewInspector.build/Objects-normal/arm64 -c -j10 -enable-batch-mode -incremental -Xcc -ivfsstatcache -Xcc /Users/admin/builder/spi-builder-workspace/.derivedData/SDKStatCaches.noindex/appletvos18.4-22L251-271d326055c85f9856fa135c41255102.sdkstatcache -output-file-map /Users/admin/builder/spi-builder-workspace/.derivedData/Build/Intermediates.noindex/ViewInspector.build/Debug-appletvos/ViewInspector.build/Objects-normal/arm64/ViewInspector-OutputFileMap.json -use-frontend-parseable-output -save-temps -no-color-diagnostics -serialize-diagnostics -emit-dependencies -emit-module -emit-module-path /Users/admin/builder/spi-builder-workspace/.derivedData/Build/Intermediates.noindex/ViewInspector.build/Debug-appletvos/ViewInspector.build/Objects-normal/arm64/ViewInspector.swiftmodule -validate-clang-modules-once -clang-build-session-file /Users/admin/builder/spi-builder-workspace/.derivedData/ModuleCache.noindex/Session.modulevalidation -package-name viewinspector -Xcc -I/Users/admin/builder/spi-builder-workspace/.derivedData/Build/Intermediates.noindex/ViewInspector.build/Debug-appletvos/ViewInspector.build/swift-overrides.hmap -emit-const-values -Xfrontend -const-gather-protocols-file -Xfrontend /Users/admin/builder/spi-builder-workspace/.derivedData/Build/Intermediates.noindex/ViewInspector.build/Debug-appletvos/ViewInspector.build/Objects-normal/arm64/ViewInspector_const_extract_protocols.json -Xcc -I/Users/admin/builder/spi-builder-workspace/.derivedData/Build/Products/Debug-appletvos/include -Xcc -I/Users/admin/builder/spi-builder-workspace/.derivedData/Build/Intermediates.noindex/ViewInspector.build/Debug-appletvos/ViewInspector.build/DerivedSources-normal/arm64 -Xcc -I/Users/admin/builder/spi-builder-workspace/.derivedData/Build/Intermediates.noindex/ViewInspector.build/Debug-appletvos/ViewInspector.build/DerivedSources/arm64 -Xcc -I/Users/admin/builder/spi-builder-workspace/.derivedData/Build/Intermediates.noindex/ViewInspector.build/Debug-appletvos/ViewInspector.build/DerivedSources -Xcc -DSWIFT_PACKAGE -Xcc -DDEBUG\=1 -emit-objc-header -emit-objc-header-path /Users/admin/builder/spi-builder-workspace/.derivedData/Build/Intermediates.noindex/ViewInspector.build/Debug-appletvos/ViewInspector.build/Objects-normal/arm64/ViewInspector-Swift.h -working-directory /Users/admin/builder/spi-builder-workspace/.swiftpm/xcode -experimental-emit-module-separately -disable-cmo
Copy /Users/admin/builder/spi-builder-workspace/.derivedData/Build/Products/Debug-appletvos/ViewInspector.swiftmodule/arm64-apple-tvos.swiftmodule /Users/admin/builder/spi-builder-workspace/.derivedData/Build/Intermediates.noindex/ViewInspector.build/Debug-appletvos/ViewInspector.build/Objects-normal/arm64/ViewInspector.swiftmodule (in target 'ViewInspector' from project 'ViewInspector')
    cd /Users/admin/builder/spi-builder-workspace/.dependencies/checkouts/ViewInspector
    builtin-copy -exclude .DS_Store -exclude CVS -exclude .svn -exclude .git -exclude .hg -resolve-src-symlinks -rename /Users/admin/builder/spi-builder-workspace/.derivedData/Build/Intermediates.noindex/ViewInspector.build/Debug-appletvos/ViewInspector.build/Objects-normal/arm64/ViewInspector.swiftmodule /Users/admin/builder/spi-builder-workspace/.derivedData/Build/Products/Debug-appletvos/ViewInspector.swiftmodule/arm64-apple-tvos.swiftmodule
Copy /Users/admin/builder/spi-builder-workspace/.derivedData/Build/Products/Debug-appletvos/ViewInspector.swiftmodule/arm64-apple-tvos.abi.json /Users/admin/builder/spi-builder-workspace/.derivedData/Build/Intermediates.noindex/ViewInspector.build/Debug-appletvos/ViewInspector.build/Objects-normal/arm64/ViewInspector.abi.json (in target 'ViewInspector' from project 'ViewInspector')
    cd /Users/admin/builder/spi-builder-workspace/.dependencies/checkouts/ViewInspector
    builtin-copy -exclude .DS_Store -exclude CVS -exclude .svn -exclude .git -exclude .hg -resolve-src-symlinks -rename /Users/admin/builder/spi-builder-workspace/.derivedData/Build/Intermediates.noindex/ViewInspector.build/Debug-appletvos/ViewInspector.build/Objects-normal/arm64/ViewInspector.abi.json /Users/admin/builder/spi-builder-workspace/.derivedData/Build/Products/Debug-appletvos/ViewInspector.swiftmodule/arm64-apple-tvos.abi.json
Copy /Users/admin/builder/spi-builder-workspace/.derivedData/Build/Products/Debug-appletvos/ViewInspector.swiftmodule/Project/arm64-apple-tvos.swiftsourceinfo /Users/admin/builder/spi-builder-workspace/.derivedData/Build/Intermediates.noindex/ViewInspector.build/Debug-appletvos/ViewInspector.build/Objects-normal/arm64/ViewInspector.swiftsourceinfo (in target 'ViewInspector' from project 'ViewInspector')
    cd /Users/admin/builder/spi-builder-workspace/.dependencies/checkouts/ViewInspector
    builtin-copy -exclude .DS_Store -exclude CVS -exclude .svn -exclude .git -exclude .hg -resolve-src-symlinks -rename /Users/admin/builder/spi-builder-workspace/.derivedData/Build/Intermediates.noindex/ViewInspector.build/Debug-appletvos/ViewInspector.build/Objects-normal/arm64/ViewInspector.swiftsourceinfo /Users/admin/builder/spi-builder-workspace/.derivedData/Build/Products/Debug-appletvos/ViewInspector.swiftmodule/Project/arm64-apple-tvos.swiftsourceinfo
ExtractAppIntentsMetadata (in target 'JoinedText' from project 'JoinedText')
    cd /Users/admin/builder/spi-builder-workspace
    /Applications/Xcode-16.3.0.app/Contents/Developer/Toolchains/XcodeDefault.xctoolchain/usr/bin/appintentsmetadataprocessor --toolchain-dir /Applications/Xcode-16.3.0.app/Contents/Developer/Toolchains/XcodeDefault.xctoolchain --module-name JoinedText --sdk-root /Applications/Xcode-16.3.0.app/Contents/Developer/Platforms/AppleTVOS.platform/Developer/SDKs/AppleTVOS18.4.sdk --xcode-version 16E140 --platform-family tvOS --deployment-target 13.0 --bundle-identifier spi-builder-workspace.JoinedText --output /Users/admin/builder/spi-builder-workspace/.derivedData/Build/Products/Debug-appletvos/JoinedText.appintents --target-triple arm64-apple-tvos13.0 --binary-file /Users/admin/builder/spi-builder-workspace/.derivedData/Build/Products/Debug-appletvos/JoinedText.o --dependency-file /Users/admin/builder/spi-builder-workspace/.derivedData/Build/Intermediates.noindex/JoinedText.build/Debug-appletvos/JoinedText.build/Objects-normal/arm64/JoinedText_dependency_info.dat --stringsdata-file /Users/admin/builder/spi-builder-workspace/.derivedData/Build/Intermediates.noindex/JoinedText.build/Debug-appletvos/JoinedText.build/Objects-normal/arm64/ExtractedAppShortcutsMetadata.stringsdata --source-file-list /Users/admin/builder/spi-builder-workspace/.derivedData/Build/Intermediates.noindex/JoinedText.build/Debug-appletvos/JoinedText.build/Objects-normal/arm64/JoinedText.SwiftFileList --metadata-file-list /Users/admin/builder/spi-builder-workspace/.derivedData/Build/Intermediates.noindex/JoinedText.build/Debug-appletvos/JoinedText.build/JoinedText.DependencyMetadataFileList --static-metadata-file-list /Users/admin/builder/spi-builder-workspace/.derivedData/Build/Intermediates.noindex/JoinedText.build/Debug-appletvos/JoinedText.build/JoinedText.DependencyStaticMetadataFileList --swift-const-vals-list /Users/admin/builder/spi-builder-workspace/.derivedData/Build/Intermediates.noindex/JoinedText.build/Debug-appletvos/JoinedText.build/Objects-normal/arm64/JoinedText.SwiftConstValuesFileList --force --compile-time-extraction --deployment-aware-processing --validate-assistant-intents --no-app-shortcuts-localization
2025-04-26 07:32:32.667 appintentsmetadataprocessor[796:4730] Starting appintentsmetadataprocessor export
2025-04-26 07:32:32.719 appintentsmetadataprocessor[796:4730] Extracted no relevant App Intents symbols, skipping writing output
SwiftDriverJobDiscovery normal arm64 Compiling CustomView.swift, CustomViewModifier.swift, DatePicker.swift, DelayedPreferenceView.swift, DisclosureGroup.swift, Divider.swift, EditButton.swift, EllipticalGradient.swift, EmptyView.swift, EquatableView.swift, ForEach.swift, Form.swift, GeometryReader.swift (in target 'ViewInspector' from project 'ViewInspector')
SwiftDriver JoinedTextTests normal arm64 com.apple.xcode.tools.swift.compiler (in target 'JoinedTextTests' from project 'JoinedText')
    cd /Users/admin/builder/spi-builder-workspace/.swiftpm/xcode
    builtin-SwiftDriver -- /Applications/Xcode-16.3.0.app/Contents/Developer/Toolchains/XcodeDefault.xctoolchain/usr/bin/swiftc -module-name JoinedTextTests -Onone -enforce-exclusivity\=checked @/Users/admin/builder/spi-builder-workspace/.derivedData/Build/Intermediates.noindex/JoinedText.build/Debug-appletvos/JoinedTextTests.build/Objects-normal/arm64/JoinedTextTests.SwiftFileList -DSWIFT_PACKAGE -DDEBUG -DXcode -plugin-path /Applications/Xcode-16.3.0.app/Contents/Developer/Toolchains/XcodeDefault.xctoolchain/usr/lib/swift/host/plugins/testing -enable-experimental-feature DebugDescriptionMacro -sdk /Applications/Xcode-16.3.0.app/Contents/Developer/Platforms/AppleTVOS.platform/Developer/SDKs/AppleTVOS18.4.sdk -target arm64-apple-tvos13.0 -g -module-cache-path /Users/admin/builder/spi-builder-workspace/.derivedData/ModuleCache.noindex -Xfrontend -serialize-debugging-options -profile-coverage-mapping -profile-generate -enable-testing -index-store-path /Users/admin/builder/spi-builder-workspace/.derivedData/Index.noindex/DataStore -swift-version 5 -I /Users/admin/builder/spi-builder-workspace/.derivedData/Build/Products/Debug-appletvos -I /Applications/Xcode-16.3.0.app/Contents/Developer/Platforms/AppleTVOS.platform/Developer/usr/lib -F /Users/admin/builder/spi-builder-workspace/.derivedData/Build/Products/Debug-appletvos/PackageFrameworks -F /Users/admin/builder/spi-builder-workspace/.derivedData/Build/Products/Debug-appletvos/PackageFrameworks -F /Users/admin/builder/spi-builder-workspace/.derivedData/Build/Products/Debug-appletvos -F /Applications/Xcode-16.3.0.app/Contents/Developer/Platforms/AppleTVOS.platform/Developer/Library/Frameworks -F /Applications/Xcode-16.3.0.app/Contents/Developer/Platforms/AppleTVOS.platform/Developer/SDKs/AppleTVOS18.4.sdk/Developer/Library/Frameworks -c -j10 -enable-batch-mode -incremental -Xcc -ivfsstatcache -Xcc /Users/admin/builder/spi-builder-workspace/.derivedData/SDKStatCaches.noindex/appletvos18.4-22L251-271d326055c85f9856fa135c41255102.sdkstatcache -output-file-map /Users/admin/builder/spi-builder-workspace/.derivedData/Build/Intermediates.noindex/JoinedText.build/Debug-appletvos/JoinedTextTests.build/Objects-normal/arm64/JoinedTextTests-OutputFileMap.json -use-frontend-parseable-output -save-temps -no-color-diagnostics -serialize-diagnostics -emit-dependencies -emit-module -emit-module-path /Users/admin/builder/spi-builder-workspace/.derivedData/Build/Intermediates.noindex/JoinedText.build/Debug-appletvos/JoinedTextTests.build/Objects-normal/arm64/JoinedTextTests.swiftmodule -validate-clang-modules-once -clang-build-session-file /Users/admin/builder/spi-builder-workspace/.derivedData/ModuleCache.noindex/Session.modulevalidation -emit-const-values -Xfrontend -const-gather-protocols-file -Xfrontend /Users/admin/builder/spi-builder-workspace/.derivedData/Build/Intermediates.noindex/JoinedText.build/Debug-appletvos/JoinedTextTests.build/Objects-normal/arm64/JoinedTextTests_const_extract_protocols.json -Xcc -I/Users/admin/builder/spi-builder-workspace/.derivedData/Build/Products/Debug-appletvos/include -Xcc -I/Users/admin/builder/spi-builder-workspace/.derivedData/Build/Intermediates.noindex/JoinedText.build/Debug-appletvos/JoinedTextTests.build/DerivedSources-normal/arm64 -Xcc -I/Users/admin/builder/spi-builder-workspace/.derivedData/Build/Intermediates.noindex/JoinedText.build/Debug-appletvos/JoinedTextTests.build/DerivedSources/arm64 -Xcc -I/Users/admin/builder/spi-builder-workspace/.derivedData/Build/Intermediates.noindex/JoinedText.build/Debug-appletvos/JoinedTextTests.build/DerivedSources -Xcc -DSWIFT_PACKAGE -Xcc -DDEBUG\=1 -working-directory /Users/admin/builder/spi-builder-workspace/.swiftpm/xcode -experimental-emit-module-separately -disable-cmo
SwiftEmitModule normal arm64 Emitting\ module\ for\ JoinedTextTests (in target 'JoinedTextTests' from project 'JoinedText')
Failed frontend command:
/Applications/Xcode-16.3.0.app/Contents/Developer/Toolchains/XcodeDefault.xctoolchain/usr/bin/swift-frontend -frontend -emit-module -experimental-skip-non-inlinable-function-bodies-without-types /Users/admin/builder/spi-builder-workspace/Tests/JoinedTextTests/CodeFlowTests.swift /Users/admin/builder/spi-builder-workspace/Tests/JoinedTextTests/TextJoiningTests.swift /Users/admin/builder/spi-builder-workspace/Tests/JoinedTextTests/TextStylingTests.swift /Users/admin/builder/spi-builder-workspace/Tests/JoinedTextTests/XCTestCase+Utils.swift /Users/admin/builder/spi-builder-workspace/Tests/JoinedTextTests/XCTestManifests.swift -target arm64-apple-tvos13.0 -Xllvm -aarch64-use-tbi -enable-objc-interop -stack-check -sdk /Applications/Xcode-16.3.0.app/Contents/Developer/Platforms/AppleTVOS.platform/Developer/SDKs/AppleTVOS18.4.sdk -I /Users/admin/builder/spi-builder-workspace/.derivedData/Build/Products/Debug-appletvos -I /Applications/Xcode-16.3.0.app/Contents/Developer/Platforms/AppleTVOS.platform/Developer/usr/lib -F /Users/admin/builder/spi-builder-workspace/.derivedData/Build/Products/Debug-appletvos/PackageFrameworks -F /Users/admin/builder/spi-builder-workspace/.derivedData/Build/Products/Debug-appletvos/PackageFrameworks -F /Users/admin/builder/spi-builder-workspace/.derivedData/Build/Products/Debug-appletvos -F /Applications/Xcode-16.3.0.app/Contents/Developer/Platforms/AppleTVOS.platform/Developer/Library/Frameworks -F /Applications/Xcode-16.3.0.app/Contents/Developer/Platforms/AppleTVOS.platform/Developer/SDKs/AppleTVOS18.4.sdk/Developer/Library/Frameworks -no-color-diagnostics -enable-testing -g -debug-info-format\=dwarf -dwarf-version\=4 -module-cache-path /Users/admin/builder/spi-builder-workspace/.derivedData/ModuleCache.noindex -profile-generate -profile-coverage-mapping -swift-version 5 -enforce-exclusivity\=checked -Onone -D SWIFT_PACKAGE -D DEBUG -D Xcode -serialize-debugging-options -const-gather-protocols-file /Users/admin/builder/spi-builder-workspace/.derivedData/Build/Intermediates.noindex/JoinedText.build/Debug-appletvos/JoinedTextTests.build/Objects-normal/arm64/JoinedTextTests_const_extract_protocols.json -enable-experimental-feature DebugDescriptionMacro -empty-abi-descriptor -plugin-path /Applications/Xcode-16.3.0.app/Contents/Developer/Toolchains/XcodeDefault.xctoolchain/usr/lib/swift/host/plugins/testing -validate-clang-modules-once -clang-build-session-file /Users/admin/builder/spi-builder-workspace/.derivedData/ModuleCache.noindex/Session.modulevalidation -Xcc -working-directory -Xcc /Users/admin/builder/spi-builder-workspace/.swiftpm/xcode -resource-dir /Applications/Xcode-16.3.0.app/Contents/Developer/Toolchains/XcodeDefault.xctoolchain/usr/lib/swift -enable-anonymous-context-mangled-names -file-compilation-dir /Users/admin/builder/spi-builder-workspace/.swiftpm/xcode -Xcc -ivfsstatcache -Xcc /Users/admin/builder/spi-builder-workspace/.derivedData/SDKStatCaches.noindex/appletvos18.4-22L251-271d326055c85f9856fa135c41255102.sdkstatcache -Xcc -I/Users/admin/builder/spi-builder-workspace/.derivedData/Build/Products/Debug-appletvos/include -Xcc -I/Users/admin/builder/spi-builder-workspace/.derivedData/Build/Intermediates.noindex/JoinedText.build/Debug-appletvos/JoinedTextTests.build/DerivedSources-normal/arm64 -Xcc -I/Users/admin/builder/spi-builder-workspace/.derivedData/Build/Intermediates.noindex/JoinedText.build/Debug-appletvos/JoinedTextTests.build/DerivedSources/arm64 -Xcc -I/Users/admin/builder/spi-builder-workspace/.derivedData/Build/Intermediates.noindex/JoinedText.build/Debug-appletvos/JoinedTextTests.build/DerivedSources -Xcc -DSWIFT_PACKAGE -Xcc -DDEBUG\=1 -module-name JoinedTextTests -frontend-parseable-output -disable-clang-spi -target-sdk-version 18.4 -target-sdk-name appletvos18.4 -external-plugin-path /Applications/Xcode-16.3.0.app/Contents/Developer/Platforms/AppleTVOS.platform/Developer/usr/lib/swift/host/plugins\#/Applications/Xcode-16.3.0.app/Contents/Developer/Platforms/AppleTVOS.platform/Developer/usr/bin/swift-plugin-server -external-plugin-path /Applications/Xcode-16.3.0.app/Contents/Developer/Platforms/AppleTVOS.platform/Developer/usr/local/lib/swift/host/plugins\#/Applications/Xcode-16.3.0.app/Contents/Developer/Platforms/AppleTVOS.platform/Developer/usr/bin/swift-plugin-server -in-process-plugin-server-path /Applications/Xcode-16.3.0.app/Contents/Developer/Toolchains/XcodeDefault.xctoolchain/usr/lib/swift/host/libSwiftInProcPluginServer.dylib -plugin-path /Applications/Xcode-16.3.0.app/Contents/Developer/Toolchains/XcodeDefault.xctoolchain/usr/lib/swift/host/plugins -plugin-path /Applications/Xcode-16.3.0.app/Contents/Developer/Toolchains/XcodeDefault.xctoolchain/usr/local/lib/swift/host/plugins -emit-module-doc-path /Users/admin/builder/spi-builder-workspace/.derivedData/Build/Intermediates.noindex/JoinedText.build/Debug-appletvos/JoinedTextTests.build/Objects-normal/arm64/JoinedTextTests.swiftdoc -emit-module-source-info-path /Users/admin/builder/spi-builder-workspace/.derivedData/Build/Intermediates.noindex/JoinedText.build/Debug-appletvos/JoinedTextTests.build/Objects-normal/arm64/JoinedTextTests.swiftsourceinfo -serialize-diagnostics-path /Users/admin/builder/spi-builder-workspace/.derivedData/Build/Intermediates.noindex/JoinedText.build/Debug-appletvos/JoinedTextTests.build/Objects-normal/arm64/JoinedTextTests-master-emit-module.dia -emit-dependencies-path /Users/admin/builder/spi-builder-workspace/.derivedData/Build/Intermediates.noindex/JoinedText.build/Debug-appletvos/JoinedTextTests.build/Objects-normal/arm64/JoinedTextTests-master-emit-module.d -o /Users/admin/builder/spi-builder-workspace/.derivedData/Build/Intermediates.noindex/JoinedText.build/Debug-appletvos/JoinedTextTests.build/Objects-normal/arm64/JoinedTextTests.swiftmodule -emit-abi-descriptor-path /Users/admin/builder/spi-builder-workspace/.derivedData/Build/Intermediates.noindex/JoinedText.build/Debug-appletvos/JoinedTextTests.build/Objects-normal/arm64/JoinedTextTests.abi.json
EmitSwiftModule normal arm64 (in target 'JoinedTextTests' from project 'JoinedText')
    cd /Users/admin/builder/spi-builder-workspace/.swiftpm/xcode

/Users/admin/builder/spi-builder-workspace/Tests/JoinedTextTests/TextStylingTests.swift:44:68: error: 'TextAttributes' is not a member type of generic struct 'ViewInspector.InspectableView<View>'
    func attributes(forSubstring substring: String) throws -> Self.TextAttributes {
                                                              ~~~~ ^
/Users/admin/builder/spi-builder-workspace/.dependencies/checkouts/ViewInspector/Sources/ViewInspector/InspectableView.swift:8:15: note: 'InspectableView' declared here
public struct InspectableView<View> where View: BaseViewType {
              ^
SwiftCompile normal arm64 Compiling\ XCTestManifests.swift /Users/admin/builder/spi-builder-workspace/Tests/JoinedTextTests/XCTestManifests.swift (in target 'JoinedTextTests' from project 'JoinedText')
SwiftCompile normal arm64 /Users/admin/builder/spi-builder-workspace/Tests/JoinedTextTests/XCTestManifests.swift (in target 'JoinedTextTests' from project 'JoinedText')
    cd /Users/admin/builder/spi-builder-workspace/.swiftpm/xcode

SwiftDriverJobDiscovery normal arm64 Compiling Gesture.swift, Grid.swift, Group.swift, GroupBox.swift, HSplitView.swift, HStack.swift, HelpView.swift, IDView.swift, Image.swift, Label.swift, LabeledContent.swift, LazyHGrid.swift (in target 'ViewInspector' from project 'ViewInspector')
SwiftCompile normal arm64 Compiling\ TextStylingTests.swift /Users/admin/builder/spi-builder-workspace/Tests/JoinedTextTests/TextStylingTests.swift (in target 'JoinedTextTests' from project 'JoinedText')
SwiftCompile normal arm64 /Users/admin/builder/spi-builder-workspace/Tests/JoinedTextTests/TextStylingTests.swift (in target 'JoinedTextTests' from project 'JoinedText')
    cd /Users/admin/builder/spi-builder-workspace/.swiftpm/xcode

SwiftDriverJobDiscovery normal arm64 Compiling NavigationDestination.swift, NavigationLink.swift, NavigationSplitView.swift, NavigationStack.swift, NavigationView.swift, OptionalContent.swift, OutlineGroup.swift, Overlay.swift, PasteButton.swift, Picker.swift, Popover.swift, PopoverContent.swift (in target 'ViewInspector' from project 'ViewInspector')
SwiftCompile normal arm64 Compiling\ XCTestCase+Utils.swift /Users/admin/builder/spi-builder-workspace/Tests/JoinedTextTests/XCTestCase+Utils.swift (in target 'JoinedTextTests' from project 'JoinedText')
SwiftCompile normal arm64 /Users/admin/builder/spi-builder-workspace/Tests/JoinedTextTests/XCTestCase+Utils.swift (in target 'JoinedTextTests' from project 'JoinedText')
    cd /Users/admin/builder/spi-builder-workspace/.swiftpm/xcode

SwiftCompile normal arm64 Compiling\ TextJoiningTests.swift /Users/admin/builder/spi-builder-workspace/Tests/JoinedTextTests/TextJoiningTests.swift (in target 'JoinedTextTests' from project 'JoinedText')
SwiftCompile normal arm64 /Users/admin/builder/spi-builder-workspace/Tests/JoinedTextTests/TextJoiningTests.swift (in target 'JoinedTextTests' from project 'JoinedText')
    cd /Users/admin/builder/spi-builder-workspace/.swiftpm/xcode

SwiftDriverJobDiscovery normal arm64 Compiling Alert.swift, AngularGradient.swift, AnyView.swift, AsyncImage.swift, Button.swift, Canvas.swift, ClassifiedView.swift, Color.swift, ColorPicker.swift, ConditionalContent.swift, ConfirmationDialog.swift, ContentUnavailableView.swift, ControlGroup.swift (in target 'ViewInspector' from project 'ViewInspector')
SwiftCompile normal arm64 Compiling\ CodeFlowTests.swift /Users/admin/builder/spi-builder-workspace/Tests/JoinedTextTests/CodeFlowTests.swift (in target 'JoinedTextTests' from project 'JoinedText')
Command SwiftCompile failed with a nonzero exit code
** BUILD FAILED **
The following build commands failed:
	SwiftEmitModule normal arm64 Emitting\ module\ for\ JoinedTextTests (in target 'JoinedTextTests' from project 'JoinedText')
	EmitSwiftModule normal arm64 (in target 'JoinedTextTests' from project 'JoinedText')
	SwiftCompile normal arm64 Compiling\ CodeFlowTests.swift /Users/admin/builder/spi-builder-workspace/Tests/JoinedTextTests/CodeFlowTests.swift (in target 'JoinedTextTests' from project 'JoinedText')
	Building workspace spi-builder-workspace with scheme JoinedText
(4 failures)
BUILD FAILURE 6.1 tvOS