Build Information
Failed to build SwiftMysql, reference master (5cbf3b
), with Swift 6.1 for Linux on 25 Apr 2025 10:58:43 UTC.
Build Command
bash -c docker run --pull=always --rm -v "checkouts-4609320-2":/host -w "$PWD" registry.gitlab.com/finestructure/spi-images:basic-6.1-latest swift build --triple x86_64-unknown-linux-gnu 2>&1
Build Log
========================================
RunAll
========================================
Builder version: 4.61.0
Interrupt handler set up.
========================================
Checkout
========================================
Clone URL: https://github.com/noppoman/swiftmysql.git
Reference: master
Initialized empty Git repository in /host/spi-builder-workspace/.git/
hint: Using 'master' as the name for the initial branch. This default branch name
hint: is subject to change. To configure the initial branch name to use in all
hint: of your new repositories, which will suppress this warning, call:
hint:
hint: git config --global init.defaultBranch <name>
hint:
hint: Names commonly chosen instead of 'master' are 'main', 'trunk' and
hint: 'development'. The just-created branch can be renamed via this command:
hint:
hint: git branch -m <name>
From https://github.com/noppoman/swiftmysql
* branch master -> FETCH_HEAD
* [new branch] master -> origin/master
HEAD is now at 5cbf3bb Merge pull request #6 from noppoMan/evm-visiblity
Cloned https://github.com/noppoman/swiftmysql.git
Revision (git rev-parse @):
5cbf3bb1c2c1c5129b8096ed1b7ee3740049ad20
SUCCESS checkout https://github.com/noppoman/swiftmysql.git at master
========================================
Build
========================================
Selected platform: linux
Swift version: 6.1
Building package at path: $PWD
https://github.com/noppoman/swiftmysql.git
https://github.com/noppoman/swiftmysql.git
WARNING: environment variable SUPPRESS_SWIFT_6_FLAGS is not set
{
"dependencies" : [
{
"identity" : "prorsumnet",
"requirement" : {
"range" : [
{
"lower_bound" : "0.1.0",
"upper_bound" : "1.0.0"
}
]
},
"type" : "sourceControl",
"url" : "https://github.com/noppoMan/ProrsumNet.git"
}
],
"manifest_display_name" : "SwiftMysql",
"name" : "SwiftMysql",
"path" : "/host/spi-builder-workspace",
"platforms" : [
],
"products" : [
{
"name" : "SwiftMysql",
"targets" : [
"SwiftMysql"
],
"type" : {
"library" : [
"automatic"
]
}
}
],
"targets" : [
{
"c99name" : "SwiftMysqlTests",
"module_type" : "SwiftTarget",
"name" : "SwiftMysqlTests",
"path" : "Tests/SwiftMysqlTests",
"sources" : [
"Async/AsyncConnectionPoolTests.swift",
"Async/AsyncConnectionTests.swift",
"Async/AsyncSelectTests.swift",
"Async/AsyncTransaction.swift",
"Async/AsyncWriteTests.swift",
"ConnectionPoolTests.swift",
"ConnectionTests.swift",
"PreparedStatementTests.swift",
"SelectTests.swift",
"Support.swift",
"TransactionTests.swift"
],
"target_dependencies" : [
"SwiftMysql"
],
"type" : "test"
},
{
"c99name" : "SwiftMysql",
"module_type" : "SwiftTarget",
"name" : "SwiftMysql",
"path" : "Sources/SwiftMysql",
"product_dependencies" : [
"ProrsumNet"
],
"product_memberships" : [
"SwiftMysql"
],
"sources" : [
"Bytes.swift",
"Connection/Async/AsyncConnection.swift",
"Connection/Async/AsyncConnectionPool.swift",
"Connection/Async/AsyncPacketWriter.swift",
"Connection/Async/AsyncStream.swift",
"Connection/Async/AsyncTransaction.swift",
"Connection/Connection.swift",
"Connection/ConnectionPool.swift",
"Connection/ConnectionType.swift",
"Connection/Transaction.swift",
"Date.swift",
"Error.swift",
"Protocol/Constants.swift",
"Protocol/Packet/BinaryRowDataPacket.swift",
"Protocol/Packet/Field.swift",
"Protocol/Packet/HandShakePacket.swift",
"Protocol/Packet/OKPacket.swift",
"Protocol/Packet/PrepareResultPacket.swift",
"Protocol/Packet/RowDataPacket.swift",
"Protocol/Packet/RowDataParsable.swift",
"Pthread.swift",
"Query/Async/AsyncQueryResult.swift",
"Query/Query.swift",
"Query/QueryResult.swift",
"Query/QueryStatus.swift",
"Query/ResultFetcher.swift",
"Query/Row.swift",
"Query/RowSequence.swift",
"Query/Statement.swift",
"Stream/PacketStream.swift",
"ThreadUnsafeEventEmitter.swift",
"Util.swift"
],
"type" : "library"
}
],
"tools_version" : "4.0"
}
Running build ...
bash -c docker run --pull=always --rm -v "checkouts-4609320-2":/host -w "$PWD" registry.gitlab.com/finestructure/spi-images:basic-6.1-latest swift build --triple x86_64-unknown-linux-gnu -Xswiftc -Xfrontend -Xswiftc -stats-output-dir -Xswiftc -Xfrontend -Xswiftc .stats -Xswiftc -strict-concurrency=complete -Xswiftc -enable-upcoming-feature -Xswiftc StrictConcurrency -Xswiftc -enable-upcoming-feature -Xswiftc DisableOutwardActorInference -Xswiftc -enable-upcoming-feature -Xswiftc GlobalActorIsolatedTypesUsability -Xswiftc -enable-upcoming-feature -Xswiftc InferSendableFromCaptures 2>&1
basic-6.1-latest: Pulling from finestructure/spi-images
Digest: sha256:3bdcac04179f4ed3e5b8e9dbd6e74bbf5ebc0f4fde48bbaad7d1e5c757e65bcb
Status: Image is up to date for registry.gitlab.com/finestructure/spi-images:basic-6.1-latest
Fetching https://github.com/noppoMan/ProrsumNet.git
[1/174] Fetching prorsumnet
Fetched https://github.com/noppoMan/ProrsumNet.git from cache (0.20s)
Computing version for https://github.com/noppoMan/ProrsumNet.git
Computed https://github.com/noppoMan/ProrsumNet.git at 0.1.3 (0.69s)
Fetching https://github.com/vapor/clibressl.git
[1/3365] Fetching clibressl
Fetched https://github.com/vapor/clibressl.git from cache (0.54s)
Computing version for https://github.com/vapor/clibressl.git
Computed https://github.com/vapor/clibressl.git at 1.0.1 (1.00s)
Creating working copy for https://github.com/vapor/clibressl.git
Working copy of https://github.com/vapor/clibressl.git resolved at 1.0.1
Creating working copy for https://github.com/noppoMan/ProrsumNet.git
Working copy of https://github.com/noppoMan/ProrsumNet.git resolved at 0.1.3
Building for debugging...
[0/619] Write sources
[2/619] Compiling CLibreSSL a_enum.c
[3/619] Compiling CLibreSSL a_dup.c
[4/619] Compiling CLibreSSL bn_mul.c
[5/619] Compiling CLibreSSL bio_b64.c
[6/619] Compiling CLibreSSL a_digest.c
[7/619] Compiling CLibreSSL xts128.c
[8/619] Compiling CLibreSSL gostr341001_ameth.c
[8/619] Compiling CLibreSSL xcbc_enc.c
[10/619] Compiling CLibreSSL x_x509a.c
[11/619] Compiling CLibreSSL a_bitstr.c
[12/619] Write swift-version-24593BA9C3E375BF.txt
[13/619] Compiling CLibreSSL x_val.c
[14/619] Compiling CLibreSSL x_x509.c
[15/619] Compiling CLibreSSL x_spki.c
[16/619] Compiling CLibreSSL x_sig.c
[17/619] Compiling CLibreSSL x_req.c
[18/619] Compiling CLibreSSL x_pubkey.c
[19/619] Compiling CLibreSSL x_long.c
[20/619] Compiling CLibreSSL x_nx509.c
[21/619] Compiling CLibreSSL x_name.c
[22/619] Compiling CLibreSSL x_pkey.c
[23/619] Compiling CLibreSSL x_exten.c
[24/619] Compiling CLibreSSL x_bignum.c
[25/619] Compiling CLibreSSL x_info.c
[26/619] Compiling CLibreSSL x_attrib.c
[27/619] Compiling CLibreSSL x_algor.c
[28/619] Compiling CLibreSSL x_crl.c
[29/619] Compiling CLibreSSL x_all.c
[30/619] Compiling CLibreSSL x509rset.c
[31/619] Compiling CLibreSSL x509type.c
[32/619] Compiling CLibreSSL x509spki.c
[33/619] Compiling CLibreSSL x509_v3.c
[34/619] Compiling CLibreSSL x509name.c
[35/619] Compiling CLibreSSL x509_vpm.c
[36/619] Compiling CLibreSSL x509cset.c
[37/619] Compiling CLibreSSL x509_trs.c
[38/619] Compiling CLibreSSL x509_set.c
[39/619] Compiling CLibreSSL x509_txt.c
[40/619] Compiling CLibreSSL x509_vfy.c
[41/619] Compiling CLibreSSL x509_req.c
[42/619] Compiling CLibreSSL x509_obj.c
[43/619] Compiling CLibreSSL x509_ext.c
[44/619] Compiling CLibreSSL x509_err.c
[45/619] Compiling CLibreSSL x509_r2x.c
[46/619] Compiling CLibreSSL wp_dgst.c
[47/619] Compiling CLibreSSL x509_lu.c
[47/619] Compiling CLibreSSL x509_d2.c
[49/619] Compiling CLibreSSL wp_block.c
[50/619] Compiling CLibreSSL x509_cmp.c
[51/619] Compiling CLibreSSL x509_att.c
[52/619] Compiling CLibreSSL x509_def.c
[53/619] Compiling CLibreSSL v3_skey.c
[54/619] Compiling CLibreSSL v3_utl.c
[55/619] Compiling CLibreSSL v3_sxnet.c
[56/619] Compiling CLibreSSL v3err.c
[57/619] Compiling CLibreSSL v3_purp.c
[58/619] Compiling CLibreSSL v3_pmaps.c
[59/619] Compiling CLibreSSL v3_pku.c
[60/619] Compiling CLibreSSL v3_prn.c
[61/619] Compiling CLibreSSL v3_pcia.c
[62/619] Compiling CLibreSSL v3_pcons.c
[63/619] Compiling CLibreSSL v3_pci.c
[64/619] Compiling CLibreSSL v3_ocsp.c
[65/619] Compiling CLibreSSL v3_int.c
[65/619] Compiling CLibreSSL v3_ncons.c
[67/619] Compiling CLibreSSL v3_lib.c
[68/619] Compiling CLibreSSL v3_info.c
[69/619] Compiling CLibreSSL v3_ia5.c
[70/619] Compiling CLibreSSL v3_genn.c
[71/619] Compiling CLibreSSL v3_enum.c
[72/619] Compiling CLibreSSL v3_extku.c
[73/619] Compiling CLibreSSL v3_conf.c
[74/619] Compiling CLibreSSL v3_bitst.c
[74/619] Compiling CLibreSSL v3_crld.c
[76/619] Compiling CLibreSSL v3_cpols.c
[77/619] Compiling CLibreSSL ui_openssl_win.c
[78/619] Compiling CLibreSSL v3_alt.c
[79/619] Compiling CLibreSSL v3_akeya.c
[80/619] Compiling CLibreSSL ui_util.c
[81/619] Compiling CLibreSSL v3_bcons.c
[82/619] Compiling CLibreSSL ui_lib.c
[83/619] Compiling CLibreSSL v3_akey.c
[84/619] Compiling CLibreSSL ui_openssl.c
[85/619] Compiling CLibreSSL txt_db.c
[86/619] Compiling CLibreSSL ui_err.c
[87/619] Compiling CLibreSSL ts_verify_ctx.c
[88/619] Compiling CLibreSSL ts_rsp_verify.c
[89/619] Compiling CLibreSSL ts_rsp_utils.c
[90/619] Compiling CLibreSSL ts_rsp_print.c
[91/619] Compiling CLibreSSL ts_req_print.c
[92/619] Compiling CLibreSSL ts_lib.c
[93/619] Compiling CLibreSSL ts_req_utils.c
[94/619] Compiling CLibreSSL ts_rsp_sign.c
[95/619] Compiling CLibreSSL ts_err.c
[96/619] Compiling CLibreSSL ts_asn1.c
/host/spi-builder-workspace/.build/checkouts/clibressl/Sources/CLibreSSL/tls_verify.c:161:36: error: call to undeclared function 'getprogname'; ISO C99 and later do not support implicit function declarations [-Wimplicit-function-declaration]
161 | "dNSName encoding (%d)\n", getprogname(),
| ^
/host/spi-builder-workspace/.build/checkouts/clibressl/Sources/CLibreSSL/tls_verify.c:161:36: note: did you mean 'getpeername'?
/usr/include/x86_64-linux-gnu/sys/socket.h:130:12: note: 'getpeername' declared here
130 | extern int getpeername (int __fd, __SOCKADDR_ARG __addr,
| ^
1 error generated.
[97/619] Compiling CLibreSSL tls_verify.c
[97/619] Compiling CLibreSSL ts_conf.c
[97/619] Compiling CLibreSSL tls_peer.c
[97/619] Compiling CLibreSSL tls_config.c
[97/619] Compiling CLibreSSL tls_server.c
[97/619] Compiling CLibreSSL tls_client.c
[97/619] Compiling CLibreSSL tls_util.c
[97/619] Compiling CLibreSSL tls_conninfo.c
Running build ...
bash -c docker run --pull=always --rm -v "checkouts-4609320-2":/host -w "$PWD" registry.gitlab.com/finestructure/spi-images:basic-6.1-latest swift build --triple x86_64-unknown-linux-gnu 2>&1
basic-6.1-latest: Pulling from finestructure/spi-images
Digest: sha256:3bdcac04179f4ed3e5b8e9dbd6e74bbf5ebc0f4fde48bbaad7d1e5c757e65bcb
Status: Image is up to date for registry.gitlab.com/finestructure/spi-images:basic-6.1-latest
[0/1] Planning build
Building for debugging...
[0/523] Compiling CLibreSSL tls_conninfo.c
/host/spi-builder-workspace/.build/checkouts/clibressl/Sources/CLibreSSL/tls_verify.c:161:36: error: call to undeclared function 'getprogname'; ISO C99 and later do not support implicit function declarations [-Wimplicit-function-declaration]
161 | "dNSName encoding (%d)\n", getprogname(),
| ^
/host/spi-builder-workspace/.build/checkouts/clibressl/Sources/CLibreSSL/tls_verify.c:161:36: note: did you mean 'getpeername'?
/usr/include/x86_64-linux-gnu/sys/socket.h:130:12: note: 'getpeername' declared here
130 | extern int getpeername (int __fd, __SOCKADDR_ARG __addr,
| ^
1 error generated.
[1/523] Compiling CLibreSSL tls_verify.c
[1/523] Compiling CLibreSSL tls_server.c
[1/523] Compiling CLibreSSL tls_util.c
[19/523] Compiling CLibreSSL tls_peer.c
[126/523] Compiling CLibreSSL tls_client.c
[140/523] Compiling CLibreSSL ts_conf.c
[249/523] Compiling CLibreSSL tls_config.c
[522/523] Write swift-version-24593BA9C3E375BF.txt
BUILD FAILURE 6.1 linux