Build Information
Failed to build RealmSwiftMacro, reference 0.0.5 (803b20
), with Swift 6.0 for watchOS using Xcode 16.2 on 30 Nov 2024 00:46:44 UTC.
Build Command
env DEVELOPER_DIR=/Applications/Xcode-16.1.0.app xcrun xcodebuild -IDEClonedSourcePackagesDirPathOverride=$PWD/.dependencies -skipMacroValidation -skipPackagePluginValidation -derivedDataPath $PWD/.derivedData build -scheme RealmSwiftMacro-Package -destination generic/platform=watchOS OTHER_SWIFT_FLAGS=-stats-output-dir .stats -strict-concurrency=complete -enable-upcoming-feature StrictConcurrency -enable-upcoming-feature DisableOutwardActorInference -enable-upcoming-feature GlobalActorIsolatedTypesUsability -enable-upcoming-feature InferSendableFromCaptures
Build Log
SwiftEmitModule normal arm64 Emitting\ module\ for\ SwiftSyntax509 (in target 'SwiftSyntax509' from project 'swift-syntax')
cd /Users/admin/builder/spi-builder-workspace/.swiftpm/xcode
builtin-swiftTaskExecution -- /Applications/Xcode-16.1.0.app/Contents/Developer/Toolchains/XcodeDefault.xctoolchain/usr/bin/swift-frontend -frontend -emit-module -experimental-skip-non-inlinable-function-bodies-without-types /Users/admin/builder/spi-builder-workspace/.dependencies/checkouts/swift-syntax/Sources/SwiftSyntax509/Empty.swift -target arm64-apple-macos10.15 -Xllvm -aarch64-use-tbi -enable-objc-interop -stack-check -sdk /Applications/Xcode-16.1.0.app/Contents/Developer/Platforms/MacOSX.platform/Developer/SDKs/MacOSX15.1.sdk -I /Users/admin/builder/spi-builder-workspace/.derivedData/Build/Products/Debug -I /Applications/Xcode-16.1.0.app/Contents/Developer/Platforms/MacOSX.platform/Developer/usr/lib -F /Users/admin/builder/spi-builder-workspace/.derivedData/Build/Products/Debug -F /Applications/Xcode-16.1.0.app/Contents/Developer/Platforms/MacOSX.platform/Developer/Library/Frameworks -no-color-diagnostics -enable-testing -g -debug-info-format\=dwarf -dwarf-version\=4 -module-cache-path /Users/admin/builder/spi-builder-workspace/.derivedData/ModuleCache.noindex -suppress-warnings -profile-generate -profile-coverage-mapping -swift-version 5 -enforce-exclusivity\=checked -stats-output-dir /Users/admin/builder/spi-builder-workspace/.swiftpm/xcode/.stats -Onone -D SWIFT_PACKAGE -D DEBUG -serialize-debugging-options -const-gather-protocols-file /Users/admin/builder/spi-builder-workspace/.derivedData/Build/Intermediates.noindex/swift-syntax.build/Debug/SwiftSyntax509.build/Objects-normal/arm64/SwiftSyntax509_const_extract_protocols.json -enable-experimental-feature DebugDescriptionMacro -enable-experimental-feature OpaqueTypeErasure -enable-upcoming-feature StrictConcurrency -enable-upcoming-feature DisableOutwardActorInference -enable-upcoming-feature GlobalActorIsolatedTypesUsability -enable-upcoming-feature InferSendableFromCaptures -strict-concurrency\=complete -empty-abi-descriptor -plugin-path /Applications/Xcode-16.1.0.app/Contents/Developer/Toolchains/XcodeDefault.xctoolchain/usr/lib/swift/host/plugins/testing -validate-clang-modules-once -clang-build-session-file /Users/admin/builder/spi-builder-workspace/.derivedData/ModuleCache.noindex/Session.modulevalidation -Xcc -working-directory -Xcc /Users/admin/builder/spi-builder-workspace/.swiftpm/xcode -resource-dir /Applications/Xcode-16.1.0.app/Contents/Developer/Toolchains/XcodeDefault.xctoolchain/usr/lib/swift -enable-anonymous-context-mangled-names -file-compilation-dir /Users/admin/builder/spi-builder-workspace/.swiftpm/xcode -Xcc -D_LIBCPP_HARDENING_MODE\=_LIBCPP_HARDENING_MODE_DEBUG -Xcc -ivfsstatcache -Xcc /Users/admin/builder/spi-builder-workspace/.derivedData/SDKStatCaches.noindex/macosx15.1-24B75-44d23fded74b714c58e69ec4af40d824.sdkstatcache -Xcc -I/Users/admin/builder/spi-builder-workspace/.derivedData/Build/Intermediates.noindex/swift-syntax.build/Debug/SwiftSyntax509.build/swift-overrides.hmap -Xcc -I/Users/admin/builder/spi-builder-workspace/.derivedData/Build/Products/Debug/include -Xcc -I/Users/admin/builder/spi-builder-workspace/.derivedData/Build/Intermediates.noindex/swift-syntax.build/Debug/SwiftSyntax509.build/DerivedSources-normal/arm64 -Xcc -I/Users/admin/builder/spi-builder-workspace/.derivedData/Build/Intermediates.noindex/swift-syntax.build/Debug/SwiftSyntax509.build/DerivedSources/arm64 -Xcc -I/Users/admin/builder/spi-builder-workspace/.derivedData/Build/Intermediates.noindex/swift-syntax.build/Debug/SwiftSyntax509.build/DerivedSources -Xcc -DSWIFT_PACKAGE -Xcc -DDEBUG\=1 -module-name SwiftSyntax509 -frontend-parseable-output -disable-clang-spi -target-sdk-version 15.1 -target-sdk-name macosx15.1 -external-plugin-path /Applications/Xcode-16.1.0.app/Contents/Developer/Platforms/MacOSX.platform/Developer/usr/lib/swift/host/plugins\#/Applications/Xcode-16.1.0.app/Contents/Developer/Platforms/MacOSX.platform/Developer/usr/bin/swift-plugin-server -external-plugin-path /Applications/Xcode-16.1.0.app/Contents/Developer/Platforms/MacOSX.platform/Developer/usr/local/lib/swift/host/plugins\#/Applications/Xcode-16.1.0.app/Contents/Developer/Platforms/MacOSX.platform/Developer/usr/bin/swift-plugin-server -plugin-path /Applications/Xcode-16.1.0.app/Contents/Developer/Toolchains/XcodeDefault.xctoolchain/usr/lib/swift/host/plugins -plugin-path /Applications/Xcode-16.1.0.app/Contents/Developer/Toolchains/XcodeDefault.xctoolchain/usr/local/lib/swift/host/plugins -emit-module-doc-path /Users/admin/builder/spi-builder-workspace/.derivedData/Build/Intermediates.noindex/swift-syntax.build/Debug/SwiftSyntax509.build/Objects-normal/arm64/SwiftSyntax509.swiftdoc -emit-module-source-info-path /Users/admin/builder/spi-builder-workspace/.derivedData/Build/Intermediates.noindex/swift-syntax.build/Debug/SwiftSyntax509.build/Objects-normal/arm64/SwiftSyntax509.swiftsourceinfo -emit-objc-header-path /Users/admin/builder/spi-builder-workspace/.derivedData/Build/Intermediates.noindex/swift-syntax.build/Debug/SwiftSyntax509.build/Objects-normal/arm64/SwiftSyntax509-Swift.h -serialize-diagnostics-path /Users/admin/builder/spi-builder-workspace/.derivedData/Build/Intermediates.noindex/swift-syntax.build/Debug/SwiftSyntax509.build/Objects-normal/arm64/SwiftSyntax509-master-emit-module.dia -emit-dependencies-path /Users/admin/builder/spi-builder-workspace/.derivedData/Build/Intermediates.noindex/swift-syntax.build/Debug/SwiftSyntax509.build/Objects-normal/arm64/SwiftSyntax509-master-emit-module.d -parse-as-library -o /Users/admin/builder/spi-builder-workspace/.derivedData/Build/Intermediates.noindex/swift-syntax.build/Debug/SwiftSyntax509.build/Objects-normal/arm64/SwiftSyntax509.swiftmodule -emit-abi-descriptor-path /Users/admin/builder/spi-builder-workspace/.derivedData/Build/Intermediates.noindex/swift-syntax.build/Debug/SwiftSyntax509.build/Objects-normal/arm64/SwiftSyntax509.abi.json
SwiftCompile normal arm64 /Users/admin/builder/spi-builder-workspace/.dependencies/checkouts/swift-syntax/Sources/SwiftSyntax509/Empty.swift (in target 'SwiftSyntax509' from project 'swift-syntax')
cd /Users/admin/builder/spi-builder-workspace/.swiftpm/xcode
/Applications/Xcode-16.1.0.app/Contents/Developer/Toolchains/XcodeDefault.xctoolchain/usr/bin/swift-frontend -emit-module -experimental-skip-non-inlinable-function-bodies-without-types /Users/admin/builder/spi-builder-workspace/.dependencies/checkouts/swift-syntax/Sources/SwiftSyntax509/Empty.swift -target arm64-apple-macos10.15 -Xllvm -aarch64-use-tbi -enable-objc-interop -stack-check -sdk /Applications/Xcode-16.1.0.app/Contents/Developer/Platforms/MacOSX.platform/Developer/SDKs/MacOSX15.1.sdk -I /Users/admin/builder/spi-builder-workspace/.derivedData/Build/Products/Debug -I /Applications/Xcode-16.1.0.app/Contents/Developer/Platforms/MacOSX.platform/Developer/usr/lib -F /Users/admin/builder/spi-builder-workspace/.derivedData/Build/Products/Debug -F /Applications/Xcode-16.1.0.app/Contents/Developer/Platforms/MacOSX.platform/Developer/Library/Frameworks -no-color-diagnostics -enable-testing -g -debug-info-format\=dwarf -dwarf-version\=4 -module-cache-path /Users/admin/builder/spi-builder-workspace/.derivedData/ModuleCache.noindex -suppress-warnings -profile-generate -profile-coverage-mapping -swift-version 5 -enforce-exclusivity\=checked -stats-output-dir /Users/admin/builder/spi-builder-workspace/.swiftpm/xcode/.stats -Onone -D SWIFT_PACKAGE -D DEBUG -serialize-debugging-options -const-gather-protocols-file /Users/admin/builder/spi-builder-workspace/.derivedData/Build/Intermediates.noindex/swift-syntax.build/Debug/SwiftSyntax509.build/Objects-normal/arm64/SwiftSyntax509_const_extract_protocols.json -enable-experimental-feature DebugDescriptionMacro -enable-experimental-feature OpaqueTypeErasure -enable-upcoming-feature StrictConcurrency -enable-upcoming-feature DisableOutwardActorInference -enable-upcoming-feature GlobalActorIsolatedTypesUsability -enable-upcoming-feature InferSendableFromCaptures -strict-concurrency\=complete -empty-abi-descriptor -plugin-path /Applications/Xcode-16.1.0.app/Contents/Developer/Toolchains/XcodeDefault.xctoolchain/usr/lib/swift/host/plugins/testing -validate-clang-modules-once -clang-build-session-file /Users/admin/builder/spi-builder-workspace/.derivedData/ModuleCache.noindex/Session.modulevalidation -Xcc -working-directory -Xcc /Users/admin/builder/spi-builder-workspace/.swiftpm/xcode -resource-dir /Applications/Xcode-16.1.0.app/Contents/Developer/Toolchains/XcodeDefault.xctoolchain/usr/lib/swift -enable-anonymous-context-mangled-names -file-compilation-dir /Users/admin/builder/spi-builder-workspace/.swiftpm/xcode -Xcc -D_LIBCPP_HARDENING_MODE\=_LIBCPP_HARDENING_MODE_DEBUG -Xcc -ivfsstatcache -Xcc /Users/admin/builder/spi-builder-workspace/.derivedData/SDKStatCaches.noindex/macosx15.1-24B75-44d23fded74b714c58e69ec4af40d824.sdkstatcache -Xcc -I/Users/admin/builder/spi-builder-workspace/.derivedData/Build/Intermediates.noindex/swift-syntax.build/Debug/SwiftSyntax509.build/swift-overrides.hmap -Xcc -I/Users/admin/builder/spi-builder-workspace/.derivedData/Build/Products/Debug/include -Xcc -I/Users/admin/builder/spi-builder-workspace/.derivedData/Build/Intermediates.noindex/swift-syntax.build/Debug/SwiftSyntax509.build/DerivedSources-normal/arm64 -Xcc -I/Users/admin/builder/spi-builder-workspace/.derivedData/Build/Intermediates.noindex/swift-syntax.build/Debug/SwiftSyntax509.build/DerivedSources/arm64 -Xcc -I/Users/admin/builder/spi-builder-workspace/.derivedData/Build/Intermediates.noindex/swift-syntax.build/Debug/SwiftSyntax509.build/DerivedSources -Xcc -DSWIFT_PACKAGE -Xcc -DDEBUG\=1 -module-name SwiftSyntax509 -frontend-parseable-output -disable-clang-spi -target-sdk-version 15.1 -target-sdk-name macosx15.1 -external-plugin-path /Applications/Xcode-16.1.0.app/Contents/Developer/Platforms/MacOSX.platform/Developer/usr/lib/swift/host/plugins\#/Applications/Xcode-16.1.0.app/Contents/Developer/Platforms/MacOSX.platform/Developer/usr/bin/swift-plugin-server -external-plugin-path /Applications/Xcode-16.1.0.app/Contents/Developer/Platforms/MacOSX.platform/Developer/usr/local/lib/swift/host/plugins\#/Applications/Xcode-16.1.0.app/Contents/Developer/Platforms/MacOSX.platform/Developer/usr/bin/swift-plugin-server -plugin-path /Applications/Xcode-16.1.0.app/Contents/Developer/Toolchains/XcodeDefault.xctoolchain/usr/lib/swift/host/plugins -plugin-path /Applications/Xcode-16.1.0.app/Contents/Developer/Toolchains/XcodeDefault.xctoolchain/usr/local/lib/swift/host/plugins -emit-module-doc-path /Users/admin/builder/spi-builder-workspace/.derivedData/Build/Intermediates.noindex/swift-syntax.build/Debug/SwiftSyntax509.build/Objects-normal/arm64/SwiftSyntax509.swiftdoc -emit-module-source-info-path /Users/admin/builder/spi-builder-workspace/.derivedData/Build/Intermediates.noindex/swift-syntax.build/Debug/SwiftSyntax509.build/Objects-normal/arm64/SwiftSyntax509.swiftsourceinfo -emit-objc-header-path /Users/admin/builder/spi-builder-workspace/.derivedData/Build/Intermediates.noindex/swift-syntax.build/Debug/SwiftSyntax509.build/Objects-normal/arm64/SwiftSyntax509-Swift.h -serialize-diagnostics-path /Users/admin/builder/spi-builder-workspace/.derivedData/Build/Intermediates.noindex/swift-syntax.build/Debug/SwiftSyntax509.build/Objects-normal/arm64/SwiftSyntax509-master-emit-module.dia -emit-dependencies-path /Users/admin/builder/spi-builder-workspace/.derivedData/Build/Intermediates.noindex/swift-syntax.build/Debug/SwiftSyntax509.build/Objects-normal/arm64/SwiftSyntax509-master-emit-module.d -parse-as-library -o /Users/admin/builder/spi-builder-workspace/.derivedData/Build/Intermediates.noindex/swift-syntax.build/Debug/SwiftSyntax509.build/Objects-normal/arm64/SwiftSyntax509.swiftmodule -emit-abi-descriptor-path /Users/admin/builder/spi-builder-workspace/.derivedData/Build/Intermediates.noindex/swift-syntax.build/Debug/SwiftSyntax509.build/Objects-normal/arm64/SwiftSyntax509.abi.json
SwiftEmitModule normal x86_64 Emitting\ module\ for\ SwiftSyntax509 (in target 'SwiftSyntax509' from project 'swift-syntax')
cd /Users/admin/builder/spi-builder-workspace/.swiftpm/xcode
builtin-swiftTaskExecution -- /Applications/Xcode-16.1.0.app/Contents/Developer/Toolchains/XcodeDefault.xctoolchain/usr/bin/swift-frontend -frontend -emit-module -experimental-skip-non-inlinable-function-bodies-without-types /Users/admin/builder/spi-builder-workspace/.dependencies/checkouts/swift-syntax/Sources/SwiftSyntax509/Empty.swift -target x86_64-apple-macos10.15 -enable-objc-interop -stack-check -sdk /Applications/Xcode-16.1.0.app/Contents/Developer/Platforms/MacOSX.platform/Developer/SDKs/MacOSX15.1.sdk -I /Users/admin/builder/spi-builder-workspace/.derivedData/Build/Products/Debug -I /Applications/Xcode-16.1.0.app/Contents/Developer/Platforms/MacOSX.platform/Developer/usr/lib -F /Users/admin/builder/spi-builder-workspace/.derivedData/Build/Products/Debug -F /Applications/Xcode-16.1.0.app/Contents/Developer/Platforms/MacOSX.platform/Developer/Library/Frameworks -no-color-diagnostics -enable-testing -g -debug-info-format\=dwarf -dwarf-version\=4 -module-cache-path /Users/admin/builder/spi-builder-workspace/.derivedData/ModuleCache.noindex -suppress-warnings -profile-generate -profile-coverage-mapping -swift-version 5 -enforce-exclusivity\=checked -stats-output-dir /Users/admin/builder/spi-builder-workspace/.swiftpm/xcode/.stats -Onone -D SWIFT_PACKAGE -D DEBUG -serialize-debugging-options -const-gather-protocols-file /Users/admin/builder/spi-builder-workspace/.derivedData/Build/Intermediates.noindex/swift-syntax.build/Debug/SwiftSyntax509.build/Objects-normal/x86_64/SwiftSyntax509_const_extract_protocols.json -enable-experimental-feature DebugDescriptionMacro -enable-experimental-feature OpaqueTypeErasure -enable-upcoming-feature StrictConcurrency -enable-upcoming-feature DisableOutwardActorInference -enable-upcoming-feature GlobalActorIsolatedTypesUsability -enable-upcoming-feature InferSendableFromCaptures -strict-concurrency\=complete -empty-abi-descriptor -plugin-path /Applications/Xcode-16.1.0.app/Contents/Developer/Toolchains/XcodeDefault.xctoolchain/usr/lib/swift/host/plugins/testing -validate-clang-modules-once -clang-build-session-file /Users/admin/builder/spi-builder-workspace/.derivedData/ModuleCache.noindex/Session.modulevalidation -Xcc -working-directory -Xcc /Users/admin/builder/spi-builder-workspace/.swiftpm/xcode -resource-dir /Applications/Xcode-16.1.0.app/Contents/Developer/Toolchains/XcodeDefault.xctoolchain/usr/lib/swift -enable-anonymous-context-mangled-names -file-compilation-dir /Users/admin/builder/spi-builder-workspace/.swiftpm/xcode -Xcc -D_LIBCPP_HARDENING_MODE\=_LIBCPP_HARDENING_MODE_DEBUG -Xcc -ivfsstatcache -Xcc /Users/admin/builder/spi-builder-workspace/.derivedData/SDKStatCaches.noindex/macosx15.1-24B75-44d23fded74b714c58e69ec4af40d824.sdkstatcache -Xcc -I/Users/admin/builder/spi-builder-workspace/.derivedData/Build/Intermediates.noindex/swift-syntax.build/Debug/SwiftSyntax509.build/swift-overrides.hmap -Xcc -I/Users/admin/builder/spi-builder-workspace/.derivedData/Build/Products/Debug/include -Xcc -I/Users/admin/builder/spi-builder-workspace/.derivedData/Build/Intermediates.noindex/swift-syntax.build/Debug/SwiftSyntax509.build/DerivedSources-normal/x86_64 -Xcc -I/Users/admin/builder/spi-builder-workspace/.derivedData/Build/Intermediates.noindex/swift-syntax.build/Debug/SwiftSyntax509.build/DerivedSources/x86_64 -Xcc -I/Users/admin/builder/spi-builder-workspace/.derivedData/Build/Intermediates.noindex/swift-syntax.build/Debug/SwiftSyntax509.build/DerivedSources -Xcc -DSWIFT_PACKAGE -Xcc -DDEBUG\=1 -module-name SwiftSyntax509 -frontend-parseable-output -disable-clang-spi -target-sdk-version 15.1 -target-sdk-name macosx15.1 -external-plugin-path /Applications/Xcode-16.1.0.app/Contents/Developer/Platforms/MacOSX.platform/Developer/usr/lib/swift/host/plugins\#/Applications/Xcode-16.1.0.app/Contents/Developer/Platforms/MacOSX.platform/Developer/usr/bin/swift-plugin-server -external-plugin-path /Applications/Xcode-16.1.0.app/Contents/Developer/Platforms/MacOSX.platform/Developer/usr/local/lib/swift/host/plugins\#/Applications/Xcode-16.1.0.app/Contents/Developer/Platforms/MacOSX.platform/Developer/usr/bin/swift-plugin-server -plugin-path /Applications/Xcode-16.1.0.app/Contents/Developer/Toolchains/XcodeDefault.xctoolchain/usr/lib/swift/host/plugins -plugin-path /Applications/Xcode-16.1.0.app/Contents/Developer/Toolchains/XcodeDefault.xctoolchain/usr/local/lib/swift/host/plugins -emit-module-doc-path /Users/admin/builder/spi-builder-workspace/.derivedData/Build/Intermediates.noindex/swift-syntax.build/Debug/SwiftSyntax509.build/Objects-normal/x86_64/SwiftSyntax509.swiftdoc -emit-module-source-info-path /Users/admin/builder/spi-builder-workspace/.derivedData/Build/Intermediates.noindex/swift-syntax.build/Debug/SwiftSyntax509.build/Objects-normal/x86_64/SwiftSyntax509.swiftsourceinfo -emit-objc-header-path /Users/admin/builder/spi-builder-workspace/.derivedData/Build/Intermediates.noindex/swift-syntax.build/Debug/SwiftSyntax509.build/Objects-normal/x86_64/SwiftSyntax509-Swift.h -serialize-diagnostics-path /Users/admin/builder/spi-builder-workspace/.derivedData/Build/Intermediates.noindex/swift-syntax.build/Debug/SwiftSyntax509.build/Objects-normal/x86_64/SwiftSyntax509-master-emit-module.dia -emit-dependencies-path /Users/admin/builder/spi-builder-workspace/.derivedData/Build/Intermediates.noindex/swift-syntax.build/Debug/SwiftSyntax509.build/Objects-normal/x86_64/SwiftSyntax509-master-emit-module.d -parse-as-library -o /Users/admin/builder/spi-builder-workspace/.derivedData/Build/Intermediates.noindex/swift-syntax.build/Debug/SwiftSyntax509.build/Objects-normal/x86_64/SwiftSyntax509.swiftmodule -emit-abi-descriptor-path /Users/admin/builder/spi-builder-workspace/.derivedData/Build/Intermediates.noindex/swift-syntax.build/Debug/SwiftSyntax509.build/Objects-normal/x86_64/SwiftSyntax509.abi.json
SwiftCompile normal x86_64 /Users/admin/builder/spi-builder-workspace/.dependencies/checkouts/swift-syntax/Sources/SwiftSyntax509/Empty.swift (in target 'SwiftSyntax509' from project 'swift-syntax')
cd /Users/admin/builder/spi-builder-workspace/.swiftpm/xcode
/Applications/Xcode-16.1.0.app/Contents/Developer/Toolchains/XcodeDefault.xctoolchain/usr/bin/swift-frontend -emit-module -experimental-skip-non-inlinable-function-bodies-without-types /Users/admin/builder/spi-builder-workspace/.dependencies/checkouts/swift-syntax/Sources/SwiftSyntax509/Empty.swift -target x86_64-apple-macos10.15 -enable-objc-interop -stack-check -sdk /Applications/Xcode-16.1.0.app/Contents/Developer/Platforms/MacOSX.platform/Developer/SDKs/MacOSX15.1.sdk -I /Users/admin/builder/spi-builder-workspace/.derivedData/Build/Products/Debug -I /Applications/Xcode-16.1.0.app/Contents/Developer/Platforms/MacOSX.platform/Developer/usr/lib -F /Users/admin/builder/spi-builder-workspace/.derivedData/Build/Products/Debug -F /Applications/Xcode-16.1.0.app/Contents/Developer/Platforms/MacOSX.platform/Developer/Library/Frameworks -no-color-diagnostics -enable-testing -g -debug-info-format\=dwarf -dwarf-version\=4 -module-cache-path /Users/admin/builder/spi-builder-workspace/.derivedData/ModuleCache.noindex -suppress-warnings -profile-generate -profile-coverage-mapping -swift-version 5 -enforce-exclusivity\=checked -stats-output-dir /Users/admin/builder/spi-builder-workspace/.swiftpm/xcode/.stats -Onone -D SWIFT_PACKAGE -D DEBUG -serialize-debugging-options -const-gather-protocols-file /Users/admin/builder/spi-builder-workspace/.derivedData/Build/Intermediates.noindex/swift-syntax.build/Debug/SwiftSyntax509.build/Objects-normal/x86_64/SwiftSyntax509_const_extract_protocols.json -enable-experimental-feature DebugDescriptionMacro -enable-experimental-feature OpaqueTypeErasure -enable-upcoming-feature StrictConcurrency -enable-upcoming-feature DisableOutwardActorInference -enable-upcoming-feature GlobalActorIsolatedTypesUsability -enable-upcoming-feature InferSendableFromCaptures -strict-concurrency\=complete -empty-abi-descriptor -plugin-path /Applications/Xcode-16.1.0.app/Contents/Developer/Toolchains/XcodeDefault.xctoolchain/usr/lib/swift/host/plugins/testing -validate-clang-modules-once -clang-build-session-file /Users/admin/builder/spi-builder-workspace/.derivedData/ModuleCache.noindex/Session.modulevalidation -Xcc -working-directory -Xcc /Users/admin/builder/spi-builder-workspace/.swiftpm/xcode -resource-dir /Applications/Xcode-16.1.0.app/Contents/Developer/Toolchains/XcodeDefault.xctoolchain/usr/lib/swift -enable-anonymous-context-mangled-names -file-compilation-dir /Users/admin/builder/spi-builder-workspace/.swiftpm/xcode -Xcc -D_LIBCPP_HARDENING_MODE\=_LIBCPP_HARDENING_MODE_DEBUG -Xcc -ivfsstatcache -Xcc /Users/admin/builder/spi-builder-workspace/.derivedData/SDKStatCaches.noindex/macosx15.1-24B75-44d23fded74b714c58e69ec4af40d824.sdkstatcache -Xcc -I/Users/admin/builder/spi-builder-workspace/.derivedData/Build/Intermediates.noindex/swift-syntax.build/Debug/SwiftSyntax509.build/swift-overrides.hmap -Xcc -I/Users/admin/builder/spi-builder-workspace/.derivedData/Build/Products/Debug/include -Xcc -I/Users/admin/builder/spi-builder-workspace/.derivedData/Build/Intermediates.noindex/swift-syntax.build/Debug/SwiftSyntax509.build/DerivedSources-normal/x86_64 -Xcc -I/Users/admin/builder/spi-builder-workspace/.derivedData/Build/Intermediates.noindex/swift-syntax.build/Debug/SwiftSyntax509.build/DerivedSources/x86_64 -Xcc -I/Users/admin/builder/spi-builder-workspace/.derivedData/Build/Intermediates.noindex/swift-syntax.build/Debug/SwiftSyntax509.build/DerivedSources -Xcc -DSWIFT_PACKAGE -Xcc -DDEBUG\=1 -module-name SwiftSyntax509 -frontend-parseable-output -disable-clang-spi -target-sdk-version 15.1 -target-sdk-name macosx15.1 -external-plugin-path /Applications/Xcode-16.1.0.app/Contents/Developer/Platforms/MacOSX.platform/Developer/usr/lib/swift/host/plugins\#/Applications/Xcode-16.1.0.app/Contents/Developer/Platforms/MacOSX.platform/Developer/usr/bin/swift-plugin-server -external-plugin-path /Applications/Xcode-16.1.0.app/Contents/Developer/Platforms/MacOSX.platform/Developer/usr/local/lib/swift/host/plugins\#/Applications/Xcode-16.1.0.app/Contents/Developer/Platforms/MacOSX.platform/Developer/usr/bin/swift-plugin-server -plugin-path /Applications/Xcode-16.1.0.app/Contents/Developer/Toolchains/XcodeDefault.xctoolchain/usr/lib/swift/host/plugins -plugin-path /Applications/Xcode-16.1.0.app/Contents/Developer/Toolchains/XcodeDefault.xctoolchain/usr/local/lib/swift/host/plugins -emit-module-doc-path /Users/admin/builder/spi-builder-workspace/.derivedData/Build/Intermediates.noindex/swift-syntax.build/Debug/SwiftSyntax509.build/Objects-normal/x86_64/SwiftSyntax509.swiftdoc -emit-module-source-info-path /Users/admin/builder/spi-builder-workspace/.derivedData/Build/Intermediates.noindex/swift-syntax.build/Debug/SwiftSyntax509.build/Objects-normal/x86_64/SwiftSyntax509.swiftsourceinfo -emit-objc-header-path /Users/admin/builder/spi-builder-workspace/.derivedData/Build/Intermediates.noindex/swift-syntax.build/Debug/SwiftSyntax509.build/Objects-normal/x86_64/SwiftSyntax509-Swift.h -serialize-diagnostics-path /Users/admin/builder/spi-builder-workspace/.derivedData/Build/Intermediates.noindex/swift-syntax.build/Debug/SwiftSyntax509.build/Objects-normal/x86_64/SwiftSyntax509-master-emit-module.dia -emit-dependencies-path /Users/admin/builder/spi-builder-workspace/.derivedData/Build/Intermediates.noindex/swift-syntax.build/Debug/SwiftSyntax509.build/Objects-normal/x86_64/SwiftSyntax509-master-emit-module.d -parse-as-library -o /Users/admin/builder/spi-builder-workspace/.derivedData/Build/Intermediates.noindex/swift-syntax.build/Debug/SwiftSyntax509.build/Objects-normal/x86_64/SwiftSyntax509.swiftmodule -emit-abi-descriptor-path /Users/admin/builder/spi-builder-workspace/.derivedData/Build/Intermediates.noindex/swift-syntax.build/Debug/SwiftSyntax509.build/Objects-normal/x86_64/SwiftSyntax509.abi.json
SwiftEmitModule normal arm64 Emitting\ module\ for\ RealmSwift (in target 'RealmSwift' from project 'Realm')
cd /Users/admin/builder/spi-builder-workspace/.swiftpm/xcode
builtin-swiftTaskExecution -- /Applications/Xcode-16.1.0.app/Contents/Developer/Toolchains/XcodeDefault.xctoolchain/usr/bin/swift-frontend -frontend -emit-module -experimental-skip-non-inlinable-function-bodies-without-types /Users/admin/builder/spi-builder-workspace/.derivedData/Build/Intermediates.noindex/Realm.build/Debug-watchos/RealmSwift.build/DerivedSources/resource_bundle_accessor.swift /Users/admin/builder/spi-builder-workspace/.dependencies/checkouts/realm-swift/RealmSwift/Aliases.swift /Users/admin/builder/spi-builder-workspace/.dependencies/checkouts/realm-swift/RealmSwift/AnyRealmValue.swift /Users/admin/builder/spi-builder-workspace/.dependencies/checkouts/realm-swift/RealmSwift/App.swift /Users/admin/builder/spi-builder-workspace/.dependencies/checkouts/realm-swift/RealmSwift/AsymmetricObject.swift /Users/admin/builder/spi-builder-workspace/.dependencies/checkouts/realm-swift/RealmSwift/BSON.swift /Users/admin/builder/spi-builder-workspace/.dependencies/checkouts/realm-swift/RealmSwift/Combine.swift /Users/admin/builder/spi-builder-workspace/.dependencies/checkouts/realm-swift/RealmSwift/CustomPersistable.swift /Users/admin/builder/spi-builder-workspace/.dependencies/checkouts/realm-swift/RealmSwift/Decimal128.swift /Users/admin/builder/spi-builder-workspace/.dependencies/checkouts/realm-swift/RealmSwift/EmbeddedObject.swift /Users/admin/builder/spi-builder-workspace/.dependencies/checkouts/realm-swift/RealmSwift/Error.swift /Users/admin/builder/spi-builder-workspace/.dependencies/checkouts/realm-swift/RealmSwift/Events.swift /Users/admin/builder/spi-builder-workspace/.dependencies/checkouts/realm-swift/RealmSwift/Geospatial.swift /Users/admin/builder/spi-builder-workspace/.dependencies/checkouts/realm-swift/RealmSwift/Impl/BasicTypes.swift /Users/admin/builder/spi-builder-workspace/.dependencies/checkouts/realm-swift/RealmSwift/Impl/CollectionAccess.swift /Users/admin/builder/spi-builder-workspace/.dependencies/checkouts/realm-swift/RealmSwift/Impl/ComplexTypes.swift /Users/admin/builder/spi-builder-workspace/.dependencies/checkouts/realm-swift/RealmSwift/Impl/KeyPathStrings.swift /Users/admin/builder/spi-builder-workspace/.dependencies/checkouts/realm-swift/RealmSwift/Impl/ObjcBridgeable.swift /Users/admin/builder/spi-builder-workspace/.dependencies/checkouts/realm-swift/RealmSwift/Impl/Persistable.swift /Users/admin/builder/spi-builder-workspace/.dependencies/checkouts/realm-swift/RealmSwift/Impl/PropertyAccessors.swift /Users/admin/builder/spi-builder-workspace/.dependencies/checkouts/realm-swift/RealmSwift/Impl/RealmCollectionImpl.swift /Users/admin/builder/spi-builder-workspace/.dependencies/checkouts/realm-swift/RealmSwift/Impl/SchemaDiscovery.swift /Users/admin/builder/spi-builder-workspace/.dependencies/checkouts/realm-swift/RealmSwift/LinkingObjects.swift /Users/admin/builder/spi-builder-workspace/.dependencies/checkouts/realm-swift/RealmSwift/List.swift /Users/admin/builder/spi-builder-workspace/.dependencies/checkouts/realm-swift/RealmSwift/Map.swift /Users/admin/builder/spi-builder-workspace/.dependencies/checkouts/realm-swift/RealmSwift/Migration.swift /Users/admin/builder/spi-builder-workspace/.dependencies/checkouts/realm-swift/RealmSwift/MongoClient.swift /Users/admin/builder/spi-builder-workspace/.dependencies/checkouts/realm-swift/RealmSwift/MutableSet.swift /Users/admin/builder/spi-builder-workspace/.dependencies/checkouts/realm-swift/RealmSwift/Object.swift /Users/admin/builder/spi-builder-workspace/.dependencies/checkouts/realm-swift/RealmSwift/ObjectId.swift /Users/admin/builder/spi-builder-workspace/.dependencies/checkouts/realm-swift/RealmSwift/ObjectSchema.swift /Users/admin/builder/spi-builder-workspace/.dependencies/checkouts/realm-swift/RealmSwift/ObjectiveCSupport+AnyRealmValue.swift /Users/admin/builder/spi-builder-workspace/.dependencies/checkouts/realm-swift/RealmSwift/ObjectiveCSupport+BSON.swift /Users/admin/builder/spi-builder-workspace/.dependencies/checkouts/realm-swift/RealmSwift/ObjectiveCSupport+Sync.swift /Users/admin/builder/spi-builder-workspace/.dependencies/checkouts/realm-swift/RealmSwift/ObjectiveCSupport.swift /Users/admin/builder/spi-builder-workspace/.dependencies/checkouts/realm-swift/RealmSwift/Optional.swift /Users/admin/builder/spi-builder-workspace/.dependencies/checkouts/realm-swift/RealmSwift/PersistedProperty.swift /Users/admin/builder/spi-builder-workspace/.dependencies/checkouts/realm-swift/RealmSwift/Projection.swift /Users/admin/builder/spi-builder-workspace/.dependencies/checkouts/realm-swift/RealmSwift/Property.swift /Users/admin/builder/spi-builder-workspace/.dependencies/checkouts/realm-swift/RealmSwift/Query.swift /Users/admin/builder/spi-builder-workspace/.dependencies/checkouts/realm-swift/RealmSwift/Realm.swift /Users/admin/builder/spi-builder-workspace/.dependencies/checkouts/realm-swift/RealmSwift/RealmCollection.swift /Users/admin/builder/spi-builder-workspace/.dependencies/checkouts/realm-swift/RealmSwift/RealmConfiguration.swift /Users/admin/builder/spi-builder-workspace/.dependencies/checkouts/realm-swift/RealmSwift/RealmKeyedCollection.swift /Users/admin/builder/spi-builder-workspace/.dependencies/checkouts/realm-swift/RealmSwift/RealmProperty.swift /Users/admin/builder/spi-builder-workspace/.dependencies/checkouts/realm-swift/RealmSwift/Results.swift /Users/admin/builder/spi-builder-workspace/.dependencies/checkouts/realm-swift/RealmSwift/Schema.swift /Users/admin/builder/spi-builder-workspace/.dependencies/checkouts/realm-swift/RealmSwift/SectionedResults.swift /Users/admin/builder/spi-builder-workspace/.dependencies/checkouts/realm-swift/RealmSwift/SortDescriptor.swift /Users/admin/builder/spi-builder-workspace/.dependencies/checkouts/realm-swift/RealmSwift/SwiftUI.swift /Users/admin/builder/spi-builder-workspace/.dependencies/checkouts/realm-swift/RealmSwift/Sync.swift /Users/admin/builder/spi-builder-workspace/.dependencies/checkouts/realm-swift/RealmSwift/SyncSubscription.swift /Users/admin/builder/spi-builder-workspace/.dependencies/checkouts/realm-swift/RealmSwift/ThreadSafeReference.swift /Users/admin/builder/spi-builder-workspace/.dependencies/checkouts/realm-swift/RealmSwift/Util.swift -target arm64-apple-watchos4.0 -Xllvm -aarch64-use-tbi -enable-objc-interop -sdk /Applications/Xcode-16.1.0.app/Contents/Developer/Platforms/WatchOS.platform/Developer/SDKs/WatchOS11.1.sdk -I /Users/admin/builder/spi-builder-workspace/.derivedData/Build/Products/Debug-watchos -I /Applications/Xcode-16.1.0.app/Contents/Developer/Platforms/WatchOS.platform/Developer/usr/lib -F /Users/admin/builder/spi-builder-workspace/.derivedData/Build/Products/Debug-watchos/PackageFrameworks -F /Users/admin/builder/spi-builder-workspace/.derivedData/Build/Products/Debug-watchos/PackageFrameworks -F /Users/admin/builder/spi-builder-workspace/.derivedData/Build/Products/Debug-watchos/PackageFrameworks -F /Users/admin/builder/spi-builder-workspace/.derivedData/Build/Products/Debug-watchos/PackageFrameworks -F /Users/admin/builder/spi-builder-workspace/.derivedData/Build/Products/Debug-watchos/PackageFrameworks -F /Users/admin/builder/spi-builder-workspace/.derivedData/Build/Products/Debug-watchos -F /Applications/Xcode-16.1.0.app/Contents/Developer/Platforms/WatchOS.platform/Developer/Library/Frameworks -F /Applications/Xcode-16.1.0.app/Contents/Developer/Platforms/WatchOS.platform/Developer/SDKs/WatchOS11.1.sdk/Developer/Library/Frameworks -no-color-diagnostics -enable-testing -g -debug-info-format\=dwarf -dwarf-version\=4 -module-cache-path /Users/admin/builder/spi-builder-workspace/.derivedData/ModuleCache.noindex -suppress-warnings -profile-generate -profile-coverage-mapping -swift-version 6 -enforce-exclusivity\=checked -stats-output-dir /Users/admin/builder/spi-builder-workspace/.swiftpm/xcode/.stats -Onone -D SWIFT_PACKAGE -D DEBUG -serialize-debugging-options -const-gather-protocols-file /Users/admin/builder/spi-builder-workspace/.derivedData/Build/Intermediates.noindex/Realm.build/Debug-watchos/RealmSwift.build/Objects-normal/arm64/RealmSwift_const_extract_protocols.json -enable-experimental-feature DebugDescriptionMacro -enable-experimental-feature OpaqueTypeErasure -enable-upcoming-feature StrictConcurrency -enable-upcoming-feature DisableOutwardActorInference -enable-upcoming-feature GlobalActorIsolatedTypesUsability -enable-upcoming-feature InferSendableFromCaptures -strict-concurrency\=complete -empty-abi-descriptor -plugin-path /Applications/Xcode-16.1.0.app/Contents/Developer/Toolchains/XcodeDefault.xctoolchain/usr/lib/swift/host/plugins/testing -validate-clang-modules-once -clang-build-session-file /Users/admin/builder/spi-builder-workspace/.derivedData/ModuleCache.noindex/Session.modulevalidation -Xcc -working-directory -Xcc /Users/admin/builder/spi-builder-workspace/.swiftpm/xcode -resource-dir /Applications/Xcode-16.1.0.app/Contents/Developer/Toolchains/XcodeDefault.xctoolchain/usr/lib/swift -enable-anonymous-context-mangled-names -file-compilation-dir /Users/admin/builder/spi-builder-workspace/.swiftpm/xcode -Xcc -fmodule-map-file\=/Users/admin/builder/spi-builder-workspace/.derivedData/Build/Intermediates.noindex/GeneratedModuleMaps-watchos/s2geometry.modulemap -Xcc -fmodule-map-file\=/Users/admin/builder/spi-builder-workspace/.derivedData/Build/Intermediates.noindex/GeneratedModuleMaps-watchos/Bid.modulemap -Xcc -fmodule-map-file\=/Users/admin/builder/spi-builder-workspace/.derivedData/Build/Intermediates.noindex/GeneratedModuleMaps-watchos/RealmCoreResources.modulemap -Xcc -D_LIBCPP_HARDENING_MODE\=_LIBCPP_HARDENING_MODE_DEBUG -Xcc -ivfsstatcache -Xcc /Users/admin/builder/spi-builder-workspace/.derivedData/SDKStatCaches.noindex/watchos11.1-22R574-7b9df0bda16bb4641b33636c68f04660.sdkstatcache -Xcc -I/Users/admin/builder/spi-builder-workspace/.derivedData/Build/Intermediates.noindex/Realm.build/Debug-watchos/RealmSwift.build/swift-overrides.hmap -Xcc -I/Users/admin/builder/spi-builder-workspace/.dependencies/checkouts/realm-core/src -Xcc -I/Users/admin/builder/spi-builder-workspace/.dependencies/checkouts/realm-core/src/external/s2 -Xcc -I/Users/admin/builder/spi-builder-workspace/.dependencies/checkouts/realm-core/src/external/IntelRDFPMathLib20U2/LIBRARY/src -Xcc -I/Users/admin/builder/spi-builder-workspace/.dependencies/checkouts/realm-core/src/spm -Xcc -I/Users/admin/builder/spi-builder-workspace/.dependencies/checkouts/realm-swift/include -Xcc -I/Users/admin/builder/spi-builder-workspace/.derivedData/Build/Products/Debug-watchos/include -Xcc -I/Users/admin/builder/spi-builder-workspace/.derivedData/Build/Intermediates.noindex/Realm.build/Debug-watchos/RealmSwift.build/DerivedSources-normal/arm64 -Xcc -I/Users/admin/builder/spi-builder-workspace/.derivedData/Build/Intermediates.noindex/Realm.build/Debug-watchos/RealmSwift.build/DerivedSources/arm64 -Xcc -I/Users/admin/builder/spi-builder-workspace/.derivedData/Build/Intermediates.noindex/Realm.build/Debug-watchos/RealmSwift.build/DerivedSources -Xcc -DSWIFT_PACKAGE -Xcc -DDEBUG\=1 -module-name RealmSwift -package-name realm_swift -frontend-parseable-output -disable-clang-spi -target-sdk-version 11.1 -target-sdk-name watchos11.1 -external-plugin-path /Applications/Xcode-16.1.0.app/Contents/Developer/Platforms/WatchOS.platform/Developer/usr/lib/swift/host/plugins\#/Applications/Xcode-16.1.0.app/Contents/Developer/Platforms/WatchOS.platform/Developer/usr/bin/swift-plugin-server -external-plugin-path /Applications/Xcode-16.1.0.app/Contents/Developer/Platforms/WatchOS.platform/Developer/usr/local/lib/swift/host/plugins\#/Applications/Xcode-16.1.0.app/Contents/Developer/Platforms/WatchOS.platform/Developer/usr/bin/swift-plugin-server -plugin-path /Applications/Xcode-16.1.0.app/Contents/Developer/Toolchains/XcodeDefault.xctoolchain/usr/lib/swift/host/plugins -plugin-path /Applications/Xcode-16.1.0.app/Contents/Developer/Toolchains/XcodeDefault.xctoolchain/usr/local/lib/swift/host/plugins -emit-module-doc-path /Users/admin/builder/spi-builder-workspace/.derivedData/Build/Intermediates.noindex/Realm.build/Debug-watchos/RealmSwift.build/Objects-normal/arm64/RealmSwift.swiftdoc -emit-module-source-info-path /Users/admin/builder/spi-builder-workspace/.derivedData/Build/Intermediates.noindex/Realm.build/Debug-watchos/RealmSwift.build/Objects-normal/arm64/RealmSwift.swiftsourceinfo -emit-objc-header-path /Users/admin/builder/spi-builder-workspace/.derivedData/Build/Intermediates.noindex/Realm.build/Debug-watchos/RealmSwift.build/Objects-normal/arm64/RealmSwift-Swift.h -serialize-diagnostics-path /Users/admin/builder/spi-builder-workspace/.derivedData/Build/Intermediates.noindex/Realm.build/Debug-watchos/RealmSwift.build/Objects-normal/arm64/RealmSwift-master-emit-module.dia -emit-dependencies-path /Users/admin/builder/spi-builder-workspace/.derivedData/Build/Intermediates.noindex/Realm.build/Debug-watchos/RealmSwift.build/Objects-normal/arm64/RealmSwift-master-emit-module.d -o /Users/admin/builder/spi-builder-workspace/.derivedData/Build/Intermediates.noindex/Realm.build/Debug-watchos/RealmSwift.build/Objects-normal/arm64/RealmSwift.swiftmodule -emit-abi-descriptor-path /Users/admin/builder/spi-builder-workspace/.derivedData/Build/Intermediates.noindex/Realm.build/Debug-watchos/RealmSwift.build/Objects-normal/arm64/RealmSwift.abi.json
EmitSwiftModule normal arm64 (in target 'RealmSwift' from project 'Realm')
cd /Users/admin/builder/spi-builder-workspace/.swiftpm/xcode
/Applications/Xcode-16.1.0.app/Contents/Developer/Toolchains/XcodeDefault.xctoolchain/usr/bin/swift-frontend -emit-module -experimental-skip-non-inlinable-function-bodies-without-types /Users/admin/builder/spi-builder-workspace/.derivedData/Build/Intermediates.noindex/Realm.build/Debug-watchos/RealmSwift.build/DerivedSources/resource_bundle_accessor.swift /Users/admin/builder/spi-builder-workspace/.dependencies/checkouts/realm-swift/RealmSwift/Aliases.swift /Users/admin/builder/spi-builder-workspace/.dependencies/checkouts/realm-swift/RealmSwift/AnyRealmValue.swift /Users/admin/builder/spi-builder-workspace/.dependencies/checkouts/realm-swift/RealmSwift/App.swift /Users/admin/builder/spi-builder-workspace/.dependencies/checkouts/realm-swift/RealmSwift/AsymmetricObject.swift /Users/admin/builder/spi-builder-workspace/.dependencies/checkouts/realm-swift/RealmSwift/BSON.swift /Users/admin/builder/spi-builder-workspace/.dependencies/checkouts/realm-swift/RealmSwift/Combine.swift /Users/admin/builder/spi-builder-workspace/.dependencies/checkouts/realm-swift/RealmSwift/CustomPersistable.swift /Users/admin/builder/spi-builder-workspace/.dependencies/checkouts/realm-swift/RealmSwift/Decimal128.swift /Users/admin/builder/spi-builder-workspace/.dependencies/checkouts/realm-swift/RealmSwift/EmbeddedObject.swift /Users/admin/builder/spi-builder-workspace/.dependencies/checkouts/realm-swift/RealmSwift/Error.swift /Users/admin/builder/spi-builder-workspace/.dependencies/checkouts/realm-swift/RealmSwift/Events.swift /Users/admin/builder/spi-builder-workspace/.dependencies/checkouts/realm-swift/RealmSwift/Geospatial.swift /Users/admin/builder/spi-builder-workspace/.dependencies/checkouts/realm-swift/RealmSwift/Impl/BasicTypes.swift /Users/admin/builder/spi-builder-workspace/.dependencies/checkouts/realm-swift/RealmSwift/Impl/CollectionAccess.swift /Users/admin/builder/spi-builder-workspace/.dependencies/checkouts/realm-swift/RealmSwift/Impl/ComplexTypes.swift /Users/admin/builder/spi-builder-workspace/.dependencies/checkouts/realm-swift/RealmSwift/Impl/KeyPathStrings.swift /Users/admin/builder/spi-builder-workspace/.dependencies/checkouts/realm-swift/RealmSwift/Impl/ObjcBridgeable.swift /Users/admin/builder/spi-builder-workspace/.dependencies/checkouts/realm-swift/RealmSwift/Impl/Persistable.swift /Users/admin/builder/spi-builder-workspace/.dependencies/checkouts/realm-swift/RealmSwift/Impl/PropertyAccessors.swift /Users/admin/builder/spi-builder-workspace/.dependencies/checkouts/realm-swift/RealmSwift/Impl/RealmCollectionImpl.swift /Users/admin/builder/spi-builder-workspace/.dependencies/checkouts/realm-swift/RealmSwift/Impl/SchemaDiscovery.swift /Users/admin/builder/spi-builder-workspace/.dependencies/checkouts/realm-swift/RealmSwift/LinkingObjects.swift /Users/admin/builder/spi-builder-workspace/.dependencies/checkouts/realm-swift/RealmSwift/List.swift /Users/admin/builder/spi-builder-workspace/.dependencies/checkouts/realm-swift/RealmSwift/Map.swift /Users/admin/builder/spi-builder-workspace/.dependencies/checkouts/realm-swift/RealmSwift/Migration.swift /Users/admin/builder/spi-builder-workspace/.dependencies/checkouts/realm-swift/RealmSwift/MongoClient.swift /Users/admin/builder/spi-builder-workspace/.dependencies/checkouts/realm-swift/RealmSwift/MutableSet.swift /Users/admin/builder/spi-builder-workspace/.dependencies/checkouts/realm-swift/RealmSwift/Object.swift /Users/admin/builder/spi-builder-workspace/.dependencies/checkouts/realm-swift/RealmSwift/ObjectId.swift /Users/admin/builder/spi-builder-workspace/.dependencies/checkouts/realm-swift/RealmSwift/ObjectSchema.swift /Users/admin/builder/spi-builder-workspace/.dependencies/checkouts/realm-swift/RealmSwift/ObjectiveCSupport+AnyRealmValue.swift /Users/admin/builder/spi-builder-workspace/.dependencies/checkouts/realm-swift/RealmSwift/ObjectiveCSupport+BSON.swift /Users/admin/builder/spi-builder-workspace/.dependencies/checkouts/realm-swift/RealmSwift/ObjectiveCSupport+Sync.swift /Users/admin/builder/spi-builder-workspace/.dependencies/checkouts/realm-swift/RealmSwift/ObjectiveCSupport.swift /Users/admin/builder/spi-builder-workspace/.dependencies/checkouts/realm-swift/RealmSwift/Optional.swift /Users/admin/builder/spi-builder-workspace/.dependencies/checkouts/realm-swift/RealmSwift/PersistedProperty.swift /Users/admin/builder/spi-builder-workspace/.dependencies/checkouts/realm-swift/RealmSwift/Projection.swift /Users/admin/builder/spi-builder-workspace/.dependencies/checkouts/realm-swift/RealmSwift/Property.swift /Users/admin/builder/spi-builder-workspace/.dependencies/checkouts/realm-swift/RealmSwift/Query.swift /Users/admin/builder/spi-builder-workspace/.dependencies/checkouts/realm-swift/RealmSwift/Realm.swift /Users/admin/builder/spi-builder-workspace/.dependencies/checkouts/realm-swift/RealmSwift/RealmCollection.swift /Users/admin/builder/spi-builder-workspace/.dependencies/checkouts/realm-swift/RealmSwift/RealmConfiguration.swift /Users/admin/builder/spi-builder-workspace/.dependencies/checkouts/realm-swift/RealmSwift/RealmKeyedCollection.swift /Users/admin/builder/spi-builder-workspace/.dependencies/checkouts/realm-swift/RealmSwift/RealmProperty.swift /Users/admin/builder/spi-builder-workspace/.dependencies/checkouts/realm-swift/RealmSwift/Results.swift /Users/admin/builder/spi-builder-workspace/.dependencies/checkouts/realm-swift/RealmSwift/Schema.swift /Users/admin/builder/spi-builder-workspace/.dependencies/checkouts/realm-swift/RealmSwift/SectionedResults.swift /Users/admin/builder/spi-builder-workspace/.dependencies/checkouts/realm-swift/RealmSwift/SortDescriptor.swift /Users/admin/builder/spi-builder-workspace/.dependencies/checkouts/realm-swift/RealmSwift/SwiftUI.swift /Users/admin/builder/spi-builder-workspace/.dependencies/checkouts/realm-swift/RealmSwift/Sync.swift /Users/admin/builder/spi-builder-workspace/.dependencies/checkouts/realm-swift/RealmSwift/SyncSubscription.swift /Users/admin/builder/spi-builder-workspace/.dependencies/checkouts/realm-swift/RealmSwift/ThreadSafeReference.swift /Users/admin/builder/spi-builder-workspace/.dependencies/checkouts/realm-swift/RealmSwift/Util.swift -target arm64-apple-watchos4.0 -Xllvm -aarch64-use-tbi -enable-objc-interop -sdk /Applications/Xcode-16.1.0.app/Contents/Developer/Platforms/WatchOS.platform/Developer/SDKs/WatchOS11.1.sdk -I /Users/admin/builder/spi-builder-workspace/.derivedData/Build/Products/Debug-watchos -I /Applications/Xcode-16.1.0.app/Contents/Developer/Platforms/WatchOS.platform/Developer/usr/lib -F /Users/admin/builder/spi-builder-workspace/.derivedData/Build/Products/Debug-watchos/PackageFrameworks -F /Users/admin/builder/spi-builder-workspace/.derivedData/Build/Products/Debug-watchos/PackageFrameworks -F /Users/admin/builder/spi-builder-workspace/.derivedData/Build/Products/Debug-watchos/PackageFrameworks -F /Users/admin/builder/spi-builder-workspace/.derivedData/Build/Products/Debug-watchos/PackageFrameworks -F /Users/admin/builder/spi-builder-workspace/.derivedData/Build/Products/Debug-watchos/PackageFrameworks -F /Users/admin/builder/spi-builder-workspace/.derivedData/Build/Products/Debug-watchos -F /Applications/Xcode-16.1.0.app/Contents/Developer/Platforms/WatchOS.platform/Developer/Library/Frameworks -F /Applications/Xcode-16.1.0.app/Contents/Developer/Platforms/WatchOS.platform/Developer/SDKs/WatchOS11.1.sdk/Developer/Library/Frameworks -no-color-diagnostics -enable-testing -g -debug-info-format\=dwarf -dwarf-version\=4 -module-cache-path /Users/admin/builder/spi-builder-workspace/.derivedData/ModuleCache.noindex -suppress-warnings -profile-generate -profile-coverage-mapping -swift-version 6 -enforce-exclusivity\=checked -stats-output-dir /Users/admin/builder/spi-builder-workspace/.swiftpm/xcode/.stats -Onone -D SWIFT_PACKAGE -D DEBUG -serialize-debugging-options -const-gather-protocols-file /Users/admin/builder/spi-builder-workspace/.derivedData/Build/Intermediates.noindex/Realm.build/Debug-watchos/RealmSwift.build/Objects-normal/arm64/RealmSwift_const_extract_protocols.json -enable-experimental-feature DebugDescriptionMacro -enable-experimental-feature OpaqueTypeErasure -enable-upcoming-feature StrictConcurrency -enable-upcoming-feature DisableOutwardActorInference -enable-upcoming-feature GlobalActorIsolatedTypesUsability -enable-upcoming-feature InferSendableFromCaptures -strict-concurrency\=complete -empty-abi-descriptor -plugin-path /Applications/Xcode-16.1.0.app/Contents/Developer/Toolchains/XcodeDefault.xctoolchain/usr/lib/swift/host/plugins/testing -validate-clang-modules-once -clang-build-session-file /Users/admin/builder/spi-builder-workspace/.derivedData/ModuleCache.noindex/Session.modulevalidation -Xcc -working-directory -Xcc /Users/admin/builder/spi-builder-workspace/.swiftpm/xcode -resource-dir /Applications/Xcode-16.1.0.app/Contents/Developer/Toolchains/XcodeDefault.xctoolchain/usr/lib/swift -enable-anonymous-context-mangled-names -file-compilation-dir /Users/admin/builder/spi-builder-workspace/.swiftpm/xcode -Xcc -fmodule-map-file\=/Users/admin/builder/spi-builder-workspace/.derivedData/Build/Intermediates.noindex/GeneratedModuleMaps-watchos/s2geometry.modulemap -Xcc -fmodule-map-file\=/Users/admin/builder/spi-builder-workspace/.derivedData/Build/Intermediates.noindex/GeneratedModuleMaps-watchos/Bid.modulemap -Xcc -fmodule-map-file\=/Users/admin/builder/spi-builder-workspace/.derivedData/Build/Intermediates.noindex/GeneratedModuleMaps-watchos/RealmCoreResources.modulemap -Xcc -D_LIBCPP_HARDENING_MODE\=_LIBCPP_HARDENING_MODE_DEBUG -Xcc -ivfsstatcache -Xcc /Users/admin/builder/spi-builder-workspace/.derivedData/SDKStatCaches.noindex/watchos11.1-22R574-7b9df0bda16bb4641b33636c68f04660.sdkstatcache -Xcc -I/Users/admin/builder/spi-builder-workspace/.derivedData/Build/Intermediates.noindex/Realm.build/Debug-watchos/RealmSwift.build/swift-overrides.hmap -Xcc -I/Users/admin/builder/spi-builder-workspace/.dependencies/checkouts/realm-core/src -Xcc -I/Users/admin/builder/spi-builder-workspace/.dependencies/checkouts/realm-core/src/external/s2 -Xcc -I/Users/admin/builder/spi-builder-workspace/.dependencies/checkouts/realm-core/src/external/IntelRDFPMathLib20U2/LIBRARY/src -Xcc -I/Users/admin/builder/spi-builder-workspace/.dependencies/checkouts/realm-core/src/spm -Xcc -I/Users/admin/builder/spi-builder-workspace/.dependencies/checkouts/realm-swift/include -Xcc -I/Users/admin/builder/spi-builder-workspace/.derivedData/Build/Products/Debug-watchos/include -Xcc -I/Users/admin/builder/spi-builder-workspace/.derivedData/Build/Intermediates.noindex/Realm.build/Debug-watchos/RealmSwift.build/DerivedSources-normal/arm64 -Xcc -I/Users/admin/builder/spi-builder-workspace/.derivedData/Build/Intermediates.noindex/Realm.build/Debug-watchos/RealmSwift.build/DerivedSources/arm64 -Xcc -I/Users/admin/builder/spi-builder-workspace/.derivedData/Build/Intermediates.noindex/Realm.build/Debug-watchos/RealmSwift.build/DerivedSources -Xcc -DSWIFT_PACKAGE -Xcc -DDEBUG\=1 -module-name RealmSwift -package-name realm_swift -frontend-parseable-output -disable-clang-spi -target-sdk-version 11.1 -target-sdk-name watchos11.1 -external-plugin-path /Applications/Xcode-16.1.0.app/Contents/Developer/Platforms/WatchOS.platform/Developer/usr/lib/swift/host/plugins\#/Applications/Xcode-16.1.0.app/Contents/Developer/Platforms/WatchOS.platform/Developer/usr/bin/swift-plugin-server -external-plugin-path /Applications/Xcode-16.1.0.app/Contents/Developer/Platforms/WatchOS.platform/Developer/usr/local/lib/swift/host/plugins\#/Applications/Xcode-16.1.0.app/Contents/Developer/Platforms/WatchOS.platform/Developer/usr/bin/swift-plugin-server -plugin-path /Applications/Xcode-16.1.0.app/Contents/Developer/Toolchains/XcodeDefault.xctoolchain/usr/lib/swift/host/plugins -plugin-path /Applications/Xcode-16.1.0.app/Contents/Developer/Toolchains/XcodeDefault.xctoolchain/usr/local/lib/swift/host/plugins -emit-module-doc-path /Users/admin/builder/spi-builder-workspace/.derivedData/Build/Intermediates.noindex/Realm.build/Debug-watchos/RealmSwift.build/Objects-normal/arm64/RealmSwift.swiftdoc -emit-module-source-info-path /Users/admin/builder/spi-builder-workspace/.derivedData/Build/Intermediates.noindex/Realm.build/Debug-watchos/RealmSwift.build/Objects-normal/arm64/RealmSwift.swiftsourceinfo -emit-objc-header-path /Users/admin/builder/spi-builder-workspace/.derivedData/Build/Intermediates.noindex/Realm.build/Debug-watchos/RealmSwift.build/Objects-normal/arm64/RealmSwift-Swift.h -serialize-diagnostics-path /Users/admin/builder/spi-builder-workspace/.derivedData/Build/Intermediates.noindex/Realm.build/Debug-watchos/RealmSwift.build/Objects-normal/arm64/RealmSwift-master-emit-module.dia -emit-dependencies-path /Users/admin/builder/spi-builder-workspace/.derivedData/Build/Intermediates.noindex/Realm.build/Debug-watchos/RealmSwift.build/Objects-normal/arm64/RealmSwift-master-emit-module.d -o /Users/admin/builder/spi-builder-workspace/.derivedData/Build/Intermediates.noindex/Realm.build/Debug-watchos/RealmSwift.build/Objects-normal/arm64/RealmSwift.swiftmodule -emit-abi-descriptor-path /Users/admin/builder/spi-builder-workspace/.derivedData/Build/Intermediates.noindex/Realm.build/Debug-watchos/RealmSwift.build/Objects-normal/arm64/RealmSwift.abi.json
Command EmitSwiftModule failed with a nonzero exit code
<unknown>:0: error: upcoming feature 'StrictConcurrency' is already enabled as of Swift version 6
<unknown>:0: error: upcoming feature 'DisableOutwardActorInference' is already enabled as of Swift version 6
<unknown>:0: error: upcoming feature 'GlobalActorIsolatedTypesUsability' is already enabled as of Swift version 6
<unknown>:0: error: upcoming feature 'InferSendableFromCaptures' is already enabled as of Swift version 6
SwiftEmitModule normal armv7k Emitting\ module\ for\ RealmSwift (in target 'RealmSwift' from project 'Realm')
cd /Users/admin/builder/spi-builder-workspace/.swiftpm/xcode
builtin-swiftTaskExecution -- /Applications/Xcode-16.1.0.app/Contents/Developer/Toolchains/XcodeDefault.xctoolchain/usr/bin/swift-frontend -frontend -emit-module -experimental-skip-non-inlinable-function-bodies-without-types /Users/admin/builder/spi-builder-workspace/.derivedData/Build/Intermediates.noindex/Realm.build/Debug-watchos/RealmSwift.build/DerivedSources/resource_bundle_accessor.swift /Users/admin/builder/spi-builder-workspace/.dependencies/checkouts/realm-swift/RealmSwift/Aliases.swift /Users/admin/builder/spi-builder-workspace/.dependencies/checkouts/realm-swift/RealmSwift/AnyRealmValue.swift /Users/admin/builder/spi-builder-workspace/.dependencies/checkouts/realm-swift/RealmSwift/App.swift /Users/admin/builder/spi-builder-workspace/.dependencies/checkouts/realm-swift/RealmSwift/AsymmetricObject.swift /Users/admin/builder/spi-builder-workspace/.dependencies/checkouts/realm-swift/RealmSwift/BSON.swift /Users/admin/builder/spi-builder-workspace/.dependencies/checkouts/realm-swift/RealmSwift/Combine.swift /Users/admin/builder/spi-builder-workspace/.dependencies/checkouts/realm-swift/RealmSwift/CustomPersistable.swift /Users/admin/builder/spi-builder-workspace/.dependencies/checkouts/realm-swift/RealmSwift/Decimal128.swift /Users/admin/builder/spi-builder-workspace/.dependencies/checkouts/realm-swift/RealmSwift/EmbeddedObject.swift /Users/admin/builder/spi-builder-workspace/.dependencies/checkouts/realm-swift/RealmSwift/Error.swift /Users/admin/builder/spi-builder-workspace/.dependencies/checkouts/realm-swift/RealmSwift/Events.swift /Users/admin/builder/spi-builder-workspace/.dependencies/checkouts/realm-swift/RealmSwift/Geospatial.swift /Users/admin/builder/spi-builder-workspace/.dependencies/checkouts/realm-swift/RealmSwift/Impl/BasicTypes.swift /Users/admin/builder/spi-builder-workspace/.dependencies/checkouts/realm-swift/RealmSwift/Impl/CollectionAccess.swift /Users/admin/builder/spi-builder-workspace/.dependencies/checkouts/realm-swift/RealmSwift/Impl/ComplexTypes.swift /Users/admin/builder/spi-builder-workspace/.dependencies/checkouts/realm-swift/RealmSwift/Impl/KeyPathStrings.swift /Users/admin/builder/spi-builder-workspace/.dependencies/checkouts/realm-swift/RealmSwift/Impl/ObjcBridgeable.swift /Users/admin/builder/spi-builder-workspace/.dependencies/checkouts/realm-swift/RealmSwift/Impl/Persistable.swift /Users/admin/builder/spi-builder-workspace/.dependencies/checkouts/realm-swift/RealmSwift/Impl/PropertyAccessors.swift /Users/admin/builder/spi-builder-workspace/.dependencies/checkouts/realm-swift/RealmSwift/Impl/RealmCollectionImpl.swift /Users/admin/builder/spi-builder-workspace/.dependencies/checkouts/realm-swift/RealmSwift/Impl/SchemaDiscovery.swift /Users/admin/builder/spi-builder-workspace/.dependencies/checkouts/realm-swift/RealmSwift/LinkingObjects.swift /Users/admin/builder/spi-builder-workspace/.dependencies/checkouts/realm-swift/RealmSwift/List.swift /Users/admin/builder/spi-builder-workspace/.dependencies/checkouts/realm-swift/RealmSwift/Map.swift /Users/admin/builder/spi-builder-workspace/.dependencies/checkouts/realm-swift/RealmSwift/Migration.swift /Users/admin/builder/spi-builder-workspace/.dependencies/checkouts/realm-swift/RealmSwift/MongoClient.swift /Users/admin/builder/spi-builder-workspace/.dependencies/checkouts/realm-swift/RealmSwift/MutableSet.swift /Users/admin/builder/spi-builder-workspace/.dependencies/checkouts/realm-swift/RealmSwift/Object.swift /Users/admin/builder/spi-builder-workspace/.dependencies/checkouts/realm-swift/RealmSwift/ObjectId.swift /Users/admin/builder/spi-builder-workspace/.dependencies/checkouts/realm-swift/RealmSwift/ObjectSchema.swift /Users/admin/builder/spi-builder-workspace/.dependencies/checkouts/realm-swift/RealmSwift/ObjectiveCSupport+AnyRealmValue.swift /Users/admin/builder/spi-builder-workspace/.dependencies/checkouts/realm-swift/RealmSwift/ObjectiveCSupport+BSON.swift /Users/admin/builder/spi-builder-workspace/.dependencies/checkouts/realm-swift/RealmSwift/ObjectiveCSupport+Sync.swift /Users/admin/builder/spi-builder-workspace/.dependencies/checkouts/realm-swift/RealmSwift/ObjectiveCSupport.swift /Users/admin/builder/spi-builder-workspace/.dependencies/checkouts/realm-swift/RealmSwift/Optional.swift /Users/admin/builder/spi-builder-workspace/.dependencies/checkouts/realm-swift/RealmSwift/PersistedProperty.swift /Users/admin/builder/spi-builder-workspace/.dependencies/checkouts/realm-swift/RealmSwift/Projection.swift /Users/admin/builder/spi-builder-workspace/.dependencies/checkouts/realm-swift/RealmSwift/Property.swift /Users/admin/builder/spi-builder-workspace/.dependencies/checkouts/realm-swift/RealmSwift/Query.swift /Users/admin/builder/spi-builder-workspace/.dependencies/checkouts/realm-swift/RealmSwift/Realm.swift /Users/admin/builder/spi-builder-workspace/.dependencies/checkouts/realm-swift/RealmSwift/RealmCollection.swift /Users/admin/builder/spi-builder-workspace/.dependencies/checkouts/realm-swift/RealmSwift/RealmConfiguration.swift /Users/admin/builder/spi-builder-workspace/.dependencies/checkouts/realm-swift/RealmSwift/RealmKeyedCollection.swift /Users/admin/builder/spi-builder-workspace/.dependencies/checkouts/realm-swift/RealmSwift/RealmProperty.swift /Users/admin/builder/spi-builder-workspace/.dependencies/checkouts/realm-swift/RealmSwift/Results.swift /Users/admin/builder/spi-builder-workspace/.dependencies/checkouts/realm-swift/RealmSwift/Schema.swift /Users/admin/builder/spi-builder-workspace/.dependencies/checkouts/realm-swift/RealmSwift/SectionedResults.swift /Users/admin/builder/spi-builder-workspace/.dependencies/checkouts/realm-swift/RealmSwift/SortDescriptor.swift /Users/admin/builder/spi-builder-workspace/.dependencies/checkouts/realm-swift/RealmSwift/SwiftUI.swift /Users/admin/builder/spi-builder-workspace/.dependencies/checkouts/realm-swift/RealmSwift/Sync.swift /Users/admin/builder/spi-builder-workspace/.dependencies/checkouts/realm-swift/RealmSwift/SyncSubscription.swift /Users/admin/builder/spi-builder-workspace/.dependencies/checkouts/realm-swift/RealmSwift/ThreadSafeReference.swift /Users/admin/builder/spi-builder-workspace/.dependencies/checkouts/realm-swift/RealmSwift/Util.swift -target armv7k-apple-watchos4.0 -enable-objc-interop -sdk /Applications/Xcode-16.1.0.app/Contents/Developer/Platforms/WatchOS.platform/Developer/SDKs/WatchOS11.1.sdk -I /Users/admin/builder/spi-builder-workspace/.derivedData/Build/Products/Debug-watchos -I /Applications/Xcode-16.1.0.app/Contents/Developer/Platforms/WatchOS.platform/Developer/usr/lib -F /Users/admin/builder/spi-builder-workspace/.derivedData/Build/Products/Debug-watchos/PackageFrameworks -F /Users/admin/builder/spi-builder-workspace/.derivedData/Build/Products/Debug-watchos/PackageFrameworks -F /Users/admin/builder/spi-builder-workspace/.derivedData/Build/Products/Debug-watchos/PackageFrameworks -F /Users/admin/builder/spi-builder-workspace/.derivedData/Build/Products/Debug-watchos/PackageFrameworks -F /Users/admin/builder/spi-builder-workspace/.derivedData/Build/Products/Debug-watchos/PackageFrameworks -F /Users/admin/builder/spi-builder-workspace/.derivedData/Build/Products/Debug-watchos -F /Applications/Xcode-16.1.0.app/Contents/Developer/Platforms/WatchOS.platform/Developer/Library/Frameworks -F /Applications/Xcode-16.1.0.app/Contents/Developer/Platforms/WatchOS.platform/Developer/SDKs/WatchOS11.1.sdk/Developer/Library/Frameworks -no-color-diagnostics -enable-testing -g -debug-info-format\=dwarf -dwarf-version\=4 -module-cache-path /Users/admin/builder/spi-builder-workspace/.derivedData/ModuleCache.noindex -suppress-warnings -profile-generate -profile-coverage-mapping -swift-version 6 -enforce-exclusivity\=checked -stats-output-dir /Users/admin/builder/spi-builder-workspace/.swiftpm/xcode/.stats -Onone -D SWIFT_PACKAGE -D DEBUG -serialize-debugging-options -const-gather-protocols-file /Users/admin/builder/spi-builder-workspace/.derivedData/Build/Intermediates.noindex/Realm.build/Debug-watchos/RealmSwift.build/Objects-normal/armv7k/RealmSwift_const_extract_protocols.json -enable-experimental-feature DebugDescriptionMacro -enable-experimental-feature OpaqueTypeErasure -enable-upcoming-feature StrictConcurrency -enable-upcoming-feature DisableOutwardActorInference -enable-upcoming-feature GlobalActorIsolatedTypesUsability -enable-upcoming-feature InferSendableFromCaptures -strict-concurrency\=complete -empty-abi-descriptor -plugin-path /Applications/Xcode-16.1.0.app/Contents/Developer/Toolchains/XcodeDefault.xctoolchain/usr/lib/swift/host/plugins/testing -validate-clang-modules-once -clang-build-session-file /Users/admin/builder/spi-builder-workspace/.derivedData/ModuleCache.noindex/Session.modulevalidation -Xcc -working-directory -Xcc /Users/admin/builder/spi-builder-workspace/.swiftpm/xcode -resource-dir /Applications/Xcode-16.1.0.app/Contents/Developer/Toolchains/XcodeDefault.xctoolchain/usr/lib/swift -enable-anonymous-context-mangled-names -file-compilation-dir /Users/admin/builder/spi-builder-workspace/.swiftpm/xcode -Xcc -fmodule-map-file\=/Users/admin/builder/spi-builder-workspace/.derivedData/Build/Intermediates.noindex/GeneratedModuleMaps-watchos/s2geometry.modulemap -Xcc -fmodule-map-file\=/Users/admin/builder/spi-builder-workspace/.derivedData/Build/Intermediates.noindex/GeneratedModuleMaps-watchos/Bid.modulemap -Xcc -fmodule-map-file\=/Users/admin/builder/spi-builder-workspace/.derivedData/Build/Intermediates.noindex/GeneratedModuleMaps-watchos/RealmCoreResources.modulemap -Xcc -D_LIBCPP_HARDENING_MODE\=_LIBCPP_HARDENING_MODE_DEBUG -Xcc -ivfsstatcache -Xcc /Users/admin/builder/spi-builder-workspace/.derivedData/SDKStatCaches.noindex/watchos11.1-22R574-7b9df0bda16bb4641b33636c68f04660.sdkstatcache -Xcc -I/Users/admin/builder/spi-builder-workspace/.derivedData/Build/Intermediates.noindex/Realm.build/Debug-watchos/RealmSwift.build/swift-overrides.hmap -Xcc -I/Users/admin/builder/spi-builder-workspace/.dependencies/checkouts/realm-core/src -Xcc -I/Users/admin/builder/spi-builder-workspace/.dependencies/checkouts/realm-core/src/external/s2 -Xcc -I/Users/admin/builder/spi-builder-workspace/.dependencies/checkouts/realm-core/src/external/IntelRDFPMathLib20U2/LIBRARY/src -Xcc -I/Users/admin/builder/spi-builder-workspace/.dependencies/checkouts/realm-core/src/spm -Xcc -I/Users/admin/builder/spi-builder-workspace/.dependencies/checkouts/realm-swift/include -Xcc -I/Users/admin/builder/spi-builder-workspace/.derivedData/Build/Products/Debug-watchos/include -Xcc -I/Users/admin/builder/spi-builder-workspace/.derivedData/Build/Intermediates.noindex/Realm.build/Debug-watchos/RealmSwift.build/DerivedSources-normal/armv7k -Xcc -I/Users/admin/builder/spi-builder-workspace/.derivedData/Build/Intermediates.noindex/Realm.build/Debug-watchos/RealmSwift.build/DerivedSources/armv7k -Xcc -I/Users/admin/builder/spi-builder-workspace/.derivedData/Build/Intermediates.noindex/Realm.build/Debug-watchos/RealmSwift.build/DerivedSources -Xcc -DSWIFT_PACKAGE -Xcc -DDEBUG\=1 -module-name RealmSwift -package-name realm_swift -frontend-parseable-output -disable-clang-spi -target-sdk-version 11.1 -target-sdk-name watchos11.1 -external-plugin-path /Applications/Xcode-16.1.0.app/Contents/Developer/Platforms/WatchOS.platform/Developer/usr/lib/swift/host/plugins\#/Applications/Xcode-16.1.0.app/Contents/Developer/Platforms/WatchOS.platform/Developer/usr/bin/swift-plugin-server -external-plugin-path /Applications/Xcode-16.1.0.app/Contents/Developer/Platforms/WatchOS.platform/Developer/usr/local/lib/swift/host/plugins\#/Applications/Xcode-16.1.0.app/Contents/Developer/Platforms/WatchOS.platform/Developer/usr/bin/swift-plugin-server -plugin-path /Applications/Xcode-16.1.0.app/Contents/Developer/Toolchains/XcodeDefault.xctoolchain/usr/lib/swift/host/plugins -plugin-path /Applications/Xcode-16.1.0.app/Contents/Developer/Toolchains/XcodeDefault.xctoolchain/usr/local/lib/swift/host/plugins -emit-module-doc-path /Users/admin/builder/spi-builder-workspace/.derivedData/Build/Intermediates.noindex/Realm.build/Debug-watchos/RealmSwift.build/Objects-normal/armv7k/RealmSwift.swiftdoc -emit-module-source-info-path /Users/admin/builder/spi-builder-workspace/.derivedData/Build/Intermediates.noindex/Realm.build/Debug-watchos/RealmSwift.build/Objects-normal/armv7k/RealmSwift.swiftsourceinfo -emit-objc-header-path /Users/admin/builder/spi-builder-workspace/.derivedData/Build/Intermediates.noindex/Realm.build/Debug-watchos/RealmSwift.build/Objects-normal/armv7k/RealmSwift-Swift.h -serialize-diagnostics-path /Users/admin/builder/spi-builder-workspace/.derivedData/Build/Intermediates.noindex/Realm.build/Debug-watchos/RealmSwift.build/Objects-normal/armv7k/RealmSwift-master-emit-module.dia -emit-dependencies-path /Users/admin/builder/spi-builder-workspace/.derivedData/Build/Intermediates.noindex/Realm.build/Debug-watchos/RealmSwift.build/Objects-normal/armv7k/RealmSwift-master-emit-module.d -o /Users/admin/builder/spi-builder-workspace/.derivedData/Build/Intermediates.noindex/Realm.build/Debug-watchos/RealmSwift.build/Objects-normal/armv7k/RealmSwift.swiftmodule -emit-abi-descriptor-path /Users/admin/builder/spi-builder-workspace/.derivedData/Build/Intermediates.noindex/Realm.build/Debug-watchos/RealmSwift.build/Objects-normal/armv7k/RealmSwift.abi.json
EmitSwiftModule normal armv7k (in target 'RealmSwift' from project 'Realm')
cd /Users/admin/builder/spi-builder-workspace/.swiftpm/xcode
/Applications/Xcode-16.1.0.app/Contents/Developer/Toolchains/XcodeDefault.xctoolchain/usr/bin/swift-frontend -emit-module -experimental-skip-non-inlinable-function-bodies-without-types /Users/admin/builder/spi-builder-workspace/.derivedData/Build/Intermediates.noindex/Realm.build/Debug-watchos/RealmSwift.build/DerivedSources/resource_bundle_accessor.swift /Users/admin/builder/spi-builder-workspace/.dependencies/checkouts/realm-swift/RealmSwift/Aliases.swift /Users/admin/builder/spi-builder-workspace/.dependencies/checkouts/realm-swift/RealmSwift/AnyRealmValue.swift /Users/admin/builder/spi-builder-workspace/.dependencies/checkouts/realm-swift/RealmSwift/App.swift /Users/admin/builder/spi-builder-workspace/.dependencies/checkouts/realm-swift/RealmSwift/AsymmetricObject.swift /Users/admin/builder/spi-builder-workspace/.dependencies/checkouts/realm-swift/RealmSwift/BSON.swift /Users/admin/builder/spi-builder-workspace/.dependencies/checkouts/realm-swift/RealmSwift/Combine.swift /Users/admin/builder/spi-builder-workspace/.dependencies/checkouts/realm-swift/RealmSwift/CustomPersistable.swift /Users/admin/builder/spi-builder-workspace/.dependencies/checkouts/realm-swift/RealmSwift/Decimal128.swift /Users/admin/builder/spi-builder-workspace/.dependencies/checkouts/realm-swift/RealmSwift/EmbeddedObject.swift /Users/admin/builder/spi-builder-workspace/.dependencies/checkouts/realm-swift/RealmSwift/Error.swift /Users/admin/builder/spi-builder-workspace/.dependencies/checkouts/realm-swift/RealmSwift/Events.swift /Users/admin/builder/spi-builder-workspace/.dependencies/checkouts/realm-swift/RealmSwift/Geospatial.swift /Users/admin/builder/spi-builder-workspace/.dependencies/checkouts/realm-swift/RealmSwift/Impl/BasicTypes.swift /Users/admin/builder/spi-builder-workspace/.dependencies/checkouts/realm-swift/RealmSwift/Impl/CollectionAccess.swift /Users/admin/builder/spi-builder-workspace/.dependencies/checkouts/realm-swift/RealmSwift/Impl/ComplexTypes.swift /Users/admin/builder/spi-builder-workspace/.dependencies/checkouts/realm-swift/RealmSwift/Impl/KeyPathStrings.swift /Users/admin/builder/spi-builder-workspace/.dependencies/checkouts/realm-swift/RealmSwift/Impl/ObjcBridgeable.swift /Users/admin/builder/spi-builder-workspace/.dependencies/checkouts/realm-swift/RealmSwift/Impl/Persistable.swift /Users/admin/builder/spi-builder-workspace/.dependencies/checkouts/realm-swift/RealmSwift/Impl/PropertyAccessors.swift /Users/admin/builder/spi-builder-workspace/.dependencies/checkouts/realm-swift/RealmSwift/Impl/RealmCollectionImpl.swift /Users/admin/builder/spi-builder-workspace/.dependencies/checkouts/realm-swift/RealmSwift/Impl/SchemaDiscovery.swift /Users/admin/builder/spi-builder-workspace/.dependencies/checkouts/realm-swift/RealmSwift/LinkingObjects.swift /Users/admin/builder/spi-builder-workspace/.dependencies/checkouts/realm-swift/RealmSwift/List.swift /Users/admin/builder/spi-builder-workspace/.dependencies/checkouts/realm-swift/RealmSwift/Map.swift /Users/admin/builder/spi-builder-workspace/.dependencies/checkouts/realm-swift/RealmSwift/Migration.swift /Users/admin/builder/spi-builder-workspace/.dependencies/checkouts/realm-swift/RealmSwift/MongoClient.swift /Users/admin/builder/spi-builder-workspace/.dependencies/checkouts/realm-swift/RealmSwift/MutableSet.swift /Users/admin/builder/spi-builder-workspace/.dependencies/checkouts/realm-swift/RealmSwift/Object.swift /Users/admin/builder/spi-builder-workspace/.dependencies/checkouts/realm-swift/RealmSwift/ObjectId.swift /Users/admin/builder/spi-builder-workspace/.dependencies/checkouts/realm-swift/RealmSwift/ObjectSchema.swift /Users/admin/builder/spi-builder-workspace/.dependencies/checkouts/realm-swift/RealmSwift/ObjectiveCSupport+AnyRealmValue.swift /Users/admin/builder/spi-builder-workspace/.dependencies/checkouts/realm-swift/RealmSwift/ObjectiveCSupport+BSON.swift /Users/admin/builder/spi-builder-workspace/.dependencies/checkouts/realm-swift/RealmSwift/ObjectiveCSupport+Sync.swift /Users/admin/builder/spi-builder-workspace/.dependencies/checkouts/realm-swift/RealmSwift/ObjectiveCSupport.swift /Users/admin/builder/spi-builder-workspace/.dependencies/checkouts/realm-swift/RealmSwift/Optional.swift /Users/admin/builder/spi-builder-workspace/.dependencies/checkouts/realm-swift/RealmSwift/PersistedProperty.swift /Users/admin/builder/spi-builder-workspace/.dependencies/checkouts/realm-swift/RealmSwift/Projection.swift /Users/admin/builder/spi-builder-workspace/.dependencies/checkouts/realm-swift/RealmSwift/Property.swift /Users/admin/builder/spi-builder-workspace/.dependencies/checkouts/realm-swift/RealmSwift/Query.swift /Users/admin/builder/spi-builder-workspace/.dependencies/checkouts/realm-swift/RealmSwift/Realm.swift /Users/admin/builder/spi-builder-workspace/.dependencies/checkouts/realm-swift/RealmSwift/RealmCollection.swift /Users/admin/builder/spi-builder-workspace/.dependencies/checkouts/realm-swift/RealmSwift/RealmConfiguration.swift /Users/admin/builder/spi-builder-workspace/.dependencies/checkouts/realm-swift/RealmSwift/RealmKeyedCollection.swift /Users/admin/builder/spi-builder-workspace/.dependencies/checkouts/realm-swift/RealmSwift/RealmProperty.swift /Users/admin/builder/spi-builder-workspace/.dependencies/checkouts/realm-swift/RealmSwift/Results.swift /Users/admin/builder/spi-builder-workspace/.dependencies/checkouts/realm-swift/RealmSwift/Schema.swift /Users/admin/builder/spi-builder-workspace/.dependencies/checkouts/realm-swift/RealmSwift/SectionedResults.swift /Users/admin/builder/spi-builder-workspace/.dependencies/checkouts/realm-swift/RealmSwift/SortDescriptor.swift /Users/admin/builder/spi-builder-workspace/.dependencies/checkouts/realm-swift/RealmSwift/SwiftUI.swift /Users/admin/builder/spi-builder-workspace/.dependencies/checkouts/realm-swift/RealmSwift/Sync.swift /Users/admin/builder/spi-builder-workspace/.dependencies/checkouts/realm-swift/RealmSwift/SyncSubscription.swift /Users/admin/builder/spi-builder-workspace/.dependencies/checkouts/realm-swift/RealmSwift/ThreadSafeReference.swift /Users/admin/builder/spi-builder-workspace/.dependencies/checkouts/realm-swift/RealmSwift/Util.swift -target armv7k-apple-watchos4.0 -enable-objc-interop -sdk /Applications/Xcode-16.1.0.app/Contents/Developer/Platforms/WatchOS.platform/Developer/SDKs/WatchOS11.1.sdk -I /Users/admin/builder/spi-builder-workspace/.derivedData/Build/Products/Debug-watchos -I /Applications/Xcode-16.1.0.app/Contents/Developer/Platforms/WatchOS.platform/Developer/usr/lib -F /Users/admin/builder/spi-builder-workspace/.derivedData/Build/Products/Debug-watchos/PackageFrameworks -F /Users/admin/builder/spi-builder-workspace/.derivedData/Build/Products/Debug-watchos/PackageFrameworks -F /Users/admin/builder/spi-builder-workspace/.derivedData/Build/Products/Debug-watchos/PackageFrameworks -F /Users/admin/builder/spi-builder-workspace/.derivedData/Build/Products/Debug-watchos/PackageFrameworks -F /Users/admin/builder/spi-builder-workspace/.derivedData/Build/Products/Debug-watchos/PackageFrameworks -F /Users/admin/builder/spi-builder-workspace/.derivedData/Build/Products/Debug-watchos -F /Applications/Xcode-16.1.0.app/Contents/Developer/Platforms/WatchOS.platform/Developer/Library/Frameworks -F /Applications/Xcode-16.1.0.app/Contents/Developer/Platforms/WatchOS.platform/Developer/SDKs/WatchOS11.1.sdk/Developer/Library/Frameworks -no-color-diagnostics -enable-testing -g -debug-info-format\=dwarf -dwarf-version\=4 -module-cache-path /Users/admin/builder/spi-builder-workspace/.derivedData/ModuleCache.noindex -suppress-warnings -profile-generate -profile-coverage-mapping -swift-version 6 -enforce-exclusivity\=checked -stats-output-dir /Users/admin/builder/spi-builder-workspace/.swiftpm/xcode/.stats -Onone -D SWIFT_PACKAGE -D DEBUG -serialize-debugging-options -const-gather-protocols-file /Users/admin/builder/spi-builder-workspace/.derivedData/Build/Intermediates.noindex/Realm.build/Debug-watchos/RealmSwift.build/Objects-normal/armv7k/RealmSwift_const_extract_protocols.json -enable-experimental-feature DebugDescriptionMacro -enable-experimental-feature OpaqueTypeErasure -enable-upcoming-feature StrictConcurrency -enable-upcoming-feature DisableOutwardActorInference -enable-upcoming-feature GlobalActorIsolatedTypesUsability -enable-upcoming-feature InferSendableFromCaptures -strict-concurrency\=complete -empty-abi-descriptor -plugin-path /Applications/Xcode-16.1.0.app/Contents/Developer/Toolchains/XcodeDefault.xctoolchain/usr/lib/swift/host/plugins/testing -validate-clang-modules-once -clang-build-session-file /Users/admin/builder/spi-builder-workspace/.derivedData/ModuleCache.noindex/Session.modulevalidation -Xcc -working-directory -Xcc /Users/admin/builder/spi-builder-workspace/.swiftpm/xcode -resource-dir /Applications/Xcode-16.1.0.app/Contents/Developer/Toolchains/XcodeDefault.xctoolchain/usr/lib/swift -enable-anonymous-context-mangled-names -file-compilation-dir /Users/admin/builder/spi-builder-workspace/.swiftpm/xcode -Xcc -fmodule-map-file\=/Users/admin/builder/spi-builder-workspace/.derivedData/Build/Intermediates.noindex/GeneratedModuleMaps-watchos/s2geometry.modulemap -Xcc -fmodule-map-file\=/Users/admin/builder/spi-builder-workspace/.derivedData/Build/Intermediates.noindex/GeneratedModuleMaps-watchos/Bid.modulemap -Xcc -fmodule-map-file\=/Users/admin/builder/spi-builder-workspace/.derivedData/Build/Intermediates.noindex/GeneratedModuleMaps-watchos/RealmCoreResources.modulemap -Xcc -D_LIBCPP_HARDENING_MODE\=_LIBCPP_HARDENING_MODE_DEBUG -Xcc -ivfsstatcache -Xcc /Users/admin/builder/spi-builder-workspace/.derivedData/SDKStatCaches.noindex/watchos11.1-22R574-7b9df0bda16bb4641b33636c68f04660.sdkstatcache -Xcc -I/Users/admin/builder/spi-builder-workspace/.derivedData/Build/Intermediates.noindex/Realm.build/Debug-watchos/RealmSwift.build/swift-overrides.hmap -Xcc -I/Users/admin/builder/spi-builder-workspace/.dependencies/checkouts/realm-core/src -Xcc -I/Users/admin/builder/spi-builder-workspace/.dependencies/checkouts/realm-core/src/external/s2 -Xcc -I/Users/admin/builder/spi-builder-workspace/.dependencies/checkouts/realm-core/src/external/IntelRDFPMathLib20U2/LIBRARY/src -Xcc -I/Users/admin/builder/spi-builder-workspace/.dependencies/checkouts/realm-core/src/spm -Xcc -I/Users/admin/builder/spi-builder-workspace/.dependencies/checkouts/realm-swift/include -Xcc -I/Users/admin/builder/spi-builder-workspace/.derivedData/Build/Products/Debug-watchos/include -Xcc -I/Users/admin/builder/spi-builder-workspace/.derivedData/Build/Intermediates.noindex/Realm.build/Debug-watchos/RealmSwift.build/DerivedSources-normal/armv7k -Xcc -I/Users/admin/builder/spi-builder-workspace/.derivedData/Build/Intermediates.noindex/Realm.build/Debug-watchos/RealmSwift.build/DerivedSources/armv7k -Xcc -I/Users/admin/builder/spi-builder-workspace/.derivedData/Build/Intermediates.noindex/Realm.build/Debug-watchos/RealmSwift.build/DerivedSources -Xcc -DSWIFT_PACKAGE -Xcc -DDEBUG\=1 -module-name RealmSwift -package-name realm_swift -frontend-parseable-output -disable-clang-spi -target-sdk-version 11.1 -target-sdk-name watchos11.1 -external-plugin-path /Applications/Xcode-16.1.0.app/Contents/Developer/Platforms/WatchOS.platform/Developer/usr/lib/swift/host/plugins\#/Applications/Xcode-16.1.0.app/Contents/Developer/Platforms/WatchOS.platform/Developer/usr/bin/swift-plugin-server -external-plugin-path /Applications/Xcode-16.1.0.app/Contents/Developer/Platforms/WatchOS.platform/Developer/usr/local/lib/swift/host/plugins\#/Applications/Xcode-16.1.0.app/Contents/Developer/Platforms/WatchOS.platform/Developer/usr/bin/swift-plugin-server -plugin-path /Applications/Xcode-16.1.0.app/Contents/Developer/Toolchains/XcodeDefault.xctoolchain/usr/lib/swift/host/plugins -plugin-path /Applications/Xcode-16.1.0.app/Contents/Developer/Toolchains/XcodeDefault.xctoolchain/usr/local/lib/swift/host/plugins -emit-module-doc-path /Users/admin/builder/spi-builder-workspace/.derivedData/Build/Intermediates.noindex/Realm.build/Debug-watchos/RealmSwift.build/Objects-normal/armv7k/RealmSwift.swiftdoc -emit-module-source-info-path /Users/admin/builder/spi-builder-workspace/.derivedData/Build/Intermediates.noindex/Realm.build/Debug-watchos/RealmSwift.build/Objects-normal/armv7k/RealmSwift.swiftsourceinfo -emit-objc-header-path /Users/admin/builder/spi-builder-workspace/.derivedData/Build/Intermediates.noindex/Realm.build/Debug-watchos/RealmSwift.build/Objects-normal/armv7k/RealmSwift-Swift.h -serialize-diagnostics-path /Users/admin/builder/spi-builder-workspace/.derivedData/Build/Intermediates.noindex/Realm.build/Debug-watchos/RealmSwift.build/Objects-normal/armv7k/RealmSwift-master-emit-module.dia -emit-dependencies-path /Users/admin/builder/spi-builder-workspace/.derivedData/Build/Intermediates.noindex/Realm.build/Debug-watchos/RealmSwift.build/Objects-normal/armv7k/RealmSwift-master-emit-module.d -o /Users/admin/builder/spi-builder-workspace/.derivedData/Build/Intermediates.noindex/Realm.build/Debug-watchos/RealmSwift.build/Objects-normal/armv7k/RealmSwift.swiftmodule -emit-abi-descriptor-path /Users/admin/builder/spi-builder-workspace/.derivedData/Build/Intermediates.noindex/Realm.build/Debug-watchos/RealmSwift.build/Objects-normal/armv7k/RealmSwift.abi.json
<unknown>:0: error: upcoming feature 'StrictConcurrency' is already enabled as of Swift version 6
<unknown>:0: error: upcoming feature 'DisableOutwardActorInference' is already enabled as of Swift version 6
<unknown>:0: error: upcoming feature 'GlobalActorIsolatedTypesUsability' is already enabled as of Swift version 6
<unknown>:0: error: upcoming feature 'InferSendableFromCaptures' is already enabled as of Swift version 6
SwiftEmitModule normal arm64_32 Emitting\ module\ for\ RealmSwift (in target 'RealmSwift' from project 'Realm')
cd /Users/admin/builder/spi-builder-workspace/.swiftpm/xcode
builtin-swiftTaskExecution -- /Applications/Xcode-16.1.0.app/Contents/Developer/Toolchains/XcodeDefault.xctoolchain/usr/bin/swift-frontend -frontend -emit-module -experimental-skip-non-inlinable-function-bodies-without-types /Users/admin/builder/spi-builder-workspace/.derivedData/Build/Intermediates.noindex/Realm.build/Debug-watchos/RealmSwift.build/DerivedSources/resource_bundle_accessor.swift /Users/admin/builder/spi-builder-workspace/.dependencies/checkouts/realm-swift/RealmSwift/Aliases.swift /Users/admin/builder/spi-builder-workspace/.dependencies/checkouts/realm-swift/RealmSwift/AnyRealmValue.swift /Users/admin/builder/spi-builder-workspace/.dependencies/checkouts/realm-swift/RealmSwift/App.swift /Users/admin/builder/spi-builder-workspace/.dependencies/checkouts/realm-swift/RealmSwift/AsymmetricObject.swift /Users/admin/builder/spi-builder-workspace/.dependencies/checkouts/realm-swift/RealmSwift/BSON.swift /Users/admin/builder/spi-builder-workspace/.dependencies/checkouts/realm-swift/RealmSwift/Combine.swift /Users/admin/builder/spi-builder-workspace/.dependencies/checkouts/realm-swift/RealmSwift/CustomPersistable.swift /Users/admin/builder/spi-builder-workspace/.dependencies/checkouts/realm-swift/RealmSwift/Decimal128.swift /Users/admin/builder/spi-builder-workspace/.dependencies/checkouts/realm-swift/RealmSwift/EmbeddedObject.swift /Users/admin/builder/spi-builder-workspace/.dependencies/checkouts/realm-swift/RealmSwift/Error.swift /Users/admin/builder/spi-builder-workspace/.dependencies/checkouts/realm-swift/RealmSwift/Events.swift /Users/admin/builder/spi-builder-workspace/.dependencies/checkouts/realm-swift/RealmSwift/Geospatial.swift /Users/admin/builder/spi-builder-workspace/.dependencies/checkouts/realm-swift/RealmSwift/Impl/BasicTypes.swift /Users/admin/builder/spi-builder-workspace/.dependencies/checkouts/realm-swift/RealmSwift/Impl/CollectionAccess.swift /Users/admin/builder/spi-builder-workspace/.dependencies/checkouts/realm-swift/RealmSwift/Impl/ComplexTypes.swift /Users/admin/builder/spi-builder-workspace/.dependencies/checkouts/realm-swift/RealmSwift/Impl/KeyPathStrings.swift /Users/admin/builder/spi-builder-workspace/.dependencies/checkouts/realm-swift/RealmSwift/Impl/ObjcBridgeable.swift /Users/admin/builder/spi-builder-workspace/.dependencies/checkouts/realm-swift/RealmSwift/Impl/Persistable.swift /Users/admin/builder/spi-builder-workspace/.dependencies/checkouts/realm-swift/RealmSwift/Impl/PropertyAccessors.swift /Users/admin/builder/spi-builder-workspace/.dependencies/checkouts/realm-swift/RealmSwift/Impl/RealmCollectionImpl.swift /Users/admin/builder/spi-builder-workspace/.dependencies/checkouts/realm-swift/RealmSwift/Impl/SchemaDiscovery.swift /Users/admin/builder/spi-builder-workspace/.dependencies/checkouts/realm-swift/RealmSwift/LinkingObjects.swift /Users/admin/builder/spi-builder-workspace/.dependencies/checkouts/realm-swift/RealmSwift/List.swift /Users/admin/builder/spi-builder-workspace/.dependencies/checkouts/realm-swift/RealmSwift/Map.swift /Users/admin/builder/spi-builder-workspace/.dependencies/checkouts/realm-swift/RealmSwift/Migration.swift /Users/admin/builder/spi-builder-workspace/.dependencies/checkouts/realm-swift/RealmSwift/MongoClient.swift /Users/admin/builder/spi-builder-workspace/.dependencies/checkouts/realm-swift/RealmSwift/MutableSet.swift /Users/admin/builder/spi-builder-workspace/.dependencies/checkouts/realm-swift/RealmSwift/Object.swift /Users/admin/builder/spi-builder-workspace/.dependencies/checkouts/realm-swift/RealmSwift/ObjectId.swift /Users/admin/builder/spi-builder-workspace/.dependencies/checkouts/realm-swift/RealmSwift/ObjectSchema.swift /Users/admin/builder/spi-builder-workspace/.dependencies/checkouts/realm-swift/RealmSwift/ObjectiveCSupport+AnyRealmValue.swift /Users/admin/builder/spi-builder-workspace/.dependencies/checkouts/realm-swift/RealmSwift/ObjectiveCSupport+BSON.swift /Users/admin/builder/spi-builder-workspace/.dependencies/checkouts/realm-swift/RealmSwift/ObjectiveCSupport+Sync.swift /Users/admin/builder/spi-builder-workspace/.dependencies/checkouts/realm-swift/RealmSwift/ObjectiveCSupport.swift /Users/admin/builder/spi-builder-workspace/.dependencies/checkouts/realm-swift/RealmSwift/Optional.swift /Users/admin/builder/spi-builder-workspace/.dependencies/checkouts/realm-swift/RealmSwift/PersistedProperty.swift /Users/admin/builder/spi-builder-workspace/.dependencies/checkouts/realm-swift/RealmSwift/Projection.swift /Users/admin/builder/spi-builder-workspace/.dependencies/checkouts/realm-swift/RealmSwift/Property.swift /Users/admin/builder/spi-builder-workspace/.dependencies/checkouts/realm-swift/RealmSwift/Query.swift /Users/admin/builder/spi-builder-workspace/.dependencies/checkouts/realm-swift/RealmSwift/Realm.swift /Users/admin/builder/spi-builder-workspace/.dependencies/checkouts/realm-swift/RealmSwift/RealmCollection.swift /Users/admin/builder/spi-builder-workspace/.dependencies/checkouts/realm-swift/RealmSwift/RealmConfiguration.swift /Users/admin/builder/spi-builder-workspace/.dependencies/checkouts/realm-swift/RealmSwift/RealmKeyedCollection.swift /Users/admin/builder/spi-builder-workspace/.dependencies/checkouts/realm-swift/RealmSwift/RealmProperty.swift /Users/admin/builder/spi-builder-workspace/.dependencies/checkouts/realm-swift/RealmSwift/Results.swift /Users/admin/builder/spi-builder-workspace/.dependencies/checkouts/realm-swift/RealmSwift/Schema.swift /Users/admin/builder/spi-builder-workspace/.dependencies/checkouts/realm-swift/RealmSwift/SectionedResults.swift /Users/admin/builder/spi-builder-workspace/.dependencies/checkouts/realm-swift/RealmSwift/SortDescriptor.swift /Users/admin/builder/spi-builder-workspace/.dependencies/checkouts/realm-swift/RealmSwift/SwiftUI.swift /Users/admin/builder/spi-builder-workspace/.dependencies/checkouts/realm-swift/RealmSwift/Sync.swift /Users/admin/builder/spi-builder-workspace/.dependencies/checkouts/realm-swift/RealmSwift/SyncSubscription.swift /Users/admin/builder/spi-builder-workspace/.dependencies/checkouts/realm-swift/RealmSwift/ThreadSafeReference.swift /Users/admin/builder/spi-builder-workspace/.dependencies/checkouts/realm-swift/RealmSwift/Util.swift -target arm64_32-apple-watchos4.0 -enable-objc-interop -sdk /Applications/Xcode-16.1.0.app/Contents/Developer/Platforms/WatchOS.platform/Developer/SDKs/WatchOS11.1.sdk -I /Users/admin/builder/spi-builder-workspace/.derivedData/Build/Products/Debug-watchos -I /Applications/Xcode-16.1.0.app/Contents/Developer/Platforms/WatchOS.platform/Developer/usr/lib -F /Users/admin/builder/spi-builder-workspace/.derivedData/Build/Products/Debug-watchos/PackageFrameworks -F /Users/admin/builder/spi-builder-workspace/.derivedData/Build/Products/Debug-watchos/PackageFrameworks -F /Users/admin/builder/spi-builder-workspace/.derivedData/Build/Products/Debug-watchos/PackageFrameworks -F /Users/admin/builder/spi-builder-workspace/.derivedData/Build/Products/Debug-watchos/PackageFrameworks -F /Users/admin/builder/spi-builder-workspace/.derivedData/Build/Products/Debug-watchos/PackageFrameworks -F /Users/admin/builder/spi-builder-workspace/.derivedData/Build/Products/Debug-watchos -F /Applications/Xcode-16.1.0.app/Contents/Developer/Platforms/WatchOS.platform/Developer/Library/Frameworks -F /Applications/Xcode-16.1.0.app/Contents/Developer/Platforms/WatchOS.platform/Developer/SDKs/WatchOS11.1.sdk/Developer/Library/Frameworks -no-color-diagnostics -enable-testing -g -debug-info-format\=dwarf -dwarf-version\=4 -module-cache-path /Users/admin/builder/spi-builder-workspace/.derivedData/ModuleCache.noindex -suppress-warnings -profile-generate -profile-coverage-mapping -swift-version 6 -enforce-exclusivity\=checked -stats-output-dir /Users/admin/builder/spi-builder-workspace/.swiftpm/xcode/.stats -Onone -D SWIFT_PACKAGE -D DEBUG -serialize-debugging-options -const-gather-protocols-file /Users/admin/builder/spi-builder-workspace/.derivedData/Build/Intermediates.noindex/Realm.build/Debug-watchos/RealmSwift.build/Objects-normal/arm64_32/RealmSwift_const_extract_protocols.json -enable-experimental-feature DebugDescriptionMacro -enable-experimental-feature OpaqueTypeErasure -enable-upcoming-feature StrictConcurrency -enable-upcoming-feature DisableOutwardActorInference -enable-upcoming-feature GlobalActorIsolatedTypesUsability -enable-upcoming-feature InferSendableFromCaptures -strict-concurrency\=complete -empty-abi-descriptor -plugin-path /Applications/Xcode-16.1.0.app/Contents/Developer/Toolchains/XcodeDefault.xctoolchain/usr/lib/swift/host/plugins/testing -validate-clang-modules-once -clang-build-session-file /Users/admin/builder/spi-builder-workspace/.derivedData/ModuleCache.noindex/Session.modulevalidation -Xcc -working-directory -Xcc /Users/admin/builder/spi-builder-workspace/.swiftpm/xcode -resource-dir /Applications/Xcode-16.1.0.app/Contents/Developer/Toolchains/XcodeDefault.xctoolchain/usr/lib/swift -enable-anonymous-context-mangled-names -file-compilation-dir /Users/admin/builder/spi-builder-workspace/.swiftpm/xcode -Xcc -fmodule-map-file\=/Users/admin/builder/spi-builder-workspace/.derivedData/Build/Intermediates.noindex/GeneratedModuleMaps-watchos/s2geometry.modulemap -Xcc -fmodule-map-file\=/Users/admin/builder/spi-builder-workspace/.derivedData/Build/Intermediates.noindex/GeneratedModuleMaps-watchos/Bid.modulemap -Xcc -fmodule-map-file\=/Users/admin/builder/spi-builder-workspace/.derivedData/Build/Intermediates.noindex/GeneratedModuleMaps-watchos/RealmCoreResources.modulemap -Xcc -D_LIBCPP_HARDENING_MODE\=_LIBCPP_HARDENING_MODE_DEBUG -Xcc -ivfsstatcache -Xcc /Users/admin/builder/spi-builder-workspace/.derivedData/SDKStatCaches.noindex/watchos11.1-22R574-7b9df0bda16bb4641b33636c68f04660.sdkstatcache -Xcc -I/Users/admin/builder/spi-builder-workspace/.derivedData/Build/Intermediates.noindex/Realm.build/Debug-watchos/RealmSwift.build/swift-overrides.hmap -Xcc -I/Users/admin/builder/spi-builder-workspace/.dependencies/checkouts/realm-core/src -Xcc -I/Users/admin/builder/spi-builder-workspace/.dependencies/checkouts/realm-core/src/external/s2 -Xcc -I/Users/admin/builder/spi-builder-workspace/.dependencies/checkouts/realm-core/src/external/IntelRDFPMathLib20U2/LIBRARY/src -Xcc -I/Users/admin/builder/spi-builder-workspace/.dependencies/checkouts/realm-core/src/spm -Xcc -I/Users/admin/builder/spi-builder-workspace/.dependencies/checkouts/realm-swift/include -Xcc -I/Users/admin/builder/spi-builder-workspace/.derivedData/Build/Products/Debug-watchos/include -Xcc -I/Users/admin/builder/spi-builder-workspace/.derivedData/Build/Intermediates.noindex/Realm.build/Debug-watchos/RealmSwift.build/DerivedSources-normal/arm64_32 -Xcc -I/Users/admin/builder/spi-builder-workspace/.derivedData/Build/Intermediates.noindex/Realm.build/Debug-watchos/RealmSwift.build/DerivedSources/arm64_32 -Xcc -I/Users/admin/builder/spi-builder-workspace/.derivedData/Build/Intermediates.noindex/Realm.build/Debug-watchos/RealmSwift.build/DerivedSources -Xcc -DSWIFT_PACKAGE -Xcc -DDEBUG\=1 -module-name RealmSwift -package-name realm_swift -frontend-parseable-output -disable-clang-spi -target-sdk-version 11.1 -target-sdk-name watchos11.1 -external-plugin-path /Applications/Xcode-16.1.0.app/Contents/Developer/Platforms/WatchOS.platform/Developer/usr/lib/swift/host/plugins\#/Applications/Xcode-16.1.0.app/Contents/Developer/Platforms/WatchOS.platform/Developer/usr/bin/swift-plugin-server -external-plugin-path /Applications/Xcode-16.1.0.app/Contents/Developer/Platforms/WatchOS.platform/Developer/usr/local/lib/swift/host/plugins\#/Applications/Xcode-16.1.0.app/Contents/Developer/Platforms/WatchOS.platform/Developer/usr/bin/swift-plugin-server -plugin-path /Applications/Xcode-16.1.0.app/Contents/Developer/Toolchains/XcodeDefault.xctoolchain/usr/lib/swift/host/plugins -plugin-path /Applications/Xcode-16.1.0.app/Contents/Developer/Toolchains/XcodeDefault.xctoolchain/usr/local/lib/swift/host/plugins -emit-module-doc-path /Users/admin/builder/spi-builder-workspace/.derivedData/Build/Intermediates.noindex/Realm.build/Debug-watchos/RealmSwift.build/Objects-normal/arm64_32/RealmSwift.swiftdoc -emit-module-source-info-path /Users/admin/builder/spi-builder-workspace/.derivedData/Build/Intermediates.noindex/Realm.build/Debug-watchos/RealmSwift.build/Objects-normal/arm64_32/RealmSwift.swiftsourceinfo -emit-objc-header-path /Users/admin/builder/spi-builder-workspace/.derivedData/Build/Intermediates.noindex/Realm.build/Debug-watchos/RealmSwift.build/Objects-normal/arm64_32/RealmSwift-Swift.h -serialize-diagnostics-path /Users/admin/builder/spi-builder-workspace/.derivedData/Build/Intermediates.noindex/Realm.build/Debug-watchos/RealmSwift.build/Objects-normal/arm64_32/RealmSwift-master-emit-module.dia -emit-dependencies-path /Users/admin/builder/spi-builder-workspace/.derivedData/Build/Intermediates.noindex/Realm.build/Debug-watchos/RealmSwift.build/Objects-normal/arm64_32/RealmSwift-master-emit-module.d -o /Users/admin/builder/spi-builder-workspace/.derivedData/Build/Intermediates.noindex/Realm.build/Debug-watchos/RealmSwift.build/Objects-normal/arm64_32/RealmSwift.swiftmodule -emit-abi-descriptor-path /Users/admin/builder/spi-builder-workspace/.derivedData/Build/Intermediates.noindex/Realm.build/Debug-watchos/RealmSwift.build/Objects-normal/arm64_32/RealmSwift.abi.json
<unknown>:0: error: upcoming feature 'StrictConcurrency' is already enabled as of Swift version 6
<unknown>:0: error: upcoming feature 'DisableOutwardActorInference' is already enabled as of Swift version 6
<unknown>:0: error: upcoming feature 'GlobalActorIsolatedTypesUsability' is already enabled as of Swift version 6
<unknown>:0: error: upcoming feature 'InferSendableFromCaptures' is already enabled as of Swift version 6
EmitSwiftModule normal arm64_32 (in target 'RealmSwift' from project 'Realm')
cd /Users/admin/builder/spi-builder-workspace/.swiftpm/xcode
/Applications/Xcode-16.1.0.app/Contents/Developer/Toolchains/XcodeDefault.xctoolchain/usr/bin/swift-frontend -emit-module -experimental-skip-non-inlinable-function-bodies-without-types /Users/admin/builder/spi-builder-workspace/.derivedData/Build/Intermediates.noindex/Realm.build/Debug-watchos/RealmSwift.build/DerivedSources/resource_bundle_accessor.swift /Users/admin/builder/spi-builder-workspace/.dependencies/checkouts/realm-swift/RealmSwift/Aliases.swift /Users/admin/builder/spi-builder-workspace/.dependencies/checkouts/realm-swift/RealmSwift/AnyRealmValue.swift /Users/admin/builder/spi-builder-workspace/.dependencies/checkouts/realm-swift/RealmSwift/App.swift /Users/admin/builder/spi-builder-workspace/.dependencies/checkouts/realm-swift/RealmSwift/AsymmetricObject.swift /Users/admin/builder/spi-builder-workspace/.dependencies/checkouts/realm-swift/RealmSwift/BSON.swift /Users/admin/builder/spi-builder-workspace/.dependencies/checkouts/realm-swift/RealmSwift/Combine.swift /Users/admin/builder/spi-builder-workspace/.dependencies/checkouts/realm-swift/RealmSwift/CustomPersistable.swift /Users/admin/builder/spi-builder-workspace/.dependencies/checkouts/realm-swift/RealmSwift/Decimal128.swift /Users/admin/builder/spi-builder-workspace/.dependencies/checkouts/realm-swift/RealmSwift/EmbeddedObject.swift /Users/admin/builder/spi-builder-workspace/.dependencies/checkouts/realm-swift/RealmSwift/Error.swift /Users/admin/builder/spi-builder-workspace/.dependencies/checkouts/realm-swift/RealmSwift/Events.swift /Users/admin/builder/spi-builder-workspace/.dependencies/checkouts/realm-swift/RealmSwift/Geospatial.swift /Users/admin/builder/spi-builder-workspace/.dependencies/checkouts/realm-swift/RealmSwift/Impl/BasicTypes.swift /Users/admin/builder/spi-builder-workspace/.dependencies/checkouts/realm-swift/RealmSwift/Impl/CollectionAccess.swift /Users/admin/builder/spi-builder-workspace/.dependencies/checkouts/realm-swift/RealmSwift/Impl/ComplexTypes.swift /Users/admin/builder/spi-builder-workspace/.dependencies/checkouts/realm-swift/RealmSwift/Impl/KeyPathStrings.swift /Users/admin/builder/spi-builder-workspace/.dependencies/checkouts/realm-swift/RealmSwift/Impl/ObjcBridgeable.swift /Users/admin/builder/spi-builder-workspace/.dependencies/checkouts/realm-swift/RealmSwift/Impl/Persistable.swift /Users/admin/builder/spi-builder-workspace/.dependencies/checkouts/realm-swift/RealmSwift/Impl/PropertyAccessors.swift /Users/admin/builder/spi-builder-workspace/.dependencies/checkouts/realm-swift/RealmSwift/Impl/RealmCollectionImpl.swift /Users/admin/builder/spi-builder-workspace/.dependencies/checkouts/realm-swift/RealmSwift/Impl/SchemaDiscovery.swift /Users/admin/builder/spi-builder-workspace/.dependencies/checkouts/realm-swift/RealmSwift/LinkingObjects.swift /Users/admin/builder/spi-builder-workspace/.dependencies/checkouts/realm-swift/RealmSwift/List.swift /Users/admin/builder/spi-builder-workspace/.dependencies/checkouts/realm-swift/RealmSwift/Map.swift /Users/admin/builder/spi-builder-workspace/.dependencies/checkouts/realm-swift/RealmSwift/Migration.swift /Users/admin/builder/spi-builder-workspace/.dependencies/checkouts/realm-swift/RealmSwift/MongoClient.swift /Users/admin/builder/spi-builder-workspace/.dependencies/checkouts/realm-swift/RealmSwift/MutableSet.swift /Users/admin/builder/spi-builder-workspace/.dependencies/checkouts/realm-swift/RealmSwift/Object.swift /Users/admin/builder/spi-builder-workspace/.dependencies/checkouts/realm-swift/RealmSwift/ObjectId.swift /Users/admin/builder/spi-builder-workspace/.dependencies/checkouts/realm-swift/RealmSwift/ObjectSchema.swift /Users/admin/builder/spi-builder-workspace/.dependencies/checkouts/realm-swift/RealmSwift/ObjectiveCSupport+AnyRealmValue.swift /Users/admin/builder/spi-builder-workspace/.dependencies/checkouts/realm-swift/RealmSwift/ObjectiveCSupport+BSON.swift /Users/admin/builder/spi-builder-workspace/.dependencies/checkouts/realm-swift/RealmSwift/ObjectiveCSupport+Sync.swift /Users/admin/builder/spi-builder-workspace/.dependencies/checkouts/realm-swift/RealmSwift/ObjectiveCSupport.swift /Users/admin/builder/spi-builder-workspace/.dependencies/checkouts/realm-swift/RealmSwift/Optional.swift /Users/admin/builder/spi-builder-workspace/.dependencies/checkouts/realm-swift/RealmSwift/PersistedProperty.swift /Users/admin/builder/spi-builder-workspace/.dependencies/checkouts/realm-swift/RealmSwift/Projection.swift /Users/admin/builder/spi-builder-workspace/.dependencies/checkouts/realm-swift/RealmSwift/Property.swift /Users/admin/builder/spi-builder-workspace/.dependencies/checkouts/realm-swift/RealmSwift/Query.swift /Users/admin/builder/spi-builder-workspace/.dependencies/checkouts/realm-swift/RealmSwift/Realm.swift /Users/admin/builder/spi-builder-workspace/.dependencies/checkouts/realm-swift/RealmSwift/RealmCollection.swift /Users/admin/builder/spi-builder-workspace/.dependencies/checkouts/realm-swift/RealmSwift/RealmConfiguration.swift /Users/admin/builder/spi-builder-workspace/.dependencies/checkouts/realm-swift/RealmSwift/RealmKeyedCollection.swift /Users/admin/builder/spi-builder-workspace/.dependencies/checkouts/realm-swift/RealmSwift/RealmProperty.swift /Users/admin/builder/spi-builder-workspace/.dependencies/checkouts/realm-swift/RealmSwift/Results.swift /Users/admin/builder/spi-builder-workspace/.dependencies/checkouts/realm-swift/RealmSwift/Schema.swift /Users/admin/builder/spi-builder-workspace/.dependencies/checkouts/realm-swift/RealmSwift/SectionedResults.swift /Users/admin/builder/spi-builder-workspace/.dependencies/checkouts/realm-swift/RealmSwift/SortDescriptor.swift /Users/admin/builder/spi-builder-workspace/.dependencies/checkouts/realm-swift/RealmSwift/SwiftUI.swift /Users/admin/builder/spi-builder-workspace/.dependencies/checkouts/realm-swift/RealmSwift/Sync.swift /Users/admin/builder/spi-builder-workspace/.dependencies/checkouts/realm-swift/RealmSwift/SyncSubscription.swift /Users/admin/builder/spi-builder-workspace/.dependencies/checkouts/realm-swift/RealmSwift/ThreadSafeReference.swift /Users/admin/builder/spi-builder-workspace/.dependencies/checkouts/realm-swift/RealmSwift/Util.swift -target arm64_32-apple-watchos4.0 -enable-objc-interop -sdk /Applications/Xcode-16.1.0.app/Contents/Developer/Platforms/WatchOS.platform/Developer/SDKs/WatchOS11.1.sdk -I /Users/admin/builder/spi-builder-workspace/.derivedData/Build/Products/Debug-watchos -I /Applications/Xcode-16.1.0.app/Contents/Developer/Platforms/WatchOS.platform/Developer/usr/lib -F /Users/admin/builder/spi-builder-workspace/.derivedData/Build/Products/Debug-watchos/PackageFrameworks -F /Users/admin/builder/spi-builder-workspace/.derivedData/Build/Products/Debug-watchos/PackageFrameworks -F /Users/admin/builder/spi-builder-workspace/.derivedData/Build/Products/Debug-watchos/PackageFrameworks -F /Users/admin/builder/spi-builder-workspace/.derivedData/Build/Products/Debug-watchos/PackageFrameworks -F /Users/admin/builder/spi-builder-workspace/.derivedData/Build/Products/Debug-watchos/PackageFrameworks -F /Users/admin/builder/spi-builder-workspace/.derivedData/Build/Products/Debug-watchos -F /Applications/Xcode-16.1.0.app/Contents/Developer/Platforms/WatchOS.platform/Developer/Library/Frameworks -F /Applications/Xcode-16.1.0.app/Contents/Developer/Platforms/WatchOS.platform/Developer/SDKs/WatchOS11.1.sdk/Developer/Library/Frameworks -no-color-diagnostics -enable-testing -g -debug-info-format\=dwarf -dwarf-version\=4 -module-cache-path /Users/admin/builder/spi-builder-workspace/.derivedData/ModuleCache.noindex -suppress-warnings -profile-generate -profile-coverage-mapping -swift-version 6 -enforce-exclusivity\=checked -stats-output-dir /Users/admin/builder/spi-builder-workspace/.swiftpm/xcode/.stats -Onone -D SWIFT_PACKAGE -D DEBUG -serialize-debugging-options -const-gather-protocols-file /Users/admin/builder/spi-builder-workspace/.derivedData/Build/Intermediates.noindex/Realm.build/Debug-watchos/RealmSwift.build/Objects-normal/arm64_32/RealmSwift_const_extract_protocols.json -enable-experimental-feature DebugDescriptionMacro -enable-experimental-feature OpaqueTypeErasure -enable-upcoming-feature StrictConcurrency -enable-upcoming-feature DisableOutwardActorInference -enable-upcoming-feature GlobalActorIsolatedTypesUsability -enable-upcoming-feature InferSendableFromCaptures -strict-concurrency\=complete -empty-abi-descriptor -plugin-path /Applications/Xcode-16.1.0.app/Contents/Developer/Toolchains/XcodeDefault.xctoolchain/usr/lib/swift/host/plugins/testing -validate-clang-modules-once -clang-build-session-file /Users/admin/builder/spi-builder-workspace/.derivedData/ModuleCache.noindex/Session.modulevalidation -Xcc -working-directory -Xcc /Users/admin/builder/spi-builder-workspace/.swiftpm/xcode -resource-dir /Applications/Xcode-16.1.0.app/Contents/Developer/Toolchains/XcodeDefault.xctoolchain/usr/lib/swift -enable-anonymous-context-mangled-names -file-compilation-dir /Users/admin/builder/spi-builder-workspace/.swiftpm/xcode -Xcc -fmodule-map-file\=/Users/admin/builder/spi-builder-workspace/.derivedData/Build/Intermediates.noindex/GeneratedModuleMaps-watchos/s2geometry.modulemap -Xcc -fmodule-map-file\=/Users/admin/builder/spi-builder-workspace/.derivedData/Build/Intermediates.noindex/GeneratedModuleMaps-watchos/Bid.modulemap -Xcc -fmodule-map-file\=/Users/admin/builder/spi-builder-workspace/.derivedData/Build/Intermediates.noindex/GeneratedModuleMaps-watchos/RealmCoreResources.modulemap -Xcc -D_LIBCPP_HARDENING_MODE\=_LIBCPP_HARDENING_MODE_DEBUG -Xcc -ivfsstatcache -Xcc /Users/admin/builder/spi-builder-workspace/.derivedData/SDKStatCaches.noindex/watchos11.1-22R574-7b9df0bda16bb4641b33636c68f04660.sdkstatcache -Xcc -I/Users/admin/builder/spi-builder-workspace/.derivedData/Build/Intermediates.noindex/Realm.build/Debug-watchos/RealmSwift.build/swift-overrides.hmap -Xcc -I/Users/admin/builder/spi-builder-workspace/.dependencies/checkouts/realm-core/src -Xcc -I/Users/admin/builder/spi-builder-workspace/.dependencies/checkouts/realm-core/src/external/s2 -Xcc -I/Users/admin/builder/spi-builder-workspace/.dependencies/checkouts/realm-core/src/external/IntelRDFPMathLib20U2/LIBRARY/src -Xcc -I/Users/admin/builder/spi-builder-workspace/.dependencies/checkouts/realm-core/src/spm -Xcc -I/Users/admin/builder/spi-builder-workspace/.dependencies/checkouts/realm-swift/include -Xcc -I/Users/admin/builder/spi-builder-workspace/.derivedData/Build/Products/Debug-watchos/include -Xcc -I/Users/admin/builder/spi-builder-workspace/.derivedData/Build/Intermediates.noindex/Realm.build/Debug-watchos/RealmSwift.build/DerivedSources-normal/arm64_32 -Xcc -I/Users/admin/builder/spi-builder-workspace/.derivedData/Build/Intermediates.noindex/Realm.build/Debug-watchos/RealmSwift.build/DerivedSources/arm64_32 -Xcc -I/Users/admin/builder/spi-builder-workspace/.derivedData/Build/Intermediates.noindex/Realm.build/Debug-watchos/RealmSwift.build/DerivedSources -Xcc -DSWIFT_PACKAGE -Xcc -DDEBUG\=1 -module-name RealmSwift -package-name realm_swift -frontend-parseable-output -disable-clang-spi -target-sdk-version 11.1 -target-sdk-name watchos11.1 -external-plugin-path /Applications/Xcode-16.1.0.app/Contents/Developer/Platforms/WatchOS.platform/Developer/usr/lib/swift/host/plugins\#/Applications/Xcode-16.1.0.app/Contents/Developer/Platforms/WatchOS.platform/Developer/usr/bin/swift-plugin-server -external-plugin-path /Applications/Xcode-16.1.0.app/Contents/Developer/Platforms/WatchOS.platform/Developer/usr/local/lib/swift/host/plugins\#/Applications/Xcode-16.1.0.app/Contents/Developer/Platforms/WatchOS.platform/Developer/usr/bin/swift-plugin-server -plugin-path /Applications/Xcode-16.1.0.app/Contents/Developer/Toolchains/XcodeDefault.xctoolchain/usr/lib/swift/host/plugins -plugin-path /Applications/Xcode-16.1.0.app/Contents/Developer/Toolchains/XcodeDefault.xctoolchain/usr/local/lib/swift/host/plugins -emit-module-doc-path /Users/admin/builder/spi-builder-workspace/.derivedData/Build/Intermediates.noindex/Realm.build/Debug-watchos/RealmSwift.build/Objects-normal/arm64_32/RealmSwift.swiftdoc -emit-module-source-info-path /Users/admin/builder/spi-builder-workspace/.derivedData/Build/Intermediates.noindex/Realm.build/Debug-watchos/RealmSwift.build/Objects-normal/arm64_32/RealmSwift.swiftsourceinfo -emit-objc-header-path /Users/admin/builder/spi-builder-workspace/.derivedData/Build/Intermediates.noindex/Realm.build/Debug-watchos/RealmSwift.build/Objects-normal/arm64_32/RealmSwift-Swift.h -serialize-diagnostics-path /Users/admin/builder/spi-builder-workspace/.derivedData/Build/Intermediates.noindex/Realm.build/Debug-watchos/RealmSwift.build/Objects-normal/arm64_32/RealmSwift-master-emit-module.dia -emit-dependencies-path /Users/admin/builder/spi-builder-workspace/.derivedData/Build/Intermediates.noindex/Realm.build/Debug-watchos/RealmSwift.build/Objects-normal/arm64_32/RealmSwift-master-emit-module.d -o /Users/admin/builder/spi-builder-workspace/.derivedData/Build/Intermediates.noindex/Realm.build/Debug-watchos/RealmSwift.build/Objects-normal/arm64_32/RealmSwift.swiftmodule -emit-abi-descriptor-path /Users/admin/builder/spi-builder-workspace/.derivedData/Build/Intermediates.noindex/Realm.build/Debug-watchos/RealmSwift.build/Objects-normal/arm64_32/RealmSwift.abi.json
CompileC /Users/admin/builder/spi-builder-workspace/.derivedData/Build/Intermediates.noindex/RealmDatabase.build/Debug-watchos/s2geometry.build/Objects-normal/arm64/s2loop.o /Users/admin/builder/spi-builder-workspace/.dependencies/checkouts/realm-core/src/external/s2/s2loop.cc normal arm64 c++ com.apple.compilers.llvm.clang.1_0.compiler (in target 's2geometry' from project 'RealmDatabase')
cd /Users/admin/builder/spi-builder-workspace/.swiftpm/xcode
Using response file: /Users/admin/builder/spi-builder-workspace/.derivedData/Build/Intermediates.noindex/RealmDatabase.build/Debug-watchos/s2geometry.build/Objects-normal/arm64/82b82416624d2658e5098eb0a28c15c5-common-args.resp
/Applications/Xcode-16.1.0.app/Contents/Developer/Toolchains/XcodeDefault.xctoolchain/usr/bin/clang -x c++ -ivfsstatcache /Users/admin/builder/spi-builder-workspace/.derivedData/SDKStatCaches.noindex/watchos11.1-22R574-7b9df0bda16bb4641b33636c68f04660.sdkstatcache -fmessage-length\=0 -fdiagnostics-show-note-include-stack -fmacro-backtrace-limit\=0 -fno-color-diagnostics -fmodules-prune-interval\=86400 -fmodules-prune-after\=345600 -fbuild-session-file\=/Users/admin/builder/spi-builder-workspace/.derivedData/ModuleCache.noindex/Session.modulevalidation -fmodules-validate-once-per-build-session -Wnon-modular-include-in-framework-module -Werror\=non-modular-include-in-framework-module -Wno-trigraphs -Wno-missing-field-initializers -Wno-missing-prototypes -Wno-return-type -Wno-non-virtual-dtor -Wno-overloaded-virtual -Wno-exit-time-destructors -Wno-missing-braces -Wparentheses -Wswitch -Wno-unused-function -Wno-unused-label -Wno-unused-parameter -Wno-unused-variable -Wunused-value -Wno-empty-body -Wno-uninitialized -Wno-unknown-pragmas -w -Wno-shadow -Wno-four-char-constants -Wno-conversion -Wno-constant-conversion -Wno-int-conversion -Wno-bool-conversion -Wno-enum-conversion -Wno-float-conversion -Wno-non-literal-null-conversion -Wno-objc-literal-conversion -Wshorten-64-to-32 -Wno-newline-eof -Wno-c++11-extensions -Wno-implicit-fallthrough -fstrict-aliasing -Wdeprecated-declarations -Winvalid-offsetof -Wno-sign-conversion -Wno-infinite-recursion -Wno-move -Wno-comma -Wno-block-capture-autoreleasing -Wno-strict-prototypes -Wno-range-loop-analysis -Wno-semicolon-before-method-body -index-store-path /Users/admin/builder/spi-builder-workspace/.derivedData/Index.noindex/DataStore @/Users/admin/builder/spi-builder-workspace/.derivedData/Build/Intermediates.noindex/RealmDatabase.build/Debug-watchos/s2geometry.build/Objects-normal/arm64/82b82416624d2658e5098eb0a28c15c5-common-args.resp -MMD -MT dependencies -MF /Users/admin/builder/spi-builder-workspace/.derivedData/Build/Intermediates.noindex/RealmDatabase.build/Debug-watchos/s2geometry.build/Objects-normal/arm64/s2loop.d --serialize-diagnostics /Users/admin/builder/spi-builder-workspace/.derivedData/Build/Intermediates.noindex/RealmDatabase.build/Debug-watchos/s2geometry.build/Objects-normal/arm64/s2loop.dia -c /Users/admin/builder/spi-builder-workspace/.dependencies/checkouts/realm-core/src/external/s2/s2loop.cc -o /Users/admin/builder/spi-builder-workspace/.derivedData/Build/Intermediates.noindex/RealmDatabase.build/Debug-watchos/s2geometry.build/Objects-normal/arm64/s2loop.o -index-unit-output-path /RealmDatabase.build/Debug-watchos/s2geometry.build/Objects-normal/arm64/s2loop.o
CompileC /Users/admin/builder/spi-builder-workspace/.derivedData/Build/Intermediates.noindex/RealmDatabase.build/Debug-watchos/s2geometry.build/Objects-normal/arm64/s2latlngrect.o /Users/admin/builder/spi-builder-workspace/.dependencies/checkouts/realm-core/src/external/s2/s2latlngrect.cc normal arm64 c++ com.apple.compilers.llvm.clang.1_0.compiler (in target 's2geometry' from project 'RealmDatabase')
cd /Users/admin/builder/spi-builder-workspace/.swiftpm/xcode
Using response file: /Users/admin/builder/spi-builder-workspace/.derivedData/Build/Intermediates.noindex/RealmDatabase.build/Debug-watchos/s2geometry.build/Objects-normal/arm64/82b82416624d2658e5098eb0a28c15c5-common-args.resp
/Applications/Xcode-16.1.0.app/Contents/Developer/Toolchains/XcodeDefault.xctoolchain/usr/bin/clang -x c++ -ivfsstatcache /Users/admin/builder/spi-builder-workspace/.derivedData/SDKStatCaches.noindex/watchos11.1-22R574-7b9df0bda16bb4641b33636c68f04660.sdkstatcache -fmessage-length\=0 -fdiagnostics-show-note-include-stack -fmacro-backtrace-limit\=0 -fno-color-diagnostics -fmodules-prune-interval\=86400 -fmodules-prune-after\=345600 -fbuild-session-file\=/Users/admin/builder/spi-builder-workspace/.derivedData/ModuleCache.noindex/Session.modulevalidation -fmodules-validate-once-per-build-session -Wnon-modular-include-in-framework-module -Werror\=non-modular-include-in-framework-module -Wno-trigraphs -Wno-missing-field-initializers -Wno-missing-prototypes -Wno-return-type -Wno-non-virtual-dtor -Wno-overloaded-virtual -Wno-exit-time-destructors -Wno-missing-braces -Wparentheses -Wswitch -Wno-unused-function -Wno-unused-label -Wno-unused-parameter -Wno-unused-variable -Wunused-value -Wno-empty-body -Wno-uninitialized -Wno-unknown-pragmas -w -Wno-shadow -Wno-four-char-constants -Wno-conversion -Wno-constant-conversion -Wno-int-conversion -Wno-bool-conversion -Wno-enum-conversion -Wno-float-conversion -Wno-non-literal-null-conversion -Wno-objc-literal-conversion -Wshorten-64-to-32 -Wno-newline-eof -Wno-c++11-extensions -Wno-implicit-fallthrough -fstrict-aliasing -Wdeprecated-declarations -Winvalid-offsetof -Wno-sign-conversion -Wno-infinite-recursion -Wno-move -Wno-comma -Wno-block-capture-autoreleasing -Wno-strict-prototypes -Wno-range-loop-analysis -Wno-semicolon-before-method-body -index-store-path /Users/admin/builder/spi-builder-workspace/.derivedData/Index.noindex/DataStore @/Users/admin/builder/spi-builder-workspace/.derivedData/Build/Intermediates.noindex/RealmDatabase.build/Debug-watchos/s2geometry.build/Objects-normal/arm64/82b82416624d2658e5098eb0a28c15c5-common-args.resp -MMD -MT dependencies -MF /Users/admin/builder/spi-builder-workspace/.derivedData/Build/Intermediates.noindex/RealmDatabase.build/Debug-watchos/s2geometry.build/Objects-normal/arm64/s2latlngrect.d --serialize-diagnostics /Users/admin/builder/spi-builder-workspace/.derivedData/Build/Intermediates.noindex/RealmDatabase.build/Debug-watchos/s2geometry.build/Objects-normal/arm64/s2latlngrect.dia -c /Users/admin/builder/spi-builder-workspace/.dependencies/checkouts/realm-core/src/external/s2/s2latlngrect.cc -o /Users/admin/builder/spi-builder-workspace/.derivedData/Build/Intermediates.noindex/RealmDatabase.build/Debug-watchos/s2geometry.build/Objects-normal/arm64/s2latlngrect.o -index-unit-output-path /RealmDatabase.build/Debug-watchos/s2geometry.build/Objects-normal/arm64/s2latlngrect.o
CompileC /Users/admin/builder/spi-builder-workspace/.derivedData/Build/Intermediates.noindex/RealmDatabase.build/Debug-watchos/s2geometry.build/Objects-normal/arm64/s2latlng.o /Users/admin/builder/spi-builder-workspace/.dependencies/checkouts/realm-core/src/external/s2/s2latlng.cc normal arm64 c++ com.apple.compilers.llvm.clang.1_0.compiler (in target 's2geometry' from project 'RealmDatabase')
cd /Users/admin/builder/spi-builder-workspace/.swiftpm/xcode
Using response file: /Users/admin/builder/spi-builder-workspace/.derivedData/Build/Intermediates.noindex/RealmDatabase.build/Debug-watchos/s2geometry.build/Objects-normal/arm64/82b82416624d2658e5098eb0a28c15c5-common-args.resp
/Applications/Xcode-16.1.0.app/Contents/Developer/Toolchains/XcodeDefault.xctoolchain/usr/bin/clang -x c++ -ivfsstatcache /Users/admin/builder/spi-builder-workspace/.derivedData/SDKStatCaches.noindex/watchos11.1-22R574-7b9df0bda16bb4641b33636c68f04660.sdkstatcache -fmessage-length\=0 -fdiagnostics-show-note-include-stack -fmacro-backtrace-limit\=0 -fno-color-diagnostics -fmodules-prune-interval\=86400 -fmodules-prune-after\=345600 -fbuild-session-file\=/Users/admin/builder/spi-builder-workspace/.derivedData/ModuleCache.noindex/Session.modulevalidation -fmodules-validate-once-per-build-session -Wnon-modular-include-in-framework-module -Werror\=non-modular-include-in-framework-module -Wno-trigraphs -Wno-missing-field-initializers -Wno-missing-prototypes -Wno-return-type -Wno-non-virtual-dtor -Wno-overloaded-virtual -Wno-exit-time-destructors -Wno-missing-braces -Wparentheses -Wswitch -Wno-unused-function -Wno-unused-label -Wno-unused-parameter -Wno-unused-variable -Wunused-value -Wno-empty-body -Wno-uninitialized -Wno-unknown-pragmas -w -Wno-shadow -Wno-four-char-constants -Wno-conversion -Wno-constant-conversion -Wno-int-conversion -Wno-bool-conversion -Wno-enum-conversion -Wno-float-conversion -Wno-non-literal-null-conversion -Wno-objc-literal-conversion -Wshorten-64-to-32 -Wno-newline-eof -Wno-c++11-extensions -Wno-implicit-fallthrough -fstrict-aliasing -Wdeprecated-declarations -Winvalid-offsetof -Wno-sign-conversion -Wno-infinite-recursion -Wno-move -Wno-comma -Wno-block-capture-autoreleasing -Wno-strict-prototypes -Wno-range-loop-analysis -Wno-semicolon-before-method-body -index-store-path /Users/admin/builder/spi-builder-workspace/.derivedData/Index.noindex/DataStore @/Users/admin/builder/spi-builder-workspace/.derivedData/Build/Intermediates.noindex/RealmDatabase.build/Debug-watchos/s2geometry.build/Objects-normal/arm64/82b82416624d2658e5098eb0a28c15c5-common-args.resp -MMD -MT dependencies -MF /Users/admin/builder/spi-builder-workspace/.derivedData/Build/Intermediates.noindex/RealmDatabase.build/Debug-watchos/s2geometry.build/Objects-normal/arm64/s2latlng.d --serialize-diagnostics /Users/admin/builder/spi-builder-workspace/.derivedData/Build/Intermediates.noindex/RealmDatabase.build/Debug-watchos/s2geometry.build/Objects-normal/arm64/s2latlng.dia -c /Users/admin/builder/spi-builder-workspace/.dependencies/checkouts/realm-core/src/external/s2/s2latlng.cc -o /Users/admin/builder/spi-builder-workspace/.derivedData/Build/Intermediates.noindex/RealmDatabase.build/Debug-watchos/s2geometry.build/Objects-normal/arm64/s2latlng.o -index-unit-output-path /RealmDatabase.build/Debug-watchos/s2geometry.build/Objects-normal/arm64/s2latlng.o
CompileC /Users/admin/builder/spi-builder-workspace/.derivedData/Build/Intermediates.noindex/RealmDatabase.build/Debug-watchos/s2geometry.build/Objects-normal/arm64/s2edgeutil.o /Users/admin/builder/spi-builder-workspace/.dependencies/checkouts/realm-core/src/external/s2/s2edgeutil.cc normal arm64 c++ com.apple.compilers.llvm.clang.1_0.compiler (in target 's2geometry' from project 'RealmDatabase')
cd /Users/admin/builder/spi-builder-workspace/.swiftpm/xcode
Using response file: /Users/admin/builder/spi-builder-workspace/.derivedData/Build/Intermediates.noindex/RealmDatabase.build/Debug-watchos/s2geometry.build/Objects-normal/arm64/82b82416624d2658e5098eb0a28c15c5-common-args.resp
/Applications/Xcode-16.1.0.app/Contents/Developer/Toolchains/XcodeDefault.xctoolchain/usr/bin/clang -x c++ -ivfsstatcache /Users/admin/builder/spi-builder-workspace/.derivedData/SDKStatCaches.noindex/watchos11.1-22R574-7b9df0bda16bb4641b33636c68f04660.sdkstatcache -fmessage-length\=0 -fdiagnostics-show-note-include-stack -fmacro-backtrace-limit\=0 -fno-color-diagnostics -fmodules-prune-interval\=86400 -fmodules-prune-after\=345600 -fbuild-session-file\=/Users/admin/builder/spi-builder-workspace/.derivedData/ModuleCache.noindex/Session.modulevalidation -fmodules-validate-once-per-build-session -Wnon-modular-include-in-framework-module -Werror\=non-modular-include-in-framework-module -Wno-trigraphs -Wno-missing-field-initializers -Wno-missing-prototypes -Wno-return-type -Wno-non-virtual-dtor -Wno-overloaded-virtual -Wno-exit-time-destructors -Wno-missing-braces -Wparentheses -Wswitch -Wno-unused-function -Wno-unused-label -Wno-unused-parameter -Wno-unused-variable -Wunused-value -Wno-empty-body -Wno-uninitialized -Wno-unknown-pragmas -w -Wno-shadow -Wno-four-char-constants -Wno-conversion -Wno-constant-conversion -Wno-int-conversion -Wno-bool-conversion -Wno-enum-conversion -Wno-float-conversion -Wno-non-literal-null-conversion -Wno-objc-literal-conversion -Wshorten-64-to-32 -Wno-newline-eof -Wno-c++11-extensions -Wno-implicit-fallthrough -fstrict-aliasing -Wdeprecated-declarations -Winvalid-offsetof -Wno-sign-conversion -Wno-infinite-recursion -Wno-move -Wno-comma -Wno-block-capture-autoreleasing -Wno-strict-prototypes -Wno-range-loop-analysis -Wno-semicolon-before-method-body -index-store-path /Users/admin/builder/spi-builder-workspace/.derivedData/Index.noindex/DataStore @/Users/admin/builder/spi-builder-workspace/.derivedData/Build/Intermediates.noindex/RealmDatabase.build/Debug-watchos/s2geometry.build/Objects-normal/arm64/82b82416624d2658e5098eb0a28c15c5-common-args.resp -MMD -MT dependencies -MF /Users/admin/builder/spi-builder-workspace/.derivedData/Build/Intermediates.noindex/RealmDatabase.build/Debug-watchos/s2geometry.build/Objects-normal/arm64/s2edgeutil.d --serialize-diagnostics /Users/admin/builder/spi-builder-workspace/.derivedData/Build/Intermediates.noindex/RealmDatabase.build/Debug-watchos/s2geometry.build/Objects-normal/arm64/s2edgeutil.dia -c /Users/admin/builder/spi-builder-workspace/.dependencies/checkouts/realm-core/src/external/s2/s2edgeutil.cc -o /Users/admin/builder/spi-builder-workspace/.derivedData/Build/Intermediates.noindex/RealmDatabase.build/Debug-watchos/s2geometry.build/Objects-normal/arm64/s2edgeutil.o -index-unit-output-path /RealmDatabase.build/Debug-watchos/s2geometry.build/Objects-normal/arm64/s2edgeutil.o
CompileC /Users/admin/builder/spi-builder-workspace/.derivedData/Build/Intermediates.noindex/RealmDatabase.build/Debug-watchos/s2geometry.build/Objects-normal/arm64/s2edgeindex.o /Users/admin/builder/spi-builder-workspace/.dependencies/checkouts/realm-core/src/external/s2/s2edgeindex.cc normal arm64 c++ com.apple.compilers.llvm.clang.1_0.compiler (in target 's2geometry' from project 'RealmDatabase')
cd /Users/admin/builder/spi-builder-workspace/.swiftpm/xcode
Using response file: /Users/admin/builder/spi-builder-workspace/.derivedData/Build/Intermediates.noindex/RealmDatabase.build/Debug-watchos/s2geometry.build/Objects-normal/arm64/82b82416624d2658e5098eb0a28c15c5-common-args.resp
/Applications/Xcode-16.1.0.app/Contents/Developer/Toolchains/XcodeDefault.xctoolchain/usr/bin/clang -x c++ -ivfsstatcache /Users/admin/builder/spi-builder-workspace/.derivedData/SDKStatCaches.noindex/watchos11.1-22R574-7b9df0bda16bb4641b33636c68f04660.sdkstatcache -fmessage-length\=0 -fdiagnostics-show-note-include-stack -fmacro-backtrace-limit\=0 -fno-color-diagnostics -fmodules-prune-interval\=86400 -fmodules-prune-after\=345600 -fbuild-session-file\=/Users/admin/builder/spi-builder-workspace/.derivedData/ModuleCache.noindex/Session.modulevalidation -fmodules-validate-once-per-build-session -Wnon-modular-include-in-framework-module -Werror\=non-modular-include-in-framework-module -Wno-trigraphs -Wno-missing-field-initializers -Wno-missing-prototypes -Wno-return-type -Wno-non-virtual-dtor -Wno-overloaded-virtual -Wno-exit-time-destructors -Wno-missing-braces -Wparentheses -Wswitch -Wno-unused-function -Wno-unused-label -Wno-unused-parameter -Wno-unused-variable -Wunused-value -Wno-empty-body -Wno-uninitialized -Wno-unknown-pragmas -w -Wno-shadow -Wno-four-char-constants -Wno-conversion -Wno-constant-conversion -Wno-int-conversion -Wno-bool-conversion -Wno-enum-conversion -Wno-float-conversion -Wno-non-literal-null-conversion -Wno-objc-literal-conversion -Wshorten-64-to-32 -Wno-newline-eof -Wno-c++11-extensions -Wno-implicit-fallthrough -fstrict-aliasing -Wdeprecated-declarations -Winvalid-offsetof -Wno-sign-conversion -Wno-infinite-recursion -Wno-move -Wno-comma -Wno-block-capture-autoreleasing -Wno-strict-prototypes -Wno-range-loop-analysis -Wno-semicolon-before-method-body -index-store-path /Users/admin/builder/spi-builder-workspace/.derivedData/Index.noindex/DataStore @/Users/admin/builder/spi-builder-workspace/.derivedData/Build/Intermediates.noindex/RealmDatabase.build/Debug-watchos/s2geometry.build/Objects-normal/arm64/82b82416624d2658e5098eb0a28c15c5-common-args.resp -MMD -MT dependencies -MF /Users/admin/builder/spi-builder-workspace/.derivedData/Build/Intermediates.noindex/RealmDatabase.build/Debug-watchos/s2geometry.build/Objects-normal/arm64/s2edgeindex.d --serialize-diagnostics /Users/admin/builder/spi-builder-workspace/.derivedData/Build/Intermediates.noindex/RealmDatabase.build/Debug-watchos/s2geometry.build/Objects-normal/arm64/s2edgeindex.dia -c /Users/admin/builder/spi-builder-workspace/.dependencies/checkouts/realm-core/src/external/s2/s2edgeindex.cc -o /Users/admin/builder/spi-builder-workspace/.derivedData/Build/Intermediates.noindex/RealmDatabase.build/Debug-watchos/s2geometry.build/Objects-normal/arm64/s2edgeindex.o -index-unit-output-path /RealmDatabase.build/Debug-watchos/s2geometry.build/Objects-normal/arm64/s2edgeindex.o
CompileC /Users/admin/builder/spi-builder-workspace/.derivedData/Build/Intermediates.noindex/RealmDatabase.build/Debug-watchos/s2geometry.build/Objects-normal/arm64/s2cellid.o /Users/admin/builder/spi-builder-workspace/.dependencies/checkouts/realm-core/src/external/s2/s2cellid.cc normal arm64 c++ com.apple.compilers.llvm.clang.1_0.compiler (in target 's2geometry' from project 'RealmDatabase')
cd /Users/admin/builder/spi-builder-workspace/.swiftpm/xcode
Using response file: /Users/admin/builder/spi-builder-workspace/.derivedData/Build/Intermediates.noindex/RealmDatabase.build/Debug-watchos/s2geometry.build/Objects-normal/arm64/82b82416624d2658e5098eb0a28c15c5-common-args.resp
/Applications/Xcode-16.1.0.app/Contents/Developer/Toolchains/XcodeDefault.xctoolchain/usr/bin/clang -x c++ -ivfsstatcache /Users/admin/builder/spi-builder-workspace/.derivedData/SDKStatCaches.noindex/watchos11.1-22R574-7b9df0bda16bb4641b33636c68f04660.sdkstatcache -fmessage-length\=0 -fdiagnostics-show-note-include-stack -fmacro-backtrace-limit\=0 -fno-color-diagnostics -fmodules-prune-interval\=86400 -fmodules-prune-after\=345600 -fbuild-session-file\=/Users/admin/builder/spi-builder-workspace/.derivedData/ModuleCache.noindex/Session.modulevalidation -fmodules-validate-once-per-build-session -Wnon-modular-include-in-framework-module -Werror\=non-modular-include-in-framework-module -Wno-trigraphs -Wno-missing-field-initializers -Wno-missing-prototypes -Wno-return-type -Wno-non-virtual-dtor -Wno-overloaded-virtual -Wno-exit-time-destructors -Wno-missing-braces -Wparentheses -Wswitch -Wno-unused-function -Wno-unused-label -Wno-unused-parameter -Wno-unused-variable -Wunused-value -Wno-empty-body -Wno-uninitialized -Wno-unknown-pragmas -w -Wno-shadow -Wno-four-char-constants -Wno-conversion -Wno-constant-conversion -Wno-int-conversion -Wno-bool-conversion -Wno-enum-conversion -Wno-float-conversion -Wno-non-literal-null-conversion -Wno-objc-literal-conversion -Wshorten-64-to-32 -Wno-newline-eof -Wno-c++11-extensions -Wno-implicit-fallthrough -fstrict-aliasing -Wdeprecated-declarations -Winvalid-offsetof -Wno-sign-conversion -Wno-infinite-recursion -Wno-move -Wno-comma -Wno-block-capture-autoreleasing -Wno-strict-prototypes -Wno-range-loop-analysis -Wno-semicolon-before-method-body -index-store-path /Users/admin/builder/spi-builder-workspace/.derivedData/Index.noindex/DataStore @/Users/admin/builder/spi-builder-workspace/.derivedData/Build/Intermediates.noindex/RealmDatabase.build/Debug-watchos/s2geometry.build/Objects-normal/arm64/82b82416624d2658e5098eb0a28c15c5-common-args.resp -MMD -MT dependencies -MF /Users/admin/builder/spi-builder-workspace/.derivedData/Build/Intermediates.noindex/RealmDatabase.build/Debug-watchos/s2geometry.build/Objects-normal/arm64/s2cellid.d --serialize-diagnostics /Users/admin/builder/spi-builder-workspace/.derivedData/Build/Intermediates.noindex/RealmDatabase.build/Debug-watchos/s2geometry.build/Objects-normal/arm64/s2cellid.dia -c /Users/admin/builder/spi-builder-workspace/.dependencies/checkouts/realm-core/src/external/s2/s2cellid.cc -o /Users/admin/builder/spi-builder-workspace/.derivedData/Build/Intermediates.noindex/RealmDatabase.build/Debug-watchos/s2geometry.build/Objects-normal/arm64/s2cellid.o -index-unit-output-path /RealmDatabase.build/Debug-watchos/s2geometry.build/Objects-normal/arm64/s2cellid.o
CompileC /Users/admin/builder/spi-builder-workspace/.derivedData/Build/Intermediates.noindex/RealmDatabase.build/Debug-watchos/s2geometry.build/Objects-normal/arm64/s2cell.o /Users/admin/builder/spi-builder-workspace/.dependencies/checkouts/realm-core/src/external/s2/s2cell.cc normal arm64 c++ com.apple.compilers.llvm.clang.1_0.compiler (in target 's2geometry' from project 'RealmDatabase')
cd /Users/admin/builder/spi-builder-workspace/.swiftpm/xcode
Using response file: /Users/admin/builder/spi-builder-workspace/.derivedData/Build/Intermediates.noindex/RealmDatabase.build/Debug-watchos/s2geometry.build/Objects-normal/arm64/82b82416624d2658e5098eb0a28c15c5-common-args.resp
/Applications/Xcode-16.1.0.app/Contents/Developer/Toolchains/XcodeDefault.xctoolchain/usr/bin/clang -x c++ -ivfsstatcache /Users/admin/builder/spi-builder-workspace/.derivedData/SDKStatCaches.noindex/watchos11.1-22R574-7b9df0bda16bb4641b33636c68f04660.sdkstatcache -fmessage-length\=0 -fdiagnostics-show-note-include-stack -fmacro-backtrace-limit\=0 -fno-color-diagnostics -fmodules-prune-interval\=86400 -fmodules-prune-after\=345600 -fbuild-session-file\=/Users/admin/builder/spi-builder-workspace/.derivedData/ModuleCache.noindex/Session.modulevalidation -fmodules-validate-once-per-build-session -Wnon-modular-include-in-framework-module -Werror\=non-modular-include-in-framework-module -Wno-trigraphs -Wno-missing-field-initializers -Wno-missing-prototypes -Wno-return-type -Wno-non-virtual-dtor -Wno-overloaded-virtual -Wno-exit-time-destructors -Wno-missing-braces -Wparentheses -Wswitch -Wno-unused-function -Wno-unused-label -Wno-unused-parameter -Wno-unused-variable -Wunused-value -Wno-empty-body -Wno-uninitialized -Wno-unknown-pragmas -w -Wno-shadow -Wno-four-char-constants -Wno-conversion -Wno-constant-conversion -Wno-int-conversion -Wno-bool-conversion -Wno-enum-conversion -Wno-float-conversion -Wno-non-literal-null-conversion -Wno-objc-literal-conversion -Wshorten-64-to-32 -Wno-newline-eof -Wno-c++11-extensions -Wno-implicit-fallthrough -fstrict-aliasing -Wdeprecated-declarations -Winvalid-offsetof -Wno-sign-conversion -Wno-infinite-recursion -Wno-move -Wno-comma -Wno-block-capture-autoreleasing -Wno-strict-prototypes -Wno-range-loop-analysis -Wno-semicolon-before-method-body -index-store-path /Users/admin/builder/spi-builder-workspace/.derivedData/Index.noindex/DataStore @/Users/admin/builder/spi-builder-workspace/.derivedData/Build/Intermediates.noindex/RealmDatabase.build/Debug-watchos/s2geometry.build/Objects-normal/arm64/82b82416624d2658e5098eb0a28c15c5-common-args.resp -MMD -MT dependencies -MF /Users/admin/builder/spi-builder-workspace/.derivedData/Build/Intermediates.noindex/RealmDatabase.build/Debug-watchos/s2geometry.build/Objects-normal/arm64/s2cell.d --serialize-diagnostics /Users/admin/builder/spi-builder-workspace/.derivedData/Build/Intermediates.noindex/RealmDatabase.build/Debug-watchos/s2geometry.build/Objects-normal/arm64/s2cell.dia -c /Users/admin/builder/spi-builder-workspace/.dependencies/checkouts/realm-core/src/external/s2/s2cell.cc -o /Users/admin/builder/spi-builder-workspace/.derivedData/Build/Intermediates.noindex/RealmDatabase.build/Debug-watchos/s2geometry.build/Objects-normal/arm64/s2cell.o -index-unit-output-path /RealmDatabase.build/Debug-watchos/s2geometry.build/Objects-normal/arm64/s2cell.o
CompileC /Users/admin/builder/spi-builder-workspace/.derivedData/Build/Intermediates.noindex/RealmDatabase.build/Debug-watchos/s2geometry.build/Objects-normal/arm64/s2cap.o /Users/admin/builder/spi-builder-workspace/.dependencies/checkouts/realm-core/src/external/s2/s2cap.cc normal arm64 c++ com.apple.compilers.llvm.clang.1_0.compiler (in target 's2geometry' from project 'RealmDatabase')
cd /Users/admin/builder/spi-builder-workspace/.swiftpm/xcode
Using response file: /Users/admin/builder/spi-builder-workspace/.derivedData/Build/Intermediates.noindex/RealmDatabase.build/Debug-watchos/s2geometry.build/Objects-normal/arm64/82b82416624d2658e5098eb0a28c15c5-common-args.resp
/Applications/Xcode-16.1.0.app/Contents/Developer/Toolchains/XcodeDefault.xctoolchain/usr/bin/clang -x c++ -ivfsstatcache /Users/admin/builder/spi-builder-workspace/.derivedData/SDKStatCaches.noindex/watchos11.1-22R574-7b9df0bda16bb4641b33636c68f04660.sdkstatcache -fmessage-length\=0 -fdiagnostics-show-note-include-stack -fmacro-backtrace-limit\=0 -fno-color-diagnostics -fmodules-prune-interval\=86400 -fmodules-prune-after\=345600 -fbuild-session-file\=/Users/admin/builder/spi-builder-workspace/.derivedData/ModuleCache.noindex/Session.modulevalidation -fmodules-validate-once-per-build-session -Wnon-modular-include-in-framework-module -Werror\=non-modular-include-in-framework-module -Wno-trigraphs -Wno-missing-field-initializers -Wno-missing-prototypes -Wno-return-type -Wno-non-virtual-dtor -Wno-overloaded-virtual -Wno-exit-time-destructors -Wno-missing-braces -Wparentheses -Wswitch -Wno-unused-function -Wno-unused-label -Wno-unused-parameter -Wno-unused-variable -Wunused-value -Wno-empty-body -Wno-uninitialized -Wno-unknown-pragmas -w -Wno-shadow -Wno-four-char-constants -Wno-conversion -Wno-constant-conversion -Wno-int-conversion -Wno-bool-conversion -Wno-enum-conversion -Wno-float-conversion -Wno-non-literal-null-conversion -Wno-objc-literal-conversion -Wshorten-64-to-32 -Wno-newline-eof -Wno-c++11-extensions -Wno-implicit-fallthrough -fstrict-aliasing -Wdeprecated-declarations -Winvalid-offsetof -Wno-sign-conversion -Wno-infinite-recursion -Wno-move -Wno-comma -Wno-block-capture-autoreleasing -Wno-strict-prototypes -Wno-range-loop-analysis -Wno-semicolon-before-method-body -index-store-path /Users/admin/builder/spi-builder-workspace/.derivedData/Index.noindex/DataStore @/Users/admin/builder/spi-builder-workspace/.derivedData/Build/Intermediates.noindex/RealmDatabase.build/Debug-watchos/s2geometry.build/Objects-normal/arm64/82b82416624d2658e5098eb0a28c15c5-common-args.resp -MMD -MT dependencies -MF /Users/admin/builder/spi-builder-workspace/.derivedData/Build/Intermediates.noindex/RealmDatabase.build/Debug-watchos/s2geometry.build/Objects-normal/arm64/s2cap.d --serialize-diagnostics /Users/admin/builder/spi-builder-workspace/.derivedData/Build/Intermediates.noindex/RealmDatabase.build/Debug-watchos/s2geometry.build/Objects-normal/arm64/s2cap.dia -c /Users/admin/builder/spi-builder-workspace/.dependencies/checkouts/realm-core/src/external/s2/s2cap.cc -o /Users/admin/builder/spi-builder-workspace/.derivedData/Build/Intermediates.noindex/RealmDatabase.build/Debug-watchos/s2geometry.build/Objects-normal/arm64/s2cap.o -index-unit-output-path /RealmDatabase.build/Debug-watchos/s2geometry.build/Objects-normal/arm64/s2cap.o
CompileC /Users/admin/builder/spi-builder-workspace/.derivedData/Build/Intermediates.noindex/RealmDatabase.build/Debug-watchos/s2geometry.build/Objects-normal/arm64/s2.o /Users/admin/builder/spi-builder-workspace/.dependencies/checkouts/realm-core/src/external/s2/s2.cc normal arm64 c++ com.apple.compilers.llvm.clang.1_0.compiler (in target 's2geometry' from project 'RealmDatabase')
cd /Users/admin/builder/spi-builder-workspace/.swiftpm/xcode
Using response file: /Users/admin/builder/spi-builder-workspace/.derivedData/Build/Intermediates.noindex/RealmDatabase.build/Debug-watchos/s2geometry.build/Objects-normal/arm64/82b82416624d2658e5098eb0a28c15c5-common-args.resp
/Applications/Xcode-16.1.0.app/Contents/Developer/Toolchains/XcodeDefault.xctoolchain/usr/bin/clang -x c++ -ivfsstatcache /Users/admin/builder/spi-builder-workspace/.derivedData/SDKStatCaches.noindex/watchos11.1-22R574-7b9df0bda16bb4641b33636c68f04660.sdkstatcache -fmessage-length\=0 -fdiagnostics-show-note-include-stack -fmacro-backtrace-limit\=0 -fno-color-diagnostics -fmodules-prune-interval\=86400 -fmodules-prune-after\=345600 -fbuild-session-file\=/Users/admin/builder/spi-builder-workspace/.derivedData/ModuleCache.noindex/Session.modulevalidation -fmodules-validate-once-per-build-session -Wnon-modular-include-in-framework-module -Werror\=non-modular-include-in-framework-module -Wno-trigraphs -Wno-missing-field-initializers -Wno-missing-prototypes -Wno-return-type -Wno-non-virtual-dtor -Wno-overloaded-virtual -Wno-exit-time-destructors -Wno-missing-braces -Wparentheses -Wswitch -Wno-unused-function -Wno-unused-label -Wno-unused-parameter -Wno-unused-variable -Wunused-value -Wno-empty-body -Wno-uninitialized -Wno-unknown-pragmas -w -Wno-shadow -Wno-four-char-constants -Wno-conversion -Wno-constant-conversion -Wno-int-conversion -Wno-bool-conversion -Wno-enum-conversion -Wno-float-conversion -Wno-non-literal-null-conversion -Wno-objc-literal-conversion -Wshorten-64-to-32 -Wno-newline-eof -Wno-c++11-extensions -Wno-implicit-fallthrough -fstrict-aliasing -Wdeprecated-declarations -Winvalid-offsetof -Wno-sign-conversion -Wno-infinite-recursion -Wno-move -Wno-comma -Wno-block-capture-autoreleasing -Wno-strict-prototypes -Wno-range-loop-analysis -Wno-semicolon-before-method-body -index-store-path /Users/admin/builder/spi-builder-workspace/.derivedData/Index.noindex/DataStore @/Users/admin/builder/spi-builder-workspace/.derivedData/Build/Intermediates.noindex/RealmDatabase.build/Debug-watchos/s2geometry.build/Objects-normal/arm64/82b82416624d2658e5098eb0a28c15c5-common-args.resp -MMD -MT dependencies -MF /Users/admin/builder/spi-builder-workspace/.derivedData/Build/Intermediates.noindex/RealmDatabase.build/Debug-watchos/s2geometry.build/Objects-normal/arm64/s2.d --serialize-diagnostics /Users/admin/builder/spi-builder-workspace/.derivedData/Build/Intermediates.noindex/RealmDatabase.build/Debug-watchos/s2geometry.build/Objects-normal/arm64/s2.dia -c /Users/admin/builder/spi-builder-workspace/.dependencies/checkouts/realm-core/src/external/s2/s2.cc -o /Users/admin/builder/spi-builder-workspace/.derivedData/Build/Intermediates.noindex/RealmDatabase.build/Debug-watchos/s2geometry.build/Objects-normal/arm64/s2.o -index-unit-output-path /RealmDatabase.build/Debug-watchos/s2geometry.build/Objects-normal/arm64/s2.o
CompileC /Users/admin/builder/spi-builder-workspace/.derivedData/Build/Intermediates.noindex/RealmDatabase.build/Debug-watchos/s2geometry.build/Objects-normal/arm64/s1interval.o /Users/admin/builder/spi-builder-workspace/.dependencies/checkouts/realm-core/src/external/s2/s1interval.cc normal arm64 c++ com.apple.compilers.llvm.clang.1_0.compiler (in target 's2geometry' from project 'RealmDatabase')
cd /Users/admin/builder/spi-builder-workspace/.swiftpm/xcode
Using response file: /Users/admin/builder/spi-builder-workspace/.derivedData/Build/Intermediates.noindex/RealmDatabase.build/Debug-watchos/s2geometry.build/Objects-normal/arm64/82b82416624d2658e5098eb0a28c15c5-common-args.resp
/Applications/Xcode-16.1.0.app/Contents/Developer/Toolchains/XcodeDefault.xctoolchain/usr/bin/clang -x c++ -ivfsstatcache /Users/admin/builder/spi-builder-workspace/.derivedData/SDKStatCaches.noindex/watchos11.1-22R574-7b9df0bda16bb4641b33636c68f04660.sdkstatcache -fmessage-length\=0 -fdiagnostics-show-note-include-stack -fmacro-backtrace-limit\=0 -fno-color-diagnostics -fmodules-prune-interval\=86400 -fmodules-prune-after\=345600 -fbuild-session-file\=/Users/admin/builder/spi-builder-workspace/.derivedData/ModuleCache.noindex/Session.modulevalidation -fmodules-validate-once-per-build-session -Wnon-modular-include-in-framework-module -Werror\=non-modular-include-in-framework-module -Wno-trigraphs -Wno-missing-field-initializers -Wno-missing-prototypes -Wno-return-type -Wno-non-virtual-dtor -Wno-overloaded-virtual -Wno-exit-time-destructors -Wno-missing-braces -Wparentheses -Wswitch -Wno-unused-function -Wno-unused-label -Wno-unused-parameter -Wno-unused-variable -Wunused-value -Wno-empty-body -Wno-uninitialized -Wno-unknown-pragmas -w -Wno-shadow -Wno-four-char-constants -Wno-conversion -Wno-constant-conversion -Wno-int-conversion -Wno-bool-conversion -Wno-enum-conversion -Wno-float-conversion -Wno-non-literal-null-conversion -Wno-objc-literal-conversion -Wshorten-64-to-32 -Wno-newline-eof -Wno-c++11-extensions -Wno-implicit-fallthrough -fstrict-aliasing -Wdeprecated-declarations -Winvalid-offsetof -Wno-sign-conversion -Wno-infinite-recursion -Wno-move -Wno-comma -Wno-block-capture-autoreleasing -Wno-strict-prototypes -Wno-range-loop-analysis -Wno-semicolon-before-method-body -index-store-path /Users/admin/builder/spi-builder-workspace/.derivedData/Index.noindex/DataStore @/Users/admin/builder/spi-builder-workspace/.derivedData/Build/Intermediates.noindex/RealmDatabase.build/Debug-watchos/s2geometry.build/Objects-normal/arm64/82b82416624d2658e5098eb0a28c15c5-common-args.resp -MMD -MT dependencies -MF /Users/admin/builder/spi-builder-workspace/.derivedData/Build/Intermediates.noindex/RealmDatabase.build/Debug-watchos/s2geometry.build/Objects-normal/arm64/s1interval.d --serialize-diagnostics /Users/admin/builder/spi-builder-workspace/.derivedData/Build/Intermediates.noindex/RealmDatabase.build/Debug-watchos/s2geometry.build/Objects-normal/arm64/s1interval.dia -c /Users/admin/builder/spi-builder-workspace/.dependencies/checkouts/realm-core/src/external/s2/s1interval.cc -o /Users/admin/builder/spi-builder-workspace/.derivedData/Build/Intermediates.noindex/RealmDatabase.build/Debug-watchos/s2geometry.build/Objects-normal/arm64/s1interval.o -index-unit-output-path /RealmDatabase.build/Debug-watchos/s2geometry.build/Objects-normal/arm64/s1interval.o
CompileC /Users/admin/builder/spi-builder-workspace/.derivedData/Build/Intermediates.noindex/RealmDatabase.build/Debug-watchos/s2geometry.build/Objects-normal/arm64/s1angle.o /Users/admin/builder/spi-builder-workspace/.dependencies/checkouts/realm-core/src/external/s2/s1angle.cc normal arm64 c++ com.apple.compilers.llvm.clang.1_0.compiler (in target 's2geometry' from project 'RealmDatabase')
cd /Users/admin/builder/spi-builder-workspace/.swiftpm/xcode
Using response file: /Users/admin/builder/spi-builder-workspace/.derivedData/Build/Intermediates.noindex/RealmDatabase.build/Debug-watchos/s2geometry.build/Objects-normal/arm64/82b82416624d2658e5098eb0a28c15c5-common-args.resp
/Applications/Xcode-16.1.0.app/Contents/Developer/Toolchains/XcodeDefault.xctoolchain/usr/bin/clang -x c++ -ivfsstatcache /Users/admin/builder/spi-builder-workspace/.derivedData/SDKStatCaches.noindex/watchos11.1-22R574-7b9df0bda16bb4641b33636c68f04660.sdkstatcache -fmessage-length\=0 -fdiagnostics-show-note-include-stack -fmacro-backtrace-limit\=0 -fno-color-diagnostics -fmodules-prune-interval\=86400 -fmodules-prune-after\=345600 -fbuild-session-file\=/Users/admin/builder/spi-builder-workspace/.derivedData/ModuleCache.noindex/Session.modulevalidation -fmodules-validate-once-per-build-session -Wnon-modular-include-in-framework-module -Werror\=non-modular-include-in-framework-module -Wno-trigraphs -Wno-missing-field-initializers -Wno-missing-prototypes -Wno-return-type -Wno-non-virtual-dtor -Wno-overloaded-virtual -Wno-exit-time-destructors -Wno-missing-braces -Wparentheses -Wswitch -Wno-unused-function -Wno-unused-label -Wno-unused-parameter -Wno-unused-variable -Wunused-value -Wno-empty-body -Wno-uninitialized -Wno-unknown-pragmas -w -Wno-shadow -Wno-four-char-constants -Wno-conversion -Wno-constant-conversion -Wno-int-conversion -Wno-bool-conversion -Wno-enum-conversion -Wno-float-conversion -Wno-non-literal-null-conversion -Wno-objc-literal-conversion -Wshorten-64-to-32 -Wno-newline-eof -Wno-c++11-extensions -Wno-implicit-fallthrough -fstrict-aliasing -Wdeprecated-declarations -Winvalid-offsetof -Wno-sign-conversion -Wno-infinite-recursion -Wno-move -Wno-comma -Wno-block-capture-autoreleasing -Wno-strict-prototypes -Wno-range-loop-analysis -Wno-semicolon-before-method-body -index-store-path /Users/admin/builder/spi-builder-workspace/.derivedData/Index.noindex/DataStore @/Users/admin/builder/spi-builder-workspace/.derivedData/Build/Intermediates.noindex/RealmDatabase.build/Debug-watchos/s2geometry.build/Objects-normal/arm64/82b82416624d2658e5098eb0a28c15c5-common-args.resp -MMD -MT dependencies -MF /Users/admin/builder/spi-builder-workspace/.derivedData/Build/Intermediates.noindex/RealmDatabase.build/Debug-watchos/s2geometry.build/Objects-normal/arm64/s1angle.d --serialize-diagnostics /Users/admin/builder/spi-builder-workspace/.derivedData/Build/Intermediates.noindex/RealmDatabase.build/Debug-watchos/s2geometry.build/Objects-normal/arm64/s1angle.dia -c /Users/admin/builder/spi-builder-workspace/.dependencies/checkouts/realm-core/src/external/s2/s1angle.cc -o /Users/admin/builder/spi-builder-workspace/.derivedData/Build/Intermediates.noindex/RealmDatabase.build/Debug-watchos/s2geometry.build/Objects-normal/arm64/s1angle.o -index-unit-output-path /RealmDatabase.build/Debug-watchos/s2geometry.build/Objects-normal/arm64/s1angle.o
CompileC /Users/admin/builder/spi-builder-workspace/.derivedData/Build/Intermediates.noindex/RealmDatabase.build/Debug-watchos/s2geometry.build/Objects-normal/arm64/mathutil.o /Users/admin/builder/spi-builder-workspace/.dependencies/checkouts/realm-core/src/external/s2/util/math/mathutil.cc normal arm64 c++ com.apple.compilers.llvm.clang.1_0.compiler (in target 's2geometry' from project 'RealmDatabase')
cd /Users/admin/builder/spi-builder-workspace/.swiftpm/xcode
Using response file: /Users/admin/builder/spi-builder-workspace/.derivedData/Build/Intermediates.noindex/RealmDatabase.build/Debug-watchos/s2geometry.build/Objects-normal/arm64/82b82416624d2658e5098eb0a28c15c5-common-args.resp
/Applications/Xcode-16.1.0.app/Contents/Developer/Toolchains/XcodeDefault.xctoolchain/usr/bin/clang -x c++ -ivfsstatcache /Users/admin/builder/spi-builder-workspace/.derivedData/SDKStatCaches.noindex/watchos11.1-22R574-7b9df0bda16bb4641b33636c68f04660.sdkstatcache -fmessage-length\=0 -fdiagnostics-show-note-include-stack -fmacro-backtrace-limit\=0 -fno-color-diagnostics -fmodules-prune-interval\=86400 -fmodules-prune-after\=345600 -fbuild-session-file\=/Users/admin/builder/spi-builder-workspace/.derivedData/ModuleCache.noindex/Session.modulevalidation -fmodules-validate-once-per-build-session -Wnon-modular-include-in-framework-module -Werror\=non-modular-include-in-framework-module -Wno-trigraphs -Wno-missing-field-initializers -Wno-missing-prototypes -Wno-return-type -Wno-non-virtual-dtor -Wno-overloaded-virtual -Wno-exit-time-destructors -Wno-missing-braces -Wparentheses -Wswitch -Wno-unused-function -Wno-unused-label -Wno-unused-parameter -Wno-unused-variable -Wunused-value -Wno-empty-body -Wno-uninitialized -Wno-unknown-pragmas -w -Wno-shadow -Wno-four-char-constants -Wno-conversion -Wno-constant-conversion -Wno-int-conversion -Wno-bool-conversion -Wno-enum-conversion -Wno-float-conversion -Wno-non-literal-null-conversion -Wno-objc-literal-conversion -Wshorten-64-to-32 -Wno-newline-eof -Wno-c++11-extensions -Wno-implicit-fallthrough -fstrict-aliasing -Wdeprecated-declarations -Winvalid-offsetof -Wno-sign-conversion -Wno-infinite-recursion -Wno-move -Wno-comma -Wno-block-capture-autoreleasing -Wno-strict-prototypes -Wno-range-loop-analysis -Wno-semicolon-before-method-body -index-store-path /Users/admin/builder/spi-builder-workspace/.derivedData/Index.noindex/DataStore @/Users/admin/builder/spi-builder-workspace/.derivedData/Build/Intermediates.noindex/RealmDatabase.build/Debug-watchos/s2geometry.build/Objects-normal/arm64/82b82416624d2658e5098eb0a28c15c5-common-args.resp -MMD -MT dependencies -MF /Users/admin/builder/spi-builder-workspace/.derivedData/Build/Intermediates.noindex/RealmDatabase.build/Debug-watchos/s2geometry.build/Objects-normal/arm64/mathutil.d --serialize-diagnostics /Users/admin/builder/spi-builder-workspace/.derivedData/Build/Intermediates.noindex/RealmDatabase.build/Debug-watchos/s2geometry.build/Objects-normal/arm64/mathutil.dia -c /Users/admin/builder/spi-builder-workspace/.dependencies/checkouts/realm-core/src/external/s2/util/math/mathutil.cc -o /Users/admin/builder/spi-builder-workspace/.derivedData/Build/Intermediates.noindex/RealmDatabase.build/Debug-watchos/s2geometry.build/Objects-normal/arm64/mathutil.o -index-unit-output-path /RealmDatabase.build/Debug-watchos/s2geometry.build/Objects-normal/arm64/mathutil.o
CompileC /Users/admin/builder/spi-builder-workspace/.derivedData/Build/Intermediates.noindex/RealmDatabase.build/Debug-watchos/s2geometry.build/Objects-normal/arm64/mathlimits.o /Users/admin/builder/spi-builder-workspace/.dependencies/checkouts/realm-core/src/external/s2/util/math/mathlimits.cc normal arm64 c++ com.apple.compilers.llvm.clang.1_0.compiler (in target 's2geometry' from project 'RealmDatabase')
cd /Users/admin/builder/spi-builder-workspace/.swiftpm/xcode
Using response file: /Users/admin/builder/spi-builder-workspace/.derivedData/Build/Intermediates.noindex/RealmDatabase.build/Debug-watchos/s2geometry.build/Objects-normal/arm64/82b82416624d2658e5098eb0a28c15c5-common-args.resp
/Applications/Xcode-16.1.0.app/Contents/Developer/Toolchains/XcodeDefault.xctoolchain/usr/bin/clang -x c++ -ivfsstatcache /Users/admin/builder/spi-builder-workspace/.derivedData/SDKStatCaches.noindex/watchos11.1-22R574-7b9df0bda16bb4641b33636c68f04660.sdkstatcache -fmessage-length\=0 -fdiagnostics-show-note-include-stack -fmacro-backtrace-limit\=0 -fno-color-diagnostics -fmodules-prune-interval\=86400 -fmodules-prune-after\=345600 -fbuild-session-file\=/Users/admin/builder/spi-builder-workspace/.derivedData/ModuleCache.noindex/Session.modulevalidation -fmodules-validate-once-per-build-session -Wnon-modular-include-in-framework-module -Werror\=non-modular-include-in-framework-module -Wno-trigraphs -Wno-missing-field-initializers -Wno-missing-prototypes -Wno-return-type -Wno-non-virtual-dtor -Wno-overloaded-virtual -Wno-exit-time-destructors -Wno-missing-braces -Wparentheses -Wswitch -Wno-unused-function -Wno-unused-label -Wno-unused-parameter -Wno-unused-variable -Wunused-value -Wno-empty-body -Wno-uninitialized -Wno-unknown-pragmas -w -Wno-shadow -Wno-four-char-constants -Wno-conversion -Wno-constant-conversion -Wno-int-conversion -Wno-bool-conversion -Wno-enum-conversion -Wno-float-conversion -Wno-non-literal-null-conversion -Wno-objc-literal-conversion -Wshorten-64-to-32 -Wno-newline-eof -Wno-c++11-extensions -Wno-implicit-fallthrough -fstrict-aliasing -Wdeprecated-declarations -Winvalid-offsetof -Wno-sign-conversion -Wno-infinite-recursion -Wno-move -Wno-comma -Wno-block-capture-autoreleasing -Wno-strict-prototypes -Wno-range-loop-analysis -Wno-semicolon-before-method-body -index-store-path /Users/admin/builder/spi-builder-workspace/.derivedData/Index.noindex/DataStore @/Users/admin/builder/spi-builder-workspace/.derivedData/Build/Intermediates.noindex/RealmDatabase.build/Debug-watchos/s2geometry.build/Objects-normal/arm64/82b82416624d2658e5098eb0a28c15c5-common-args.resp -MMD -MT dependencies -MF /Users/admin/builder/spi-builder-workspace/.derivedData/Build/Intermediates.noindex/RealmDatabase.build/Debug-watchos/s2geometry.build/Objects-normal/arm64/mathlimits.d --serialize-diagnostics /Users/admin/builder/spi-builder-workspace/.derivedData/Build/Intermediates.noindex/RealmDatabase.build/Debug-watchos/s2geometry.build/Objects-normal/arm64/mathlimits.dia -c /Users/admin/builder/spi-builder-workspace/.dependencies/checkouts/realm-core/src/external/s2/util/math/mathlimits.cc -o /Users/admin/builder/spi-builder-workspace/.derivedData/Build/Intermediates.noindex/RealmDatabase.build/Debug-watchos/s2geometry.build/Objects-normal/arm64/mathlimits.o -index-unit-output-path /RealmDatabase.build/Debug-watchos/s2geometry.build/Objects-normal/arm64/mathlimits.o
CompileC /Users/admin/builder/spi-builder-workspace/.derivedData/Build/Intermediates.noindex/RealmDatabase.build/Debug-watchos/RealmCoreResources.build/Objects-normal/armv7k/dummy.o /Users/admin/builder/spi-builder-workspace/.dependencies/checkouts/realm-core/src/spm/dummy.mm normal armv7k objective-c++ com.apple.compilers.llvm.clang.1_0.compiler (in target 'RealmCoreResources' from project 'RealmDatabase')
cd /Users/admin/builder/spi-builder-workspace/.swiftpm/xcode
Using response file: /Users/admin/builder/spi-builder-workspace/.derivedData/Build/Intermediates.noindex/RealmDatabase.build/Debug-watchos/RealmCoreResources.build/Objects-normal/armv7k/af3fcb34312c57c0f52879cdce924b91-common-args.resp
/Applications/Xcode-16.1.0.app/Contents/Developer/Toolchains/XcodeDefault.xctoolchain/usr/bin/clang -x objective-c++ -ivfsstatcache /Users/admin/builder/spi-builder-workspace/.derivedData/SDKStatCaches.noindex/watchos11.1-22R574-7b9df0bda16bb4641b33636c68f04660.sdkstatcache -fmessage-length\=0 -fdiagnostics-show-note-include-stack -fmacro-backtrace-limit\=0 -fno-color-diagnostics -fmodules-prune-interval\=86400 -fmodules-prune-after\=345600 -fbuild-session-file\=/Users/admin/builder/spi-builder-workspace/.derivedData/ModuleCache.noindex/Session.modulevalidation -fmodules-validate-once-per-build-session -Wnon-modular-include-in-framework-module -Werror\=non-modular-include-in-framework-module -Wno-trigraphs -Wno-missing-field-initializers -Wno-missing-prototypes -Wno-return-type -Wno-implicit-atomic-properties -Wno-objc-interface-ivars -Wno-arc-repeated-use-of-weak -Wno-non-virtual-dtor -Wno-overloaded-virtual -Wno-exit-time-destructors -Wno-missing-braces -Wparentheses -Wswitch -Wno-unused-function -Wno-unused-label -Wno-unused-parameter -Wno-unused-variable -Wunused-value -Wno-empty-body -Wno-uninitialized -Wno-unknown-pragmas -w -Wno-shadow -Wno-four-char-constants -Wno-conversion -Wno-constant-conversion -Wno-int-conversion -Wno-bool-conversion -Wno-enum-conversion -Wno-float-conversion -Wno-non-literal-null-conversion -Wno-objc-literal-conversion -Wno-shorten-64-to-32 -Wno-newline-eof -Wno-selector -Wno-strict-selector-match -Wno-undeclared-selector -Wno-deprecated-implementations -Wno-c++11-extensions -Wno-implicit-fallthrough -fstrict-aliasing -Wprotocol -Wdeprecated-declarations -Winvalid-offsetof -Wno-sign-conversion -Wno-infinite-recursion -Wno-move -Wno-comma -Wno-block-capture-autoreleasing -Wno-strict-prototypes -Wno-range-loop-analysis -Wno-semicolon-before-method-body -index-store-path /Users/admin/builder/spi-builder-workspace/.derivedData/Index.noindex/DataStore @/Users/admin/builder/spi-builder-workspace/.derivedData/Build/Intermediates.noindex/RealmDatabase.build/Debug-watchos/RealmCoreResources.build/Objects-normal/armv7k/af3fcb34312c57c0f52879cdce924b91-common-args.resp -include /Users/admin/builder/spi-builder-workspace/.derivedData/Build/Intermediates.noindex/RealmDatabase.build/Debug-watchos/RealmCoreResources.build/DerivedSources/resource_bundle_accessor.h -MMD -MT dependencies -MF /Users/admin/builder/spi-builder-workspace/.derivedData/Build/Intermediates.noindex/RealmDatabase.build/Debug-watchos/RealmCoreResources.build/Objects-normal/armv7k/dummy.d --serialize-diagnostics /Users/admin/builder/spi-builder-workspace/.derivedData/Build/Intermediates.noindex/RealmDatabase.build/Debug-watchos/RealmCoreResources.build/Objects-normal/armv7k/dummy.dia -c /Users/admin/builder/spi-builder-workspace/.dependencies/checkouts/realm-core/src/spm/dummy.mm -o /Users/admin/builder/spi-builder-workspace/.derivedData/Build/Intermediates.noindex/RealmDatabase.build/Debug-watchos/RealmCoreResources.build/Objects-normal/armv7k/dummy.o -index-unit-output-path /RealmDatabase.build/Debug-watchos/RealmCoreResources.build/Objects-normal/armv7k/dummy.o
CompileC /Users/admin/builder/spi-builder-workspace/.derivedData/Build/Intermediates.noindex/RealmDatabase.build/Debug-watchos/RealmCoreResources.build/Objects-normal/arm64_32/dummy.o /Users/admin/builder/spi-builder-workspace/.dependencies/checkouts/realm-core/src/spm/dummy.mm normal arm64_32 objective-c++ com.apple.compilers.llvm.clang.1_0.compiler (in target 'RealmCoreResources' from project 'RealmDatabase')
cd /Users/admin/builder/spi-builder-workspace/.swiftpm/xcode
Using response file: /Users/admin/builder/spi-builder-workspace/.derivedData/Build/Intermediates.noindex/RealmDatabase.build/Debug-watchos/RealmCoreResources.build/Objects-normal/arm64_32/af3fcb34312c57c0f52879cdce924b91-common-args.resp
/Applications/Xcode-16.1.0.app/Contents/Developer/Toolchains/XcodeDefault.xctoolchain/usr/bin/clang -x objective-c++ -ivfsstatcache /Users/admin/builder/spi-builder-workspace/.derivedData/SDKStatCaches.noindex/watchos11.1-22R574-7b9df0bda16bb4641b33636c68f04660.sdkstatcache -fmessage-length\=0 -fdiagnostics-show-note-include-stack -fmacro-backtrace-limit\=0 -fno-color-diagnostics -fmodules-prune-interval\=86400 -fmodules-prune-after\=345600 -fbuild-session-file\=/Users/admin/builder/spi-builder-workspace/.derivedData/ModuleCache.noindex/Session.modulevalidation -fmodules-validate-once-per-build-session -Wnon-modular-include-in-framework-module -Werror\=non-modular-include-in-framework-module -Wno-trigraphs -Wno-missing-field-initializers -Wno-missing-prototypes -Wno-return-type -Wno-implicit-atomic-properties -Wno-objc-interface-ivars -Wno-arc-repeated-use-of-weak -Wno-non-virtual-dtor -Wno-overloaded-virtual -Wno-exit-time-destructors -Wno-missing-braces -Wparentheses -Wswitch -Wno-unused-function -Wno-unused-label -Wno-unused-parameter -Wno-unused-variable -Wunused-value -Wno-empty-body -Wno-uninitialized -Wno-unknown-pragmas -w -Wno-shadow -Wno-four-char-constants -Wno-conversion -Wno-constant-conversion -Wno-int-conversion -Wno-bool-conversion -Wno-enum-conversion -Wno-float-conversion -Wno-non-literal-null-conversion -Wno-objc-literal-conversion -Wno-shorten-64-to-32 -Wno-newline-eof -Wno-selector -Wno-strict-selector-match -Wno-undeclared-selector -Wno-deprecated-implementations -Wno-c++11-extensions -Wno-implicit-fallthrough -fstrict-aliasing -Wprotocol -Wdeprecated-declarations -Winvalid-offsetof -Wno-sign-conversion -Wno-infinite-recursion -Wno-move -Wno-comma -Wno-block-capture-autoreleasing -Wno-strict-prototypes -Wno-range-loop-analysis -Wno-semicolon-before-method-body -index-store-path /Users/admin/builder/spi-builder-workspace/.derivedData/Index.noindex/DataStore @/Users/admin/builder/spi-builder-workspace/.derivedData/Build/Intermediates.noindex/RealmDatabase.build/Debug-watchos/RealmCoreResources.build/Objects-normal/arm64_32/af3fcb34312c57c0f52879cdce924b91-common-args.resp -include /Users/admin/builder/spi-builder-workspace/.derivedData/Build/Intermediates.noindex/RealmDatabase.build/Debug-watchos/RealmCoreResources.build/DerivedSources/resource_bundle_accessor.h -MMD -MT dependencies -MF /Users/admin/builder/spi-builder-workspace/.derivedData/Build/Intermediates.noindex/RealmDatabase.build/Debug-watchos/RealmCoreResources.build/Objects-normal/arm64_32/dummy.d --serialize-diagnostics /Users/admin/builder/spi-builder-workspace/.derivedData/Build/Intermediates.noindex/RealmDatabase.build/Debug-watchos/RealmCoreResources.build/Objects-normal/arm64_32/dummy.dia -c /Users/admin/builder/spi-builder-workspace/.dependencies/checkouts/realm-core/src/spm/dummy.mm -o /Users/admin/builder/spi-builder-workspace/.derivedData/Build/Intermediates.noindex/RealmDatabase.build/Debug-watchos/RealmCoreResources.build/Objects-normal/arm64_32/dummy.o -index-unit-output-path /RealmDatabase.build/Debug-watchos/RealmCoreResources.build/Objects-normal/arm64_32/dummy.o
CompileC /Users/admin/builder/spi-builder-workspace/.derivedData/Build/Intermediates.noindex/RealmDatabase.build/Debug-watchos/RealmCoreResources.build/Objects-normal/arm64/dummy.o /Users/admin/builder/spi-builder-workspace/.dependencies/checkouts/realm-core/src/spm/dummy.mm normal arm64 objective-c++ com.apple.compilers.llvm.clang.1_0.compiler (in target 'RealmCoreResources' from project 'RealmDatabase')
cd /Users/admin/builder/spi-builder-workspace/.swiftpm/xcode
Using response file: /Users/admin/builder/spi-builder-workspace/.derivedData/Build/Intermediates.noindex/RealmDatabase.build/Debug-watchos/RealmCoreResources.build/Objects-normal/arm64/af3fcb34312c57c0f52879cdce924b91-common-args.resp
/Applications/Xcode-16.1.0.app/Contents/Developer/Toolchains/XcodeDefault.xctoolchain/usr/bin/clang -x objective-c++ -ivfsstatcache /Users/admin/builder/spi-builder-workspace/.derivedData/SDKStatCaches.noindex/watchos11.1-22R574-7b9df0bda16bb4641b33636c68f04660.sdkstatcache -fmessage-length\=0 -fdiagnostics-show-note-include-stack -fmacro-backtrace-limit\=0 -fno-color-diagnostics -fmodules-prune-interval\=86400 -fmodules-prune-after\=345600 -fbuild-session-file\=/Users/admin/builder/spi-builder-workspace/.derivedData/ModuleCache.noindex/Session.modulevalidation -fmodules-validate-once-per-build-session -Wnon-modular-include-in-framework-module -Werror\=non-modular-include-in-framework-module -Wno-trigraphs -Wno-missing-field-initializers -Wno-missing-prototypes -Wno-return-type -Wno-implicit-atomic-properties -Wno-objc-interface-ivars -Wno-arc-repeated-use-of-weak -Wno-non-virtual-dtor -Wno-overloaded-virtual -Wno-exit-time-destructors -Wno-missing-braces -Wparentheses -Wswitch -Wno-unused-function -Wno-unused-label -Wno-unused-parameter -Wno-unused-variable -Wunused-value -Wno-empty-body -Wno-uninitialized -Wno-unknown-pragmas -w -Wno-shadow -Wno-four-char-constants -Wno-conversion -Wno-constant-conversion -Wno-int-conversion -Wno-bool-conversion -Wno-enum-conversion -Wno-float-conversion -Wno-non-literal-null-conversion -Wno-objc-literal-conversion -Wshorten-64-to-32 -Wno-newline-eof -Wno-selector -Wno-strict-selector-match -Wno-undeclared-selector -Wno-deprecated-implementations -Wno-c++11-extensions -Wno-implicit-fallthrough -fstrict-aliasing -Wprotocol -Wdeprecated-declarations -Winvalid-offsetof -Wno-sign-conversion -Wno-infinite-recursion -Wno-move -Wno-comma -Wno-block-capture-autoreleasing -Wno-strict-prototypes -Wno-range-loop-analysis -Wno-semicolon-before-method-body -index-store-path /Users/admin/builder/spi-builder-workspace/.derivedData/Index.noindex/DataStore @/Users/admin/builder/spi-builder-workspace/.derivedData/Build/Intermediates.noindex/RealmDatabase.build/Debug-watchos/RealmCoreResources.build/Objects-normal/arm64/af3fcb34312c57c0f52879cdce924b91-common-args.resp -include /Users/admin/builder/spi-builder-workspace/.derivedData/Build/Intermediates.noindex/RealmDatabase.build/Debug-watchos/RealmCoreResources.build/DerivedSources/resource_bundle_accessor.h -MMD -MT dependencies -MF /Users/admin/builder/spi-builder-workspace/.derivedData/Build/Intermediates.noindex/RealmDatabase.build/Debug-watchos/RealmCoreResources.build/Objects-normal/arm64/dummy.d --serialize-diagnostics /Users/admin/builder/spi-builder-workspace/.derivedData/Build/Intermediates.noindex/RealmDatabase.build/Debug-watchos/RealmCoreResources.build/Objects-normal/arm64/dummy.dia -c /Users/admin/builder/spi-builder-workspace/.dependencies/checkouts/realm-core/src/spm/dummy.mm -o /Users/admin/builder/spi-builder-workspace/.derivedData/Build/Intermediates.noindex/RealmDatabase.build/Debug-watchos/RealmCoreResources.build/Objects-normal/arm64/dummy.o -index-unit-output-path /RealmDatabase.build/Debug-watchos/RealmCoreResources.build/Objects-normal/arm64/dummy.o
CompileC /Users/admin/builder/spi-builder-workspace/.derivedData/Build/Intermediates.noindex/RealmDatabase.build/Debug-watchos/RealmCore.build/Objects-normal/armv7k/tokenizer.o /Users/admin/builder/spi-builder-workspace/.dependencies/checkouts/realm-core/src/realm/tokenizer.cpp normal armv7k c++ com.apple.compilers.llvm.clang.1_0.compiler (in target 'RealmCore' from project 'RealmDatabase')
cd /Users/admin/builder/spi-builder-workspace/.swiftpm/xcode
Using response file: /Users/admin/builder/spi-builder-workspace/.derivedData/Build/Intermediates.noindex/RealmDatabase.build/Debug-watchos/RealmCore.build/Objects-normal/armv7k/82b82416624d2658e5098eb0a28c15c5-common-args.resp
/Applications/Xcode-16.1.0.app/Contents/Developer/Toolchains/XcodeDefault.xctoolchain/usr/bin/clang -x c++ -ivfsstatcache /Users/admin/builder/spi-builder-workspace/.derivedData/SDKStatCaches.noindex/watchos11.1-22R574-7b9df0bda16bb4641b33636c68f04660.sdkstatcache -fmessage-length\=0 -fdiagnostics-show-note-include-stack -fmacro-backtrace-limit\=0 -fno-color-diagnostics -fmodules-prune-interval\=86400 -fmodules-prune-after\=345600 -fbuild-session-file\=/Users/admin/builder/spi-builder-workspace/.derivedData/ModuleCache.noindex/Session.modulevalidation -fmodules-validate-once-per-build-session -Wnon-modular-include-in-framework-module -Werror\=non-modular-include-in-framework-module -Wno-trigraphs -Wno-missing-field-initializers -Wno-missing-prototypes -Wno-return-type -Wno-non-virtual-dtor -Wno-overloaded-virtual -Wno-exit-time-destructors -Wno-missing-braces -Wparentheses -Wswitch -Wno-unused-function -Wno-unused-label -Wno-unused-parameter -Wno-unused-variable -Wunused-value -Wno-empty-body -Wno-uninitialized -Wno-unknown-pragmas -w -Wno-shadow -Wno-four-char-constants -Wno-conversion -Wno-constant-conversion -Wno-int-conversion -Wno-bool-conversion -Wno-enum-conversion -Wno-float-conversion -Wno-non-literal-null-conversion -Wno-objc-literal-conversion -Wno-shorten-64-to-32 -Wno-newline-eof -Wno-c++11-extensions -Wno-implicit-fallthrough -fstrict-aliasing -Wdeprecated-declarations -Winvalid-offsetof -Wno-sign-conversion -Wno-infinite-recursion -Wno-move -Wno-comma -Wno-block-capture-autoreleasing -Wno-strict-prototypes -Wno-range-loop-analysis -Wno-semicolon-before-method-body -index-store-path /Users/admin/builder/spi-builder-workspace/.derivedData/Index.noindex/DataStore @/Users/admin/builder/spi-builder-workspace/.derivedData/Build/Intermediates.noindex/RealmDatabase.build/Debug-watchos/RealmCore.build/Objects-normal/armv7k/82b82416624d2658e5098eb0a28c15c5-common-args.resp -MMD -MT dependencies -MF /Users/admin/builder/spi-builder-workspace/.derivedData/Build/Intermediates.noindex/RealmDatabase.build/Debug-watchos/RealmCore.build/Objects-normal/armv7k/tokenizer.d --serialize-diagnostics /Users/admin/builder/spi-builder-workspace/.derivedData/Build/Intermediates.noindex/RealmDatabase.build/Debug-watchos/RealmCore.build/Objects-normal/armv7k/tokenizer.dia -c /Users/admin/builder/spi-builder-workspace/.dependencies/checkouts/realm-core/src/realm/tokenizer.cpp -o /Users/admin/builder/spi-builder-workspace/.derivedData/Build/Intermediates.noindex/RealmDatabase.build/Debug-watchos/RealmCore.build/Objects-normal/armv7k/tokenizer.o -index-unit-output-path /RealmDatabase.build/Debug-watchos/RealmCore.build/Objects-normal/armv7k/tokenizer.o
CompileC /Users/admin/builder/spi-builder-workspace/.derivedData/Build/Intermediates.noindex/RealmDatabase.build/Debug-watchos/RealmCore.build/Objects-normal/armv7k/to_string.o /Users/admin/builder/spi-builder-workspace/.dependencies/checkouts/realm-core/src/realm/util/to_string.cpp normal armv7k c++ com.apple.compilers.llvm.clang.1_0.compiler (in target 'RealmCore' from project 'RealmDatabase')
cd /Users/admin/builder/spi-builder-workspace/.swiftpm/xcode
Using response file: /Users/admin/builder/spi-builder-workspace/.derivedData/Build/Intermediates.noindex/RealmDatabase.build/Debug-watchos/RealmCore.build/Objects-normal/armv7k/82b82416624d2658e5098eb0a28c15c5-common-args.resp
/Applications/Xcode-16.1.0.app/Contents/Developer/Toolchains/XcodeDefault.xctoolchain/usr/bin/clang -x c++ -ivfsstatcache /Users/admin/builder/spi-builder-workspace/.derivedData/SDKStatCaches.noindex/watchos11.1-22R574-7b9df0bda16bb4641b33636c68f04660.sdkstatcache -fmessage-length\=0 -fdiagnostics-show-note-include-stack -fmacro-backtrace-limit\=0 -fno-color-diagnostics -fmodules-prune-interval\=86400 -fmodules-prune-after\=345600 -fbuild-session-file\=/Users/admin/builder/spi-builder-workspace/.derivedData/ModuleCache.noindex/Session.modulevalidation -fmodules-validate-once-per-build-session -Wnon-modular-include-in-framework-module -Werror\=non-modular-include-in-framework-module -Wno-trigraphs -Wno-missing-field-initializers -Wno-missing-prototypes -Wno-return-type -Wno-non-virtual-dtor -Wno-overloaded-virtual -Wno-exit-time-destructors -Wno-missing-braces -Wparentheses -Wswitch -Wno-unused-function -Wno-unused-label -Wno-unused-parameter -Wno-unused-variable -Wunused-value -Wno-empty-body -Wno-uninitialized -Wno-unknown-pragmas -w -Wno-shadow -Wno-four-char-constants -Wno-conversion -Wno-constant-conversion -Wno-int-conversion -Wno-bool-conversion -Wno-enum-conversion -Wno-float-conversion -Wno-non-literal-null-conversion -Wno-objc-literal-conversion -Wno-shorten-64-to-32 -Wno-newline-eof -Wno-c++11-extensions -Wno-implicit-fallthrough -fstrict-aliasing -Wdeprecated-declarations -Winvalid-offsetof -Wno-sign-conversion -Wno-infinite-recursion -Wno-move -Wno-comma -Wno-block-capture-autoreleasing -Wno-strict-prototypes -Wno-range-loop-analysis -Wno-semicolon-before-method-body -index-store-path /Users/admin/builder/spi-builder-workspace/.derivedData/Index.noindex/DataStore @/Users/admin/builder/spi-builder-workspace/.derivedData/Build/Intermediates.noindex/RealmDatabase.build/Debug-watchos/RealmCore.build/Objects-normal/armv7k/82b82416624d2658e5098eb0a28c15c5-common-args.resp -MMD -MT dependencies -MF /Users/admin/builder/spi-builder-workspace/.derivedData/Build/Intermediates.noindex/RealmDatabase.build/Debug-watchos/RealmCore.build/Objects-normal/armv7k/to_string.d --serialize-diagnostics /Users/admin/builder/spi-builder-workspace/.derivedData/Build/Intermediates.noindex/RealmDatabase.build/Debug-watchos/RealmCore.build/Objects-normal/armv7k/to_string.dia -c /Users/admin/builder/spi-builder-workspace/.dependencies/checkouts/realm-core/src/realm/util/to_string.cpp -o /Users/admin/builder/spi-builder-workspace/.derivedData/Build/Intermediates.noindex/RealmDatabase.build/Debug-watchos/RealmCore.build/Objects-normal/armv7k/to_string.o -index-unit-output-path /RealmDatabase.build/Debug-watchos/RealmCore.build/Objects-normal/armv7k/to_string.o
CompileC /Users/admin/builder/spi-builder-workspace/.derivedData/Build/Intermediates.noindex/RealmDatabase.build/Debug-watchos/RealmCore.build/Objects-normal/armv7k/to_json.o /Users/admin/builder/spi-builder-workspace/.dependencies/checkouts/realm-core/src/realm/to_json.cpp normal armv7k c++ com.apple.compilers.llvm.clang.1_0.compiler (in target 'RealmCore' from project 'RealmDatabase')
cd /Users/admin/builder/spi-builder-workspace/.swiftpm/xcode
Using response file: /Users/admin/builder/spi-builder-workspace/.derivedData/Build/Intermediates.noindex/RealmDatabase.build/Debug-watchos/RealmCore.build/Objects-normal/armv7k/82b82416624d2658e5098eb0a28c15c5-common-args.resp
/Applications/Xcode-16.1.0.app/Contents/Developer/Toolchains/XcodeDefault.xctoolchain/usr/bin/clang -x c++ -ivfsstatcache /Users/admin/builder/spi-builder-workspace/.derivedData/SDKStatCaches.noindex/watchos11.1-22R574-7b9df0bda16bb4641b33636c68f04660.sdkstatcache -fmessage-length\=0 -fdiagnostics-show-note-include-stack -fmacro-backtrace-limit\=0 -fno-color-diagnostics -fmodules-prune-interval\=86400 -fmodules-prune-after\=345600 -fbuild-session-file\=/Users/admin/builder/spi-builder-workspace/.derivedData/ModuleCache.noindex/Session.modulevalidation -fmodules-validate-once-per-build-session -Wnon-modular-include-in-framework-module -Werror\=non-modular-include-in-framework-module -Wno-trigraphs -Wno-missing-field-initializers -Wno-missing-prototypes -Wno-return-type -Wno-non-virtual-dtor -Wno-overloaded-virtual -Wno-exit-time-destructors -Wno-missing-braces -Wparentheses -Wswitch -Wno-unused-function -Wno-unused-label -Wno-unused-parameter -Wno-unused-variable -Wunused-value -Wno-empty-body -Wno-uninitialized -Wno-unknown-pragmas -w -Wno-shadow -Wno-four-char-constants -Wno-conversion -Wno-constant-conversion -Wno-int-conversion -Wno-bool-conversion -Wno-enum-conversion -Wno-float-conversion -Wno-non-literal-null-conversion -Wno-objc-literal-conversion -Wno-shorten-64-to-32 -Wno-newline-eof -Wno-c++11-extensions -Wno-implicit-fallthrough -fstrict-aliasing -Wdeprecated-declarations -Winvalid-offsetof -Wno-sign-conversion -Wno-infinite-recursion -Wno-move -Wno-comma -Wno-block-capture-autoreleasing -Wno-strict-prototypes -Wno-range-loop-analysis -Wno-semicolon-before-method-body -index-store-path /Users/admin/builder/spi-builder-workspace/.derivedData/Index.noindex/DataStore @/Users/admin/builder/spi-builder-workspace/.derivedData/Build/Intermediates.noindex/RealmDatabase.build/Debug-watchos/RealmCore.build/Objects-normal/armv7k/82b82416624d2658e5098eb0a28c15c5-common-args.resp -MMD -MT dependencies -MF /Users/admin/builder/spi-builder-workspace/.derivedData/Build/Intermediates.noindex/RealmDatabase.build/Debug-watchos/RealmCore.build/Objects-normal/armv7k/to_json.d --serialize-diagnostics /Users/admin/builder/spi-builder-workspace/.derivedData/Build/Intermediates.noindex/RealmDatabase.build/Debug-watchos/RealmCore.build/Objects-normal/armv7k/to_json.dia -c /Users/admin/builder/spi-builder-workspace/.dependencies/checkouts/realm-core/src/realm/to_json.cpp -o /Users/admin/builder/spi-builder-workspace/.derivedData/Build/Intermediates.noindex/RealmDatabase.build/Debug-watchos/RealmCore.build/Objects-normal/armv7k/to_json.o -index-unit-output-path /RealmDatabase.build/Debug-watchos/RealmCore.build/Objects-normal/armv7k/to_json.o
CompileC /Users/admin/builder/spi-builder-workspace/.derivedData/Build/Intermediates.noindex/RealmDatabase.build/Debug-watchos/RealmCore.build/Objects-normal/armv7k/timestamp_logger.o /Users/admin/builder/spi-builder-workspace/.dependencies/checkouts/realm-core/src/realm/util/timestamp_logger.cpp normal armv7k c++ com.apple.compilers.llvm.clang.1_0.compiler (in target 'RealmCore' from project 'RealmDatabase')
cd /Users/admin/builder/spi-builder-workspace/.swiftpm/xcode
Using response file: /Users/admin/builder/spi-builder-workspace/.derivedData/Build/Intermediates.noindex/RealmDatabase.build/Debug-watchos/RealmCore.build/Objects-normal/armv7k/82b82416624d2658e5098eb0a28c15c5-common-args.resp
/Applications/Xcode-16.1.0.app/Contents/Developer/Toolchains/XcodeDefault.xctoolchain/usr/bin/clang -x c++ -ivfsstatcache /Users/admin/builder/spi-builder-workspace/.derivedData/SDKStatCaches.noindex/watchos11.1-22R574-7b9df0bda16bb4641b33636c68f04660.sdkstatcache -fmessage-length\=0 -fdiagnostics-show-note-include-stack -fmacro-backtrace-limit\=0 -fno-color-diagnostics -fmodules-prune-interval\=86400 -fmodules-prune-after\=345600 -fbuild-session-file\=/Users/admin/builder/spi-builder-workspace/.derivedData/ModuleCache.noindex/Session.modulevalidation -fmodules-validate-once-per-build-session -Wnon-modular-include-in-framework-module -Werror\=non-modular-include-in-framework-module -Wno-trigraphs -Wno-missing-field-initializers -Wno-missing-prototypes -Wno-return-type -Wno-non-virtual-dtor -Wno-overloaded-virtual -Wno-exit-time-destructors -Wno-missing-braces -Wparentheses -Wswitch -Wno-unused-function -Wno-unused-label -Wno-unused-parameter -Wno-unused-variable -Wunused-value -Wno-empty-body -Wno-uninitialized -Wno-unknown-pragmas -w -Wno-shadow -Wno-four-char-constants -Wno-conversion -Wno-constant-conversion -Wno-int-conversion -Wno-bool-conversion -Wno-enum-conversion -Wno-float-conversion -Wno-non-literal-null-conversion -Wno-objc-literal-conversion -Wno-shorten-64-to-32 -Wno-newline-eof -Wno-c++11-extensions -Wno-implicit-fallthrough -fstrict-aliasing -Wdeprecated-declarations -Winvalid-offsetof -Wno-sign-conversion -Wno-infinite-recursion -Wno-move -Wno-comma -Wno-block-capture-autoreleasing -Wno-strict-prototypes -Wno-range-loop-analysis -Wno-semicolon-before-method-body -index-store-path /Users/admin/builder/spi-builder-workspace/.derivedData/Index.noindex/DataStore @/Users/admin/builder/spi-builder-workspace/.derivedData/Build/Intermediates.noindex/RealmDatabase.build/Debug-watchos/RealmCore.build/Objects-normal/armv7k/82b82416624d2658e5098eb0a28c15c5-common-args.resp -MMD -MT dependencies -MF /Users/admin/builder/spi-builder-workspace/.derivedData/Build/Intermediates.noindex/RealmDatabase.build/Debug-watchos/RealmCore.build/Objects-normal/armv7k/timestamp_logger.d --serialize-diagnostics /Users/admin/builder/spi-builder-workspace/.derivedData/Build/Intermediates.noindex/RealmDatabase.build/Debug-watchos/RealmCore.build/Objects-normal/armv7k/timestamp_logger.dia -c /Users/admin/builder/spi-builder-workspace/.dependencies/checkouts/realm-core/src/realm/util/timestamp_logger.cpp -o /Users/admin/builder/spi-builder-workspace/.derivedData/Build/Intermediates.noindex/RealmDatabase.build/Debug-watchos/RealmCore.build/Objects-normal/armv7k/timestamp_logger.o -index-unit-output-path /RealmDatabase.build/Debug-watchos/RealmCore.build/Objects-normal/armv7k/timestamp_logger.o
CompileC /Users/admin/builder/spi-builder-workspace/.derivedData/Build/Intermediates.noindex/RealmDatabase.build/Debug-watchos/RealmCore.build/Objects-normal/armv7k/timestamp_formatter.o /Users/admin/builder/spi-builder-workspace/.dependencies/checkouts/realm-core/src/realm/util/timestamp_formatter.cpp normal armv7k c++ com.apple.compilers.llvm.clang.1_0.compiler (in target 'RealmCore' from project 'RealmDatabase')
cd /Users/admin/builder/spi-builder-workspace/.swiftpm/xcode
Using response file: /Users/admin/builder/spi-builder-workspace/.derivedData/Build/Intermediates.noindex/RealmDatabase.build/Debug-watchos/RealmCore.build/Objects-normal/armv7k/82b82416624d2658e5098eb0a28c15c5-common-args.resp
/Applications/Xcode-16.1.0.app/Contents/Developer/Toolchains/XcodeDefault.xctoolchain/usr/bin/clang -x c++ -ivfsstatcache /Users/admin/builder/spi-builder-workspace/.derivedData/SDKStatCaches.noindex/watchos11.1-22R574-7b9df0bda16bb4641b33636c68f04660.sdkstatcache -fmessage-length\=0 -fdiagnostics-show-note-include-stack -fmacro-backtrace-limit\=0 -fno-color-diagnostics -fmodules-prune-interval\=86400 -fmodules-prune-after\=345600 -fbuild-session-file\=/Users/admin/builder/spi-builder-workspace/.derivedData/ModuleCache.noindex/Session.modulevalidation -fmodules-validate-once-per-build-session -Wnon-modular-include-in-framework-module -Werror\=non-modular-include-in-framework-module -Wno-trigraphs -Wno-missing-field-initializers -Wno-missing-prototypes -Wno-return-type -Wno-non-virtual-dtor -Wno-overloaded-virtual -Wno-exit-time-destructors -Wno-missing-braces -Wparentheses -Wswitch -Wno-unused-function -Wno-unused-label -Wno-unused-parameter -Wno-unused-variable -Wunused-value -Wno-empty-body -Wno-uninitialized -Wno-unknown-pragmas -w -Wno-shadow -Wno-four-char-constants -Wno-conversion -Wno-constant-conversion -Wno-int-conversion -Wno-bool-conversion -Wno-enum-conversion -Wno-float-conversion -Wno-non-literal-null-conversion -Wno-objc-literal-conversion -Wno-shorten-64-to-32 -Wno-newline-eof -Wno-c++11-extensions -Wno-implicit-fallthrough -fstrict-aliasing -Wdeprecated-declarations -Winvalid-offsetof -Wno-sign-conversion -Wno-infinite-recursion -Wno-move -Wno-comma -Wno-block-capture-autoreleasing -Wno-strict-prototypes -Wno-range-loop-analysis -Wno-semicolon-before-method-body -index-store-path /Users/admin/builder/spi-builder-workspace/.derivedData/Index.noindex/DataStore @/Users/admin/builder/spi-builder-workspace/.derivedData/Build/Intermediates.noindex/RealmDatabase.build/Debug-watchos/RealmCore.build/Objects-normal/armv7k/82b82416624d2658e5098eb0a28c15c5-common-args.resp -MMD -MT dependencies -MF /Users/admin/builder/spi-builder-workspace/.derivedData/Build/Intermediates.noindex/RealmDatabase.build/Debug-watchos/RealmCore.build/Objects-normal/armv7k/timestamp_formatter.d --serialize-diagnostics /Users/admin/builder/spi-builder-workspace/.derivedData/Build/Intermediates.noindex/RealmDatabase.build/Debug-watchos/RealmCore.build/Objects-normal/armv7k/timestamp_formatter.dia -c /Users/admin/builder/spi-builder-workspace/.dependencies/checkouts/realm-core/src/realm/util/timestamp_formatter.cpp -o /Users/admin/builder/spi-builder-workspace/.derivedData/Build/Intermediates.noindex/RealmDatabase.build/Debug-watchos/RealmCore.build/Objects-normal/armv7k/timestamp_formatter.o -index-unit-output-path /RealmDatabase.build/Debug-watchos/RealmCore.build/Objects-normal/armv7k/timestamp_formatter.o
CompileC /Users/admin/builder/spi-builder-workspace/.derivedData/Build/Intermediates.noindex/RealmDatabase.build/Debug-watchos/RealmCore.build/Objects-normal/armv7k/time.o /Users/admin/builder/spi-builder-workspace/.dependencies/checkouts/realm-core/src/realm/util/time.cpp normal armv7k c++ com.apple.compilers.llvm.clang.1_0.compiler (in target 'RealmCore' from project 'RealmDatabase')
cd /Users/admin/builder/spi-builder-workspace/.swiftpm/xcode
Using response file: /Users/admin/builder/spi-builder-workspace/.derivedData/Build/Intermediates.noindex/RealmDatabase.build/Debug-watchos/RealmCore.build/Objects-normal/armv7k/82b82416624d2658e5098eb0a28c15c5-common-args.resp
/Applications/Xcode-16.1.0.app/Contents/Developer/Toolchains/XcodeDefault.xctoolchain/usr/bin/clang -x c++ -ivfsstatcache /Users/admin/builder/spi-builder-workspace/.derivedData/SDKStatCaches.noindex/watchos11.1-22R574-7b9df0bda16bb4641b33636c68f04660.sdkstatcache -fmessage-length\=0 -fdiagnostics-show-note-include-stack -fmacro-backtrace-limit\=0 -fno-color-diagnostics -fmodules-prune-interval\=86400 -fmodules-prune-after\=345600 -fbuild-session-file\=/Users/admin/builder/spi-builder-workspace/.derivedData/ModuleCache.noindex/Session.modulevalidation -fmodules-validate-once-per-build-session -Wnon-modular-include-in-framework-module -Werror\=non-modular-include-in-framework-module -Wno-trigraphs -Wno-missing-field-initializers -Wno-missing-prototypes -Wno-return-type -Wno-non-virtual-dtor -Wno-overloaded-virtual -Wno-exit-time-destructors -Wno-missing-braces -Wparentheses -Wswitch -Wno-unused-function -Wno-unused-label -Wno-unused-parameter -Wno-unused-variable -Wunused-value -Wno-empty-body -Wno-uninitialized -Wno-unknown-pragmas -w -Wno-shadow -Wno-four-char-constants -Wno-conversion -Wno-constant-conversion -Wno-int-conversion -Wno-bool-conversion -Wno-enum-conversion -Wno-float-conversion -Wno-non-literal-null-conversion -Wno-objc-literal-conversion -Wno-shorten-64-to-32 -Wno-newline-eof -Wno-c++11-extensions -Wno-implicit-fallthrough -fstrict-aliasing -Wdeprecated-declarations -Winvalid-offsetof -Wno-sign-conversion -Wno-infinite-recursion -Wno-move -Wno-comma -Wno-block-capture-autoreleasing -Wno-strict-prototypes -Wno-range-loop-analysis -Wno-semicolon-before-method-body -index-store-path /Users/admin/builder/spi-builder-workspace/.derivedData/Index.noindex/DataStore @/Users/admin/builder/spi-builder-workspace/.derivedData/Build/Intermediates.noindex/RealmDatabase.build/Debug-watchos/RealmCore.build/Objects-normal/armv7k/82b82416624d2658e5098eb0a28c15c5-common-args.resp -MMD -MT dependencies -MF /Users/admin/builder/spi-builder-workspace/.derivedData/Build/Intermediates.noindex/RealmDatabase.build/Debug-watchos/RealmCore.build/Objects-normal/armv7k/time.d --serialize-diagnostics /Users/admin/builder/spi-builder-workspace/.derivedData/Build/Intermediates.noindex/RealmDatabase.build/Debug-watchos/RealmCore.build/Objects-normal/armv7k/time.dia -c /Users/admin/builder/spi-builder-workspace/.dependencies/checkouts/realm-core/src/realm/util/time.cpp -o /Users/admin/builder/spi-builder-workspace/.derivedData/Build/Intermediates.noindex/RealmDatabase.build/Debug-watchos/RealmCore.build/Objects-normal/armv7k/time.o -index-unit-output-path /RealmDatabase.build/Debug-watchos/RealmCore.build/Objects-normal/armv7k/time.o
CompileC /Users/admin/builder/spi-builder-workspace/.derivedData/Build/Intermediates.noindex/RealmDatabase.build/Debug-watchos/RealmCore.build/Objects-normal/armv7k/thread_safe_reference.o /Users/admin/builder/spi-builder-workspace/.dependencies/checkouts/realm-core/src/realm/object-store/thread_safe_reference.cpp normal armv7k c++ com.apple.compilers.llvm.clang.1_0.compiler (in target 'RealmCore' from project 'RealmDatabase')
cd /Users/admin/builder/spi-builder-workspace/.swiftpm/xcode
Using response file: /Users/admin/builder/spi-builder-workspace/.derivedData/Build/Intermediates.noindex/RealmDatabase.build/Debug-watchos/RealmCore.build/Objects-normal/armv7k/82b82416624d2658e5098eb0a28c15c5-common-args.resp
/Applications/Xcode-16.1.0.app/Contents/Developer/Toolchains/XcodeDefault.xctoolchain/usr/bin/clang -x c++ -ivfsstatcache /Users/admin/builder/spi-builder-workspace/.derivedData/SDKStatCaches.noindex/watchos11.1-22R574-7b9df0bda16bb4641b33636c68f04660.sdkstatcache -fmessage-length\=0 -fdiagnostics-show-note-include-stack -fmacro-backtrace-limit\=0 -fno-color-diagnostics -fmodules-prune-interval\=86400 -fmodules-prune-after\=345600 -fbuild-session-file\=/Users/admin/builder/spi-builder-workspace/.derivedData/ModuleCache.noindex/Session.modulevalidation -fmodules-validate-once-per-build-session -Wnon-modular-include-in-framework-module -Werror\=non-modular-include-in-framework-module -Wno-trigraphs -Wno-missing-field-initializers -Wno-missing-prototypes -Wno-return-type -Wno-non-virtual-dtor -Wno-overloaded-virtual -Wno-exit-time-destructors -Wno-missing-braces -Wparentheses -Wswitch -Wno-unused-function -Wno-unused-label -Wno-unused-parameter -Wno-unused-variable -Wunused-value -Wno-empty-body -Wno-uninitialized -Wno-unknown-pragmas -w -Wno-shadow -Wno-four-char-constants -Wno-conversion -Wno-constant-conversion -Wno-int-conversion -Wno-bool-conversion -Wno-enum-conversion -Wno-float-conversion -Wno-non-literal-null-conversion -Wno-objc-literal-conversion -Wno-shorten-64-to-32 -Wno-newline-eof -Wno-c++11-extensions -Wno-implicit-fallthrough -fstrict-aliasing -Wdeprecated-declarations -Winvalid-offsetof -Wno-sign-conversion -Wno-infinite-recursion -Wno-move -Wno-comma -Wno-block-capture-autoreleasing -Wno-strict-prototypes -Wno-range-loop-analysis -Wno-semicolon-before-method-body -index-store-path /Users/admin/builder/spi-builder-workspace/.derivedData/Index.noindex/DataStore @/Users/admin/builder/spi-builder-workspace/.derivedData/Build/Intermediates.noindex/RealmDatabase.build/Debug-watchos/RealmCore.build/Objects-normal/armv7k/82b82416624d2658e5098eb0a28c15c5-common-args.resp -MMD -MT dependencies -MF /Users/admin/builder/spi-builder-workspace/.derivedData/Build/Intermediates.noindex/RealmDatabase.build/Debug-watchos/RealmCore.build/Objects-normal/armv7k/thread_safe_reference.d --serialize-diagnostics /Users/admin/builder/spi-builder-workspace/.derivedData/Build/Intermediates.noindex/RealmDatabase.build/Debug-watchos/RealmCore.build/Objects-normal/armv7k/thread_safe_reference.dia -c /Users/admin/builder/spi-builder-workspace/.dependencies/checkouts/realm-core/src/realm/object-store/thread_safe_reference.cpp -o /Users/admin/builder/spi-builder-workspace/.derivedData/Build/Intermediates.noindex/RealmDatabase.build/Debug-watchos/RealmCore.build/Objects-normal/armv7k/thread_safe_reference.o -index-unit-output-path /RealmDatabase.build/Debug-watchos/RealmCore.build/Objects-normal/armv7k/thread_safe_reference.o
Ld /Users/admin/builder/spi-builder-workspace/.derivedData/Build/Intermediates.noindex/RealmDatabase.build/Debug-watchos/s2geometry.build/Objects-normal/arm64/Binary/s2geometry.o normal arm64 (in target 's2geometry' from project 'RealmDatabase')
cd /Users/admin/builder/spi-builder-workspace/.dependencies/checkouts/realm-core
/Applications/Xcode-16.1.0.app/Contents/Developer/Toolchains/XcodeDefault.xctoolchain/usr/bin/clang++ -Xlinker -reproducible -target arm64-apple-watchos4.0 -r -isysroot /Applications/Xcode-16.1.0.app/Contents/Developer/Platforms/WatchOS.platform/Developer/SDKs/WatchOS11.1.sdk -O0 -w -L/Users/admin/builder/spi-builder-workspace/.derivedData/Build/Intermediates.noindex/EagerLinkingTBDs/Debug-watchos -L/Users/admin/builder/spi-builder-workspace/.derivedData/Build/Products/Debug-watchos -L/Applications/Xcode-16.1.0.app/Contents/Developer/Platforms/WatchOS.platform/Developer/usr/lib -F/Users/admin/builder/spi-builder-workspace/.derivedData/Build/Intermediates.noindex/EagerLinkingTBDs/Debug-watchos -F/Users/admin/builder/spi-builder-workspace/.derivedData/Build/Products/Debug-watchos -iframework /Applications/Xcode-16.1.0.app/Contents/Developer/Platforms/WatchOS.platform/Developer/Library/Frameworks -iframework /Applications/Xcode-16.1.0.app/Contents/Developer/Platforms/WatchOS.platform/Developer/SDKs/WatchOS11.1.sdk/Developer/Library/Frameworks -filelist /Users/admin/builder/spi-builder-workspace/.derivedData/Build/Intermediates.noindex/RealmDatabase.build/Debug-watchos/s2geometry.build/Objects-normal/arm64/s2geometry.LinkFileList -nostdlib -Xlinker -object_path_lto -Xlinker /Users/admin/builder/spi-builder-workspace/.derivedData/Build/Intermediates.noindex/RealmDatabase.build/Debug-watchos/s2geometry.build/Objects-normal/arm64/s2geometry_lto.o -Xlinker -export_dynamic -Xlinker -no_deduplicate -Xlinker -debug_variant -Xlinker -dependency_info -Xlinker /Users/admin/builder/spi-builder-workspace/.derivedData/Build/Intermediates.noindex/RealmDatabase.build/Debug-watchos/s2geometry.build/Objects-normal/arm64/s2geometry_dependency_info.dat -o /Users/admin/builder/spi-builder-workspace/.derivedData/Build/Intermediates.noindex/RealmDatabase.build/Debug-watchos/s2geometry.build/Objects-normal/arm64/Binary/s2geometry.o
CompileC /Users/admin/builder/spi-builder-workspace/.derivedData/Build/Intermediates.noindex/RealmDatabase.build/Debug-watchos/RealmCore.build/Objects-normal/armv7k/thread.o /Users/admin/builder/spi-builder-workspace/.dependencies/checkouts/realm-core/src/realm/util/thread.cpp normal armv7k c++ com.apple.compilers.llvm.clang.1_0.compiler (in target 'RealmCore' from project 'RealmDatabase')
cd /Users/admin/builder/spi-builder-workspace/.swiftpm/xcode
Using response file: /Users/admin/builder/spi-builder-workspace/.derivedData/Build/Intermediates.noindex/RealmDatabase.build/Debug-watchos/RealmCore.build/Objects-normal/armv7k/82b82416624d2658e5098eb0a28c15c5-common-args.resp
/Applications/Xcode-16.1.0.app/Contents/Developer/Toolchains/XcodeDefault.xctoolchain/usr/bin/clang -x c++ -ivfsstatcache /Users/admin/builder/spi-builder-workspace/.derivedData/SDKStatCaches.noindex/watchos11.1-22R574-7b9df0bda16bb4641b33636c68f04660.sdkstatcache -fmessage-length\=0 -fdiagnostics-show-note-include-stack -fmacro-backtrace-limit\=0 -fno-color-diagnostics -fmodules-prune-interval\=86400 -fmodules-prune-after\=345600 -fbuild-session-file\=/Users/admin/builder/spi-builder-workspace/.derivedData/ModuleCache.noindex/Session.modulevalidation -fmodules-validate-once-per-build-session -Wnon-modular-include-in-framework-module -Werror\=non-modular-include-in-framework-module -Wno-trigraphs -Wno-missing-field-initializers -Wno-missing-prototypes -Wno-return-type -Wno-non-virtual-dtor -Wno-overloaded-virtual -Wno-exit-time-destructors -Wno-missing-braces -Wparentheses -Wswitch -Wno-unused-function -Wno-unused-label -Wno-unused-parameter -Wno-unused-variable -Wunused-value -Wno-empty-body -Wno-uninitialized -Wno-unknown-pragmas -w -Wno-shadow -Wno-four-char-constants -Wno-conversion -Wno-constant-conversion -Wno-int-conversion -Wno-bool-conversion -Wno-enum-conversion -Wno-float-conversion -Wno-non-literal-null-conversion -Wno-objc-literal-conversion -Wno-shorten-64-to-32 -Wno-newline-eof -Wno-c++11-extensions -Wno-implicit-fallthrough -fstrict-aliasing -Wdeprecated-declarations -Winvalid-offsetof -Wno-sign-conversion -Wno-infinite-recursion -Wno-move -Wno-comma -Wno-block-capture-autoreleasing -Wno-strict-prototypes -Wno-range-loop-analysis -Wno-semicolon-before-method-body -index-store-path /Users/admin/builder/spi-builder-workspace/.derivedData/Index.noindex/DataStore @/Users/admin/builder/spi-builder-workspace/.derivedData/Build/Intermediates.noindex/RealmDatabase.build/Debug-watchos/RealmCore.build/Objects-normal/armv7k/82b82416624d2658e5098eb0a28c15c5-common-args.resp -MMD -MT dependencies -MF /Users/admin/builder/spi-builder-workspace/.derivedData/Build/Intermediates.noindex/RealmDatabase.build/Debug-watchos/RealmCore.build/Objects-normal/armv7k/thread.d --serialize-diagnostics /Users/admin/builder/spi-builder-workspace/.derivedData/Build/Intermediates.noindex/RealmDatabase.build/Debug-watchos/RealmCore.build/Objects-normal/armv7k/thread.dia -c /Users/admin/builder/spi-builder-workspace/.dependencies/checkouts/realm-core/src/realm/util/thread.cpp -o /Users/admin/builder/spi-builder-workspace/.derivedData/Build/Intermediates.noindex/RealmDatabase.build/Debug-watchos/RealmCore.build/Objects-normal/armv7k/thread.o -index-unit-output-path /RealmDatabase.build/Debug-watchos/RealmCore.build/Objects-normal/armv7k/thread.o
CompileC /Users/admin/builder/spi-builder-workspace/.derivedData/Build/Intermediates.noindex/RealmDatabase.build/Debug-watchos/RealmCore.build/Objects-normal/armv7k/terminate.o /Users/admin/builder/spi-builder-workspace/.dependencies/checkouts/realm-core/src/realm/util/terminate.cpp normal armv7k c++ com.apple.compilers.llvm.clang.1_0.compiler (in target 'RealmCore' from project 'RealmDatabase')
cd /Users/admin/builder/spi-builder-workspace/.swiftpm/xcode
Using response file: /Users/admin/builder/spi-builder-workspace/.derivedData/Build/Intermediates.noindex/RealmDatabase.build/Debug-watchos/RealmCore.build/Objects-normal/armv7k/82b82416624d2658e5098eb0a28c15c5-common-args.resp
/Applications/Xcode-16.1.0.app/Contents/Developer/Toolchains/XcodeDefault.xctoolchain/usr/bin/clang -x c++ -ivfsstatcache /Users/admin/builder/spi-builder-workspace/.derivedData/SDKStatCaches.noindex/watchos11.1-22R574-7b9df0bda16bb4641b33636c68f04660.sdkstatcache -fmessage-length\=0 -fdiagnostics-show-note-include-stack -fmacro-backtrace-limit\=0 -fno-color-diagnostics -fmodules-prune-interval\=86400 -fmodules-prune-after\=345600 -fbuild-session-file\=/Users/admin/builder/spi-builder-workspace/.derivedData/ModuleCache.noindex/Session.modulevalidation -fmodules-validate-once-per-build-session -Wnon-modular-include-in-framework-module -Werror\=non-modular-include-in-framework-module -Wno-trigraphs -Wno-missing-field-initializers -Wno-missing-prototypes -Wno-return-type -Wno-non-virtual-dtor -Wno-overloaded-virtual -Wno-exit-time-destructors -Wno-missing-braces -Wparentheses -Wswitch -Wno-unused-function -Wno-unused-label -Wno-unused-parameter -Wno-unused-variable -Wunused-value -Wno-empty-body -Wno-uninitialized -Wno-unknown-pragmas -w -Wno-shadow -Wno-four-char-constants -Wno-conversion -Wno-constant-conversion -Wno-int-conversion -Wno-bool-conversion -Wno-enum-conversion -Wno-float-conversion -Wno-non-literal-null-conversion -Wno-objc-literal-conversion -Wno-shorten-64-to-32 -Wno-newline-eof -Wno-c++11-extensions -Wno-implicit-fallthrough -fstrict-aliasing -Wdeprecated-declarations -Winvalid-offsetof -Wno-sign-conversion -Wno-infinite-recursion -Wno-move -Wno-comma -Wno-block-capture-autoreleasing -Wno-strict-prototypes -Wno-range-loop-analysis -Wno-semicolon-before-method-body -index-store-path /Users/admin/builder/spi-builder-workspace/.derivedData/Index.noindex/DataStore @/Users/admin/builder/spi-builder-workspace/.derivedData/Build/Intermediates.noindex/RealmDatabase.build/Debug-watchos/RealmCore.build/Objects-normal/armv7k/82b82416624d2658e5098eb0a28c15c5-common-args.resp -MMD -MT dependencies -MF /Users/admin/builder/spi-builder-workspace/.derivedData/Build/Intermediates.noindex/RealmDatabase.build/Debug-watchos/RealmCore.build/Objects-normal/armv7k/terminate.d --serialize-diagnostics /Users/admin/builder/spi-builder-workspace/.derivedData/Build/Intermediates.noindex/RealmDatabase.build/Debug-watchos/RealmCore.build/Objects-normal/armv7k/terminate.dia -c /Users/admin/builder/spi-builder-workspace/.dependencies/checkouts/realm-core/src/realm/util/terminate.cpp -o /Users/admin/builder/spi-builder-workspace/.derivedData/Build/Intermediates.noindex/RealmDatabase.build/Debug-watchos/RealmCore.build/Objects-normal/armv7k/terminate.o -index-unit-output-path /RealmDatabase.build/Debug-watchos/RealmCore.build/Objects-normal/armv7k/terminate.o
CompileC /Users/admin/builder/spi-builder-workspace/.derivedData/Build/Intermediates.noindex/RealmDatabase.build/Debug-watchos/RealmCore.build/Objects-normal/armv7k/table_view.o /Users/admin/builder/spi-builder-workspace/.dependencies/checkouts/realm-core/src/realm/table_view.cpp normal armv7k c++ com.apple.compilers.llvm.clang.1_0.compiler (in target 'RealmCore' from project 'RealmDatabase')
cd /Users/admin/builder/spi-builder-workspace/.swiftpm/xcode
Using response file: /Users/admin/builder/spi-builder-workspace/.derivedData/Build/Intermediates.noindex/RealmDatabase.build/Debug-watchos/RealmCore.build/Objects-normal/armv7k/82b82416624d2658e5098eb0a28c15c5-common-args.resp
/Applications/Xcode-16.1.0.app/Contents/Developer/Toolchains/XcodeDefault.xctoolchain/usr/bin/clang -x c++ -ivfsstatcache /Users/admin/builder/spi-builder-workspace/.derivedData/SDKStatCaches.noindex/watchos11.1-22R574-7b9df0bda16bb4641b33636c68f04660.sdkstatcache -fmessage-length\=0 -fdiagnostics-show-note-include-stack -fmacro-backtrace-limit\=0 -fno-color-diagnostics -fmodules-prune-interval\=86400 -fmodules-prune-after\=345600 -fbuild-session-file\=/Users/admin/builder/spi-builder-workspace/.derivedData/ModuleCache.noindex/Session.modulevalidation -fmodules-validate-once-per-build-session -Wnon-modular-include-in-framework-module -Werror\=non-modular-include-in-framework-module -Wno-trigraphs -Wno-missing-field-initializers -Wno-missing-prototypes -Wno-return-type -Wno-non-virtual-dtor -Wno-overloaded-virtual -Wno-exit-time-destructors -Wno-missing-braces -Wparentheses -Wswitch -Wno-unused-function -Wno-unused-label -Wno-unused-parameter -Wno-unused-variable -Wunused-value -Wno-empty-body -Wno-uninitialized -Wno-unknown-pragmas -w -Wno-shadow -Wno-four-char-constants -Wno-conversion -Wno-constant-conversion -Wno-int-conversion -Wno-bool-conversion -Wno-enum-conversion -Wno-float-conversion -Wno-non-literal-null-conversion -Wno-objc-literal-conversion -Wno-shorten-64-to-32 -Wno-newline-eof -Wno-c++11-extensions -Wno-implicit-fallthrough -fstrict-aliasing -Wdeprecated-declarations -Winvalid-offsetof -Wno-sign-conversion -Wno-infinite-recursion -Wno-move -Wno-comma -Wno-block-capture-autoreleasing -Wno-strict-prototypes -Wno-range-loop-analysis -Wno-semicolon-before-method-body -index-store-path /Users/admin/builder/spi-builder-workspace/.derivedData/Index.noindex/DataStore @/Users/admin/builder/spi-builder-workspace/.derivedData/Build/Intermediates.noindex/RealmDatabase.build/Debug-watchos/RealmCore.build/Objects-normal/armv7k/82b82416624d2658e5098eb0a28c15c5-common-args.resp -MMD -MT dependencies -MF /Users/admin/builder/spi-builder-workspace/.derivedData/Build/Intermediates.noindex/RealmDatabase.build/Debug-watchos/RealmCore.build/Objects-normal/armv7k/table_view.d --serialize-diagnostics /Users/admin/builder/spi-builder-workspace/.derivedData/Build/Intermediates.noindex/RealmDatabase.build/Debug-watchos/RealmCore.build/Objects-normal/armv7k/table_view.dia -c /Users/admin/builder/spi-builder-workspace/.dependencies/checkouts/realm-core/src/realm/table_view.cpp -o /Users/admin/builder/spi-builder-workspace/.derivedData/Build/Intermediates.noindex/RealmDatabase.build/Debug-watchos/RealmCore.build/Objects-normal/armv7k/table_view.o -index-unit-output-path /RealmDatabase.build/Debug-watchos/RealmCore.build/Objects-normal/armv7k/table_view.o
** BUILD FAILED **
The following build commands failed:
EmitSwiftModule normal arm64 (in target 'RealmSwift' from project 'Realm')
SwiftEmitModule normal arm64 Emitting\ module\ for\ RealmSwift (in target 'RealmSwift' from project 'Realm')
Building workspace spi-builder-workspace with scheme RealmSwiftMacro-Package
(3 failures)
BUILD FAILURE 6.0 watchOS