The Swift Package Index logo.Swift Package Index

Track the adoption of Swift 6 strict concurrency checks for data race safety. How many packages are Ready for Swift 6?

Build Information

Failed to build Base32, reference 0.9.0 (c4bc0a), with Swift 6.0 for macOS (Xcode) using Xcode 16.2 on 27 Nov 2024 18:12:04 UTC.

Build Command

env DEVELOPER_DIR=/Applications/Xcode-16.1.0.app xcrun xcodebuild -IDEClonedSourcePackagesDirPathOverride=$PWD/.dependencies -skipMacroValidation -skipPackagePluginValidation -derivedDataPath $PWD/.derivedData build -scheme Base32 -destination platform=macOS,arch=arm64 OTHER_SWIFT_FLAGS=-stats-output-dir .stats -strict-concurrency=complete -enable-upcoming-feature StrictConcurrency -enable-upcoming-feature DisableOutwardActorInference -enable-upcoming-feature GlobalActorIsolatedTypesUsability -enable-upcoming-feature InferSendableFromCaptures

Build Log

========================================
RunAll
========================================
Builder version: 4.58.0
Interrupt handler set up.
========================================
Checkout
========================================
Clone URL: https://github.com/norio-nomura/Base32.git
Reference: 0.9.0
Initialized empty Git repository in /Users/admin/builder/spi-builder-workspace/.git/
From https://github.com/norio-nomura/Base32
 * tag               0.9.0      -> FETCH_HEAD
HEAD is now at c4bc0a4 Release 0.9.0
Cloned https://github.com/norio-nomura/Base32.git
Revision (git rev-parse @):
c4bc0a49689999ae2c7c778f3830a6a6e694efb8
SUCCESS checkout https://github.com/norio-nomura/Base32.git at 0.9.0
========================================
Build
========================================
Selected platform:         macosXcodebuild
Swift version:             6.0
Building package at path:  $PWD
https://github.com/norio-nomura/Base32.git
Command line invocation:
    /Applications/Xcode-16.1.0.app/Contents/Developer/usr/bin/xcodebuild -IDEClonedSourcePackagesDirPathOverride=/Users/admin/builder/spi-builder-workspace/.dependencies -resolvePackageDependencies
User defaults from command line:
    IDEClonedSourcePackagesDirPathOverride = /Users/admin/builder/spi-builder-workspace/.dependencies
    IDEPackageSupportUseBuiltinSCM = YES
resolved source packages:
{
  "dependencies" : [
  ],
  "manifest_display_name" : "Base32",
  "name" : "Base32",
  "path" : "/Users/admin/builder/spi-builder-workspace",
  "platforms" : [
  ],
  "products" : [
    {
      "name" : "Base32",
      "targets" : [
        "Base32"
      ],
      "type" : {
        "library" : [
          "automatic"
        ]
      }
    }
  ],
  "swift_languages_versions" : [
    "4",
    "4.2",
    "5"
  ],
  "targets" : [
    {
      "c99name" : "SecEncodeTransformTests",
      "module_type" : "SwiftTarget",
      "name" : "SecEncodeTransformTests",
      "path" : "Tests/SecEncodeTransformTests",
      "sources" : [
        "SecEncodeTransformTests.swift",
        "TTTDataTransformer.swift"
      ],
      "target_dependencies" : [
        "Base32"
      ],
      "type" : "test"
    },
    {
      "c99name" : "Base32Tests",
      "module_type" : "SwiftTarget",
      "name" : "Base32Tests",
      "path" : "Tests/Base32Tests",
      "sources" : [
        "Base16Tests.swift",
        "Base32Tests.swift",
        "StringExtensionTests.swift"
      ],
      "target_dependencies" : [
        "Base32"
      ],
      "type" : "test"
    },
    {
      "c99name" : "Base32",
      "module_type" : "SwiftTarget",
      "name" : "Base32",
      "path" : "Sources/Base32",
      "product_memberships" : [
        "Base32"
      ],
      "sources" : [
        "Base16.swift",
        "Base32.swift",
        "StringExtension.swift",
        "shim.swift"
      ],
      "type" : "library"
    }
  ],
  "tools_version" : "4.2"
}
{
  "project" : {
    "configurations" : [
      "Debug",
      "Release"
    ],
    "name" : "Base32",
    "schemes" : [
      "Base32"
    ],
    "targets" : [
      "Base32",
      "Base32Tests",
      "SecEncodeTransformTests"
    ]
  }
}
Running build ...
env DEVELOPER_DIR=/Applications/Xcode-16.1.0.app xcrun xcodebuild -IDEClonedSourcePackagesDirPathOverride=$PWD/.dependencies -skipMacroValidation -skipPackagePluginValidation -derivedDataPath $PWD/.derivedData build -scheme Base32 -destination platform=macOS,arch=arm64 OTHER_SWIFT_FLAGS=-stats-output-dir .stats -strict-concurrency=complete -enable-upcoming-feature StrictConcurrency -enable-upcoming-feature DisableOutwardActorInference -enable-upcoming-feature GlobalActorIsolatedTypesUsability -enable-upcoming-feature InferSendableFromCaptures
Command line invocation:
    /Applications/Xcode-16.1.0.app/Contents/Developer/usr/bin/xcodebuild -IDEClonedSourcePackagesDirPathOverride=/Users/admin/builder/spi-builder-workspace/.dependencies -skipMacroValidation -skipPackagePluginValidation -derivedDataPath /Users/admin/builder/spi-builder-workspace/.derivedData build -scheme Base32 -destination platform=macOS,arch=arm64 "OTHER_SWIFT_FLAGS=-stats-output-dir .stats -strict-concurrency=complete -enable-upcoming-feature StrictConcurrency -enable-upcoming-feature DisableOutwardActorInference -enable-upcoming-feature GlobalActorIsolatedTypesUsability -enable-upcoming-feature InferSendableFromCaptures"
User defaults from command line:
    IDEClonedSourcePackagesDirPathOverride = /Users/admin/builder/spi-builder-workspace/.dependencies
    IDEDerivedDataPathOverride = /Users/admin/builder/spi-builder-workspace/.derivedData
    IDEPackageSupportUseBuiltinSCM = YES
Build settings from command line:
    OTHER_SWIFT_FLAGS = -stats-output-dir .stats -strict-concurrency=complete -enable-upcoming-feature StrictConcurrency -enable-upcoming-feature DisableOutwardActorInference -enable-upcoming-feature GlobalActorIsolatedTypesUsability -enable-upcoming-feature InferSendableFromCaptures
Prepare packages
ComputeTargetDependencyGraph
note: Building targets in dependency order
note: Target dependency graph (1 target)
    Target 'Base32' in project 'Base32' (no dependencies)
GatherProvisioningInputs
CreateBuildDescription
ExecuteExternalTool /Applications/Xcode-16.1.0.app/Contents/Developer/Toolchains/XcodeDefault.xctoolchain/usr/bin/clang -v -E -dM -isysroot /Applications/Xcode-16.1.0.app/Contents/Developer/Platforms/MacOSX.platform/Developer/SDKs/MacOSX15.1.sdk -x c -c /dev/null
ExecuteExternalTool /Applications/Xcode-16.1.0.app/Contents/Developer/Toolchains/XcodeDefault.xctoolchain/usr/bin/swiftc --version
ExecuteExternalTool /Applications/Xcode-16.1.0.app/Contents/Developer/Toolchains/XcodeDefault.xctoolchain/usr/bin/ld -version_details
Build description signature: 93965552ed8d3b88311d73a4b595a1af
Build description path: /Users/admin/builder/spi-builder-workspace/.derivedData/Build/Intermediates.noindex/XCBuildData/93965552ed8d3b88311d73a4b595a1af.xcbuilddata
ClangStatCache /Applications/Xcode-16.1.0.app/Contents/Developer/Toolchains/XcodeDefault.xctoolchain/usr/bin/clang-stat-cache /Applications/Xcode-16.1.0.app/Contents/Developer/Platforms/MacOSX.platform/Developer/SDKs/MacOSX15.1.sdk /Users/admin/builder/spi-builder-workspace/.derivedData/SDKStatCaches.noindex/macosx15.1-24B75-44d23fded74b714c58e69ec4af40d824.sdkstatcache
    cd /Users/admin/builder/spi-builder-workspace/Base32.xcodeproj
    /Applications/Xcode-16.1.0.app/Contents/Developer/Toolchains/XcodeDefault.xctoolchain/usr/bin/clang-stat-cache /Applications/Xcode-16.1.0.app/Contents/Developer/Platforms/MacOSX.platform/Developer/SDKs/MacOSX15.1.sdk -o /Users/admin/builder/spi-builder-workspace/.derivedData/SDKStatCaches.noindex/macosx15.1-24B75-44d23fded74b714c58e69ec4af40d824.sdkstatcache
CreateBuildDirectory /Users/admin/builder/spi-builder-workspace/.derivedData/Build/Products
    cd /Users/admin/builder/spi-builder-workspace/Base32.xcodeproj
    builtin-create-build-directory /Users/admin/builder/spi-builder-workspace/.derivedData/Build/Products
CreateBuildDirectory /Users/admin/builder/spi-builder-workspace/.derivedData/Build/Intermediates.noindex
    cd /Users/admin/builder/spi-builder-workspace/Base32.xcodeproj
    builtin-create-build-directory /Users/admin/builder/spi-builder-workspace/.derivedData/Build/Intermediates.noindex
CreateBuildDirectory /Users/admin/builder/spi-builder-workspace/.derivedData/Build/Products/Debug
    cd /Users/admin/builder/spi-builder-workspace/Base32.xcodeproj
    builtin-create-build-directory /Users/admin/builder/spi-builder-workspace/.derivedData/Build/Products/Debug
CreateBuildDirectory /Users/admin/builder/spi-builder-workspace/.derivedData/Build/Intermediates.noindex/EagerLinkingTBDs/Debug
    cd /Users/admin/builder/spi-builder-workspace/Base32.xcodeproj
    builtin-create-build-directory /Users/admin/builder/spi-builder-workspace/.derivedData/Build/Intermediates.noindex/EagerLinkingTBDs/Debug
SymLink /Users/admin/builder/spi-builder-workspace/.derivedData/Build/Products/Debug/Base32.framework/Resources Versions/Current/Resources (in target 'Base32' from project 'Base32')
    cd /Users/admin/builder/spi-builder-workspace
    /bin/ln -sfh Versions/Current/Resources /Users/admin/builder/spi-builder-workspace/.derivedData/Build/Products/Debug/Base32.framework/Resources
SymLink /Users/admin/builder/spi-builder-workspace/.derivedData/Build/Products/Debug/Base32.framework/Modules Versions/Current/Modules (in target 'Base32' from project 'Base32')
    cd /Users/admin/builder/spi-builder-workspace
    /bin/ln -sfh Versions/Current/Modules /Users/admin/builder/spi-builder-workspace/.derivedData/Build/Products/Debug/Base32.framework/Modules
SymLink /Users/admin/builder/spi-builder-workspace/.derivedData/Build/Products/Debug/Base32.framework/Versions/Current A (in target 'Base32' from project 'Base32')
    cd /Users/admin/builder/spi-builder-workspace
    /bin/ln -sfh A /Users/admin/builder/spi-builder-workspace/.derivedData/Build/Products/Debug/Base32.framework/Versions/Current
WriteAuxiliaryFile /Users/admin/builder/spi-builder-workspace/.derivedData/Build/Intermediates.noindex/Base32.build/Debug/Base32.build/Objects-normal/arm64/Base32_const_extract_protocols.json (in target 'Base32' from project 'Base32')
    cd /Users/admin/builder/spi-builder-workspace
    write-file /Users/admin/builder/spi-builder-workspace/.derivedData/Build/Intermediates.noindex/Base32.build/Debug/Base32.build/Objects-normal/arm64/Base32_const_extract_protocols.json
WriteAuxiliaryFile /Users/admin/builder/spi-builder-workspace/.derivedData/Build/Intermediates.noindex/Base32.build/Debug/Base32.build/Objects-normal/arm64/Base32.SwiftFileList (in target 'Base32' from project 'Base32')
    cd /Users/admin/builder/spi-builder-workspace
    write-file /Users/admin/builder/spi-builder-workspace/.derivedData/Build/Intermediates.noindex/Base32.build/Debug/Base32.build/Objects-normal/arm64/Base32.SwiftFileList
WriteAuxiliaryFile /Users/admin/builder/spi-builder-workspace/.derivedData/Build/Intermediates.noindex/Base32.build/Debug/Base32.build/Objects-normal/arm64/Base32-OutputFileMap.json (in target 'Base32' from project 'Base32')
    cd /Users/admin/builder/spi-builder-workspace
    write-file /Users/admin/builder/spi-builder-workspace/.derivedData/Build/Intermediates.noindex/Base32.build/Debug/Base32.build/Objects-normal/arm64/Base32-OutputFileMap.json
WriteAuxiliaryFile /Users/admin/builder/spi-builder-workspace/.derivedData/Build/Intermediates.noindex/Base32.build/Debug/Base32.build/Objects-normal/arm64/Base32.SwiftConstValuesFileList (in target 'Base32' from project 'Base32')
    cd /Users/admin/builder/spi-builder-workspace
    write-file /Users/admin/builder/spi-builder-workspace/.derivedData/Build/Intermediates.noindex/Base32.build/Debug/Base32.build/Objects-normal/arm64/Base32.SwiftConstValuesFileList
WriteAuxiliaryFile /Users/admin/builder/spi-builder-workspace/.derivedData/Build/Intermediates.noindex/Base32.build/Debug/Base32.build/Objects-normal/arm64/Base32.LinkFileList (in target 'Base32' from project 'Base32')
    cd /Users/admin/builder/spi-builder-workspace
    write-file /Users/admin/builder/spi-builder-workspace/.derivedData/Build/Intermediates.noindex/Base32.build/Debug/Base32.build/Objects-normal/arm64/Base32.LinkFileList
WriteAuxiliaryFile /Users/admin/builder/spi-builder-workspace/.derivedData/Build/Intermediates.noindex/Base32.build/Debug/Base32.build/Base32.DependencyMetadataFileList (in target 'Base32' from project 'Base32')
    cd /Users/admin/builder/spi-builder-workspace
    write-file /Users/admin/builder/spi-builder-workspace/.derivedData/Build/Intermediates.noindex/Base32.build/Debug/Base32.build/Base32.DependencyMetadataFileList
SymLink /Users/admin/builder/spi-builder-workspace/.derivedData/Build/Products/Debug/Base32.framework/Headers Versions/Current/Headers (in target 'Base32' from project 'Base32')
    cd /Users/admin/builder/spi-builder-workspace
    /bin/ln -sfh Versions/Current/Headers /Users/admin/builder/spi-builder-workspace/.derivedData/Build/Products/Debug/Base32.framework/Headers
SymLink /Users/admin/builder/spi-builder-workspace/.derivedData/Build/Products/Debug/Base32.framework/Base32 Versions/Current/Base32 (in target 'Base32' from project 'Base32')
    cd /Users/admin/builder/spi-builder-workspace
    /bin/ln -sfh Versions/Current/Base32 /Users/admin/builder/spi-builder-workspace/.derivedData/Build/Products/Debug/Base32.framework/Base32
MkDir /Users/admin/builder/spi-builder-workspace/.derivedData/Build/Products/Debug/Base32.framework/Versions/A/Resources (in target 'Base32' from project 'Base32')
    cd /Users/admin/builder/spi-builder-workspace
    /bin/mkdir -p /Users/admin/builder/spi-builder-workspace/.derivedData/Build/Products/Debug/Base32.framework/Versions/A/Resources
MkDir /Users/admin/builder/spi-builder-workspace/.derivedData/Build/Products/Debug/Base32.framework/Versions/A/Headers (in target 'Base32' from project 'Base32')
    cd /Users/admin/builder/spi-builder-workspace
    /bin/mkdir -p /Users/admin/builder/spi-builder-workspace/.derivedData/Build/Products/Debug/Base32.framework/Versions/A/Headers
MkDir /Users/admin/builder/spi-builder-workspace/.derivedData/Build/Products/Debug/Base32.framework/Versions/A (in target 'Base32' from project 'Base32')
    cd /Users/admin/builder/spi-builder-workspace
    /bin/mkdir -p /Users/admin/builder/spi-builder-workspace/.derivedData/Build/Products/Debug/Base32.framework/Versions/A
MkDir /Users/admin/builder/spi-builder-workspace/.derivedData/Build/Products/Debug/Base32.framework/Versions (in target 'Base32' from project 'Base32')
    cd /Users/admin/builder/spi-builder-workspace
    /bin/mkdir -p /Users/admin/builder/spi-builder-workspace/.derivedData/Build/Products/Debug/Base32.framework/Versions
MkDir /Users/admin/builder/spi-builder-workspace/.derivedData/Build/Products/Debug/Base32.framework (in target 'Base32' from project 'Base32')
    cd /Users/admin/builder/spi-builder-workspace
    /bin/mkdir -p /Users/admin/builder/spi-builder-workspace/.derivedData/Build/Products/Debug/Base32.framework
ProcessInfoPlistFile /Users/admin/builder/spi-builder-workspace/.derivedData/Build/Products/Debug/Base32.framework/Versions/A/Resources/Info.plist /Users/admin/builder/spi-builder-workspace/Base32.xcodeproj/Base32_Info.plist (in target 'Base32' from project 'Base32')
    cd /Users/admin/builder/spi-builder-workspace
    builtin-infoPlistUtility /Users/admin/builder/spi-builder-workspace/Base32.xcodeproj/Base32_Info.plist -producttype com.apple.product-type.framework -expandbuildsettings -platform macosx -o /Users/admin/builder/spi-builder-workspace/.derivedData/Build/Products/Debug/Base32.framework/Versions/A/Resources/Info.plist
SwiftDriver Base32 normal arm64 com.apple.xcode.tools.swift.compiler (in target 'Base32' from project 'Base32')
    cd /Users/admin/builder/spi-builder-workspace
    builtin-SwiftDriver -- /Applications/Xcode-16.1.0.app/Contents/Developer/Toolchains/XcodeDefault.xctoolchain/usr/bin/swiftc -module-name Base32 -Onone -enforce-exclusivity\=checked @/Users/admin/builder/spi-builder-workspace/.derivedData/Build/Intermediates.noindex/Base32.build/Debug/Base32.build/Objects-normal/arm64/Base32.SwiftFileList -stats-output-dir .stats -strict-concurrency\=complete -enable-upcoming-feature StrictConcurrency -enable-upcoming-feature DisableOutwardActorInference -enable-upcoming-feature GlobalActorIsolatedTypesUsability -enable-upcoming-feature InferSendableFromCaptures -enable-bare-slash-regex -enable-experimental-feature DebugDescriptionMacro -sdk /Applications/Xcode-16.1.0.app/Contents/Developer/Platforms/MacOSX.platform/Developer/SDKs/MacOSX15.1.sdk -target arm64-apple-macos10.9 -g -module-cache-path /Users/admin/builder/spi-builder-workspace/.derivedData/ModuleCache.noindex -Xfrontend -serialize-debugging-options -application-extension -profile-coverage-mapping -profile-generate -enable-testing -index-store-path /Users/admin/builder/spi-builder-workspace/.derivedData/Index.noindex/DataStore -enable-experimental-feature OpaqueTypeErasure -swift-version 4.2 -I /Users/admin/builder/spi-builder-workspace/.derivedData/Build/Products/Debug -F /Users/admin/builder/spi-builder-workspace/.derivedData/Build/Products/Debug -F /Applications/Xcode-16.1.0.app/Contents/Developer/Platforms/MacOSX.platform/Developer/Library/Frameworks -c -j10 -enable-batch-mode -incremental -Xcc -ivfsstatcache -Xcc /Users/admin/builder/spi-builder-workspace/.derivedData/SDKStatCaches.noindex/macosx15.1-24B75-44d23fded74b714c58e69ec4af40d824.sdkstatcache -output-file-map /Users/admin/builder/spi-builder-workspace/.derivedData/Build/Intermediates.noindex/Base32.build/Debug/Base32.build/Objects-normal/arm64/Base32-OutputFileMap.json -use-frontend-parseable-output -save-temps -no-color-diagnostics -serialize-diagnostics -emit-dependencies -emit-module -emit-module-path /Users/admin/builder/spi-builder-workspace/.derivedData/Build/Intermediates.noindex/Base32.build/Debug/Base32.build/Objects-normal/arm64/Base32.swiftmodule -validate-clang-modules-once -clang-build-session-file /Users/admin/builder/spi-builder-workspace/.derivedData/ModuleCache.noindex/Session.modulevalidation -Xcc -I/Users/admin/builder/spi-builder-workspace/.derivedData/Build/Intermediates.noindex/Base32.build/Debug/Base32.build/swift-overrides.hmap -emit-const-values -Xfrontend -const-gather-protocols-file -Xfrontend /Users/admin/builder/spi-builder-workspace/.derivedData/Build/Intermediates.noindex/Base32.build/Debug/Base32.build/Objects-normal/arm64/Base32_const_extract_protocols.json -Xcc -I/Users/admin/builder/spi-builder-workspace/.derivedData/Build/Products/Debug/include -Xcc -I/Users/admin/builder/spi-builder-workspace/.derivedData/Build/Intermediates.noindex/Base32.build/Debug/Base32.build/DerivedSources-normal/arm64 -Xcc -I/Users/admin/builder/spi-builder-workspace/.derivedData/Build/Intermediates.noindex/Base32.build/Debug/Base32.build/DerivedSources/arm64 -Xcc -I/Users/admin/builder/spi-builder-workspace/.derivedData/Build/Intermediates.noindex/Base32.build/Debug/Base32.build/DerivedSources -emit-objc-header -emit-objc-header-path /Users/admin/builder/spi-builder-workspace/.derivedData/Build/Intermediates.noindex/Base32.build/Debug/Base32.build/Objects-normal/arm64/Base32-Swift.h -working-directory /Users/admin/builder/spi-builder-workspace -experimental-emit-module-separately -disable-cmo
SwiftEmitModule normal arm64 Emitting\ module\ for\ Base32 (in target 'Base32' from project 'Base32')
    cd /Users/admin/builder/spi-builder-workspace
    builtin-swiftTaskExecution -- /Applications/Xcode-16.1.0.app/Contents/Developer/Toolchains/XcodeDefault.xctoolchain/usr/bin/swift-frontend -frontend -emit-module -experimental-skip-non-inlinable-function-bodies-without-types /Users/admin/builder/spi-builder-workspace/Sources/Base32/Base16.swift /Users/admin/builder/spi-builder-workspace/Sources/Base32/Base32.swift /Users/admin/builder/spi-builder-workspace/Sources/Base32/shim.swift /Users/admin/builder/spi-builder-workspace/Sources/Base32/StringExtension.swift -target arm64-apple-macos10.9 -Xllvm -aarch64-use-tbi -enable-objc-interop -sdk /Applications/Xcode-16.1.0.app/Contents/Developer/Platforms/MacOSX.platform/Developer/SDKs/MacOSX15.1.sdk -I /Users/admin/builder/spi-builder-workspace/.derivedData/Build/Products/Debug -F /Users/admin/builder/spi-builder-workspace/.derivedData/Build/Products/Debug -F /Applications/Xcode-16.1.0.app/Contents/Developer/Platforms/MacOSX.platform/Developer/Library/Frameworks -no-color-diagnostics -application-extension -enable-testing -g -debug-info-format\=dwarf -dwarf-version\=2 -module-cache-path /Users/admin/builder/spi-builder-workspace/.derivedData/ModuleCache.noindex -profile-generate -profile-coverage-mapping -swift-version 4.2 -enforce-exclusivity\=checked -stats-output-dir /Users/admin/builder/spi-builder-workspace/.stats -Onone -serialize-debugging-options -const-gather-protocols-file /Users/admin/builder/spi-builder-workspace/.derivedData/Build/Intermediates.noindex/Base32.build/Debug/Base32.build/Objects-normal/arm64/Base32_const_extract_protocols.json -enable-experimental-feature DebugDescriptionMacro -enable-experimental-feature OpaqueTypeErasure -enable-upcoming-feature StrictConcurrency -enable-upcoming-feature DisableOutwardActorInference -enable-upcoming-feature GlobalActorIsolatedTypesUsability -enable-upcoming-feature InferSendableFromCaptures -enable-bare-slash-regex -strict-concurrency\=complete -empty-abi-descriptor -validate-clang-modules-once -clang-build-session-file /Users/admin/builder/spi-builder-workspace/.derivedData/ModuleCache.noindex/Session.modulevalidation -Xcc -working-directory -Xcc /Users/admin/builder/spi-builder-workspace -resource-dir /Applications/Xcode-16.1.0.app/Contents/Developer/Toolchains/XcodeDefault.xctoolchain/usr/lib/swift -enable-anonymous-context-mangled-names -file-compilation-dir /Users/admin/builder/spi-builder-workspace -Xcc -ivfsstatcache -Xcc /Users/admin/builder/spi-builder-workspace/.derivedData/SDKStatCaches.noindex/macosx15.1-24B75-44d23fded74b714c58e69ec4af40d824.sdkstatcache -Xcc -I/Users/admin/builder/spi-builder-workspace/.derivedData/Build/Intermediates.noindex/Base32.build/Debug/Base32.build/swift-overrides.hmap -Xcc -I/Users/admin/builder/spi-builder-workspace/.derivedData/Build/Products/Debug/include -Xcc -I/Users/admin/builder/spi-builder-workspace/.derivedData/Build/Intermediates.noindex/Base32.build/Debug/Base32.build/DerivedSources-normal/arm64 -Xcc -I/Users/admin/builder/spi-builder-workspace/.derivedData/Build/Intermediates.noindex/Base32.build/Debug/Base32.build/DerivedSources/arm64 -Xcc -I/Users/admin/builder/spi-builder-workspace/.derivedData/Build/Intermediates.noindex/Base32.build/Debug/Base32.build/DerivedSources -module-name Base32 -frontend-parseable-output -disable-clang-spi -target-sdk-version 15.1 -target-sdk-name macosx15.1 -external-plugin-path /Applications/Xcode-16.1.0.app/Contents/Developer/Platforms/MacOSX.platform/Developer/usr/lib/swift/host/plugins\#/Applications/Xcode-16.1.0.app/Contents/Developer/Platforms/MacOSX.platform/Developer/usr/bin/swift-plugin-server -external-plugin-path /Applications/Xcode-16.1.0.app/Contents/Developer/Platforms/MacOSX.platform/Developer/usr/local/lib/swift/host/plugins\#/Applications/Xcode-16.1.0.app/Contents/Developer/Platforms/MacOSX.platform/Developer/usr/bin/swift-plugin-server -plugin-path /Applications/Xcode-16.1.0.app/Contents/Developer/Toolchains/XcodeDefault.xctoolchain/usr/lib/swift/host/plugins -plugin-path /Applications/Xcode-16.1.0.app/Contents/Developer/Toolchains/XcodeDefault.xctoolchain/usr/local/lib/swift/host/plugins -emit-module-doc-path /Users/admin/builder/spi-builder-workspace/.derivedData/Build/Intermediates.noindex/Base32.build/Debug/Base32.build/Objects-normal/arm64/Base32.swiftdoc -emit-module-source-info-path /Users/admin/builder/spi-builder-workspace/.derivedData/Build/Intermediates.noindex/Base32.build/Debug/Base32.build/Objects-normal/arm64/Base32.swiftsourceinfo -emit-objc-header-path /Users/admin/builder/spi-builder-workspace/.derivedData/Build/Intermediates.noindex/Base32.build/Debug/Base32.build/Objects-normal/arm64/Base32-Swift.h -serialize-diagnostics-path /Users/admin/builder/spi-builder-workspace/.derivedData/Build/Intermediates.noindex/Base32.build/Debug/Base32.build/Objects-normal/arm64/Base32-master-emit-module.dia -emit-dependencies-path /Users/admin/builder/spi-builder-workspace/.derivedData/Build/Intermediates.noindex/Base32.build/Debug/Base32.build/Objects-normal/arm64/Base32-master-emit-module.d -o /Users/admin/builder/spi-builder-workspace/.derivedData/Build/Intermediates.noindex/Base32.build/Debug/Base32.build/Objects-normal/arm64/Base32.swiftmodule -emit-abi-descriptor-path /Users/admin/builder/spi-builder-workspace/.derivedData/Build/Intermediates.noindex/Base32.build/Debug/Base32.build/Objects-normal/arm64/Base32.abi.json
EmitSwiftModule normal arm64 (in target 'Base32' from project 'Base32')
    cd /Users/admin/builder/spi-builder-workspace
    /Applications/Xcode-16.1.0.app/Contents/Developer/Toolchains/XcodeDefault.xctoolchain/usr/bin/swift-frontend -emit-module -experimental-skip-non-inlinable-function-bodies-without-types /Users/admin/builder/spi-builder-workspace/Sources/Base32/Base16.swift /Users/admin/builder/spi-builder-workspace/Sources/Base32/Base32.swift /Users/admin/builder/spi-builder-workspace/Sources/Base32/shim.swift /Users/admin/builder/spi-builder-workspace/Sources/Base32/StringExtension.swift -target arm64-apple-macos10.9 -Xllvm -aarch64-use-tbi -enable-objc-interop -sdk /Applications/Xcode-16.1.0.app/Contents/Developer/Platforms/MacOSX.platform/Developer/SDKs/MacOSX15.1.sdk -I /Users/admin/builder/spi-builder-workspace/.derivedData/Build/Products/Debug -F /Users/admin/builder/spi-builder-workspace/.derivedData/Build/Products/Debug -F /Applications/Xcode-16.1.0.app/Contents/Developer/Platforms/MacOSX.platform/Developer/Library/Frameworks -no-color-diagnostics -application-extension -enable-testing -g -debug-info-format\=dwarf -dwarf-version\=2 -module-cache-path /Users/admin/builder/spi-builder-workspace/.derivedData/ModuleCache.noindex -profile-generate -profile-coverage-mapping -swift-version 4.2 -enforce-exclusivity\=checked -stats-output-dir /Users/admin/builder/spi-builder-workspace/.stats -Onone -serialize-debugging-options -const-gather-protocols-file /Users/admin/builder/spi-builder-workspace/.derivedData/Build/Intermediates.noindex/Base32.build/Debug/Base32.build/Objects-normal/arm64/Base32_const_extract_protocols.json -enable-experimental-feature DebugDescriptionMacro -enable-experimental-feature OpaqueTypeErasure -enable-upcoming-feature StrictConcurrency -enable-upcoming-feature DisableOutwardActorInference -enable-upcoming-feature GlobalActorIsolatedTypesUsability -enable-upcoming-feature InferSendableFromCaptures -enable-bare-slash-regex -strict-concurrency\=complete -empty-abi-descriptor -validate-clang-modules-once -clang-build-session-file /Users/admin/builder/spi-builder-workspace/.derivedData/ModuleCache.noindex/Session.modulevalidation -Xcc -working-directory -Xcc /Users/admin/builder/spi-builder-workspace -resource-dir /Applications/Xcode-16.1.0.app/Contents/Developer/Toolchains/XcodeDefault.xctoolchain/usr/lib/swift -enable-anonymous-context-mangled-names -file-compilation-dir /Users/admin/builder/spi-builder-workspace -Xcc -ivfsstatcache -Xcc /Users/admin/builder/spi-builder-workspace/.derivedData/SDKStatCaches.noindex/macosx15.1-24B75-44d23fded74b714c58e69ec4af40d824.sdkstatcache -Xcc -I/Users/admin/builder/spi-builder-workspace/.derivedData/Build/Intermediates.noindex/Base32.build/Debug/Base32.build/swift-overrides.hmap -Xcc -I/Users/admin/builder/spi-builder-workspace/.derivedData/Build/Products/Debug/include -Xcc -I/Users/admin/builder/spi-builder-workspace/.derivedData/Build/Intermediates.noindex/Base32.build/Debug/Base32.build/DerivedSources-normal/arm64 -Xcc -I/Users/admin/builder/spi-builder-workspace/.derivedData/Build/Intermediates.noindex/Base32.build/Debug/Base32.build/DerivedSources/arm64 -Xcc -I/Users/admin/builder/spi-builder-workspace/.derivedData/Build/Intermediates.noindex/Base32.build/Debug/Base32.build/DerivedSources -module-name Base32 -frontend-parseable-output -disable-clang-spi -target-sdk-version 15.1 -target-sdk-name macosx15.1 -external-plugin-path /Applications/Xcode-16.1.0.app/Contents/Developer/Platforms/MacOSX.platform/Developer/usr/lib/swift/host/plugins\#/Applications/Xcode-16.1.0.app/Contents/Developer/Platforms/MacOSX.platform/Developer/usr/bin/swift-plugin-server -external-plugin-path /Applications/Xcode-16.1.0.app/Contents/Developer/Platforms/MacOSX.platform/Developer/usr/local/lib/swift/host/plugins\#/Applications/Xcode-16.1.0.app/Contents/Developer/Platforms/MacOSX.platform/Developer/usr/bin/swift-plugin-server -plugin-path /Applications/Xcode-16.1.0.app/Contents/Developer/Toolchains/XcodeDefault.xctoolchain/usr/lib/swift/host/plugins -plugin-path /Applications/Xcode-16.1.0.app/Contents/Developer/Toolchains/XcodeDefault.xctoolchain/usr/local/lib/swift/host/plugins -emit-module-doc-path /Users/admin/builder/spi-builder-workspace/.derivedData/Build/Intermediates.noindex/Base32.build/Debug/Base32.build/Objects-normal/arm64/Base32.swiftdoc -emit-module-source-info-path /Users/admin/builder/spi-builder-workspace/.derivedData/Build/Intermediates.noindex/Base32.build/Debug/Base32.build/Objects-normal/arm64/Base32.swiftsourceinfo -emit-objc-header-path /Users/admin/builder/spi-builder-workspace/.derivedData/Build/Intermediates.noindex/Base32.build/Debug/Base32.build/Objects-normal/arm64/Base32-Swift.h -serialize-diagnostics-path /Users/admin/builder/spi-builder-workspace/.derivedData/Build/Intermediates.noindex/Base32.build/Debug/Base32.build/Objects-normal/arm64/Base32-master-emit-module.dia -emit-dependencies-path /Users/admin/builder/spi-builder-workspace/.derivedData/Build/Intermediates.noindex/Base32.build/Debug/Base32.build/Objects-normal/arm64/Base32-master-emit-module.d -o /Users/admin/builder/spi-builder-workspace/.derivedData/Build/Intermediates.noindex/Base32.build/Debug/Base32.build/Objects-normal/arm64/Base32.swiftmodule -emit-abi-descriptor-path /Users/admin/builder/spi-builder-workspace/.derivedData/Build/Intermediates.noindex/Base32.build/Debug/Base32.build/Objects-normal/arm64/Base32.abi.json
/Users/admin/builder/spi-builder-workspace/Sources/Base32/Base16.swift:31:34: error: 'Data' is only available in application extensions for macOS 10.10 or newer
public func base16Encode(_ data: Data, uppercase: Bool = true) -> String {
                                 ^
/Users/admin/builder/spi-builder-workspace/Sources/Base32/Base16.swift:31:13: note: add @available attribute to enclosing global function
public func base16Encode(_ data: Data, uppercase: Bool = true) -> String {
            ^
/Users/admin/builder/spi-builder-workspace/Sources/Base32/Base16.swift:37:53: error: 'Data' is only available in application extensions for macOS 10.10 or newer
public func base16DecodeToData(_ string: String) -> Data? {
                                                    ^
/Users/admin/builder/spi-builder-workspace/Sources/Base32/Base16.swift:37:13: note: add @available attribute to enclosing global function
public func base16DecodeToData(_ string: String) -> Data? {
            ^
/Users/admin/builder/spi-builder-workspace/Sources/Base32/Base16.swift:55:35: error: 'Data' is only available in application extensions for macOS 10.10 or newer
    public var base16DecodedData: Data? {
                                  ^
/Users/admin/builder/spi-builder-workspace/Sources/Base32/Base16.swift:55:16: note: add @available attribute to enclosing property
    public var base16DecodedData: Data? {
               ^
/Users/admin/builder/spi-builder-workspace/Sources/Base32/Base16.swift:53:1: note: add @available attribute to enclosing extension
extension String {
^
/Users/admin/builder/spi-builder-workspace/Sources/Base32/Base16.swift:65:56: error: 'Encoding' is only available in application extensions for macOS 10.10 or newer
    public func base16DecodedString(_ encoding: String.Encoding = .utf8) -> String? {
                                                       ^
/Users/admin/builder/spi-builder-workspace/Sources/Base32/Base16.swift:65:17: note: add @available attribute to enclosing instance method
    public func base16DecodedString(_ encoding: String.Encoding = .utf8) -> String? {
                ^
/Users/admin/builder/spi-builder-workspace/Sources/Base32/Base16.swift:53:1: note: add @available attribute to enclosing extension
extension String {
^
/Users/admin/builder/spi-builder-workspace/Sources/Base32/Base16.swift:78:35: error: 'Data' is only available in application extensions for macOS 10.10 or newer
    public var base16EncodedData: Data {
                                  ^
/Users/admin/builder/spi-builder-workspace/Sources/Base32/Base16.swift:78:16: note: add @available attribute to enclosing property
    public var base16EncodedData: Data {
               ^
/Users/admin/builder/spi-builder-workspace/Sources/Base32/Base16.swift:72:1: note: add @available attribute to enclosing extension
extension Data {
^
/Users/admin/builder/spi-builder-workspace/Sources/Base32/Base16.swift:82:35: error: 'Data' is only available in application extensions for macOS 10.10 or newer
    public var base16DecodedData: Data? {
                                  ^
/Users/admin/builder/spi-builder-workspace/Sources/Base32/Base16.swift:82:16: note: add @available attribute to enclosing property
    public var base16DecodedData: Data? {
               ^
/Users/admin/builder/spi-builder-workspace/Sources/Base32/Base16.swift:72:1: note: add @available attribute to enclosing extension
extension Data {
^
/Users/admin/builder/spi-builder-workspace/Sources/Base32/Base16.swift:72:11: error: 'Data' is only available in application extensions for macOS 10.10 or newer
extension Data {
          ^
/Users/admin/builder/spi-builder-workspace/Sources/Base32/Base16.swift:72:1: note: add @available attribute to enclosing extension
extension Data {
^
/Users/admin/builder/spi-builder-workspace/Sources/Base32/Base32.swift:33:34: error: 'Data' is only available in application extensions for macOS 10.10 or newer
public func base32Encode(_ data: Data) -> String {
                                 ^
/Users/admin/builder/spi-builder-workspace/Sources/Base32/Base32.swift:33:13: note: add @available attribute to enclosing global function
public func base32Encode(_ data: Data) -> String {
            ^
/Users/admin/builder/spi-builder-workspace/Sources/Base32/Base32.swift:39:37: error: 'Data' is only available in application extensions for macOS 10.10 or newer
public func base32HexEncode(_ data: Data) -> String {
                                    ^
/Users/admin/builder/spi-builder-workspace/Sources/Base32/Base32.swift:39:13: note: add @available attribute to enclosing global function
public func base32HexEncode(_ data: Data) -> String {
            ^
/Users/admin/builder/spi-builder-workspace/Sources/Base32/Base32.swift:45:53: error: 'Data' is only available in application extensions for macOS 10.10 or newer
public func base32DecodeToData(_ string: String) -> Data? {
                                                    ^
/Users/admin/builder/spi-builder-workspace/Sources/Base32/Base32.swift:45:13: note: add @available attribute to enclosing global function
public func base32DecodeToData(_ string: String) -> Data? {
            ^
/Users/admin/builder/spi-builder-workspace/Sources/Base32/Base32.swift:49:56: error: 'Data' is only available in application extensions for macOS 10.10 or newer
public func base32HexDecodeToData(_ string: String) -> Data? {
                                                       ^
/Users/admin/builder/spi-builder-workspace/Sources/Base32/Base32.swift:49:13: note: add @available attribute to enclosing global function
public func base32HexDecodeToData(_ string: String) -> Data? {
            ^
/Users/admin/builder/spi-builder-workspace/Sources/Base32/Base32.swift:75:35: error: 'Data' is only available in application extensions for macOS 10.10 or newer
    public var base32DecodedData: Data? {
                                  ^
/Users/admin/builder/spi-builder-workspace/Sources/Base32/Base32.swift:75:16: note: add @available attribute to enclosing property
    public var base32DecodedData: Data? {
               ^
/Users/admin/builder/spi-builder-workspace/Sources/Base32/Base32.swift:73:1: note: add @available attribute to enclosing extension
extension String {
^
/Users/admin/builder/spi-builder-workspace/Sources/Base32/Base32.swift:85:56: error: 'Encoding' is only available in application extensions for macOS 10.10 or newer
    public func base32DecodedString(_ encoding: String.Encoding = .utf8) -> String? {
                                                       ^
/Users/admin/builder/spi-builder-workspace/Sources/Base32/Base32.swift:85:17: note: add @available attribute to enclosing instance method
    public func base32DecodedString(_ encoding: String.Encoding = .utf8) -> String? {
                ^
/Users/admin/builder/spi-builder-workspace/Sources/Base32/Base32.swift:73:1: note: add @available attribute to enclosing extension
extension String {
^
/Users/admin/builder/spi-builder-workspace/Sources/Base32/Base32.swift:92:38: error: 'Data' is only available in application extensions for macOS 10.10 or newer
    public var base32HexDecodedData: Data? {
                                     ^
/Users/admin/builder/spi-builder-workspace/Sources/Base32/Base32.swift:92:16: note: add @available attribute to enclosing property
    public var base32HexDecodedData: Data? {
               ^
/Users/admin/builder/spi-builder-workspace/Sources/Base32/Base32.swift:73:1: note: add @available attribute to enclosing extension
extension String {
^
/Users/admin/builder/spi-builder-workspace/Sources/Base32/Base32.swift:102:59: error: 'Encoding' is only available in application extensions for macOS 10.10 or newer
    public func base32HexDecodedString(_ encoding: String.Encoding = .utf8) -> String? {
                                                          ^
/Users/admin/builder/spi-builder-workspace/Sources/Base32/Base32.swift:102:17: note: add @available attribute to enclosing instance method
    public func base32HexDecodedString(_ encoding: String.Encoding = .utf8) -> String? {
                ^
/Users/admin/builder/spi-builder-workspace/Sources/Base32/Base32.swift:73:1: note: add @available attribute to enclosing extension
extension String {
^
/Users/admin/builder/spi-builder-workspace/Sources/Base32/Base32.swift:115:35: error: 'Data' is only available in application extensions for macOS 10.10 or newer
    public var base32EncodedData: Data {
                                  ^
/Users/admin/builder/spi-builder-workspace/Sources/Base32/Base32.swift:115:16: note: add @available attribute to enclosing property
    public var base32EncodedData: Data {
               ^
/Users/admin/builder/spi-builder-workspace/Sources/Base32/Base32.swift:109:1: note: add @available attribute to enclosing extension
extension Data {
^
/Users/admin/builder/spi-builder-workspace/Sources/Base32/Base32.swift:119:35: error: 'Data' is only available in application extensions for macOS 10.10 or newer
    public var base32DecodedData: Data? {
                                  ^
/Users/admin/builder/spi-builder-workspace/Sources/Base32/Base32.swift:119:16: note: add @available attribute to enclosing property
    public var base32DecodedData: Data? {
               ^
/Users/admin/builder/spi-builder-workspace/Sources/Base32/Base32.swift:109:1: note: add @available attribute to enclosing extension
extension Data {
^
/Users/admin/builder/spi-builder-workspace/Sources/Base32/Base32.swift:128:38: error: 'Data' is only available in application extensions for macOS 10.10 or newer
    public var base32HexEncodedData: Data {
                                     ^
/Users/admin/builder/spi-builder-workspace/Sources/Base32/Base32.swift:128:16: note: add @available attribute to enclosing property
    public var base32HexEncodedData: Data {
               ^
/Users/admin/builder/spi-builder-workspace/Sources/Base32/Base32.swift:109:1: note: add @available attribute to enclosing extension
extension Data {
^
/Users/admin/builder/spi-builder-workspace/Sources/Base32/Base32.swift:132:38: error: 'Data' is only available in application extensions for macOS 10.10 or newer
    public var base32HexDecodedData: Data? {
                                     ^
/Users/admin/builder/spi-builder-workspace/Sources/Base32/Base32.swift:132:16: note: add @available attribute to enclosing property
    public var base32HexDecodedData: Data? {
               ^
/Users/admin/builder/spi-builder-workspace/Sources/Base32/Base32.swift:109:1: note: add @available attribute to enclosing extension
extension Data {
^
/Users/admin/builder/spi-builder-workspace/Sources/Base32/Base32.swift:109:11: error: 'Data' is only available in application extensions for macOS 10.10 or newer
extension Data {
          ^
/Users/admin/builder/spi-builder-workspace/Sources/Base32/Base32.swift:109:1: note: add @available attribute to enclosing extension
extension Data {
^
/Users/admin/builder/spi-builder-workspace/Sources/Base32/StringExtension.swift:33:47: error: 'Data' is only available in application extensions for macOS 10.10 or newer
    internal var dataUsingUTF8StringEncoding: Data {
                                              ^
/Users/admin/builder/spi-builder-workspace/Sources/Base32/StringExtension.swift:33:18: note: add @available attribute to enclosing property
    internal var dataUsingUTF8StringEncoding: Data {
                 ^
/Users/admin/builder/spi-builder-workspace/Sources/Base32/StringExtension.swift:31:1: note: add @available attribute to enclosing extension
extension String {
^
Error opening -stats-output-dir file '/Users/admin/builder/spi-builder-workspace/.stats/stats-1732731121477803-swift-frontend-Base32-all-arm64_apple_macos10.9-swiftmodule-Onone-1102097061.json' for writing
===-------------------------------------------------------------------------===
                               Swift compilation
===-------------------------------------------------------------------------===
  Total Execution Time: 3.8060 seconds (3.8238 wall clock)
   ---User Time---   --System Time--   --User+System--   ---Wall Time---  --- Name ---
   1.4547 ( 48.0%)   0.3468 ( 44.7%)   1.8015 ( 47.3%)   1.8088 ( 47.3%)  parse-and-resolve-imports
   1.4541 ( 48.0%)   0.3466 ( 44.7%)   1.8007 ( 47.3%)   1.8079 ( 47.3%)  Import resolution
   0.0170 (  0.6%)   0.0119 (  1.5%)   0.0290 (  0.8%)   0.0293 (  0.8%)  perform-sema
   0.0170 (  0.6%)   0.0119 (  1.5%)   0.0289 (  0.8%)   0.0292 (  0.8%)  TypeCheckSourceFileRequest
   0.0169 (  0.6%)   0.0119 (  1.5%)   0.0288 (  0.8%)   0.0291 (  0.8%)  Type checking and Semantic analysis
   0.0167 (  0.6%)   0.0116 (  1.5%)   0.0284 (  0.7%)   0.0287 (  0.8%)  typecheck-decl
   0.0098 (  0.3%)   0.0064 (  0.8%)   0.0163 (  0.4%)   0.0163 (  0.4%)  load-stdlib
   0.0086 (  0.3%)   0.0052 (  0.7%)   0.0138 (  0.4%)   0.0141 (  0.4%)  typecheck-expr
   0.0039 (  0.1%)   0.0026 (  0.3%)   0.0064 (  0.2%)   0.0064 (  0.2%)  InterfaceTypeRequest
   0.0028 (  0.1%)   0.0024 (  0.3%)   0.0052 (  0.1%)   0.0055 (  0.1%)  QualifiedLookupRequest
   0.0031 (  0.1%)   0.0021 (  0.3%)   0.0052 (  0.1%)   0.0052 (  0.1%)  UnqualifiedLookupRequest
   0.0025 (  0.1%)   0.0020 (  0.3%)   0.0045 (  0.1%)   0.0049 (  0.1%)  DirectLookupRequest
   0.0030 (  0.1%)   0.0019 (  0.2%)   0.0048 (  0.1%)   0.0048 (  0.1%)  ResolveTypeRequest
   0.0026 (  0.1%)   0.0014 (  0.2%)   0.0040 (  0.1%)   0.0040 (  0.1%)  performUnqualifiedLookup
   0.0016 (  0.1%)   0.0017 (  0.2%)   0.0033 (  0.1%)   0.0033 (  0.1%)  precheck-expr
   0.0016 (  0.1%)   0.0014 (  0.2%)   0.0030 (  0.1%)   0.0030 (  0.1%)  LookupConformanceInModuleRequest
   0.0021 (  0.1%)   0.0005 (  0.1%)   0.0026 (  0.1%)   0.0026 (  0.1%)  LookupInModuleRequest
   0.0011 (  0.0%)   0.0009 (  0.1%)   0.0019 (  0.1%)   0.0019 (  0.1%)  PatternBindingEntryRequest
   0.0008 (  0.0%)   0.0007 (  0.1%)   0.0015 (  0.0%)   0.0018 (  0.0%)  DefaultArgumentExprRequest
   0.0010 (  0.0%)   0.0008 (  0.1%)   0.0018 (  0.0%)   0.0018 (  0.0%)  PatternTypeRequest
   0.0015 (  0.0%)   0.0001 (  0.0%)   0.0016 (  0.0%)   0.0016 (  0.0%)  build-rewrite-system
   0.0005 (  0.0%)   0.0004 (  0.1%)   0.0010 (  0.0%)   0.0014 (  0.0%)  ParseTopLevelDeclsRequest
   0.0005 (  0.0%)   0.0004 (  0.1%)   0.0009 (  0.0%)   0.0014 (  0.0%)  ParseSourceFileRequest
   0.0007 (  0.0%)   0.0007 (  0.1%)   0.0013 (  0.0%)   0.0013 (  0.0%)  PotentialMacroExpansionsInContextRequest
   0.0007 (  0.0%)   0.0006 (  0.1%)   0.0013 (  0.0%)   0.0013 (  0.0%)  DefaultInitializerIsolation
   0.0007 (  0.0%)   0.0003 (  0.0%)   0.0011 (  0.0%)   0.0011 (  0.0%)  ModuleQualifiedLookupRequest
   0.0005 (  0.0%)   0.0004 (  0.1%)   0.0009 (  0.0%)   0.0009 (  0.0%)  ActorIsolationRequest
   0.0005 (  0.0%)   0.0002 (  0.0%)   0.0007 (  0.0%)   0.0007 (  0.0%)  ExtendedNominalRequest
   0.0004 (  0.0%)   0.0002 (  0.0%)   0.0005 (  0.0%)   0.0005 (  0.0%)  ResultTypeRequest
   0.0002 (  0.0%)   0.0002 (  0.0%)   0.0003 (  0.0%)   0.0003 (  0.0%)  IsGetterMutatingRequest
   0.0002 (  0.0%)   0.0001 (  0.0%)   0.0003 (  0.0%)   0.0003 (  0.0%)  OpaqueReadOwnershipRequest
   0.0002 (  0.0%)   0.0001 (  0.0%)   0.0003 (  0.0%)   0.0003 (  0.0%)  ExpandMemberAttributeMacros
   0.0001 (  0.0%)   0.0001 (  0.0%)   0.0003 (  0.0%)   0.0003 (  0.0%)  import-clang-decl
   0.0001 (  0.0%)   0.0001 (  0.0%)   0.0003 (  0.0%)   0.0003 (  0.0%)  AttachedPropertyWrappersRequest
   0.0001 (  0.0%)   0.0001 (  0.0%)   0.0002 (  0.0%)   0.0002 (  0.0%)  IsFunctionBodySkippedRequest
   0.0001 (  0.0%)   0.0001 (  0.0%)   0.0002 (  0.0%)   0.0002 (  0.0%)  ExpandPeerMacroRequest
   0.0001 (  0.0%)   0.0000 (  0.0%)   0.0002 (  0.0%)   0.0002 (  0.0%)  CheckRedeclarationRequest
   0.0001 (  0.0%)   0.0000 (  0.0%)   0.0002 (  0.0%)   0.0002 (  0.0%)  DefaultTypeRequest
   0.0001 (  0.0%)   0.0001 (  0.0%)   0.0002 (  0.0%)   0.0002 (  0.0%)  FragileFunctionKindRequest
   0.0001 (  0.0%)   0.0001 (  0.0%)   0.0002 (  0.0%)   0.0002 (  0.0%)  HasIsolatedSelfRequest
   0.0001 (  0.0%)   0.0001 (  0.0%)   0.0002 (  0.0%)   0.0002 (  0.0%)  GenericSignatureRequest
   0.0001 (  0.0%)   0.0001 (  0.0%)   0.0001 (  0.0%)   0.0001 (  0.0%)  IsDynamicRequest
   0.0001 (  0.0%)   0.0000 (  0.0%)   0.0001 (  0.0%)   0.0001 (  0.0%)  ExtendedTypeRequest
   0.0001 (  0.0%)   0.0001 (  0.0%)   0.0001 (  0.0%)   0.0001 (  0.0%)  StorageImplInfoRequest
   0.0001 (  0.0%)   0.0000 (  0.0%)   0.0001 (  0.0%)   0.0001 (  0.0%)  ResolveImplicitMemberRequest
   0.0001 (  0.0%)   0.0000 (  0.0%)   0.0001 (  0.0%)   0.0001 (  0.0%)  PatternBindingCheckedAndContextualizedInitRequest
   0.0001 (  0.0%)   0.0000 (  0.0%)   0.0001 (  0.0%)   0.0001 (  0.0%)  ParseMembersRequest
   0.0001 (  0.0%)   0.0001 (  0.0%)   0.0001 (  0.0%)   0.0001 (  0.0%)  HasInitAccessorRequest
   0.0001 (  0.0%)   0.0000 (  0.0%)   0.0001 (  0.0%)   0.0001 (  0.0%)  ResolveValueWitnessesRequest
   0.0001 (  0.0%)   0.0000 (  0.0%)   0.0001 (  0.0%)   0.0001 (  0.0%)  SPIGroupsRequest
   0.0001 (  0.0%)   0.0000 (  0.0%)   0.0001 (  0.0%)   0.0001 (  0.0%)  ExpandChildTypeRefinementContextsRequest
   0.0000 (  0.0%)   0.0000 (  0.0%)   0.0001 (  0.0%)   0.0001 (  0.0%)  IsActorRequest
   0.0000 (  0.0%)   0.0000 (  0.0%)   0.0001 (  0.0%)   0.0001 (  0.0%)  ConditionalRequirementsRequest
   0.0000 (  0.0%)   0.0000 (  0.0%)   0.0001 (  0.0%)   0.0001 (  0.0%)  ProtocolDependenciesRequest
   0.0000 (  0.0%)   0.0000 (  0.0%)   0.0001 (  0.0%)   0.0001 (  0.0%)  RequiresOpaqueAccessorsRequest
   0.0000 (  0.0%)   0.0000 (  0.0%)   0.0000 (  0.0%)   0.0001 (  0.0%)  GlobalActorAttributeRequest
   0.0000 (  0.0%)   0.0000 (  0.0%)   0.0000 (  0.0%)   0.0000 (  0.0%)  ExpandExtensionMacros
   0.0000 (  0.0%)   0.0000 (  0.0%)   0.0000 (  0.0%)   0.0000 (  0.0%)  HasDynamicMemberLookupAttributeRequest
   0.0000 (  0.0%)   0.0000 (  0.0%)   0.0000 (  0.0%)   0.0000 (  0.0%)  DynamicallyReplacedDeclRequest
   0.0000 (  0.0%)   0.0000 (  0.0%)   0.0000 (  0.0%)   0.0000 (  0.0%)  PropertyWrapperMutabilityRequest
   0.0000 (  0.0%)   0.0000 (  0.0%)   0.0000 (  0.0%)   0.0000 (  0.0%)  GenericParamListRequest
   0.0000 (  0.0%)   0.0000 (  0.0%)   0.0000 (  0.0%)   0.0000 (  0.0%)  ApplyAccessNoteRequest
   0.0000 (  0.0%)   0.0000 (  0.0%)   0.0000 (  0.0%)   0.0000 (  0.0%)  LookupAllConformancesInContextRequest
   0.0000 (  0.0%)   0.0000 (  0.0%)   0.0000 (  0.0%)   0.0000 (  0.0%)  RequirementSignatureRequest
   0.0000 (  0.0%)   0.0000 (  0.0%)   0.0000 (  0.0%)   0.0000 (  0.0%)  LifetimeDependenceInfoRequest
   0.0000 (  0.0%)   0.0000 (  0.0%)   0.0000 (  0.0%)   0.0000 (  0.0%)  ProtocolRequirementsRequest
   0.0000 (  0.0%)   0.0000 (  0.0%)   0.0000 (  0.0%)   0.0000 (  0.0%)  OverriddenDeclsRequest
   0.0000 (  0.0%)   0.0000 (  0.0%)   0.0000 (  0.0%)   0.0000 (  0.0%)  AttachedResultBuilderRequest
   0.0000 (  0.0%)   0.0000 (  0.0%)   0.0000 (  0.0%)   0.0000 (  0.0%)  IsObjCRequest
   0.0000 (  0.0%)   0.0000 (  0.0%)   0.0000 (  0.0%)   0.0000 (  0.0%)  ABIMembersRequest
   0.0000 (  0.0%)   0.0000 (  0.0%)   0.0000 (  0.0%)   0.0000 (  0.0%)  ObjCInterfaceAndImplementationRequest
   0.0000 (  0.0%)   0.0000 (  0.0%)   0.0000 (  0.0%)   0.0000 (  0.0%)  AccessLevelRequest
   0.0000 (  0.0%)   0.0000 (  0.0%)   0.0000 (  0.0%)   0.0000 (  0.0%)  InheritedProtocolsRequest
   0.0000 (  0.0%)   0.0000 (  0.0%)   0.0000 (  0.0%)   0.0000 (  0.0%)  HasStorageRequest
   0.0000 (  0.0%)   0.0000 (  0.0%)   0.0000 (  0.0%)   0.0000 (  0.0%)  IsFinalRequest
   0.0000 (  0.0%)   0.0000 (  0.0%)   0.0000 (  0.0%)   0.0000 (  0.0%)  ExpandAccessorMacros
   0.0000 (  0.0%)   0.0000 (  0.0%)   0.0000 (  0.0%)   0.0000 (  0.0%)  ResolvePatternRequest
   0.0000 (  0.0%)   0.0000 (  0.0%)   0.0000 (  0.0%)   0.0000 (  0.0%)  ParamSpecifierRequest
   0.0000 (  0.0%)   0.0000 (  0.0%)   0.0000 (  0.0%)   0.0000 (  0.0%)  InheritedDeclsReferencedRequest
   0.0000 (  0.0%)   0.0000 (  0.0%)   0.0000 (  0.0%)   0.0000 (  0.0%)  LocalTypeDeclsRequest
   0.0000 (  0.0%)   0.0000 (  0.0%)   0.0000 (  0.0%)   0.0000 (  0.0%)  CheckInconsistentImplementationOnlyImportsRequest
   0.0000 (  0.0%)   0.0000 (  0.0%)   0.0000 (  0.0%)   0.0000 (  0.0%)  PropertyWrapperInitializerInfoRequest
   0.0000 (  0.0%)   0.0000 (  0.0%)   0.0000 (  0.0%)   0.0000 (  0.0%)  SelfAccessKindRequest
   0.0000 (  0.0%)   0.0000 (  0.0%)   0.0000 (  0.0%)   0.0000 (  0.0%)  CompareDeclSpecializationRequest
   0.0000 (  0.0%)   0.0000 (  0.0%)   0.0000 (  0.0%)   0.0000 (  0.0%)  IsStaticRequest
   0.0000 (  0.0%)   0.0000 (  0.0%)   0.0000 (  0.0%)   0.0000 (  0.0%)  CheckInconsistentWeakLinkedImportsRequest
   0.0000 (  0.0%)   0.0000 (  0.0%)   0.0000 (  0.0%)   0.0000 (  0.0%)  AllInheritedProtocolsRequest
   0.0000 (  0.0%)   0.0000 (  0.0%)   0.0000 (  0.0%)   0.0000 (  0.0%)  IsSetterMutatingRequest
   0.0000 (  0.0%)   0.0000 (  0.0%)   0.0000 (  0.0%)   0.0000 (  0.0%)  PropertyWrapperAuxiliaryVariablesRequest
   0.0000 (  0.0%)   0.0000 (  0.0%)   0.0000 (  0.0%)   0.0000 (  0.0%)  IsAccessorTransparentRequest
   0.0000 (  0.0%)   0.0000 (  0.0%)   0.0000 (  0.0%)   0.0000 (  0.0%)  RequiresOpaqueModifyCoroutineRequest
   0.0000 (  0.0%)   0.0000 (  0.0%)   0.0000 (  0.0%)   0.0000 (  0.0%)  IsDistributedActorRequest
   0.0000 (  0.0%)   0.0000 (  0.0%)   0.0000 (  0.0%)   0.0000 (  0.0%)  perform-whole-module-type-checking
   0.0000 (  0.0%)   0.0000 (  0.0%)   0.0000 (  0.0%)   0.0000 (  0.0%)  ResolveTypeWitnessesRequest
   0.0000 (  0.0%)   0.0000 (  0.0%)   0.0000 (  0.0%)   0.0000 (  0.0%)  SimpleDidSetRequest
   0.0000 (  0.0%)   0.0000 (  0.0%)   0.0000 (  0.0%)   0.0000 (  0.0%)  HasCircularInheritedProtocolsRequest
   0.0000 (  0.0%)   0.0000 (  0.0%)   0.0000 (  0.0%)   0.0000 (  0.0%)  source-file-populate-cache
   0.0000 (  0.0%)   0.0000 (  0.0%)   0.0000 (  0.0%)   0.0000 (  0.0%)  CheckInconsistentSPIOnlyImportsRequest
   0.0000 (  0.0%)   0.0000 (  0.0%)   0.0000 (  0.0%)   0.0000 (  0.0%)  CheckInconsistentAccessLevelOnImport
   0.0000 (  0.0%)   0.0000 (  0.0%)   0.0000 (  0.0%)   0.0000 (  0.0%)  module-populate-cache
   0.0000 (  0.0%)   0.0000 (  0.0%)   0.0000 (  0.0%)   0.0000 (  0.0%)  PreCheckReturnStmtRequest
   0.0000 (  0.0%)   0.0000 (  0.0%)   0.0000 (  0.0%)   0.0000 (  0.0%)  UnderlyingTypeDeclsReferencedRequest
   0.0000 (  0.0%)   0.0000 (  0.0%)   0.0000 (  0.0%)   0.0000 (  0.0%)  DefaultAndMaxAccessLevelRequest
   0.0000 (  0.0%)   0.0000 (  0.0%)   0.0000 (  0.0%)   0.0000 (  0.0%)  HasImportsMatchingFlagRequest
   0.0000 (  0.0%)   0.0000 (  0.0%)   0.0000 (  0.0%)   0.0000 (  0.0%)  PolymorphicEffectKindRequest
   0.0000 (  0.0%)   0.0000 (  0.0%)   0.0000 (  0.0%)   0.0000 (  0.0%)  ResultBuilderTypeRequest
   0.0000 (  0.0%)   0.0000 (  0.0%)   0.0000 (  0.0%)   0.0000 (  0.0%)  AST verification
   0.0000 (  0.0%)   0.0000 (  0.0%)   0.0000 (  0.0%)   0.0000 (  0.0%)  ModuleImplicitImportsRequest
   0.0000 (  0.0%)   0.0000 (  0.0%)   0.0000 (  0.0%)   0.0000 (  0.0%)  ClosureEffectsRequest
   0.0000 (  0.0%)   0.0000 (  0.0%)   0.0000 (  0.0%)   0.0000 (  0.0%)  CheckInconsistentAccessLevelOnImportSameFileRequest
   0.0000 (  0.0%)   0.0000 (  0.0%)   0.0000 (  0.0%)   0.0000 (  0.0%)  SelfBoundsFromWhereClauseRequest
   0.0000 (  0.0%)   0.0000 (  0.0%)   0.0000 (  0.0%)   0.0000 (  0.0%)  IsImplicitlyUnwrappedOptionalRequest
   0.0000 (  0.0%)   0.0000 (  0.0%)   0.0000 (  0.0%)   0.0000 (  0.0%)  PrimarySourceFilesRequest
   0.0000 (  0.0%)   0.0000 (  0.0%)   0.0000 (  0.0%)   0.0000 (  0.0%)  PreCheckClosureBodyRequest
   3.0299 (100.0%)   0.7761 (100.0%)   3.8060 (100.0%)   3.8238 (100.0%)  Total
===-------------------------------------------------------------------------===
                                Running Program
===-------------------------------------------------------------------------===
  Total Execution Time: 1.8491 seconds (1.8567 wall clock)
   ---User Time---   --System Time--   --User+System--   ---Wall Time---  --- Name ---
   1.4821 (100.0%)   0.3670 (100.0%)   1.8491 (100.0%)   1.8567 (100.0%)  Building Target
   1.4821 (100.0%)   0.3670 (100.0%)   1.8491 (100.0%)   1.8567 (100.0%)  Total
SwiftCompile normal arm64 Compiling\ StringExtension.swift /Users/admin/builder/spi-builder-workspace/Sources/Base32/StringExtension.swift (in target 'Base32' from project 'Base32')
    cd /Users/admin/builder/spi-builder-workspace
    builtin-swiftTaskExecution -- /Applications/Xcode-16.1.0.app/Contents/Developer/Toolchains/XcodeDefault.xctoolchain/usr/bin/swift-frontend -frontend -c /Users/admin/builder/spi-builder-workspace/Sources/Base32/Base16.swift /Users/admin/builder/spi-builder-workspace/Sources/Base32/Base32.swift /Users/admin/builder/spi-builder-workspace/Sources/Base32/shim.swift -primary-file /Users/admin/builder/spi-builder-workspace/Sources/Base32/StringExtension.swift -emit-dependencies-path /Users/admin/builder/spi-builder-workspace/.derivedData/Build/Intermediates.noindex/Base32.build/Debug/Base32.build/Objects-normal/arm64/StringExtension.d -emit-const-values-path /Users/admin/builder/spi-builder-workspace/.derivedData/Build/Intermediates.noindex/Base32.build/Debug/Base32.build/Objects-normal/arm64/StringExtension.swiftconstvalues -emit-reference-dependencies-path /Users/admin/builder/spi-builder-workspace/.derivedData/Build/Intermediates.noindex/Base32.build/Debug/Base32.build/Objects-normal/arm64/StringExtension.swiftdeps -serialize-diagnostics-path /Users/admin/builder/spi-builder-workspace/.derivedData/Build/Intermediates.noindex/Base32.build/Debug/Base32.build/Objects-normal/arm64/StringExtension.dia -target arm64-apple-macos10.9 -Xllvm -aarch64-use-tbi -enable-objc-interop -sdk /Applications/Xcode-16.1.0.app/Contents/Developer/Platforms/MacOSX.platform/Developer/SDKs/MacOSX15.1.sdk -I /Users/admin/builder/spi-builder-workspace/.derivedData/Build/Products/Debug -F /Users/admin/builder/spi-builder-workspace/.derivedData/Build/Products/Debug -F /Applications/Xcode-16.1.0.app/Contents/Developer/Platforms/MacOSX.platform/Developer/Library/Frameworks -no-color-diagnostics -application-extension -enable-testing -g -debug-info-format\=dwarf -dwarf-version\=2 -module-cache-path /Users/admin/builder/spi-builder-workspace/.derivedData/ModuleCache.noindex -profile-generate -profile-coverage-mapping -swift-version 4.2 -enforce-exclusivity\=checked -stats-output-dir /Users/admin/builder/spi-builder-workspace/.stats -Onone -serialize-debugging-options -const-gather-protocols-file /Users/admin/builder/spi-builder-workspace/.derivedData/Build/Intermediates.noindex/Base32.build/Debug/Base32.build/Objects-normal/arm64/Base32_const_extract_protocols.json -enable-experimental-feature DebugDescriptionMacro -enable-experimental-feature OpaqueTypeErasure -enable-upcoming-feature StrictConcurrency -enable-upcoming-feature DisableOutwardActorInference -enable-upcoming-feature GlobalActorIsolatedTypesUsability -enable-upcoming-feature InferSendableFromCaptures -enable-bare-slash-regex -strict-concurrency\=complete -empty-abi-descriptor -validate-clang-modules-once -clang-build-session-file /Users/admin/builder/spi-builder-workspace/.derivedData/ModuleCache.noindex/Session.modulevalidation -Xcc -working-directory -Xcc /Users/admin/builder/spi-builder-workspace -resource-dir /Applications/Xcode-16.1.0.app/Contents/Developer/Toolchains/XcodeDefault.xctoolchain/usr/lib/swift -enable-anonymous-context-mangled-names -file-compilation-dir /Users/admin/builder/spi-builder-workspace -Xcc -ivfsstatcache -Xcc /Users/admin/builder/spi-builder-workspace/.derivedData/SDKStatCaches.noindex/macosx15.1-24B75-44d23fded74b714c58e69ec4af40d824.sdkstatcache -Xcc -I/Users/admin/builder/spi-builder-workspace/.derivedData/Build/Intermediates.noindex/Base32.build/Debug/Base32.build/swift-overrides.hmap -Xcc -I/Users/admin/builder/spi-builder-workspace/.derivedData/Build/Products/Debug/include -Xcc -I/Users/admin/builder/spi-builder-workspace/.derivedData/Build/Intermediates.noindex/Base32.build/Debug/Base32.build/DerivedSources-normal/arm64 -Xcc -I/Users/admin/builder/spi-builder-workspace/.derivedData/Build/Intermediates.noindex/Base32.build/Debug/Base32.build/DerivedSources/arm64 -Xcc -I/Users/admin/builder/spi-builder-workspace/.derivedData/Build/Intermediates.noindex/Base32.build/Debug/Base32.build/DerivedSources -module-name Base32 -frontend-parseable-output -disable-clang-spi -target-sdk-version 15.1 -target-sdk-name macosx15.1 -external-plugin-path /Applications/Xcode-16.1.0.app/Contents/Developer/Platforms/MacOSX.platform/Developer/usr/lib/swift/host/plugins\#/Applications/Xcode-16.1.0.app/Contents/Developer/Platforms/MacOSX.platform/Developer/usr/bin/swift-plugin-server -external-plugin-path /Applications/Xcode-16.1.0.app/Contents/Developer/Platforms/MacOSX.platform/Developer/usr/local/lib/swift/host/plugins\#/Applications/Xcode-16.1.0.app/Contents/Developer/Platforms/MacOSX.platform/Developer/usr/bin/swift-plugin-server -plugin-path /Applications/Xcode-16.1.0.app/Contents/Developer/Toolchains/XcodeDefault.xctoolchain/usr/lib/swift/host/plugins -plugin-path /Applications/Xcode-16.1.0.app/Contents/Developer/Toolchains/XcodeDefault.xctoolchain/usr/local/lib/swift/host/plugins -o /Users/admin/builder/spi-builder-workspace/.derivedData/Build/Intermediates.noindex/Base32.build/Debug/Base32.build/Objects-normal/arm64/StringExtension.o -index-unit-output-path /Base32.build/Debug/Base32.build/Objects-normal/arm64/StringExtension.o -index-store-path /Users/admin/builder/spi-builder-workspace/.derivedData/Index.noindex/DataStore -index-system-modules
SwiftCompile normal arm64 /Users/admin/builder/spi-builder-workspace/Sources/Base32/StringExtension.swift (in target 'Base32' from project 'Base32')
    cd /Users/admin/builder/spi-builder-workspace
    /Applications/Xcode-16.1.0.app/Contents/Developer/Toolchains/XcodeDefault.xctoolchain/usr/bin/swift-frontend -c /Users/admin/builder/spi-builder-workspace/Sources/Base32/Base16.swift /Users/admin/builder/spi-builder-workspace/Sources/Base32/Base32.swift /Users/admin/builder/spi-builder-workspace/Sources/Base32/shim.swift -primary-file /Users/admin/builder/spi-builder-workspace/Sources/Base32/StringExtension.swift -emit-dependencies-path /Users/admin/builder/spi-builder-workspace/.derivedData/Build/Intermediates.noindex/Base32.build/Debug/Base32.build/Objects-normal/arm64/StringExtension.d -emit-const-values-path /Users/admin/builder/spi-builder-workspace/.derivedData/Build/Intermediates.noindex/Base32.build/Debug/Base32.build/Objects-normal/arm64/StringExtension.swiftconstvalues -emit-reference-dependencies-path /Users/admin/builder/spi-builder-workspace/.derivedData/Build/Intermediates.noindex/Base32.build/Debug/Base32.build/Objects-normal/arm64/StringExtension.swiftdeps -serialize-diagnostics-path /Users/admin/builder/spi-builder-workspace/.derivedData/Build/Intermediates.noindex/Base32.build/Debug/Base32.build/Objects-normal/arm64/StringExtension.dia -target arm64-apple-macos10.9 -Xllvm -aarch64-use-tbi -enable-objc-interop -sdk /Applications/Xcode-16.1.0.app/Contents/Developer/Platforms/MacOSX.platform/Developer/SDKs/MacOSX15.1.sdk -I /Users/admin/builder/spi-builder-workspace/.derivedData/Build/Products/Debug -F /Users/admin/builder/spi-builder-workspace/.derivedData/Build/Products/Debug -F /Applications/Xcode-16.1.0.app/Contents/Developer/Platforms/MacOSX.platform/Developer/Library/Frameworks -no-color-diagnostics -application-extension -enable-testing -g -debug-info-format\=dwarf -dwarf-version\=2 -module-cache-path /Users/admin/builder/spi-builder-workspace/.derivedData/ModuleCache.noindex -profile-generate -profile-coverage-mapping -swift-version 4.2 -enforce-exclusivity\=checked -stats-output-dir /Users/admin/builder/spi-builder-workspace/.stats -Onone -serialize-debugging-options -const-gather-protocols-file /Users/admin/builder/spi-builder-workspace/.derivedData/Build/Intermediates.noindex/Base32.build/Debug/Base32.build/Objects-normal/arm64/Base32_const_extract_protocols.json -enable-experimental-feature DebugDescriptionMacro -enable-experimental-feature OpaqueTypeErasure -enable-upcoming-feature StrictConcurrency -enable-upcoming-feature DisableOutwardActorInference -enable-upcoming-feature GlobalActorIsolatedTypesUsability -enable-upcoming-feature InferSendableFromCaptures -enable-bare-slash-regex -strict-concurrency\=complete -empty-abi-descriptor -validate-clang-modules-once -clang-build-session-file /Users/admin/builder/spi-builder-workspace/.derivedData/ModuleCache.noindex/Session.modulevalidation -Xcc -working-directory -Xcc /Users/admin/builder/spi-builder-workspace -resource-dir /Applications/Xcode-16.1.0.app/Contents/Developer/Toolchains/XcodeDefault.xctoolchain/usr/lib/swift -enable-anonymous-context-mangled-names -file-compilation-dir /Users/admin/builder/spi-builder-workspace -Xcc -ivfsstatcache -Xcc /Users/admin/builder/spi-builder-workspace/.derivedData/SDKStatCaches.noindex/macosx15.1-24B75-44d23fded74b714c58e69ec4af40d824.sdkstatcache -Xcc -I/Users/admin/builder/spi-builder-workspace/.derivedData/Build/Intermediates.noindex/Base32.build/Debug/Base32.build/swift-overrides.hmap -Xcc -I/Users/admin/builder/spi-builder-workspace/.derivedData/Build/Products/Debug/include -Xcc -I/Users/admin/builder/spi-builder-workspace/.derivedData/Build/Intermediates.noindex/Base32.build/Debug/Base32.build/DerivedSources-normal/arm64 -Xcc -I/Users/admin/builder/spi-builder-workspace/.derivedData/Build/Intermediates.noindex/Base32.build/Debug/Base32.build/DerivedSources/arm64 -Xcc -I/Users/admin/builder/spi-builder-workspace/.derivedData/Build/Intermediates.noindex/Base32.build/Debug/Base32.build/DerivedSources -module-name Base32 -frontend-parseable-output -disable-clang-spi -target-sdk-version 15.1 -target-sdk-name macosx15.1 -external-plugin-path /Applications/Xcode-16.1.0.app/Contents/Developer/Platforms/MacOSX.platform/Developer/usr/lib/swift/host/plugins\#/Applications/Xcode-16.1.0.app/Contents/Developer/Platforms/MacOSX.platform/Developer/usr/bin/swift-plugin-server -external-plugin-path /Applications/Xcode-16.1.0.app/Contents/Developer/Platforms/MacOSX.platform/Developer/usr/local/lib/swift/host/plugins\#/Applications/Xcode-16.1.0.app/Contents/Developer/Platforms/MacOSX.platform/Developer/usr/bin/swift-plugin-server -plugin-path /Applications/Xcode-16.1.0.app/Contents/Developer/Toolchains/XcodeDefault.xctoolchain/usr/lib/swift/host/plugins -plugin-path /Applications/Xcode-16.1.0.app/Contents/Developer/Toolchains/XcodeDefault.xctoolchain/usr/local/lib/swift/host/plugins -o /Users/admin/builder/spi-builder-workspace/.derivedData/Build/Intermediates.noindex/Base32.build/Debug/Base32.build/Objects-normal/arm64/StringExtension.o -index-unit-output-path /Base32.build/Debug/Base32.build/Objects-normal/arm64/StringExtension.o -index-store-path /Users/admin/builder/spi-builder-workspace/.derivedData/Index.noindex/DataStore -index-system-modules
SwiftCompile normal arm64 Compiling\ Base32.swift /Users/admin/builder/spi-builder-workspace/Sources/Base32/Base32.swift (in target 'Base32' from project 'Base32')
    cd /Users/admin/builder/spi-builder-workspace
    builtin-swiftTaskExecution -- /Applications/Xcode-16.1.0.app/Contents/Developer/Toolchains/XcodeDefault.xctoolchain/usr/bin/swift-frontend -frontend -c /Users/admin/builder/spi-builder-workspace/Sources/Base32/Base16.swift -primary-file /Users/admin/builder/spi-builder-workspace/Sources/Base32/Base32.swift /Users/admin/builder/spi-builder-workspace/Sources/Base32/shim.swift /Users/admin/builder/spi-builder-workspace/Sources/Base32/StringExtension.swift -emit-dependencies-path /Users/admin/builder/spi-builder-workspace/.derivedData/Build/Intermediates.noindex/Base32.build/Debug/Base32.build/Objects-normal/arm64/Base32.d -emit-const-values-path /Users/admin/builder/spi-builder-workspace/.derivedData/Build/Intermediates.noindex/Base32.build/Debug/Base32.build/Objects-normal/arm64/Base32.swiftconstvalues -emit-reference-dependencies-path /Users/admin/builder/spi-builder-workspace/.derivedData/Build/Intermediates.noindex/Base32.build/Debug/Base32.build/Objects-normal/arm64/Base32.swiftdeps -serialize-diagnostics-path /Users/admin/builder/spi-builder-workspace/.derivedData/Build/Intermediates.noindex/Base32.build/Debug/Base32.build/Objects-normal/arm64/Base32.dia -target arm64-apple-macos10.9 -Xllvm -aarch64-use-tbi -enable-objc-interop -sdk /Applications/Xcode-16.1.0.app/Contents/Developer/Platforms/MacOSX.platform/Developer/SDKs/MacOSX15.1.sdk -I /Users/admin/builder/spi-builder-workspace/.derivedData/Build/Products/Debug -F /Users/admin/builder/spi-builder-workspace/.derivedData/Build/Products/Debug -F /Applications/Xcode-16.1.0.app/Contents/Developer/Platforms/MacOSX.platform/Developer/Library/Frameworks -no-color-diagnostics -application-extension -enable-testing -g -debug-info-format\=dwarf -dwarf-version\=2 -module-cache-path /Users/admin/builder/spi-builder-workspace/.derivedData/ModuleCache.noindex -profile-generate -profile-coverage-mapping -swift-version 4.2 -enforce-exclusivity\=checked -stats-output-dir /Users/admin/builder/spi-builder-workspace/.stats -Onone -serialize-debugging-options -const-gather-protocols-file /Users/admin/builder/spi-builder-workspace/.derivedData/Build/Intermediates.noindex/Base32.build/Debug/Base32.build/Objects-normal/arm64/Base32_const_extract_protocols.json -enable-experimental-feature DebugDescriptionMacro -enable-experimental-feature OpaqueTypeErasure -enable-upcoming-feature StrictConcurrency -enable-upcoming-feature DisableOutwardActorInference -enable-upcoming-feature GlobalActorIsolatedTypesUsability -enable-upcoming-feature InferSendableFromCaptures -enable-bare-slash-regex -strict-concurrency\=complete -empty-abi-descriptor -validate-clang-modules-once -clang-build-session-file /Users/admin/builder/spi-builder-workspace/.derivedData/ModuleCache.noindex/Session.modulevalidation -Xcc -working-directory -Xcc /Users/admin/builder/spi-builder-workspace -resource-dir /Applications/Xcode-16.1.0.app/Contents/Developer/Toolchains/XcodeDefault.xctoolchain/usr/lib/swift -enable-anonymous-context-mangled-names -file-compilation-dir /Users/admin/builder/spi-builder-workspace -Xcc -ivfsstatcache -Xcc /Users/admin/builder/spi-builder-workspace/.derivedData/SDKStatCaches.noindex/macosx15.1-24B75-44d23fded74b714c58e69ec4af40d824.sdkstatcache -Xcc -I/Users/admin/builder/spi-builder-workspace/.derivedData/Build/Intermediates.noindex/Base32.build/Debug/Base32.build/swift-overrides.hmap -Xcc -I/Users/admin/builder/spi-builder-workspace/.derivedData/Build/Products/Debug/include -Xcc -I/Users/admin/builder/spi-builder-workspace/.derivedData/Build/Intermediates.noindex/Base32.build/Debug/Base32.build/DerivedSources-normal/arm64 -Xcc -I/Users/admin/builder/spi-builder-workspace/.derivedData/Build/Intermediates.noindex/Base32.build/Debug/Base32.build/DerivedSources/arm64 -Xcc -I/Users/admin/builder/spi-builder-workspace/.derivedData/Build/Intermediates.noindex/Base32.build/Debug/Base32.build/DerivedSources -module-name Base32 -frontend-parseable-output -disable-clang-spi -target-sdk-version 15.1 -target-sdk-name macosx15.1 -external-plugin-path /Applications/Xcode-16.1.0.app/Contents/Developer/Platforms/MacOSX.platform/Developer/usr/lib/swift/host/plugins\#/Applications/Xcode-16.1.0.app/Contents/Developer/Platforms/MacOSX.platform/Developer/usr/bin/swift-plugin-server -external-plugin-path /Applications/Xcode-16.1.0.app/Contents/Developer/Platforms/MacOSX.platform/Developer/usr/local/lib/swift/host/plugins\#/Applications/Xcode-16.1.0.app/Contents/Developer/Platforms/MacOSX.platform/Developer/usr/bin/swift-plugin-server -plugin-path /Applications/Xcode-16.1.0.app/Contents/Developer/Toolchains/XcodeDefault.xctoolchain/usr/lib/swift/host/plugins -plugin-path /Applications/Xcode-16.1.0.app/Contents/Developer/Toolchains/XcodeDefault.xctoolchain/usr/local/lib/swift/host/plugins -o /Users/admin/builder/spi-builder-workspace/.derivedData/Build/Intermediates.noindex/Base32.build/Debug/Base32.build/Objects-normal/arm64/Base32.o -index-unit-output-path /Base32.build/Debug/Base32.build/Objects-normal/arm64/Base32.o -index-store-path /Users/admin/builder/spi-builder-workspace/.derivedData/Index.noindex/DataStore -index-system-modules
SwiftCompile normal arm64 /Users/admin/builder/spi-builder-workspace/Sources/Base32/Base32.swift (in target 'Base32' from project 'Base32')
    cd /Users/admin/builder/spi-builder-workspace
    /Applications/Xcode-16.1.0.app/Contents/Developer/Toolchains/XcodeDefault.xctoolchain/usr/bin/swift-frontend -c /Users/admin/builder/spi-builder-workspace/Sources/Base32/Base16.swift -primary-file /Users/admin/builder/spi-builder-workspace/Sources/Base32/Base32.swift /Users/admin/builder/spi-builder-workspace/Sources/Base32/shim.swift /Users/admin/builder/spi-builder-workspace/Sources/Base32/StringExtension.swift -emit-dependencies-path /Users/admin/builder/spi-builder-workspace/.derivedData/Build/Intermediates.noindex/Base32.build/Debug/Base32.build/Objects-normal/arm64/Base32.d -emit-const-values-path /Users/admin/builder/spi-builder-workspace/.derivedData/Build/Intermediates.noindex/Base32.build/Debug/Base32.build/Objects-normal/arm64/Base32.swiftconstvalues -emit-reference-dependencies-path /Users/admin/builder/spi-builder-workspace/.derivedData/Build/Intermediates.noindex/Base32.build/Debug/Base32.build/Objects-normal/arm64/Base32.swiftdeps -serialize-diagnostics-path /Users/admin/builder/spi-builder-workspace/.derivedData/Build/Intermediates.noindex/Base32.build/Debug/Base32.build/Objects-normal/arm64/Base32.dia -target arm64-apple-macos10.9 -Xllvm -aarch64-use-tbi -enable-objc-interop -sdk /Applications/Xcode-16.1.0.app/Contents/Developer/Platforms/MacOSX.platform/Developer/SDKs/MacOSX15.1.sdk -I /Users/admin/builder/spi-builder-workspace/.derivedData/Build/Products/Debug -F /Users/admin/builder/spi-builder-workspace/.derivedData/Build/Products/Debug -F /Applications/Xcode-16.1.0.app/Contents/Developer/Platforms/MacOSX.platform/Developer/Library/Frameworks -no-color-diagnostics -application-extension -enable-testing -g -debug-info-format\=dwarf -dwarf-version\=2 -module-cache-path /Users/admin/builder/spi-builder-workspace/.derivedData/ModuleCache.noindex -profile-generate -profile-coverage-mapping -swift-version 4.2 -enforce-exclusivity\=checked -stats-output-dir /Users/admin/builder/spi-builder-workspace/.stats -Onone -serialize-debugging-options -const-gather-protocols-file /Users/admin/builder/spi-builder-workspace/.derivedData/Build/Intermediates.noindex/Base32.build/Debug/Base32.build/Objects-normal/arm64/Base32_const_extract_protocols.json -enable-experimental-feature DebugDescriptionMacro -enable-experimental-feature OpaqueTypeErasure -enable-upcoming-feature StrictConcurrency -enable-upcoming-feature DisableOutwardActorInference -enable-upcoming-feature GlobalActorIsolatedTypesUsability -enable-upcoming-feature InferSendableFromCaptures -enable-bare-slash-regex -strict-concurrency\=complete -empty-abi-descriptor -validate-clang-modules-once -clang-build-session-file /Users/admin/builder/spi-builder-workspace/.derivedData/ModuleCache.noindex/Session.modulevalidation -Xcc -working-directory -Xcc /Users/admin/builder/spi-builder-workspace -resource-dir /Applications/Xcode-16.1.0.app/Contents/Developer/Toolchains/XcodeDefault.xctoolchain/usr/lib/swift -enable-anonymous-context-mangled-names -file-compilation-dir /Users/admin/builder/spi-builder-workspace -Xcc -ivfsstatcache -Xcc /Users/admin/builder/spi-builder-workspace/.derivedData/SDKStatCaches.noindex/macosx15.1-24B75-44d23fded74b714c58e69ec4af40d824.sdkstatcache -Xcc -I/Users/admin/builder/spi-builder-workspace/.derivedData/Build/Intermediates.noindex/Base32.build/Debug/Base32.build/swift-overrides.hmap -Xcc -I/Users/admin/builder/spi-builder-workspace/.derivedData/Build/Products/Debug/include -Xcc -I/Users/admin/builder/spi-builder-workspace/.derivedData/Build/Intermediates.noindex/Base32.build/Debug/Base32.build/DerivedSources-normal/arm64 -Xcc -I/Users/admin/builder/spi-builder-workspace/.derivedData/Build/Intermediates.noindex/Base32.build/Debug/Base32.build/DerivedSources/arm64 -Xcc -I/Users/admin/builder/spi-builder-workspace/.derivedData/Build/Intermediates.noindex/Base32.build/Debug/Base32.build/DerivedSources -module-name Base32 -frontend-parseable-output -disable-clang-spi -target-sdk-version 15.1 -target-sdk-name macosx15.1 -external-plugin-path /Applications/Xcode-16.1.0.app/Contents/Developer/Platforms/MacOSX.platform/Developer/usr/lib/swift/host/plugins\#/Applications/Xcode-16.1.0.app/Contents/Developer/Platforms/MacOSX.platform/Developer/usr/bin/swift-plugin-server -external-plugin-path /Applications/Xcode-16.1.0.app/Contents/Developer/Platforms/MacOSX.platform/Developer/usr/local/lib/swift/host/plugins\#/Applications/Xcode-16.1.0.app/Contents/Developer/Platforms/MacOSX.platform/Developer/usr/bin/swift-plugin-server -plugin-path /Applications/Xcode-16.1.0.app/Contents/Developer/Toolchains/XcodeDefault.xctoolchain/usr/lib/swift/host/plugins -plugin-path /Applications/Xcode-16.1.0.app/Contents/Developer/Toolchains/XcodeDefault.xctoolchain/usr/local/lib/swift/host/plugins -o /Users/admin/builder/spi-builder-workspace/.derivedData/Build/Intermediates.noindex/Base32.build/Debug/Base32.build/Objects-normal/arm64/Base32.o -index-unit-output-path /Base32.build/Debug/Base32.build/Objects-normal/arm64/Base32.o -index-store-path /Users/admin/builder/spi-builder-workspace/.derivedData/Index.noindex/DataStore -index-system-modules
SwiftCompile normal arm64 Compiling\ shim.swift /Users/admin/builder/spi-builder-workspace/Sources/Base32/shim.swift (in target 'Base32' from project 'Base32')
    cd /Users/admin/builder/spi-builder-workspace
    builtin-swiftTaskExecution -- /Applications/Xcode-16.1.0.app/Contents/Developer/Toolchains/XcodeDefault.xctoolchain/usr/bin/swift-frontend -frontend -c /Users/admin/builder/spi-builder-workspace/Sources/Base32/Base16.swift /Users/admin/builder/spi-builder-workspace/Sources/Base32/Base32.swift -primary-file /Users/admin/builder/spi-builder-workspace/Sources/Base32/shim.swift /Users/admin/builder/spi-builder-workspace/Sources/Base32/StringExtension.swift -emit-dependencies-path /Users/admin/builder/spi-builder-workspace/.derivedData/Build/Intermediates.noindex/Base32.build/Debug/Base32.build/Objects-normal/arm64/shim.d -emit-const-values-path /Users/admin/builder/spi-builder-workspace/.derivedData/Build/Intermediates.noindex/Base32.build/Debug/Base32.build/Objects-normal/arm64/shim.swiftconstvalues -emit-reference-dependencies-path /Users/admin/builder/spi-builder-workspace/.derivedData/Build/Intermediates.noindex/Base32.build/Debug/Base32.build/Objects-normal/arm64/shim.swiftdeps -serialize-diagnostics-path /Users/admin/builder/spi-builder-workspace/.derivedData/Build/Intermediates.noindex/Base32.build/Debug/Base32.build/Objects-normal/arm64/shim.dia -target arm64-apple-macos10.9 -Xllvm -aarch64-use-tbi -enable-objc-interop -sdk /Applications/Xcode-16.1.0.app/Contents/Developer/Platforms/MacOSX.platform/Developer/SDKs/MacOSX15.1.sdk -I /Users/admin/builder/spi-builder-workspace/.derivedData/Build/Products/Debug -F /Users/admin/builder/spi-builder-workspace/.derivedData/Build/Products/Debug -F /Applications/Xcode-16.1.0.app/Contents/Developer/Platforms/MacOSX.platform/Developer/Library/Frameworks -no-color-diagnostics -application-extension -enable-testing -g -debug-info-format\=dwarf -dwarf-version\=2 -module-cache-path /Users/admin/builder/spi-builder-workspace/.derivedData/ModuleCache.noindex -profile-generate -profile-coverage-mapping -swift-version 4.2 -enforce-exclusivity\=checked -stats-output-dir /Users/admin/builder/spi-builder-workspace/.stats -Onone -serialize-debugging-options -const-gather-protocols-file /Users/admin/builder/spi-builder-workspace/.derivedData/Build/Intermediates.noindex/Base32.build/Debug/Base32.build/Objects-normal/arm64/Base32_const_extract_protocols.json -enable-experimental-feature DebugDescriptionMacro -enable-experimental-feature OpaqueTypeErasure -enable-upcoming-feature StrictConcurrency -enable-upcoming-feature DisableOutwardActorInference -enable-upcoming-feature GlobalActorIsolatedTypesUsability -enable-upcoming-feature InferSendableFromCaptures -enable-bare-slash-regex -strict-concurrency\=complete -empty-abi-descriptor -validate-clang-modules-once -clang-build-session-file /Users/admin/builder/spi-builder-workspace/.derivedData/ModuleCache.noindex/Session.modulevalidation -Xcc -working-directory -Xcc /Users/admin/builder/spi-builder-workspace -resource-dir /Applications/Xcode-16.1.0.app/Contents/Developer/Toolchains/XcodeDefault.xctoolchain/usr/lib/swift -enable-anonymous-context-mangled-names -file-compilation-dir /Users/admin/builder/spi-builder-workspace -Xcc -ivfsstatcache -Xcc /Users/admin/builder/spi-builder-workspace/.derivedData/SDKStatCaches.noindex/macosx15.1-24B75-44d23fded74b714c58e69ec4af40d824.sdkstatcache -Xcc -I/Users/admin/builder/spi-builder-workspace/.derivedData/Build/Intermediates.noindex/Base32.build/Debug/Base32.build/swift-overrides.hmap -Xcc -I/Users/admin/builder/spi-builder-workspace/.derivedData/Build/Products/Debug/include -Xcc -I/Users/admin/builder/spi-builder-workspace/.derivedData/Build/Intermediates.noindex/Base32.build/Debug/Base32.build/DerivedSources-normal/arm64 -Xcc -I/Users/admin/builder/spi-builder-workspace/.derivedData/Build/Intermediates.noindex/Base32.build/Debug/Base32.build/DerivedSources/arm64 -Xcc -I/Users/admin/builder/spi-builder-workspace/.derivedData/Build/Intermediates.noindex/Base32.build/Debug/Base32.build/DerivedSources -module-name Base32 -frontend-parseable-output -disable-clang-spi -target-sdk-version 15.1 -target-sdk-name macosx15.1 -external-plugin-path /Applications/Xcode-16.1.0.app/Contents/Developer/Platforms/MacOSX.platform/Developer/usr/lib/swift/host/plugins\#/Applications/Xcode-16.1.0.app/Contents/Developer/Platforms/MacOSX.platform/Developer/usr/bin/swift-plugin-server -external-plugin-path /Applications/Xcode-16.1.0.app/Contents/Developer/Platforms/MacOSX.platform/Developer/usr/local/lib/swift/host/plugins\#/Applications/Xcode-16.1.0.app/Contents/Developer/Platforms/MacOSX.platform/Developer/usr/bin/swift-plugin-server -plugin-path /Applications/Xcode-16.1.0.app/Contents/Developer/Toolchains/XcodeDefault.xctoolchain/usr/lib/swift/host/plugins -plugin-path /Applications/Xcode-16.1.0.app/Contents/Developer/Toolchains/XcodeDefault.xctoolchain/usr/local/lib/swift/host/plugins -o /Users/admin/builder/spi-builder-workspace/.derivedData/Build/Intermediates.noindex/Base32.build/Debug/Base32.build/Objects-normal/arm64/shim.o -index-unit-output-path /Base32.build/Debug/Base32.build/Objects-normal/arm64/shim.o -index-store-path /Users/admin/builder/spi-builder-workspace/.derivedData/Index.noindex/DataStore -index-system-modules
SwiftCompile normal arm64 /Users/admin/builder/spi-builder-workspace/Sources/Base32/shim.swift (in target 'Base32' from project 'Base32')
    cd /Users/admin/builder/spi-builder-workspace
    /Applications/Xcode-16.1.0.app/Contents/Developer/Toolchains/XcodeDefault.xctoolchain/usr/bin/swift-frontend -c /Users/admin/builder/spi-builder-workspace/Sources/Base32/Base16.swift /Users/admin/builder/spi-builder-workspace/Sources/Base32/Base32.swift -primary-file /Users/admin/builder/spi-builder-workspace/Sources/Base32/shim.swift /Users/admin/builder/spi-builder-workspace/Sources/Base32/StringExtension.swift -emit-dependencies-path /Users/admin/builder/spi-builder-workspace/.derivedData/Build/Intermediates.noindex/Base32.build/Debug/Base32.build/Objects-normal/arm64/shim.d -emit-const-values-path /Users/admin/builder/spi-builder-workspace/.derivedData/Build/Intermediates.noindex/Base32.build/Debug/Base32.build/Objects-normal/arm64/shim.swiftconstvalues -emit-reference-dependencies-path /Users/admin/builder/spi-builder-workspace/.derivedData/Build/Intermediates.noindex/Base32.build/Debug/Base32.build/Objects-normal/arm64/shim.swiftdeps -serialize-diagnostics-path /Users/admin/builder/spi-builder-workspace/.derivedData/Build/Intermediates.noindex/Base32.build/Debug/Base32.build/Objects-normal/arm64/shim.dia -target arm64-apple-macos10.9 -Xllvm -aarch64-use-tbi -enable-objc-interop -sdk /Applications/Xcode-16.1.0.app/Contents/Developer/Platforms/MacOSX.platform/Developer/SDKs/MacOSX15.1.sdk -I /Users/admin/builder/spi-builder-workspace/.derivedData/Build/Products/Debug -F /Users/admin/builder/spi-builder-workspace/.derivedData/Build/Products/Debug -F /Applications/Xcode-16.1.0.app/Contents/Developer/Platforms/MacOSX.platform/Developer/Library/Frameworks -no-color-diagnostics -application-extension -enable-testing -g -debug-info-format\=dwarf -dwarf-version\=2 -module-cache-path /Users/admin/builder/spi-builder-workspace/.derivedData/ModuleCache.noindex -profile-generate -profile-coverage-mapping -swift-version 4.2 -enforce-exclusivity\=checked -stats-output-dir /Users/admin/builder/spi-builder-workspace/.stats -Onone -serialize-debugging-options -const-gather-protocols-file /Users/admin/builder/spi-builder-workspace/.derivedData/Build/Intermediates.noindex/Base32.build/Debug/Base32.build/Objects-normal/arm64/Base32_const_extract_protocols.json -enable-experimental-feature DebugDescriptionMacro -enable-experimental-feature OpaqueTypeErasure -enable-upcoming-feature StrictConcurrency -enable-upcoming-feature DisableOutwardActorInference -enable-upcoming-feature GlobalActorIsolatedTypesUsability -enable-upcoming-feature InferSendableFromCaptures -enable-bare-slash-regex -strict-concurrency\=complete -empty-abi-descriptor -validate-clang-modules-once -clang-build-session-file /Users/admin/builder/spi-builder-workspace/.derivedData/ModuleCache.noindex/Session.modulevalidation -Xcc -working-directory -Xcc /Users/admin/builder/spi-builder-workspace -resource-dir /Applications/Xcode-16.1.0.app/Contents/Developer/Toolchains/XcodeDefault.xctoolchain/usr/lib/swift -enable-anonymous-context-mangled-names -file-compilation-dir /Users/admin/builder/spi-builder-workspace -Xcc -ivfsstatcache -Xcc /Users/admin/builder/spi-builder-workspace/.derivedData/SDKStatCaches.noindex/macosx15.1-24B75-44d23fded74b714c58e69ec4af40d824.sdkstatcache -Xcc -I/Users/admin/builder/spi-builder-workspace/.derivedData/Build/Intermediates.noindex/Base32.build/Debug/Base32.build/swift-overrides.hmap -Xcc -I/Users/admin/builder/spi-builder-workspace/.derivedData/Build/Products/Debug/include -Xcc -I/Users/admin/builder/spi-builder-workspace/.derivedData/Build/Intermediates.noindex/Base32.build/Debug/Base32.build/DerivedSources-normal/arm64 -Xcc -I/Users/admin/builder/spi-builder-workspace/.derivedData/Build/Intermediates.noindex/Base32.build/Debug/Base32.build/DerivedSources/arm64 -Xcc -I/Users/admin/builder/spi-builder-workspace/.derivedData/Build/Intermediates.noindex/Base32.build/Debug/Base32.build/DerivedSources -module-name Base32 -frontend-parseable-output -disable-clang-spi -target-sdk-version 15.1 -target-sdk-name macosx15.1 -external-plugin-path /Applications/Xcode-16.1.0.app/Contents/Developer/Platforms/MacOSX.platform/Developer/usr/lib/swift/host/plugins\#/Applications/Xcode-16.1.0.app/Contents/Developer/Platforms/MacOSX.platform/Developer/usr/bin/swift-plugin-server -external-plugin-path /Applications/Xcode-16.1.0.app/Contents/Developer/Platforms/MacOSX.platform/Developer/usr/local/lib/swift/host/plugins\#/Applications/Xcode-16.1.0.app/Contents/Developer/Platforms/MacOSX.platform/Developer/usr/bin/swift-plugin-server -plugin-path /Applications/Xcode-16.1.0.app/Contents/Developer/Toolchains/XcodeDefault.xctoolchain/usr/lib/swift/host/plugins -plugin-path /Applications/Xcode-16.1.0.app/Contents/Developer/Toolchains/XcodeDefault.xctoolchain/usr/local/lib/swift/host/plugins -o /Users/admin/builder/spi-builder-workspace/.derivedData/Build/Intermediates.noindex/Base32.build/Debug/Base32.build/Objects-normal/arm64/shim.o -index-unit-output-path /Base32.build/Debug/Base32.build/Objects-normal/arm64/shim.o -index-store-path /Users/admin/builder/spi-builder-workspace/.derivedData/Index.noindex/DataStore -index-system-modules
SwiftCompile normal arm64 Compiling\ Base16.swift /Users/admin/builder/spi-builder-workspace/Sources/Base32/Base16.swift (in target 'Base32' from project 'Base32')
    cd /Users/admin/builder/spi-builder-workspace
    builtin-swiftTaskExecution -- /Applications/Xcode-16.1.0.app/Contents/Developer/Toolchains/XcodeDefault.xctoolchain/usr/bin/swift-frontend -frontend -c -primary-file /Users/admin/builder/spi-builder-workspace/Sources/Base32/Base16.swift /Users/admin/builder/spi-builder-workspace/Sources/Base32/Base32.swift /Users/admin/builder/spi-builder-workspace/Sources/Base32/shim.swift /Users/admin/builder/spi-builder-workspace/Sources/Base32/StringExtension.swift -emit-dependencies-path /Users/admin/builder/spi-builder-workspace/.derivedData/Build/Intermediates.noindex/Base32.build/Debug/Base32.build/Objects-normal/arm64/Base16.d -emit-const-values-path /Users/admin/builder/spi-builder-workspace/.derivedData/Build/Intermediates.noindex/Base32.build/Debug/Base32.build/Objects-normal/arm64/Base16.swiftconstvalues -emit-reference-dependencies-path /Users/admin/builder/spi-builder-workspace/.derivedData/Build/Intermediates.noindex/Base32.build/Debug/Base32.build/Objects-normal/arm64/Base16.swiftdeps -serialize-diagnostics-path /Users/admin/builder/spi-builder-workspace/.derivedData/Build/Intermediates.noindex/Base32.build/Debug/Base32.build/Objects-normal/arm64/Base16.dia -target arm64-apple-macos10.9 -Xllvm -aarch64-use-tbi -enable-objc-interop -sdk /Applications/Xcode-16.1.0.app/Contents/Developer/Platforms/MacOSX.platform/Developer/SDKs/MacOSX15.1.sdk -I /Users/admin/builder/spi-builder-workspace/.derivedData/Build/Products/Debug -F /Users/admin/builder/spi-builder-workspace/.derivedData/Build/Products/Debug -F /Applications/Xcode-16.1.0.app/Contents/Developer/Platforms/MacOSX.platform/Developer/Library/Frameworks -no-color-diagnostics -application-extension -enable-testing -g -debug-info-format\=dwarf -dwarf-version\=2 -module-cache-path /Users/admin/builder/spi-builder-workspace/.derivedData/ModuleCache.noindex -profile-generate -profile-coverage-mapping -swift-version 4.2 -enforce-exclusivity\=checked -stats-output-dir /Users/admin/builder/spi-builder-workspace/.stats -Onone -serialize-debugging-options -const-gather-protocols-file /Users/admin/builder/spi-builder-workspace/.derivedData/Build/Intermediates.noindex/Base32.build/Debug/Base32.build/Objects-normal/arm64/Base32_const_extract_protocols.json -enable-experimental-feature DebugDescriptionMacro -enable-experimental-feature OpaqueTypeErasure -enable-upcoming-feature StrictConcurrency -enable-upcoming-feature DisableOutwardActorInference -enable-upcoming-feature GlobalActorIsolatedTypesUsability -enable-upcoming-feature InferSendableFromCaptures -enable-bare-slash-regex -strict-concurrency\=complete -empty-abi-descriptor -validate-clang-modules-once -clang-build-session-file /Users/admin/builder/spi-builder-workspace/.derivedData/ModuleCache.noindex/Session.modulevalidation -Xcc -working-directory -Xcc /Users/admin/builder/spi-builder-workspace -resource-dir /Applications/Xcode-16.1.0.app/Contents/Developer/Toolchains/XcodeDefault.xctoolchain/usr/lib/swift -enable-anonymous-context-mangled-names -file-compilation-dir /Users/admin/builder/spi-builder-workspace -Xcc -ivfsstatcache -Xcc /Users/admin/builder/spi-builder-workspace/.derivedData/SDKStatCaches.noindex/macosx15.1-24B75-44d23fded74b714c58e69ec4af40d824.sdkstatcache -Xcc -I/Users/admin/builder/spi-builder-workspace/.derivedData/Build/Intermediates.noindex/Base32.build/Debug/Base32.build/swift-overrides.hmap -Xcc -I/Users/admin/builder/spi-builder-workspace/.derivedData/Build/Products/Debug/include -Xcc -I/Users/admin/builder/spi-builder-workspace/.derivedData/Build/Intermediates.noindex/Base32.build/Debug/Base32.build/DerivedSources-normal/arm64 -Xcc -I/Users/admin/builder/spi-builder-workspace/.derivedData/Build/Intermediates.noindex/Base32.build/Debug/Base32.build/DerivedSources/arm64 -Xcc -I/Users/admin/builder/spi-builder-workspace/.derivedData/Build/Intermediates.noindex/Base32.build/Debug/Base32.build/DerivedSources -module-name Base32 -frontend-parseable-output -disable-clang-spi -target-sdk-version 15.1 -target-sdk-name macosx15.1 -external-plugin-path /Applications/Xcode-16.1.0.app/Contents/Developer/Platforms/MacOSX.platform/Developer/usr/lib/swift/host/plugins\#/Applications/Xcode-16.1.0.app/Contents/Developer/Platforms/MacOSX.platform/Developer/usr/bin/swift-plugin-server -external-plugin-path /Applications/Xcode-16.1.0.app/Contents/Developer/Platforms/MacOSX.platform/Developer/usr/local/lib/swift/host/plugins\#/Applications/Xcode-16.1.0.app/Contents/Developer/Platforms/MacOSX.platform/Developer/usr/bin/swift-plugin-server -plugin-path /Applications/Xcode-16.1.0.app/Contents/Developer/Toolchains/XcodeDefault.xctoolchain/usr/lib/swift/host/plugins -plugin-path /Applications/Xcode-16.1.0.app/Contents/Developer/Toolchains/XcodeDefault.xctoolchain/usr/local/lib/swift/host/plugins -o /Users/admin/builder/spi-builder-workspace/.derivedData/Build/Intermediates.noindex/Base32.build/Debug/Base32.build/Objects-normal/arm64/Base16.o -index-unit-output-path /Base32.build/Debug/Base32.build/Objects-normal/arm64/Base16.o -index-store-path /Users/admin/builder/spi-builder-workspace/.derivedData/Index.noindex/DataStore -index-system-modules
SwiftCompile normal arm64 /Users/admin/builder/spi-builder-workspace/Sources/Base32/Base16.swift (in target 'Base32' from project 'Base32')
    cd /Users/admin/builder/spi-builder-workspace
    /Applications/Xcode-16.1.0.app/Contents/Developer/Toolchains/XcodeDefault.xctoolchain/usr/bin/swift-frontend -c -primary-file /Users/admin/builder/spi-builder-workspace/Sources/Base32/Base16.swift /Users/admin/builder/spi-builder-workspace/Sources/Base32/Base32.swift /Users/admin/builder/spi-builder-workspace/Sources/Base32/shim.swift /Users/admin/builder/spi-builder-workspace/Sources/Base32/StringExtension.swift -emit-dependencies-path /Users/admin/builder/spi-builder-workspace/.derivedData/Build/Intermediates.noindex/Base32.build/Debug/Base32.build/Objects-normal/arm64/Base16.d -emit-const-values-path /Users/admin/builder/spi-builder-workspace/.derivedData/Build/Intermediates.noindex/Base32.build/Debug/Base32.build/Objects-normal/arm64/Base16.swiftconstvalues -emit-reference-dependencies-path /Users/admin/builder/spi-builder-workspace/.derivedData/Build/Intermediates.noindex/Base32.build/Debug/Base32.build/Objects-normal/arm64/Base16.swiftdeps -serialize-diagnostics-path /Users/admin/builder/spi-builder-workspace/.derivedData/Build/Intermediates.noindex/Base32.build/Debug/Base32.build/Objects-normal/arm64/Base16.dia -target arm64-apple-macos10.9 -Xllvm -aarch64-use-tbi -enable-objc-interop -sdk /Applications/Xcode-16.1.0.app/Contents/Developer/Platforms/MacOSX.platform/Developer/SDKs/MacOSX15.1.sdk -I /Users/admin/builder/spi-builder-workspace/.derivedData/Build/Products/Debug -F /Users/admin/builder/spi-builder-workspace/.derivedData/Build/Products/Debug -F /Applications/Xcode-16.1.0.app/Contents/Developer/Platforms/MacOSX.platform/Developer/Library/Frameworks -no-color-diagnostics -application-extension -enable-testing -g -debug-info-format\=dwarf -dwarf-version\=2 -module-cache-path /Users/admin/builder/spi-builder-workspace/.derivedData/ModuleCache.noindex -profile-generate -profile-coverage-mapping -swift-version 4.2 -enforce-exclusivity\=checked -stats-output-dir /Users/admin/builder/spi-builder-workspace/.stats -Onone -serialize-debugging-options -const-gather-protocols-file /Users/admin/builder/spi-builder-workspace/.derivedData/Build/Intermediates.noindex/Base32.build/Debug/Base32.build/Objects-normal/arm64/Base32_const_extract_protocols.json -enable-experimental-feature DebugDescriptionMacro -enable-experimental-feature OpaqueTypeErasure -enable-upcoming-feature StrictConcurrency -enable-upcoming-feature DisableOutwardActorInference -enable-upcoming-feature GlobalActorIsolatedTypesUsability -enable-upcoming-feature InferSendableFromCaptures -enable-bare-slash-regex -strict-concurrency\=complete -empty-abi-descriptor -validate-clang-modules-once -clang-build-session-file /Users/admin/builder/spi-builder-workspace/.derivedData/ModuleCache.noindex/Session.modulevalidation -Xcc -working-directory -Xcc /Users/admin/builder/spi-builder-workspace -resource-dir /Applications/Xcode-16.1.0.app/Contents/Developer/Toolchains/XcodeDefault.xctoolchain/usr/lib/swift -enable-anonymous-context-mangled-names -file-compilation-dir /Users/admin/builder/spi-builder-workspace -Xcc -ivfsstatcache -Xcc /Users/admin/builder/spi-builder-workspace/.derivedData/SDKStatCaches.noindex/macosx15.1-24B75-44d23fded74b714c58e69ec4af40d824.sdkstatcache -Xcc -I/Users/admin/builder/spi-builder-workspace/.derivedData/Build/Intermediates.noindex/Base32.build/Debug/Base32.build/swift-overrides.hmap -Xcc -I/Users/admin/builder/spi-builder-workspace/.derivedData/Build/Products/Debug/include -Xcc -I/Users/admin/builder/spi-builder-workspace/.derivedData/Build/Intermediates.noindex/Base32.build/Debug/Base32.build/DerivedSources-normal/arm64 -Xcc -I/Users/admin/builder/spi-builder-workspace/.derivedData/Build/Intermediates.noindex/Base32.build/Debug/Base32.build/DerivedSources/arm64 -Xcc -I/Users/admin/builder/spi-builder-workspace/.derivedData/Build/Intermediates.noindex/Base32.build/Debug/Base32.build/DerivedSources -module-name Base32 -frontend-parseable-output -disable-clang-spi -target-sdk-version 15.1 -target-sdk-name macosx15.1 -external-plugin-path /Applications/Xcode-16.1.0.app/Contents/Developer/Platforms/MacOSX.platform/Developer/usr/lib/swift/host/plugins\#/Applications/Xcode-16.1.0.app/Contents/Developer/Platforms/MacOSX.platform/Developer/usr/bin/swift-plugin-server -external-plugin-path /Applications/Xcode-16.1.0.app/Contents/Developer/Platforms/MacOSX.platform/Developer/usr/local/lib/swift/host/plugins\#/Applications/Xcode-16.1.0.app/Contents/Developer/Platforms/MacOSX.platform/Developer/usr/bin/swift-plugin-server -plugin-path /Applications/Xcode-16.1.0.app/Contents/Developer/Toolchains/XcodeDefault.xctoolchain/usr/lib/swift/host/plugins -plugin-path /Applications/Xcode-16.1.0.app/Contents/Developer/Toolchains/XcodeDefault.xctoolchain/usr/local/lib/swift/host/plugins -o /Users/admin/builder/spi-builder-workspace/.derivedData/Build/Intermediates.noindex/Base32.build/Debug/Base32.build/Objects-normal/arm64/Base16.o -index-unit-output-path /Base32.build/Debug/Base32.build/Objects-normal/arm64/Base16.o -index-store-path /Users/admin/builder/spi-builder-workspace/.derivedData/Index.noindex/DataStore -index-system-modules
/Users/admin/builder/spi-builder-workspace/Base32.xcodeproj: warning: The macOS deployment target 'MACOSX_DEPLOYMENT_TARGET' is set to 10.9, but the range of supported deployment target versions is 10.13 to 15.1.99. (in target 'Base32' from project 'Base32')
** BUILD FAILED **
The following build commands failed:
	EmitSwiftModule normal arm64 (in target 'Base32' from project 'Base32')
	SwiftEmitModule normal arm64 Emitting\ module\ for\ Base32 (in target 'Base32' from project 'Base32')
	Building project Base32 with scheme Base32
(3 failures)
Command line invocation:
    /Applications/Xcode-16.1.0.app/Contents/Developer/usr/bin/xcodebuild -IDEClonedSourcePackagesDirPathOverride=/Users/admin/builder/spi-builder-workspace/.dependencies -skipMacroValidation -skipPackagePluginValidation -derivedDataPath /Users/admin/builder/spi-builder-workspace/.derivedData build -scheme Base32 -destination platform=macOS,arch=arm64 "OTHER_SWIFT_FLAGS=-stats-output-dir .stats -strict-concurrency=complete -enable-upcoming-feature StrictConcurrency -enable-upcoming-feature DisableOutwardActorInference -enable-upcoming-feature GlobalActorIsolatedTypesUsability -enable-upcoming-feature InferSendableFromCaptures"
User defaults from command line:
    IDEClonedSourcePackagesDirPathOverride = /Users/admin/builder/spi-builder-workspace/.dependencies
    IDEDerivedDataPathOverride = /Users/admin/builder/spi-builder-workspace/.derivedData
    IDEPackageSupportUseBuiltinSCM = YES
Build settings from command line:
    OTHER_SWIFT_FLAGS = -stats-output-dir .stats -strict-concurrency=complete -enable-upcoming-feature StrictConcurrency -enable-upcoming-feature DisableOutwardActorInference -enable-upcoming-feature GlobalActorIsolatedTypesUsability -enable-upcoming-feature InferSendableFromCaptures
Prepare packages
ComputeTargetDependencyGraph
note: Building targets in dependency order
note: Target dependency graph (1 target)
    Target 'Base32' in project 'Base32' (no dependencies)
GatherProvisioningInputs
CreateBuildDescription
ClangStatCache /Applications/Xcode-16.1.0.app/Contents/Developer/Toolchains/XcodeDefault.xctoolchain/usr/bin/clang-stat-cache /Applications/Xcode-16.1.0.app/Contents/Developer/Platforms/MacOSX.platform/Developer/SDKs/MacOSX15.1.sdk /Users/admin/builder/spi-builder-workspace/.derivedData/SDKStatCaches.noindex/macosx15.1-24B75-44d23fded74b714c58e69ec4af40d824.sdkstatcache
    cd /Users/admin/builder/spi-builder-workspace/Base32.xcodeproj
    /Applications/Xcode-16.1.0.app/Contents/Developer/Toolchains/XcodeDefault.xctoolchain/usr/bin/clang-stat-cache /Applications/Xcode-16.1.0.app/Contents/Developer/Platforms/MacOSX.platform/Developer/SDKs/MacOSX15.1.sdk -o /Users/admin/builder/spi-builder-workspace/.derivedData/SDKStatCaches.noindex/macosx15.1-24B75-44d23fded74b714c58e69ec4af40d824.sdkstatcache
/Users/admin/builder/spi-builder-workspace/Base32.xcodeproj: warning: The macOS deployment target 'MACOSX_DEPLOYMENT_TARGET' is set to 10.9, but the range of supported deployment target versions is 10.13 to 15.1.99. (in target 'Base32' from project 'Base32')
SwiftDriver Base32 normal arm64 com.apple.xcode.tools.swift.compiler (in target 'Base32' from project 'Base32')
    cd /Users/admin/builder/spi-builder-workspace
    builtin-SwiftDriver -- /Applications/Xcode-16.1.0.app/Contents/Developer/Toolchains/XcodeDefault.xctoolchain/usr/bin/swiftc -module-name Base32 -Onone -enforce-exclusivity\=checked @/Users/admin/builder/spi-builder-workspace/.derivedData/Build/Intermediates.noindex/Base32.build/Debug/Base32.build/Objects-normal/arm64/Base32.SwiftFileList -stats-output-dir .stats -strict-concurrency\=complete -enable-upcoming-feature StrictConcurrency -enable-upcoming-feature DisableOutwardActorInference -enable-upcoming-feature GlobalActorIsolatedTypesUsability -enable-upcoming-feature InferSendableFromCaptures -enable-bare-slash-regex -enable-experimental-feature DebugDescriptionMacro -sdk /Applications/Xcode-16.1.0.app/Contents/Developer/Platforms/MacOSX.platform/Developer/SDKs/MacOSX15.1.sdk -target arm64-apple-macos10.9 -g -module-cache-path /Users/admin/builder/spi-builder-workspace/.derivedData/ModuleCache.noindex -Xfrontend -serialize-debugging-options -application-extension -profile-coverage-mapping -profile-generate -enable-testing -index-store-path /Users/admin/builder/spi-builder-workspace/.derivedData/Index.noindex/DataStore -enable-experimental-feature OpaqueTypeErasure -swift-version 4.2 -I /Users/admin/builder/spi-builder-workspace/.derivedData/Build/Products/Debug -F /Users/admin/builder/spi-builder-workspace/.derivedData/Build/Products/Debug -F /Applications/Xcode-16.1.0.app/Contents/Developer/Platforms/MacOSX.platform/Developer/Library/Frameworks -c -j10 -enable-batch-mode -incremental -Xcc -ivfsstatcache -Xcc /Users/admin/builder/spi-builder-workspace/.derivedData/SDKStatCaches.noindex/macosx15.1-24B75-44d23fded74b714c58e69ec4af40d824.sdkstatcache -output-file-map /Users/admin/builder/spi-builder-workspace/.derivedData/Build/Intermediates.noindex/Base32.build/Debug/Base32.build/Objects-normal/arm64/Base32-OutputFileMap.json -use-frontend-parseable-output -save-temps -no-color-diagnostics -serialize-diagnostics -emit-dependencies -emit-module -emit-module-path /Users/admin/builder/spi-builder-workspace/.derivedData/Build/Intermediates.noindex/Base32.build/Debug/Base32.build/Objects-normal/arm64/Base32.swiftmodule -validate-clang-modules-once -clang-build-session-file /Users/admin/builder/spi-builder-workspace/.derivedData/ModuleCache.noindex/Session.modulevalidation -Xcc -I/Users/admin/builder/spi-builder-workspace/.derivedData/Build/Intermediates.noindex/Base32.build/Debug/Base32.build/swift-overrides.hmap -emit-const-values -Xfrontend -const-gather-protocols-file -Xfrontend /Users/admin/builder/spi-builder-workspace/.derivedData/Build/Intermediates.noindex/Base32.build/Debug/Base32.build/Objects-normal/arm64/Base32_const_extract_protocols.json -Xcc -I/Users/admin/builder/spi-builder-workspace/.derivedData/Build/Products/Debug/include -Xcc -I/Users/admin/builder/spi-builder-workspace/.derivedData/Build/Intermediates.noindex/Base32.build/Debug/Base32.build/DerivedSources-normal/arm64 -Xcc -I/Users/admin/builder/spi-builder-workspace/.derivedData/Build/Intermediates.noindex/Base32.build/Debug/Base32.build/DerivedSources/arm64 -Xcc -I/Users/admin/builder/spi-builder-workspace/.derivedData/Build/Intermediates.noindex/Base32.build/Debug/Base32.build/DerivedSources -emit-objc-header -emit-objc-header-path /Users/admin/builder/spi-builder-workspace/.derivedData/Build/Intermediates.noindex/Base32.build/Debug/Base32.build/Objects-normal/arm64/Base32-Swift.h -working-directory /Users/admin/builder/spi-builder-workspace -experimental-emit-module-separately -disable-cmo
SwiftEmitModule normal arm64 Emitting\ module\ for\ Base32 (in target 'Base32' from project 'Base32')
    cd /Users/admin/builder/spi-builder-workspace
    builtin-swiftTaskExecution -- /Applications/Xcode-16.1.0.app/Contents/Developer/Toolchains/XcodeDefault.xctoolchain/usr/bin/swift-frontend -frontend -emit-module -experimental-skip-non-inlinable-function-bodies-without-types /Users/admin/builder/spi-builder-workspace/Sources/Base32/Base16.swift /Users/admin/builder/spi-builder-workspace/Sources/Base32/Base32.swift /Users/admin/builder/spi-builder-workspace/Sources/Base32/shim.swift /Users/admin/builder/spi-builder-workspace/Sources/Base32/StringExtension.swift -target arm64-apple-macos10.9 -Xllvm -aarch64-use-tbi -enable-objc-interop -sdk /Applications/Xcode-16.1.0.app/Contents/Developer/Platforms/MacOSX.platform/Developer/SDKs/MacOSX15.1.sdk -I /Users/admin/builder/spi-builder-workspace/.derivedData/Build/Products/Debug -F /Users/admin/builder/spi-builder-workspace/.derivedData/Build/Products/Debug -F /Applications/Xcode-16.1.0.app/Contents/Developer/Platforms/MacOSX.platform/Developer/Library/Frameworks -no-color-diagnostics -application-extension -enable-testing -g -debug-info-format\=dwarf -dwarf-version\=2 -module-cache-path /Users/admin/builder/spi-builder-workspace/.derivedData/ModuleCache.noindex -profile-generate -profile-coverage-mapping -swift-version 4.2 -enforce-exclusivity\=checked -stats-output-dir /Users/admin/builder/spi-builder-workspace/.stats -Onone -serialize-debugging-options -const-gather-protocols-file /Users/admin/builder/spi-builder-workspace/.derivedData/Build/Intermediates.noindex/Base32.build/Debug/Base32.build/Objects-normal/arm64/Base32_const_extract_protocols.json -enable-experimental-feature DebugDescriptionMacro -enable-experimental-feature OpaqueTypeErasure -enable-upcoming-feature StrictConcurrency -enable-upcoming-feature DisableOutwardActorInference -enable-upcoming-feature GlobalActorIsolatedTypesUsability -enable-upcoming-feature InferSendableFromCaptures -enable-bare-slash-regex -strict-concurrency\=complete -empty-abi-descriptor -validate-clang-modules-once -clang-build-session-file /Users/admin/builder/spi-builder-workspace/.derivedData/ModuleCache.noindex/Session.modulevalidation -Xcc -working-directory -Xcc /Users/admin/builder/spi-builder-workspace -resource-dir /Applications/Xcode-16.1.0.app/Contents/Developer/Toolchains/XcodeDefault.xctoolchain/usr/lib/swift -enable-anonymous-context-mangled-names -file-compilation-dir /Users/admin/builder/spi-builder-workspace -Xcc -ivfsstatcache -Xcc /Users/admin/builder/spi-builder-workspace/.derivedData/SDKStatCaches.noindex/macosx15.1-24B75-44d23fded74b714c58e69ec4af40d824.sdkstatcache -Xcc -I/Users/admin/builder/spi-builder-workspace/.derivedData/Build/Intermediates.noindex/Base32.build/Debug/Base32.build/swift-overrides.hmap -Xcc -I/Users/admin/builder/spi-builder-workspace/.derivedData/Build/Products/Debug/include -Xcc -I/Users/admin/builder/spi-builder-workspace/.derivedData/Build/Intermediates.noindex/Base32.build/Debug/Base32.build/DerivedSources-normal/arm64 -Xcc -I/Users/admin/builder/spi-builder-workspace/.derivedData/Build/Intermediates.noindex/Base32.build/Debug/Base32.build/DerivedSources/arm64 -Xcc -I/Users/admin/builder/spi-builder-workspace/.derivedData/Build/Intermediates.noindex/Base32.build/Debug/Base32.build/DerivedSources -module-name Base32 -frontend-parseable-output -disable-clang-spi -target-sdk-version 15.1 -target-sdk-name macosx15.1 -external-plugin-path /Applications/Xcode-16.1.0.app/Contents/Developer/Platforms/MacOSX.platform/Developer/usr/lib/swift/host/plugins\#/Applications/Xcode-16.1.0.app/Contents/Developer/Platforms/MacOSX.platform/Developer/usr/bin/swift-plugin-server -external-plugin-path /Applications/Xcode-16.1.0.app/Contents/Developer/Platforms/MacOSX.platform/Developer/usr/local/lib/swift/host/plugins\#/Applications/Xcode-16.1.0.app/Contents/Developer/Platforms/MacOSX.platform/Developer/usr/bin/swift-plugin-server -plugin-path /Applications/Xcode-16.1.0.app/Contents/Developer/Toolchains/XcodeDefault.xctoolchain/usr/lib/swift/host/plugins -plugin-path /Applications/Xcode-16.1.0.app/Contents/Developer/Toolchains/XcodeDefault.xctoolchain/usr/local/lib/swift/host/plugins -emit-module-doc-path /Users/admin/builder/spi-builder-workspace/.derivedData/Build/Intermediates.noindex/Base32.build/Debug/Base32.build/Objects-normal/arm64/Base32.swiftdoc -emit-module-source-info-path /Users/admin/builder/spi-builder-workspace/.derivedData/Build/Intermediates.noindex/Base32.build/Debug/Base32.build/Objects-normal/arm64/Base32.swiftsourceinfo -emit-objc-header-path /Users/admin/builder/spi-builder-workspace/.derivedData/Build/Intermediates.noindex/Base32.build/Debug/Base32.build/Objects-normal/arm64/Base32-Swift.h -serialize-diagnostics-path /Users/admin/builder/spi-builder-workspace/.derivedData/Build/Intermediates.noindex/Base32.build/Debug/Base32.build/Objects-normal/arm64/Base32-master-emit-module.dia -emit-dependencies-path /Users/admin/builder/spi-builder-workspace/.derivedData/Build/Intermediates.noindex/Base32.build/Debug/Base32.build/Objects-normal/arm64/Base32-master-emit-module.d -o /Users/admin/builder/spi-builder-workspace/.derivedData/Build/Intermediates.noindex/Base32.build/Debug/Base32.build/Objects-normal/arm64/Base32.swiftmodule -emit-abi-descriptor-path /Users/admin/builder/spi-builder-workspace/.derivedData/Build/Intermediates.noindex/Base32.build/Debug/Base32.build/Objects-normal/arm64/Base32.abi.json
EmitSwiftModule normal arm64 (in target 'Base32' from project 'Base32')
    cd /Users/admin/builder/spi-builder-workspace
    /Applications/Xcode-16.1.0.app/Contents/Developer/Toolchains/XcodeDefault.xctoolchain/usr/bin/swift-frontend -emit-module -experimental-skip-non-inlinable-function-bodies-without-types /Users/admin/builder/spi-builder-workspace/Sources/Base32/Base16.swift /Users/admin/builder/spi-builder-workspace/Sources/Base32/Base32.swift /Users/admin/builder/spi-builder-workspace/Sources/Base32/shim.swift /Users/admin/builder/spi-builder-workspace/Sources/Base32/StringExtension.swift -target arm64-apple-macos10.9 -Xllvm -aarch64-use-tbi -enable-objc-interop -sdk /Applications/Xcode-16.1.0.app/Contents/Developer/Platforms/MacOSX.platform/Developer/SDKs/MacOSX15.1.sdk -I /Users/admin/builder/spi-builder-workspace/.derivedData/Build/Products/Debug -F /Users/admin/builder/spi-builder-workspace/.derivedData/Build/Products/Debug -F /Applications/Xcode-16.1.0.app/Contents/Developer/Platforms/MacOSX.platform/Developer/Library/Frameworks -no-color-diagnostics -application-extension -enable-testing -g -debug-info-format\=dwarf -dwarf-version\=2 -module-cache-path /Users/admin/builder/spi-builder-workspace/.derivedData/ModuleCache.noindex -profile-generate -profile-coverage-mapping -swift-version 4.2 -enforce-exclusivity\=checked -stats-output-dir /Users/admin/builder/spi-builder-workspace/.stats -Onone -serialize-debugging-options -const-gather-protocols-file /Users/admin/builder/spi-builder-workspace/.derivedData/Build/Intermediates.noindex/Base32.build/Debug/Base32.build/Objects-normal/arm64/Base32_const_extract_protocols.json -enable-experimental-feature DebugDescriptionMacro -enable-experimental-feature OpaqueTypeErasure -enable-upcoming-feature StrictConcurrency -enable-upcoming-feature DisableOutwardActorInference -enable-upcoming-feature GlobalActorIsolatedTypesUsability -enable-upcoming-feature InferSendableFromCaptures -enable-bare-slash-regex -strict-concurrency\=complete -empty-abi-descriptor -validate-clang-modules-once -clang-build-session-file /Users/admin/builder/spi-builder-workspace/.derivedData/ModuleCache.noindex/Session.modulevalidation -Xcc -working-directory -Xcc /Users/admin/builder/spi-builder-workspace -resource-dir /Applications/Xcode-16.1.0.app/Contents/Developer/Toolchains/XcodeDefault.xctoolchain/usr/lib/swift -enable-anonymous-context-mangled-names -file-compilation-dir /Users/admin/builder/spi-builder-workspace -Xcc -ivfsstatcache -Xcc /Users/admin/builder/spi-builder-workspace/.derivedData/SDKStatCaches.noindex/macosx15.1-24B75-44d23fded74b714c58e69ec4af40d824.sdkstatcache -Xcc -I/Users/admin/builder/spi-builder-workspace/.derivedData/Build/Intermediates.noindex/Base32.build/Debug/Base32.build/swift-overrides.hmap -Xcc -I/Users/admin/builder/spi-builder-workspace/.derivedData/Build/Products/Debug/include -Xcc -I/Users/admin/builder/spi-builder-workspace/.derivedData/Build/Intermediates.noindex/Base32.build/Debug/Base32.build/DerivedSources-normal/arm64 -Xcc -I/Users/admin/builder/spi-builder-workspace/.derivedData/Build/Intermediates.noindex/Base32.build/Debug/Base32.build/DerivedSources/arm64 -Xcc -I/Users/admin/builder/spi-builder-workspace/.derivedData/Build/Intermediates.noindex/Base32.build/Debug/Base32.build/DerivedSources -module-name Base32 -frontend-parseable-output -disable-clang-spi -target-sdk-version 15.1 -target-sdk-name macosx15.1 -external-plugin-path /Applications/Xcode-16.1.0.app/Contents/Developer/Platforms/MacOSX.platform/Developer/usr/lib/swift/host/plugins\#/Applications/Xcode-16.1.0.app/Contents/Developer/Platforms/MacOSX.platform/Developer/usr/bin/swift-plugin-server -external-plugin-path /Applications/Xcode-16.1.0.app/Contents/Developer/Platforms/MacOSX.platform/Developer/usr/local/lib/swift/host/plugins\#/Applications/Xcode-16.1.0.app/Contents/Developer/Platforms/MacOSX.platform/Developer/usr/bin/swift-plugin-server -plugin-path /Applications/Xcode-16.1.0.app/Contents/Developer/Toolchains/XcodeDefault.xctoolchain/usr/lib/swift/host/plugins -plugin-path /Applications/Xcode-16.1.0.app/Contents/Developer/Toolchains/XcodeDefault.xctoolchain/usr/local/lib/swift/host/plugins -emit-module-doc-path /Users/admin/builder/spi-builder-workspace/.derivedData/Build/Intermediates.noindex/Base32.build/Debug/Base32.build/Objects-normal/arm64/Base32.swiftdoc -emit-module-source-info-path /Users/admin/builder/spi-builder-workspace/.derivedData/Build/Intermediates.noindex/Base32.build/Debug/Base32.build/Objects-normal/arm64/Base32.swiftsourceinfo -emit-objc-header-path /Users/admin/builder/spi-builder-workspace/.derivedData/Build/Intermediates.noindex/Base32.build/Debug/Base32.build/Objects-normal/arm64/Base32-Swift.h -serialize-diagnostics-path /Users/admin/builder/spi-builder-workspace/.derivedData/Build/Intermediates.noindex/Base32.build/Debug/Base32.build/Objects-normal/arm64/Base32-master-emit-module.dia -emit-dependencies-path /Users/admin/builder/spi-builder-workspace/.derivedData/Build/Intermediates.noindex/Base32.build/Debug/Base32.build/Objects-normal/arm64/Base32-master-emit-module.d -o /Users/admin/builder/spi-builder-workspace/.derivedData/Build/Intermediates.noindex/Base32.build/Debug/Base32.build/Objects-normal/arm64/Base32.swiftmodule -emit-abi-descriptor-path /Users/admin/builder/spi-builder-workspace/.derivedData/Build/Intermediates.noindex/Base32.build/Debug/Base32.build/Objects-normal/arm64/Base32.abi.json
/Users/admin/builder/spi-builder-workspace/Sources/Base32/Base16.swift:31:34: error: 'Data' is only available in application extensions for macOS 10.10 or newer
public func base16Encode(_ data: Data, uppercase: Bool = true) -> String {
                                 ^
/Users/admin/builder/spi-builder-workspace/Sources/Base32/Base16.swift:31:13: note: add @available attribute to enclosing global function
public func base16Encode(_ data: Data, uppercase: Bool = true) -> String {
            ^
/Users/admin/builder/spi-builder-workspace/Sources/Base32/Base16.swift:37:53: error: 'Data' is only available in application extensions for macOS 10.10 or newer
public func base16DecodeToData(_ string: String) -> Data? {
                                                    ^
/Users/admin/builder/spi-builder-workspace/Sources/Base32/Base16.swift:37:13: note: add @available attribute to enclosing global function
public func base16DecodeToData(_ string: String) -> Data? {
            ^
/Users/admin/builder/spi-builder-workspace/Sources/Base32/Base16.swift:55:35: error: 'Data' is only available in application extensions for macOS 10.10 or newer
    public var base16DecodedData: Data? {
                                  ^
/Users/admin/builder/spi-builder-workspace/Sources/Base32/Base16.swift:55:16: note: add @available attribute to enclosing property
    public var base16DecodedData: Data? {
               ^
/Users/admin/builder/spi-builder-workspace/Sources/Base32/Base16.swift:53:1: note: add @available attribute to enclosing extension
extension String {
^
/Users/admin/builder/spi-builder-workspace/Sources/Base32/Base16.swift:65:56: error: 'Encoding' is only available in application extensions for macOS 10.10 or newer
    public func base16DecodedString(_ encoding: String.Encoding = .utf8) -> String? {
                                                       ^
/Users/admin/builder/spi-builder-workspace/Sources/Base32/Base16.swift:65:17: note: add @available attribute to enclosing instance method
    public func base16DecodedString(_ encoding: String.Encoding = .utf8) -> String? {
                ^
/Users/admin/builder/spi-builder-workspace/Sources/Base32/Base16.swift:53:1: note: add @available attribute to enclosing extension
extension String {
^
/Users/admin/builder/spi-builder-workspace/Sources/Base32/Base16.swift:78:35: error: 'Data' is only available in application extensions for macOS 10.10 or newer
    public var base16EncodedData: Data {
                                  ^
/Users/admin/builder/spi-builder-workspace/Sources/Base32/Base16.swift:78:16: note: add @available attribute to enclosing property
    public var base16EncodedData: Data {
               ^
/Users/admin/builder/spi-builder-workspace/Sources/Base32/Base16.swift:72:1: note: add @available attribute to enclosing extension
extension Data {
^
/Users/admin/builder/spi-builder-workspace/Sources/Base32/Base16.swift:82:35: error: 'Data' is only available in application extensions for macOS 10.10 or newer
    public var base16DecodedData: Data? {
                                  ^
/Users/admin/builder/spi-builder-workspace/Sources/Base32/Base16.swift:82:16: note: add @available attribute to enclosing property
    public var base16DecodedData: Data? {
               ^
/Users/admin/builder/spi-builder-workspace/Sources/Base32/Base16.swift:72:1: note: add @available attribute to enclosing extension
extension Data {
^
/Users/admin/builder/spi-builder-workspace/Sources/Base32/Base16.swift:72:11: error: 'Data' is only available in application extensions for macOS 10.10 or newer
extension Data {
          ^
/Users/admin/builder/spi-builder-workspace/Sources/Base32/Base16.swift:72:1: note: add @available attribute to enclosing extension
extension Data {
^
/Users/admin/builder/spi-builder-workspace/Sources/Base32/Base32.swift:33:34: error: 'Data' is only available in application extensions for macOS 10.10 or newer
public func base32Encode(_ data: Data) -> String {
                                 ^
/Users/admin/builder/spi-builder-workspace/Sources/Base32/Base32.swift:33:13: note: add @available attribute to enclosing global function
public func base32Encode(_ data: Data) -> String {
            ^
/Users/admin/builder/spi-builder-workspace/Sources/Base32/Base32.swift:39:37: error: 'Data' is only available in application extensions for macOS 10.10 or newer
public func base32HexEncode(_ data: Data) -> String {
                                    ^
/Users/admin/builder/spi-builder-workspace/Sources/Base32/Base32.swift:39:13: note: add @available attribute to enclosing global function
public func base32HexEncode(_ data: Data) -> String {
            ^
/Users/admin/builder/spi-builder-workspace/Sources/Base32/Base32.swift:45:53: error: 'Data' is only available in application extensions for macOS 10.10 or newer
public func base32DecodeToData(_ string: String) -> Data? {
                                                    ^
/Users/admin/builder/spi-builder-workspace/Sources/Base32/Base32.swift:45:13: note: add @available attribute to enclosing global function
public func base32DecodeToData(_ string: String) -> Data? {
            ^
/Users/admin/builder/spi-builder-workspace/Sources/Base32/Base32.swift:49:56: error: 'Data' is only available in application extensions for macOS 10.10 or newer
public func base32HexDecodeToData(_ string: String) -> Data? {
                                                       ^
/Users/admin/builder/spi-builder-workspace/Sources/Base32/Base32.swift:49:13: note: add @available attribute to enclosing global function
public func base32HexDecodeToData(_ string: String) -> Data? {
            ^
/Users/admin/builder/spi-builder-workspace/Sources/Base32/Base32.swift:75:35: error: 'Data' is only available in application extensions for macOS 10.10 or newer
    public var base32DecodedData: Data? {
                                  ^
/Users/admin/builder/spi-builder-workspace/Sources/Base32/Base32.swift:75:16: note: add @available attribute to enclosing property
    public var base32DecodedData: Data? {
               ^
/Users/admin/builder/spi-builder-workspace/Sources/Base32/Base32.swift:73:1: note: add @available attribute to enclosing extension
extension String {
^
/Users/admin/builder/spi-builder-workspace/Sources/Base32/Base32.swift:85:56: error: 'Encoding' is only available in application extensions for macOS 10.10 or newer
    public func base32DecodedString(_ encoding: String.Encoding = .utf8) -> String? {
                                                       ^
/Users/admin/builder/spi-builder-workspace/Sources/Base32/Base32.swift:85:17: note: add @available attribute to enclosing instance method
    public func base32DecodedString(_ encoding: String.Encoding = .utf8) -> String? {
                ^
/Users/admin/builder/spi-builder-workspace/Sources/Base32/Base32.swift:73:1: note: add @available attribute to enclosing extension
extension String {
^
/Users/admin/builder/spi-builder-workspace/Sources/Base32/Base32.swift:92:38: error: 'Data' is only available in application extensions for macOS 10.10 or newer
    public var base32HexDecodedData: Data? {
                                     ^
/Users/admin/builder/spi-builder-workspace/Sources/Base32/Base32.swift:92:16: note: add @available attribute to enclosing property
    public var base32HexDecodedData: Data? {
               ^
/Users/admin/builder/spi-builder-workspace/Sources/Base32/Base32.swift:73:1: note: add @available attribute to enclosing extension
extension String {
^
/Users/admin/builder/spi-builder-workspace/Sources/Base32/Base32.swift:102:59: error: 'Encoding' is only available in application extensions for macOS 10.10 or newer
    public func base32HexDecodedString(_ encoding: String.Encoding = .utf8) -> String? {
                                                          ^
/Users/admin/builder/spi-builder-workspace/Sources/Base32/Base32.swift:102:17: note: add @available attribute to enclosing instance method
    public func base32HexDecodedString(_ encoding: String.Encoding = .utf8) -> String? {
                ^
/Users/admin/builder/spi-builder-workspace/Sources/Base32/Base32.swift:73:1: note: add @available attribute to enclosing extension
extension String {
^
/Users/admin/builder/spi-builder-workspace/Sources/Base32/Base32.swift:115:35: error: 'Data' is only available in application extensions for macOS 10.10 or newer
    public var base32EncodedData: Data {
                                  ^
/Users/admin/builder/spi-builder-workspace/Sources/Base32/Base32.swift:115:16: note: add @available attribute to enclosing property
    public var base32EncodedData: Data {
               ^
/Users/admin/builder/spi-builder-workspace/Sources/Base32/Base32.swift:109:1: note: add @available attribute to enclosing extension
extension Data {
^
/Users/admin/builder/spi-builder-workspace/Sources/Base32/Base32.swift:119:35: error: 'Data' is only available in application extensions for macOS 10.10 or newer
    public var base32DecodedData: Data? {
                                  ^
/Users/admin/builder/spi-builder-workspace/Sources/Base32/Base32.swift:119:16: note: add @available attribute to enclosing property
    public var base32DecodedData: Data? {
               ^
/Users/admin/builder/spi-builder-workspace/Sources/Base32/Base32.swift:109:1: note: add @available attribute to enclosing extension
extension Data {
^
/Users/admin/builder/spi-builder-workspace/Sources/Base32/Base32.swift:128:38: error: 'Data' is only available in application extensions for macOS 10.10 or newer
    public var base32HexEncodedData: Data {
                                     ^
/Users/admin/builder/spi-builder-workspace/Sources/Base32/Base32.swift:128:16: note: add @available attribute to enclosing property
    public var base32HexEncodedData: Data {
               ^
/Users/admin/builder/spi-builder-workspace/Sources/Base32/Base32.swift:109:1: note: add @available attribute to enclosing extension
extension Data {
^
/Users/admin/builder/spi-builder-workspace/Sources/Base32/Base32.swift:132:38: error: 'Data' is only available in application extensions for macOS 10.10 or newer
    public var base32HexDecodedData: Data? {
                                     ^
/Users/admin/builder/spi-builder-workspace/Sources/Base32/Base32.swift:132:16: note: add @available attribute to enclosing property
    public var base32HexDecodedData: Data? {
               ^
/Users/admin/builder/spi-builder-workspace/Sources/Base32/Base32.swift:109:1: note: add @available attribute to enclosing extension
extension Data {
^
/Users/admin/builder/spi-builder-workspace/Sources/Base32/Base32.swift:109:11: error: 'Data' is only available in application extensions for macOS 10.10 or newer
extension Data {
          ^
/Users/admin/builder/spi-builder-workspace/Sources/Base32/Base32.swift:109:1: note: add @available attribute to enclosing extension
extension Data {
^
/Users/admin/builder/spi-builder-workspace/Sources/Base32/StringExtension.swift:33:47: error: 'Data' is only available in application extensions for macOS 10.10 or newer
    internal var dataUsingUTF8StringEncoding: Data {
                                              ^
/Users/admin/builder/spi-builder-workspace/Sources/Base32/StringExtension.swift:33:18: note: add @available attribute to enclosing property
    internal var dataUsingUTF8StringEncoding: Data {
                 ^
/Users/admin/builder/spi-builder-workspace/Sources/Base32/StringExtension.swift:31:1: note: add @available attribute to enclosing extension
extension String {
^
Error opening -stats-output-dir file '/Users/admin/builder/spi-builder-workspace/.stats/stats-1732731124685416-swift-frontend-Base32-all-arm64_apple_macos10.9-swiftmodule-Onone-2948803571.json' for writing
===-------------------------------------------------------------------------===
                               Swift compilation
===-------------------------------------------------------------------------===
  Total Execution Time: 0.4257 seconds (0.4501 wall clock)
   ---User Time---   --System Time--   --User+System--   ---Wall Time---  --- Name ---
   0.0233 ( 14.6%)   0.0542 ( 20.3%)   0.0775 ( 18.2%)   0.0894 ( 19.9%)  parse-and-resolve-imports
   0.0229 ( 14.4%)   0.0535 ( 20.1%)   0.0764 ( 17.9%)   0.0882 ( 19.6%)  Import resolution
   0.0173 ( 10.9%)   0.0248 (  9.3%)   0.0422 (  9.9%)   0.0423 (  9.4%)  perform-sema
   0.0173 ( 10.9%)   0.0248 (  9.3%)   0.0421 (  9.9%)   0.0422 (  9.4%)  TypeCheckSourceFileRequest
   0.0173 ( 10.8%)   0.0247 (  9.3%)   0.0420 (  9.9%)   0.0421 (  9.3%)  Type checking and Semantic analysis
   0.0170 ( 10.7%)   0.0242 (  9.1%)   0.0413 (  9.7%)   0.0414 (  9.2%)  typecheck-decl
   0.0092 (  5.8%)   0.0116 (  4.4%)   0.0208 (  4.9%)   0.0209 (  4.6%)  typecheck-expr
   0.0035 (  2.2%)   0.0050 (  1.9%)   0.0085 (  2.0%)   0.0085 (  1.9%)  InterfaceTypeRequest
   0.0032 (  2.0%)   0.0050 (  1.9%)   0.0082 (  1.9%)   0.0082 (  1.8%)  UnqualifiedLookupRequest
   0.0028 (  1.7%)   0.0047 (  1.8%)   0.0075 (  1.8%)   0.0075 (  1.7%)  QualifiedLookupRequest
   0.0028 (  1.8%)   0.0038 (  1.4%)   0.0067 (  1.6%)   0.0067 (  1.5%)  ResolveTypeRequest
   0.0025 (  1.5%)   0.0037 (  1.4%)   0.0061 (  1.4%)   0.0062 (  1.4%)  DirectLookupRequest
   0.0019 (  1.2%)   0.0042 (  1.6%)   0.0061 (  1.4%)   0.0061 (  1.4%)  precheck-expr
   0.0026 (  1.6%)   0.0033 (  1.2%)   0.0059 (  1.4%)   0.0059 (  1.3%)  performUnqualifiedLookup
   0.0010 (  0.6%)   0.0023 (  0.9%)   0.0033 (  0.8%)   0.0033 (  0.7%)  load-stdlib
   0.0018 (  1.1%)   0.0012 (  0.5%)   0.0030 (  0.7%)   0.0030 (  0.7%)  LookupInModuleRequest
   0.0011 (  0.7%)   0.0016 (  0.6%)   0.0026 (  0.6%)   0.0026 (  0.6%)  PatternBindingEntryRequest
   0.0014 (  0.9%)   0.0011 (  0.4%)   0.0025 (  0.6%)   0.0025 (  0.6%)  LookupConformanceInModuleRequest
   0.0010 (  0.6%)   0.0014 (  0.5%)   0.0024 (  0.6%)   0.0024 (  0.5%)  PatternTypeRequest
   0.0008 (  0.5%)   0.0015 (  0.6%)   0.0023 (  0.5%)   0.0023 (  0.5%)  PotentialMacroExpansionsInContextRequest
   0.0015 (  1.0%)   0.0006 (  0.2%)   0.0021 (  0.5%)   0.0021 (  0.5%)  build-rewrite-system
   0.0007 (  0.4%)   0.0014 (  0.5%)   0.0021 (  0.5%)   0.0021 (  0.5%)  DefaultInitializerIsolation
   0.0005 (  0.3%)   0.0010 (  0.4%)   0.0015 (  0.4%)   0.0015 (  0.3%)  ActorIsolationRequest
   0.0006 (  0.4%)   0.0008 (  0.3%)   0.0015 (  0.3%)   0.0015 (  0.3%)  DefaultArgumentExprRequest
   0.0006 (  0.4%)   0.0007 (  0.2%)   0.0013 (  0.3%)   0.0013 (  0.3%)  ModuleQualifiedLookupRequest
   0.0004 (  0.2%)   0.0007 (  0.2%)   0.0010 (  0.2%)   0.0011 (  0.2%)  ExtendedNominalRequest
   0.0004 (  0.2%)   0.0004 (  0.1%)   0.0007 (  0.2%)   0.0007 (  0.2%)  ResultTypeRequest
   0.0002 (  0.1%)   0.0004 (  0.2%)   0.0006 (  0.1%)   0.0006 (  0.1%)  IsGetterMutatingRequest
   0.0004 (  0.2%)   0.0001 (  0.1%)   0.0005 (  0.1%)   0.0006 (  0.1%)  ParseTopLevelDeclsRequest
   0.0004 (  0.2%)   0.0001 (  0.0%)   0.0005 (  0.1%)   0.0005 (  0.1%)  ParseSourceFileRequest
   0.0001 (  0.1%)   0.0003 (  0.1%)   0.0004 (  0.1%)   0.0004 (  0.1%)  AttachedPropertyWrappersRequest
   0.0001 (  0.1%)   0.0003 (  0.1%)   0.0004 (  0.1%)   0.0004 (  0.1%)  IsFunctionBodySkippedRequest
   0.0002 (  0.1%)   0.0002 (  0.1%)   0.0004 (  0.1%)   0.0004 (  0.1%)  OpaqueReadOwnershipRequest
   0.0001 (  0.1%)   0.0002 (  0.1%)   0.0004 (  0.1%)   0.0004 (  0.1%)  ExpandPeerMacroRequest
   0.0002 (  0.1%)   0.0001 (  0.1%)   0.0003 (  0.1%)   0.0003 (  0.1%)  ExpandMemberAttributeMacros
   0.0001 (  0.1%)   0.0002 (  0.1%)   0.0003 (  0.1%)   0.0003 (  0.1%)  import-clang-decl
   0.0001 (  0.1%)   0.0002 (  0.1%)   0.0003 (  0.1%)   0.0003 (  0.1%)  HasInitAccessorRequest
   0.0001 (  0.0%)   0.0002 (  0.1%)   0.0002 (  0.1%)   0.0002 (  0.1%)  StorageImplInfoRequest
   0.0001 (  0.1%)   0.0002 (  0.1%)   0.0003 (  0.1%)   0.0002 (  0.1%)  HasIsolatedSelfRequest
   0.0001 (  0.1%)   0.0002 (  0.1%)   0.0002 (  0.1%)   0.0002 (  0.1%)  GenericSignatureRequest
   0.0001 (  0.1%)   0.0002 (  0.1%)   0.0002 (  0.1%)   0.0002 (  0.1%)  FragileFunctionKindRequest
   0.0001 (  0.0%)   0.0002 (  0.1%)   0.0002 (  0.1%)   0.0002 (  0.1%)  IsDynamicRequest
   0.0001 (  0.1%)   0.0001 (  0.0%)   0.0002 (  0.0%)   0.0002 (  0.0%)  DefaultTypeRequest
   0.0001 (  0.1%)   0.0001 (  0.0%)   0.0002 (  0.0%)   0.0002 (  0.0%)  CheckRedeclarationRequest
   0.0001 (  0.0%)   0.0001 (  0.0%)   0.0002 (  0.0%)   0.0002 (  0.0%)  ResolveImplicitMemberRequest
   0.0001 (  0.1%)   0.0001 (  0.0%)   0.0002 (  0.0%)   0.0002 (  0.0%)  ExtendedTypeRequest
   0.0001 (  0.1%)   0.0001 (  0.0%)   0.0002 (  0.0%)   0.0002 (  0.0%)  PatternBindingCheckedAndContextualizedInitRequest
   0.0001 (  0.0%)   0.0001 (  0.0%)   0.0002 (  0.0%)   0.0002 (  0.0%)  ResolveValueWitnessesRequest
   0.0001 (  0.0%)   0.0001 (  0.0%)   0.0001 (  0.0%)   0.0001 (  0.0%)  SPIGroupsRequest
   0.0000 (  0.0%)   0.0001 (  0.0%)   0.0001 (  0.0%)   0.0001 (  0.0%)  ProtocolDependenciesRequest
   0.0000 (  0.0%)   0.0001 (  0.0%)   0.0001 (  0.0%)   0.0001 (  0.0%)  IsActorRequest
   0.0001 (  0.1%)   0.0000 (  0.0%)   0.0001 (  0.0%)   0.0001 (  0.0%)  ParseMembersRequest
   0.0000 (  0.0%)   0.0001 (  0.0%)   0.0001 (  0.0%)   0.0001 (  0.0%)  RequiresOpaqueAccessorsRequest
   0.0000 (  0.0%)   0.0000 (  0.0%)   0.0001 (  0.0%)   0.0001 (  0.0%)  ExpandChildTypeRefinementContextsRequest
   0.0000 (  0.0%)   0.0000 (  0.0%)   0.0001 (  0.0%)   0.0001 (  0.0%)  ConditionalRequirementsRequest
   0.0000 (  0.0%)   0.0000 (  0.0%)   0.0001 (  0.0%)   0.0001 (  0.0%)  ExpandExtensionMacros
   0.0000 (  0.0%)   0.0000 (  0.0%)   0.0001 (  0.0%)   0.0001 (  0.0%)  HasDynamicMemberLookupAttributeRequest
   0.0000 (  0.0%)   0.0000 (  0.0%)   0.0001 (  0.0%)   0.0001 (  0.0%)  PropertyWrapperMutabilityRequest
   0.0000 (  0.0%)   0.0000 (  0.0%)   0.0001 (  0.0%)   0.0001 (  0.0%)  GlobalActorAttributeRequest
   0.0000 (  0.0%)   0.0000 (  0.0%)   0.0000 (  0.0%)   0.0000 (  0.0%)  OverriddenDeclsRequest
   0.0000 (  0.0%)   0.0000 (  0.0%)   0.0000 (  0.0%)   0.0000 (  0.0%)  ApplyAccessNoteRequest
   0.0000 (  0.0%)   0.0000 (  0.0%)   0.0000 (  0.0%)   0.0000 (  0.0%)  ProtocolRequirementsRequest
   0.0000 (  0.0%)   0.0000 (  0.0%)   0.0000 (  0.0%)   0.0000 (  0.0%)  LifetimeDependenceInfoRequest
   0.0000 (  0.0%)   0.0000 (  0.0%)   0.0000 (  0.0%)   0.0000 (  0.0%)  DynamicallyReplacedDeclRequest
   0.0000 (  0.0%)   0.0000 (  0.0%)   0.0000 (  0.0%)   0.0000 (  0.0%)  LookupAllConformancesInContextRequest
   0.0000 (  0.0%)   0.0000 (  0.0%)   0.0000 (  0.0%)   0.0000 (  0.0%)  GenericParamListRequest
   0.0000 (  0.0%)   0.0000 (  0.0%)   0.0000 (  0.0%)   0.0000 (  0.0%)  RequirementSignatureRequest
   0.0000 (  0.0%)   0.0000 (  0.0%)   0.0000 (  0.0%)   0.0000 (  0.0%)  IsObjCRequest
   0.0000 (  0.0%)   0.0000 (  0.0%)   0.0000 (  0.0%)   0.0000 (  0.0%)  InheritedProtocolsRequest
   0.0000 (  0.0%)   0.0000 (  0.0%)   0.0000 (  0.0%)   0.0000 (  0.0%)  AttachedResultBuilderRequest
   0.0000 (  0.0%)   0.0000 (  0.0%)   0.0000 (  0.0%)   0.0000 (  0.0%)  CompareDeclSpecializationRequest
   0.0000 (  0.0%)   0.0000 (  0.0%)   0.0000 (  0.0%)   0.0000 (  0.0%)  ABIMembersRequest
   0.0000 (  0.0%)   0.0000 (  0.0%)   0.0000 (  0.0%)   0.0000 (  0.0%)  ObjCInterfaceAndImplementationRequest
   0.0000 (  0.0%)   0.0000 (  0.0%)   0.0000 (  0.0%)   0.0000 (  0.0%)  AccessLevelRequest
   0.0000 (  0.0%)   0.0000 (  0.0%)   0.0000 (  0.0%)   0.0000 (  0.0%)  IsFinalRequest
   0.0000 (  0.0%)   0.0000 (  0.0%)   0.0000 (  0.0%)   0.0000 (  0.0%)  IsSetterMutatingRequest
   0.0000 (  0.0%)   0.0000 (  0.0%)   0.0000 (  0.0%)   0.0000 (  0.0%)  CheckInconsistentImplementationOnlyImportsRequest
   0.0000 (  0.0%)   0.0000 (  0.0%)   0.0000 (  0.0%)   0.0000 (  0.0%)  CheckInconsistentWeakLinkedImportsRequest
   0.0000 (  0.0%)   0.0000 (  0.0%)   0.0000 (  0.0%)   0.0000 (  0.0%)  ParamSpecifierRequest
   0.0000 (  0.0%)   0.0000 (  0.0%)   0.0000 (  0.0%)   0.0000 (  0.0%)  AllInheritedProtocolsRequest
   0.0000 (  0.0%)   0.0000 (  0.0%)   0.0000 (  0.0%)   0.0000 (  0.0%)  ResolvePatternRequest
   0.0000 (  0.0%)   0.0000 (  0.0%)   0.0000 (  0.0%)   0.0000 (  0.0%)  PropertyWrapperAuxiliaryVariablesRequest
   0.0000 (  0.0%)   0.0000 (  0.0%)   0.0000 (  0.0%)   0.0000 (  0.0%)  IsStaticRequest
   0.0000 (  0.0%)   0.0000 (  0.0%)   0.0000 (  0.0%)   0.0000 (  0.0%)  ExpandAccessorMacros
   0.0000 (  0.0%)   0.0000 (  0.0%)   0.0000 (  0.0%)   0.0000 (  0.0%)  LocalTypeDeclsRequest
   0.0000 (  0.0%)   0.0000 (  0.0%)   0.0000 (  0.0%)   0.0000 (  0.0%)  InheritedDeclsReferencedRequest
   0.0000 (  0.0%)   0.0000 (  0.0%)   0.0000 (  0.0%)   0.0000 (  0.0%)  HasStorageRequest
   0.0000 (  0.0%)   0.0000 (  0.0%)   0.0000 (  0.0%)   0.0000 (  0.0%)  PropertyWrapperInitializerInfoRequest
   0.0000 (  0.0%)   0.0000 (  0.0%)   0.0000 (  0.0%)   0.0000 (  0.0%)  SelfAccessKindRequest
   0.0000 (  0.0%)   0.0000 (  0.0%)   0.0000 (  0.0%)   0.0000 (  0.0%)  IsAccessorTransparentRequest
   0.0000 (  0.0%)   0.0000 (  0.0%)   0.0000 (  0.0%)   0.0000 (  0.0%)  RequiresOpaqueModifyCoroutineRequest
   0.0000 (  0.0%)   0.0000 (  0.0%)   0.0000 (  0.0%)   0.0000 (  0.0%)  IsDistributedActorRequest
   0.0000 (  0.0%)   0.0000 (  0.0%)   0.0000 (  0.0%)   0.0000 (  0.0%)  ResultBuilderTypeRequest
   0.0000 (  0.0%)   0.0000 (  0.0%)   0.0000 (  0.0%)   0.0000 (  0.0%)  CheckInconsistentAccessLevelOnImport
   0.0000 (  0.0%)   0.0000 (  0.0%)   0.0000 (  0.0%)   0.0000 (  0.0%)  CheckInconsistentSPIOnlyImportsRequest
   0.0000 (  0.0%)   0.0000 (  0.0%)   0.0000 (  0.0%)   0.0000 (  0.0%)  perform-whole-module-type-checking
   0.0000 (  0.0%)   0.0000 (  0.0%)   0.0000 (  0.0%)   0.0000 (  0.0%)  HasCircularInheritedProtocolsRequest
   0.0000 (  0.0%)   0.0000 (  0.0%)   0.0000 (  0.0%)   0.0000 (  0.0%)  PreCheckReturnStmtRequest
   0.0000 (  0.0%)   0.0000 (  0.0%)   0.0000 (  0.0%)   0.0000 (  0.0%)  CheckInconsistentAccessLevelOnImportSameFileRequest
   0.0000 (  0.0%)   0.0000 (  0.0%)   0.0000 (  0.0%)   0.0000 (  0.0%)  ModuleImplicitImportsRequest
   0.0000 (  0.0%)   0.0000 (  0.0%)   0.0000 (  0.0%)   0.0000 (  0.0%)  source-file-populate-cache
   0.0000 (  0.0%)   0.0000 (  0.0%)   0.0000 (  0.0%)   0.0000 (  0.0%)  SimpleDidSetRequest
   0.0000 (  0.0%)   0.0000 (  0.0%)   0.0000 (  0.0%)   0.0000 (  0.0%)  IsImplicitlyUnwrappedOptionalRequest
   0.0000 (  0.0%)   0.0000 (  0.0%)   0.0000 (  0.0%)   0.0000 (  0.0%)  ClosureEffectsRequest
   0.0000 (  0.0%)   0.0000 (  0.0%)   0.0000 (  0.0%)   0.0000 (  0.0%)  ResolveTypeWitnessesRequest
   0.0000 (  0.0%)   0.0000 (  0.0%)   0.0000 (  0.0%)   0.0000 (  0.0%)  PreCheckClosureBodyRequest
   0.0000 (  0.0%)   0.0000 (  0.0%)   0.0000 (  0.0%)   0.0000 (  0.0%)  HasImportsMatchingFlagRequest
   0.0000 (  0.0%)   0.0000 (  0.0%)   0.0000 (  0.0%)   0.0000 (  0.0%)  module-populate-cache
   0.0000 (  0.0%)   0.0000 (  0.0%)   0.0000 (  0.0%)   0.0000 (  0.0%)  DefaultAndMaxAccessLevelRequest
   0.0000 (  0.0%)   0.0000 (  0.0%)   0.0000 (  0.0%)   0.0000 (  0.0%)  AST verification
   0.0000 (  0.0%)   0.0000 (  0.0%)   0.0000 (  0.0%)   0.0000 (  0.0%)  UnderlyingTypeDeclsReferencedRequest
   0.0000 (  0.0%)   0.0000 (  0.0%)   0.0000 (  0.0%)   0.0000 (  0.0%)  SelfBoundsFromWhereClauseRequest
   0.0000 (  0.0%)   0.0000 (  0.0%)   0.0000 (  0.0%)   0.0000 (  0.0%)  PolymorphicEffectKindRequest
   0.0000 (  0.0%)   0.0000 (  0.0%)   0.0000 (  0.0%)   0.0000 (  0.0%)  PrimarySourceFilesRequest
   0.1593 (100.0%)   0.2665 (100.0%)   0.4257 (100.0%)   0.4501 (100.0%)  Total
===-------------------------------------------------------------------------===
                                Running Program
===-------------------------------------------------------------------------===
  Total Execution Time: 0.1249 seconds (0.1369 wall clock)
   ---User Time---   --System Time--   --User+System--   ---Wall Time---  --- Name ---
   0.0422 (100.0%)   0.0828 (100.0%)   0.1249 (100.0%)   0.1369 (100.0%)  Building Target
   0.0422 (100.0%)   0.0828 (100.0%)   0.1249 (100.0%)   0.1369 (100.0%)  Total
SwiftCompile normal arm64 Compiling\ Base32.swift /Users/admin/builder/spi-builder-workspace/Sources/Base32/Base32.swift (in target 'Base32' from project 'Base32')
    cd /Users/admin/builder/spi-builder-workspace
    builtin-swiftTaskExecution -- /Applications/Xcode-16.1.0.app/Contents/Developer/Toolchains/XcodeDefault.xctoolchain/usr/bin/swift-frontend -frontend -c /Users/admin/builder/spi-builder-workspace/Sources/Base32/Base16.swift -primary-file /Users/admin/builder/spi-builder-workspace/Sources/Base32/Base32.swift /Users/admin/builder/spi-builder-workspace/Sources/Base32/shim.swift /Users/admin/builder/spi-builder-workspace/Sources/Base32/StringExtension.swift -emit-dependencies-path /Users/admin/builder/spi-builder-workspace/.derivedData/Build/Intermediates.noindex/Base32.build/Debug/Base32.build/Objects-normal/arm64/Base32.d -emit-const-values-path /Users/admin/builder/spi-builder-workspace/.derivedData/Build/Intermediates.noindex/Base32.build/Debug/Base32.build/Objects-normal/arm64/Base32.swiftconstvalues -emit-reference-dependencies-path /Users/admin/builder/spi-builder-workspace/.derivedData/Build/Intermediates.noindex/Base32.build/Debug/Base32.build/Objects-normal/arm64/Base32.swiftdeps -serialize-diagnostics-path /Users/admin/builder/spi-builder-workspace/.derivedData/Build/Intermediates.noindex/Base32.build/Debug/Base32.build/Objects-normal/arm64/Base32.dia -target arm64-apple-macos10.9 -Xllvm -aarch64-use-tbi -enable-objc-interop -sdk /Applications/Xcode-16.1.0.app/Contents/Developer/Platforms/MacOSX.platform/Developer/SDKs/MacOSX15.1.sdk -I /Users/admin/builder/spi-builder-workspace/.derivedData/Build/Products/Debug -F /Users/admin/builder/spi-builder-workspace/.derivedData/Build/Products/Debug -F /Applications/Xcode-16.1.0.app/Contents/Developer/Platforms/MacOSX.platform/Developer/Library/Frameworks -no-color-diagnostics -application-extension -enable-testing -g -debug-info-format\=dwarf -dwarf-version\=2 -module-cache-path /Users/admin/builder/spi-builder-workspace/.derivedData/ModuleCache.noindex -profile-generate -profile-coverage-mapping -swift-version 4.2 -enforce-exclusivity\=checked -stats-output-dir /Users/admin/builder/spi-builder-workspace/.stats -Onone -serialize-debugging-options -const-gather-protocols-file /Users/admin/builder/spi-builder-workspace/.derivedData/Build/Intermediates.noindex/Base32.build/Debug/Base32.build/Objects-normal/arm64/Base32_const_extract_protocols.json -enable-experimental-feature DebugDescriptionMacro -enable-experimental-feature OpaqueTypeErasure -enable-upcoming-feature StrictConcurrency -enable-upcoming-feature DisableOutwardActorInference -enable-upcoming-feature GlobalActorIsolatedTypesUsability -enable-upcoming-feature InferSendableFromCaptures -enable-bare-slash-regex -strict-concurrency\=complete -empty-abi-descriptor -validate-clang-modules-once -clang-build-session-file /Users/admin/builder/spi-builder-workspace/.derivedData/ModuleCache.noindex/Session.modulevalidation -Xcc -working-directory -Xcc /Users/admin/builder/spi-builder-workspace -resource-dir /Applications/Xcode-16.1.0.app/Contents/Developer/Toolchains/XcodeDefault.xctoolchain/usr/lib/swift -enable-anonymous-context-mangled-names -file-compilation-dir /Users/admin/builder/spi-builder-workspace -Xcc -ivfsstatcache -Xcc /Users/admin/builder/spi-builder-workspace/.derivedData/SDKStatCaches.noindex/macosx15.1-24B75-44d23fded74b714c58e69ec4af40d824.sdkstatcache -Xcc -I/Users/admin/builder/spi-builder-workspace/.derivedData/Build/Intermediates.noindex/Base32.build/Debug/Base32.build/swift-overrides.hmap -Xcc -I/Users/admin/builder/spi-builder-workspace/.derivedData/Build/Products/Debug/include -Xcc -I/Users/admin/builder/spi-builder-workspace/.derivedData/Build/Intermediates.noindex/Base32.build/Debug/Base32.build/DerivedSources-normal/arm64 -Xcc -I/Users/admin/builder/spi-builder-workspace/.derivedData/Build/Intermediates.noindex/Base32.build/Debug/Base32.build/DerivedSources/arm64 -Xcc -I/Users/admin/builder/spi-builder-workspace/.derivedData/Build/Intermediates.noindex/Base32.build/Debug/Base32.build/DerivedSources -module-name Base32 -frontend-parseable-output -disable-clang-spi -target-sdk-version 15.1 -target-sdk-name macosx15.1 -external-plugin-path /Applications/Xcode-16.1.0.app/Contents/Developer/Platforms/MacOSX.platform/Developer/usr/lib/swift/host/plugins\#/Applications/Xcode-16.1.0.app/Contents/Developer/Platforms/MacOSX.platform/Developer/usr/bin/swift-plugin-server -external-plugin-path /Applications/Xcode-16.1.0.app/Contents/Developer/Platforms/MacOSX.platform/Developer/usr/local/lib/swift/host/plugins\#/Applications/Xcode-16.1.0.app/Contents/Developer/Platforms/MacOSX.platform/Developer/usr/bin/swift-plugin-server -plugin-path /Applications/Xcode-16.1.0.app/Contents/Developer/Toolchains/XcodeDefault.xctoolchain/usr/lib/swift/host/plugins -plugin-path /Applications/Xcode-16.1.0.app/Contents/Developer/Toolchains/XcodeDefault.xctoolchain/usr/local/lib/swift/host/plugins -o /Users/admin/builder/spi-builder-workspace/.derivedData/Build/Intermediates.noindex/Base32.build/Debug/Base32.build/Objects-normal/arm64/Base32.o -index-unit-output-path /Base32.build/Debug/Base32.build/Objects-normal/arm64/Base32.o -index-store-path /Users/admin/builder/spi-builder-workspace/.derivedData/Index.noindex/DataStore -index-system-modules
SwiftCompile normal arm64 /Users/admin/builder/spi-builder-workspace/Sources/Base32/Base32.swift (in target 'Base32' from project 'Base32')
    cd /Users/admin/builder/spi-builder-workspace
    /Applications/Xcode-16.1.0.app/Contents/Developer/Toolchains/XcodeDefault.xctoolchain/usr/bin/swift-frontend -c /Users/admin/builder/spi-builder-workspace/Sources/Base32/Base16.swift -primary-file /Users/admin/builder/spi-builder-workspace/Sources/Base32/Base32.swift /Users/admin/builder/spi-builder-workspace/Sources/Base32/shim.swift /Users/admin/builder/spi-builder-workspace/Sources/Base32/StringExtension.swift -emit-dependencies-path /Users/admin/builder/spi-builder-workspace/.derivedData/Build/Intermediates.noindex/Base32.build/Debug/Base32.build/Objects-normal/arm64/Base32.d -emit-const-values-path /Users/admin/builder/spi-builder-workspace/.derivedData/Build/Intermediates.noindex/Base32.build/Debug/Base32.build/Objects-normal/arm64/Base32.swiftconstvalues -emit-reference-dependencies-path /Users/admin/builder/spi-builder-workspace/.derivedData/Build/Intermediates.noindex/Base32.build/Debug/Base32.build/Objects-normal/arm64/Base32.swiftdeps -serialize-diagnostics-path /Users/admin/builder/spi-builder-workspace/.derivedData/Build/Intermediates.noindex/Base32.build/Debug/Base32.build/Objects-normal/arm64/Base32.dia -target arm64-apple-macos10.9 -Xllvm -aarch64-use-tbi -enable-objc-interop -sdk /Applications/Xcode-16.1.0.app/Contents/Developer/Platforms/MacOSX.platform/Developer/SDKs/MacOSX15.1.sdk -I /Users/admin/builder/spi-builder-workspace/.derivedData/Build/Products/Debug -F /Users/admin/builder/spi-builder-workspace/.derivedData/Build/Products/Debug -F /Applications/Xcode-16.1.0.app/Contents/Developer/Platforms/MacOSX.platform/Developer/Library/Frameworks -no-color-diagnostics -application-extension -enable-testing -g -debug-info-format\=dwarf -dwarf-version\=2 -module-cache-path /Users/admin/builder/spi-builder-workspace/.derivedData/ModuleCache.noindex -profile-generate -profile-coverage-mapping -swift-version 4.2 -enforce-exclusivity\=checked -stats-output-dir /Users/admin/builder/spi-builder-workspace/.stats -Onone -serialize-debugging-options -const-gather-protocols-file /Users/admin/builder/spi-builder-workspace/.derivedData/Build/Intermediates.noindex/Base32.build/Debug/Base32.build/Objects-normal/arm64/Base32_const_extract_protocols.json -enable-experimental-feature DebugDescriptionMacro -enable-experimental-feature OpaqueTypeErasure -enable-upcoming-feature StrictConcurrency -enable-upcoming-feature DisableOutwardActorInference -enable-upcoming-feature GlobalActorIsolatedTypesUsability -enable-upcoming-feature InferSendableFromCaptures -enable-bare-slash-regex -strict-concurrency\=complete -empty-abi-descriptor -validate-clang-modules-once -clang-build-session-file /Users/admin/builder/spi-builder-workspace/.derivedData/ModuleCache.noindex/Session.modulevalidation -Xcc -working-directory -Xcc /Users/admin/builder/spi-builder-workspace -resource-dir /Applications/Xcode-16.1.0.app/Contents/Developer/Toolchains/XcodeDefault.xctoolchain/usr/lib/swift -enable-anonymous-context-mangled-names -file-compilation-dir /Users/admin/builder/spi-builder-workspace -Xcc -ivfsstatcache -Xcc /Users/admin/builder/spi-builder-workspace/.derivedData/SDKStatCaches.noindex/macosx15.1-24B75-44d23fded74b714c58e69ec4af40d824.sdkstatcache -Xcc -I/Users/admin/builder/spi-builder-workspace/.derivedData/Build/Intermediates.noindex/Base32.build/Debug/Base32.build/swift-overrides.hmap -Xcc -I/Users/admin/builder/spi-builder-workspace/.derivedData/Build/Products/Debug/include -Xcc -I/Users/admin/builder/spi-builder-workspace/.derivedData/Build/Intermediates.noindex/Base32.build/Debug/Base32.build/DerivedSources-normal/arm64 -Xcc -I/Users/admin/builder/spi-builder-workspace/.derivedData/Build/Intermediates.noindex/Base32.build/Debug/Base32.build/DerivedSources/arm64 -Xcc -I/Users/admin/builder/spi-builder-workspace/.derivedData/Build/Intermediates.noindex/Base32.build/Debug/Base32.build/DerivedSources -module-name Base32 -frontend-parseable-output -disable-clang-spi -target-sdk-version 15.1 -target-sdk-name macosx15.1 -external-plugin-path /Applications/Xcode-16.1.0.app/Contents/Developer/Platforms/MacOSX.platform/Developer/usr/lib/swift/host/plugins\#/Applications/Xcode-16.1.0.app/Contents/Developer/Platforms/MacOSX.platform/Developer/usr/bin/swift-plugin-server -external-plugin-path /Applications/Xcode-16.1.0.app/Contents/Developer/Platforms/MacOSX.platform/Developer/usr/local/lib/swift/host/plugins\#/Applications/Xcode-16.1.0.app/Contents/Developer/Platforms/MacOSX.platform/Developer/usr/bin/swift-plugin-server -plugin-path /Applications/Xcode-16.1.0.app/Contents/Developer/Toolchains/XcodeDefault.xctoolchain/usr/lib/swift/host/plugins -plugin-path /Applications/Xcode-16.1.0.app/Contents/Developer/Toolchains/XcodeDefault.xctoolchain/usr/local/lib/swift/host/plugins -o /Users/admin/builder/spi-builder-workspace/.derivedData/Build/Intermediates.noindex/Base32.build/Debug/Base32.build/Objects-normal/arm64/Base32.o -index-unit-output-path /Base32.build/Debug/Base32.build/Objects-normal/arm64/Base32.o -index-store-path /Users/admin/builder/spi-builder-workspace/.derivedData/Index.noindex/DataStore -index-system-modules
SwiftCompile normal arm64 Compiling\ StringExtension.swift /Users/admin/builder/spi-builder-workspace/Sources/Base32/StringExtension.swift (in target 'Base32' from project 'Base32')
    cd /Users/admin/builder/spi-builder-workspace
    builtin-swiftTaskExecution -- /Applications/Xcode-16.1.0.app/Contents/Developer/Toolchains/XcodeDefault.xctoolchain/usr/bin/swift-frontend -frontend -c /Users/admin/builder/spi-builder-workspace/Sources/Base32/Base16.swift /Users/admin/builder/spi-builder-workspace/Sources/Base32/Base32.swift /Users/admin/builder/spi-builder-workspace/Sources/Base32/shim.swift -primary-file /Users/admin/builder/spi-builder-workspace/Sources/Base32/StringExtension.swift -emit-dependencies-path /Users/admin/builder/spi-builder-workspace/.derivedData/Build/Intermediates.noindex/Base32.build/Debug/Base32.build/Objects-normal/arm64/StringExtension.d -emit-const-values-path /Users/admin/builder/spi-builder-workspace/.derivedData/Build/Intermediates.noindex/Base32.build/Debug/Base32.build/Objects-normal/arm64/StringExtension.swiftconstvalues -emit-reference-dependencies-path /Users/admin/builder/spi-builder-workspace/.derivedData/Build/Intermediates.noindex/Base32.build/Debug/Base32.build/Objects-normal/arm64/StringExtension.swiftdeps -serialize-diagnostics-path /Users/admin/builder/spi-builder-workspace/.derivedData/Build/Intermediates.noindex/Base32.build/Debug/Base32.build/Objects-normal/arm64/StringExtension.dia -target arm64-apple-macos10.9 -Xllvm -aarch64-use-tbi -enable-objc-interop -sdk /Applications/Xcode-16.1.0.app/Contents/Developer/Platforms/MacOSX.platform/Developer/SDKs/MacOSX15.1.sdk -I /Users/admin/builder/spi-builder-workspace/.derivedData/Build/Products/Debug -F /Users/admin/builder/spi-builder-workspace/.derivedData/Build/Products/Debug -F /Applications/Xcode-16.1.0.app/Contents/Developer/Platforms/MacOSX.platform/Developer/Library/Frameworks -no-color-diagnostics -application-extension -enable-testing -g -debug-info-format\=dwarf -dwarf-version\=2 -module-cache-path /Users/admin/builder/spi-builder-workspace/.derivedData/ModuleCache.noindex -profile-generate -profile-coverage-mapping -swift-version 4.2 -enforce-exclusivity\=checked -stats-output-dir /Users/admin/builder/spi-builder-workspace/.stats -Onone -serialize-debugging-options -const-gather-protocols-file /Users/admin/builder/spi-builder-workspace/.derivedData/Build/Intermediates.noindex/Base32.build/Debug/Base32.build/Objects-normal/arm64/Base32_const_extract_protocols.json -enable-experimental-feature DebugDescriptionMacro -enable-experimental-feature OpaqueTypeErasure -enable-upcoming-feature StrictConcurrency -enable-upcoming-feature DisableOutwardActorInference -enable-upcoming-feature GlobalActorIsolatedTypesUsability -enable-upcoming-feature InferSendableFromCaptures -enable-bare-slash-regex -strict-concurrency\=complete -empty-abi-descriptor -validate-clang-modules-once -clang-build-session-file /Users/admin/builder/spi-builder-workspace/.derivedData/ModuleCache.noindex/Session.modulevalidation -Xcc -working-directory -Xcc /Users/admin/builder/spi-builder-workspace -resource-dir /Applications/Xcode-16.1.0.app/Contents/Developer/Toolchains/XcodeDefault.xctoolchain/usr/lib/swift -enable-anonymous-context-mangled-names -file-compilation-dir /Users/admin/builder/spi-builder-workspace -Xcc -ivfsstatcache -Xcc /Users/admin/builder/spi-builder-workspace/.derivedData/SDKStatCaches.noindex/macosx15.1-24B75-44d23fded74b714c58e69ec4af40d824.sdkstatcache -Xcc -I/Users/admin/builder/spi-builder-workspace/.derivedData/Build/Intermediates.noindex/Base32.build/Debug/Base32.build/swift-overrides.hmap -Xcc -I/Users/admin/builder/spi-builder-workspace/.derivedData/Build/Products/Debug/include -Xcc -I/Users/admin/builder/spi-builder-workspace/.derivedData/Build/Intermediates.noindex/Base32.build/Debug/Base32.build/DerivedSources-normal/arm64 -Xcc -I/Users/admin/builder/spi-builder-workspace/.derivedData/Build/Intermediates.noindex/Base32.build/Debug/Base32.build/DerivedSources/arm64 -Xcc -I/Users/admin/builder/spi-builder-workspace/.derivedData/Build/Intermediates.noindex/Base32.build/Debug/Base32.build/DerivedSources -module-name Base32 -frontend-parseable-output -disable-clang-spi -target-sdk-version 15.1 -target-sdk-name macosx15.1 -external-plugin-path /Applications/Xcode-16.1.0.app/Contents/Developer/Platforms/MacOSX.platform/Developer/usr/lib/swift/host/plugins\#/Applications/Xcode-16.1.0.app/Contents/Developer/Platforms/MacOSX.platform/Developer/usr/bin/swift-plugin-server -external-plugin-path /Applications/Xcode-16.1.0.app/Contents/Developer/Platforms/MacOSX.platform/Developer/usr/local/lib/swift/host/plugins\#/Applications/Xcode-16.1.0.app/Contents/Developer/Platforms/MacOSX.platform/Developer/usr/bin/swift-plugin-server -plugin-path /Applications/Xcode-16.1.0.app/Contents/Developer/Toolchains/XcodeDefault.xctoolchain/usr/lib/swift/host/plugins -plugin-path /Applications/Xcode-16.1.0.app/Contents/Developer/Toolchains/XcodeDefault.xctoolchain/usr/local/lib/swift/host/plugins -o /Users/admin/builder/spi-builder-workspace/.derivedData/Build/Intermediates.noindex/Base32.build/Debug/Base32.build/Objects-normal/arm64/StringExtension.o -index-unit-output-path /Base32.build/Debug/Base32.build/Objects-normal/arm64/StringExtension.o -index-store-path /Users/admin/builder/spi-builder-workspace/.derivedData/Index.noindex/DataStore -index-system-modules
SwiftCompile normal arm64 /Users/admin/builder/spi-builder-workspace/Sources/Base32/StringExtension.swift (in target 'Base32' from project 'Base32')
    cd /Users/admin/builder/spi-builder-workspace
    /Applications/Xcode-16.1.0.app/Contents/Developer/Toolchains/XcodeDefault.xctoolchain/usr/bin/swift-frontend -c /Users/admin/builder/spi-builder-workspace/Sources/Base32/Base16.swift /Users/admin/builder/spi-builder-workspace/Sources/Base32/Base32.swift /Users/admin/builder/spi-builder-workspace/Sources/Base32/shim.swift -primary-file /Users/admin/builder/spi-builder-workspace/Sources/Base32/StringExtension.swift -emit-dependencies-path /Users/admin/builder/spi-builder-workspace/.derivedData/Build/Intermediates.noindex/Base32.build/Debug/Base32.build/Objects-normal/arm64/StringExtension.d -emit-const-values-path /Users/admin/builder/spi-builder-workspace/.derivedData/Build/Intermediates.noindex/Base32.build/Debug/Base32.build/Objects-normal/arm64/StringExtension.swiftconstvalues -emit-reference-dependencies-path /Users/admin/builder/spi-builder-workspace/.derivedData/Build/Intermediates.noindex/Base32.build/Debug/Base32.build/Objects-normal/arm64/StringExtension.swiftdeps -serialize-diagnostics-path /Users/admin/builder/spi-builder-workspace/.derivedData/Build/Intermediates.noindex/Base32.build/Debug/Base32.build/Objects-normal/arm64/StringExtension.dia -target arm64-apple-macos10.9 -Xllvm -aarch64-use-tbi -enable-objc-interop -sdk /Applications/Xcode-16.1.0.app/Contents/Developer/Platforms/MacOSX.platform/Developer/SDKs/MacOSX15.1.sdk -I /Users/admin/builder/spi-builder-workspace/.derivedData/Build/Products/Debug -F /Users/admin/builder/spi-builder-workspace/.derivedData/Build/Products/Debug -F /Applications/Xcode-16.1.0.app/Contents/Developer/Platforms/MacOSX.platform/Developer/Library/Frameworks -no-color-diagnostics -application-extension -enable-testing -g -debug-info-format\=dwarf -dwarf-version\=2 -module-cache-path /Users/admin/builder/spi-builder-workspace/.derivedData/ModuleCache.noindex -profile-generate -profile-coverage-mapping -swift-version 4.2 -enforce-exclusivity\=checked -stats-output-dir /Users/admin/builder/spi-builder-workspace/.stats -Onone -serialize-debugging-options -const-gather-protocols-file /Users/admin/builder/spi-builder-workspace/.derivedData/Build/Intermediates.noindex/Base32.build/Debug/Base32.build/Objects-normal/arm64/Base32_const_extract_protocols.json -enable-experimental-feature DebugDescriptionMacro -enable-experimental-feature OpaqueTypeErasure -enable-upcoming-feature StrictConcurrency -enable-upcoming-feature DisableOutwardActorInference -enable-upcoming-feature GlobalActorIsolatedTypesUsability -enable-upcoming-feature InferSendableFromCaptures -enable-bare-slash-regex -strict-concurrency\=complete -empty-abi-descriptor -validate-clang-modules-once -clang-build-session-file /Users/admin/builder/spi-builder-workspace/.derivedData/ModuleCache.noindex/Session.modulevalidation -Xcc -working-directory -Xcc /Users/admin/builder/spi-builder-workspace -resource-dir /Applications/Xcode-16.1.0.app/Contents/Developer/Toolchains/XcodeDefault.xctoolchain/usr/lib/swift -enable-anonymous-context-mangled-names -file-compilation-dir /Users/admin/builder/spi-builder-workspace -Xcc -ivfsstatcache -Xcc /Users/admin/builder/spi-builder-workspace/.derivedData/SDKStatCaches.noindex/macosx15.1-24B75-44d23fded74b714c58e69ec4af40d824.sdkstatcache -Xcc -I/Users/admin/builder/spi-builder-workspace/.derivedData/Build/Intermediates.noindex/Base32.build/Debug/Base32.build/swift-overrides.hmap -Xcc -I/Users/admin/builder/spi-builder-workspace/.derivedData/Build/Products/Debug/include -Xcc -I/Users/admin/builder/spi-builder-workspace/.derivedData/Build/Intermediates.noindex/Base32.build/Debug/Base32.build/DerivedSources-normal/arm64 -Xcc -I/Users/admin/builder/spi-builder-workspace/.derivedData/Build/Intermediates.noindex/Base32.build/Debug/Base32.build/DerivedSources/arm64 -Xcc -I/Users/admin/builder/spi-builder-workspace/.derivedData/Build/Intermediates.noindex/Base32.build/Debug/Base32.build/DerivedSources -module-name Base32 -frontend-parseable-output -disable-clang-spi -target-sdk-version 15.1 -target-sdk-name macosx15.1 -external-plugin-path /Applications/Xcode-16.1.0.app/Contents/Developer/Platforms/MacOSX.platform/Developer/usr/lib/swift/host/plugins\#/Applications/Xcode-16.1.0.app/Contents/Developer/Platforms/MacOSX.platform/Developer/usr/bin/swift-plugin-server -external-plugin-path /Applications/Xcode-16.1.0.app/Contents/Developer/Platforms/MacOSX.platform/Developer/usr/local/lib/swift/host/plugins\#/Applications/Xcode-16.1.0.app/Contents/Developer/Platforms/MacOSX.platform/Developer/usr/bin/swift-plugin-server -plugin-path /Applications/Xcode-16.1.0.app/Contents/Developer/Toolchains/XcodeDefault.xctoolchain/usr/lib/swift/host/plugins -plugin-path /Applications/Xcode-16.1.0.app/Contents/Developer/Toolchains/XcodeDefault.xctoolchain/usr/local/lib/swift/host/plugins -o /Users/admin/builder/spi-builder-workspace/.derivedData/Build/Intermediates.noindex/Base32.build/Debug/Base32.build/Objects-normal/arm64/StringExtension.o -index-unit-output-path /Base32.build/Debug/Base32.build/Objects-normal/arm64/StringExtension.o -index-store-path /Users/admin/builder/spi-builder-workspace/.derivedData/Index.noindex/DataStore -index-system-modules
SwiftCompile normal arm64 Compiling\ shim.swift /Users/admin/builder/spi-builder-workspace/Sources/Base32/shim.swift (in target 'Base32' from project 'Base32')
    cd /Users/admin/builder/spi-builder-workspace
    builtin-swiftTaskExecution -- /Applications/Xcode-16.1.0.app/Contents/Developer/Toolchains/XcodeDefault.xctoolchain/usr/bin/swift-frontend -frontend -c /Users/admin/builder/spi-builder-workspace/Sources/Base32/Base16.swift /Users/admin/builder/spi-builder-workspace/Sources/Base32/Base32.swift -primary-file /Users/admin/builder/spi-builder-workspace/Sources/Base32/shim.swift /Users/admin/builder/spi-builder-workspace/Sources/Base32/StringExtension.swift -emit-dependencies-path /Users/admin/builder/spi-builder-workspace/.derivedData/Build/Intermediates.noindex/Base32.build/Debug/Base32.build/Objects-normal/arm64/shim.d -emit-const-values-path /Users/admin/builder/spi-builder-workspace/.derivedData/Build/Intermediates.noindex/Base32.build/Debug/Base32.build/Objects-normal/arm64/shim.swiftconstvalues -emit-reference-dependencies-path /Users/admin/builder/spi-builder-workspace/.derivedData/Build/Intermediates.noindex/Base32.build/Debug/Base32.build/Objects-normal/arm64/shim.swiftdeps -serialize-diagnostics-path /Users/admin/builder/spi-builder-workspace/.derivedData/Build/Intermediates.noindex/Base32.build/Debug/Base32.build/Objects-normal/arm64/shim.dia -target arm64-apple-macos10.9 -Xllvm -aarch64-use-tbi -enable-objc-interop -sdk /Applications/Xcode-16.1.0.app/Contents/Developer/Platforms/MacOSX.platform/Developer/SDKs/MacOSX15.1.sdk -I /Users/admin/builder/spi-builder-workspace/.derivedData/Build/Products/Debug -F /Users/admin/builder/spi-builder-workspace/.derivedData/Build/Products/Debug -F /Applications/Xcode-16.1.0.app/Contents/Developer/Platforms/MacOSX.platform/Developer/Library/Frameworks -no-color-diagnostics -application-extension -enable-testing -g -debug-info-format\=dwarf -dwarf-version\=2 -module-cache-path /Users/admin/builder/spi-builder-workspace/.derivedData/ModuleCache.noindex -profile-generate -profile-coverage-mapping -swift-version 4.2 -enforce-exclusivity\=checked -stats-output-dir /Users/admin/builder/spi-builder-workspace/.stats -Onone -serialize-debugging-options -const-gather-protocols-file /Users/admin/builder/spi-builder-workspace/.derivedData/Build/Intermediates.noindex/Base32.build/Debug/Base32.build/Objects-normal/arm64/Base32_const_extract_protocols.json -enable-experimental-feature DebugDescriptionMacro -enable-experimental-feature OpaqueTypeErasure -enable-upcoming-feature StrictConcurrency -enable-upcoming-feature DisableOutwardActorInference -enable-upcoming-feature GlobalActorIsolatedTypesUsability -enable-upcoming-feature InferSendableFromCaptures -enable-bare-slash-regex -strict-concurrency\=complete -empty-abi-descriptor -validate-clang-modules-once -clang-build-session-file /Users/admin/builder/spi-builder-workspace/.derivedData/ModuleCache.noindex/Session.modulevalidation -Xcc -working-directory -Xcc /Users/admin/builder/spi-builder-workspace -resource-dir /Applications/Xcode-16.1.0.app/Contents/Developer/Toolchains/XcodeDefault.xctoolchain/usr/lib/swift -enable-anonymous-context-mangled-names -file-compilation-dir /Users/admin/builder/spi-builder-workspace -Xcc -ivfsstatcache -Xcc /Users/admin/builder/spi-builder-workspace/.derivedData/SDKStatCaches.noindex/macosx15.1-24B75-44d23fded74b714c58e69ec4af40d824.sdkstatcache -Xcc -I/Users/admin/builder/spi-builder-workspace/.derivedData/Build/Intermediates.noindex/Base32.build/Debug/Base32.build/swift-overrides.hmap -Xcc -I/Users/admin/builder/spi-builder-workspace/.derivedData/Build/Products/Debug/include -Xcc -I/Users/admin/builder/spi-builder-workspace/.derivedData/Build/Intermediates.noindex/Base32.build/Debug/Base32.build/DerivedSources-normal/arm64 -Xcc -I/Users/admin/builder/spi-builder-workspace/.derivedData/Build/Intermediates.noindex/Base32.build/Debug/Base32.build/DerivedSources/arm64 -Xcc -I/Users/admin/builder/spi-builder-workspace/.derivedData/Build/Intermediates.noindex/Base32.build/Debug/Base32.build/DerivedSources -module-name Base32 -frontend-parseable-output -disable-clang-spi -target-sdk-version 15.1 -target-sdk-name macosx15.1 -external-plugin-path /Applications/Xcode-16.1.0.app/Contents/Developer/Platforms/MacOSX.platform/Developer/usr/lib/swift/host/plugins\#/Applications/Xcode-16.1.0.app/Contents/Developer/Platforms/MacOSX.platform/Developer/usr/bin/swift-plugin-server -external-plugin-path /Applications/Xcode-16.1.0.app/Contents/Developer/Platforms/MacOSX.platform/Developer/usr/local/lib/swift/host/plugins\#/Applications/Xcode-16.1.0.app/Contents/Developer/Platforms/MacOSX.platform/Developer/usr/bin/swift-plugin-server -plugin-path /Applications/Xcode-16.1.0.app/Contents/Developer/Toolchains/XcodeDefault.xctoolchain/usr/lib/swift/host/plugins -plugin-path /Applications/Xcode-16.1.0.app/Contents/Developer/Toolchains/XcodeDefault.xctoolchain/usr/local/lib/swift/host/plugins -o /Users/admin/builder/spi-builder-workspace/.derivedData/Build/Intermediates.noindex/Base32.build/Debug/Base32.build/Objects-normal/arm64/shim.o -index-unit-output-path /Base32.build/Debug/Base32.build/Objects-normal/arm64/shim.o -index-store-path /Users/admin/builder/spi-builder-workspace/.derivedData/Index.noindex/DataStore -index-system-modules
SwiftCompile normal arm64 /Users/admin/builder/spi-builder-workspace/Sources/Base32/shim.swift (in target 'Base32' from project 'Base32')
    cd /Users/admin/builder/spi-builder-workspace
    /Applications/Xcode-16.1.0.app/Contents/Developer/Toolchains/XcodeDefault.xctoolchain/usr/bin/swift-frontend -c /Users/admin/builder/spi-builder-workspace/Sources/Base32/Base16.swift /Users/admin/builder/spi-builder-workspace/Sources/Base32/Base32.swift -primary-file /Users/admin/builder/spi-builder-workspace/Sources/Base32/shim.swift /Users/admin/builder/spi-builder-workspace/Sources/Base32/StringExtension.swift -emit-dependencies-path /Users/admin/builder/spi-builder-workspace/.derivedData/Build/Intermediates.noindex/Base32.build/Debug/Base32.build/Objects-normal/arm64/shim.d -emit-const-values-path /Users/admin/builder/spi-builder-workspace/.derivedData/Build/Intermediates.noindex/Base32.build/Debug/Base32.build/Objects-normal/arm64/shim.swiftconstvalues -emit-reference-dependencies-path /Users/admin/builder/spi-builder-workspace/.derivedData/Build/Intermediates.noindex/Base32.build/Debug/Base32.build/Objects-normal/arm64/shim.swiftdeps -serialize-diagnostics-path /Users/admin/builder/spi-builder-workspace/.derivedData/Build/Intermediates.noindex/Base32.build/Debug/Base32.build/Objects-normal/arm64/shim.dia -target arm64-apple-macos10.9 -Xllvm -aarch64-use-tbi -enable-objc-interop -sdk /Applications/Xcode-16.1.0.app/Contents/Developer/Platforms/MacOSX.platform/Developer/SDKs/MacOSX15.1.sdk -I /Users/admin/builder/spi-builder-workspace/.derivedData/Build/Products/Debug -F /Users/admin/builder/spi-builder-workspace/.derivedData/Build/Products/Debug -F /Applications/Xcode-16.1.0.app/Contents/Developer/Platforms/MacOSX.platform/Developer/Library/Frameworks -no-color-diagnostics -application-extension -enable-testing -g -debug-info-format\=dwarf -dwarf-version\=2 -module-cache-path /Users/admin/builder/spi-builder-workspace/.derivedData/ModuleCache.noindex -profile-generate -profile-coverage-mapping -swift-version 4.2 -enforce-exclusivity\=checked -stats-output-dir /Users/admin/builder/spi-builder-workspace/.stats -Onone -serialize-debugging-options -const-gather-protocols-file /Users/admin/builder/spi-builder-workspace/.derivedData/Build/Intermediates.noindex/Base32.build/Debug/Base32.build/Objects-normal/arm64/Base32_const_extract_protocols.json -enable-experimental-feature DebugDescriptionMacro -enable-experimental-feature OpaqueTypeErasure -enable-upcoming-feature StrictConcurrency -enable-upcoming-feature DisableOutwardActorInference -enable-upcoming-feature GlobalActorIsolatedTypesUsability -enable-upcoming-feature InferSendableFromCaptures -enable-bare-slash-regex -strict-concurrency\=complete -empty-abi-descriptor -validate-clang-modules-once -clang-build-session-file /Users/admin/builder/spi-builder-workspace/.derivedData/ModuleCache.noindex/Session.modulevalidation -Xcc -working-directory -Xcc /Users/admin/builder/spi-builder-workspace -resource-dir /Applications/Xcode-16.1.0.app/Contents/Developer/Toolchains/XcodeDefault.xctoolchain/usr/lib/swift -enable-anonymous-context-mangled-names -file-compilation-dir /Users/admin/builder/spi-builder-workspace -Xcc -ivfsstatcache -Xcc /Users/admin/builder/spi-builder-workspace/.derivedData/SDKStatCaches.noindex/macosx15.1-24B75-44d23fded74b714c58e69ec4af40d824.sdkstatcache -Xcc -I/Users/admin/builder/spi-builder-workspace/.derivedData/Build/Intermediates.noindex/Base32.build/Debug/Base32.build/swift-overrides.hmap -Xcc -I/Users/admin/builder/spi-builder-workspace/.derivedData/Build/Products/Debug/include -Xcc -I/Users/admin/builder/spi-builder-workspace/.derivedData/Build/Intermediates.noindex/Base32.build/Debug/Base32.build/DerivedSources-normal/arm64 -Xcc -I/Users/admin/builder/spi-builder-workspace/.derivedData/Build/Intermediates.noindex/Base32.build/Debug/Base32.build/DerivedSources/arm64 -Xcc -I/Users/admin/builder/spi-builder-workspace/.derivedData/Build/Intermediates.noindex/Base32.build/Debug/Base32.build/DerivedSources -module-name Base32 -frontend-parseable-output -disable-clang-spi -target-sdk-version 15.1 -target-sdk-name macosx15.1 -external-plugin-path /Applications/Xcode-16.1.0.app/Contents/Developer/Platforms/MacOSX.platform/Developer/usr/lib/swift/host/plugins\#/Applications/Xcode-16.1.0.app/Contents/Developer/Platforms/MacOSX.platform/Developer/usr/bin/swift-plugin-server -external-plugin-path /Applications/Xcode-16.1.0.app/Contents/Developer/Platforms/MacOSX.platform/Developer/usr/local/lib/swift/host/plugins\#/Applications/Xcode-16.1.0.app/Contents/Developer/Platforms/MacOSX.platform/Developer/usr/bin/swift-plugin-server -plugin-path /Applications/Xcode-16.1.0.app/Contents/Developer/Toolchains/XcodeDefault.xctoolchain/usr/lib/swift/host/plugins -plugin-path /Applications/Xcode-16.1.0.app/Contents/Developer/Toolchains/XcodeDefault.xctoolchain/usr/local/lib/swift/host/plugins -o /Users/admin/builder/spi-builder-workspace/.derivedData/Build/Intermediates.noindex/Base32.build/Debug/Base32.build/Objects-normal/arm64/shim.o -index-unit-output-path /Base32.build/Debug/Base32.build/Objects-normal/arm64/shim.o -index-store-path /Users/admin/builder/spi-builder-workspace/.derivedData/Index.noindex/DataStore -index-system-modules
SwiftCompile normal arm64 Compiling\ Base16.swift /Users/admin/builder/spi-builder-workspace/Sources/Base32/Base16.swift (in target 'Base32' from project 'Base32')
    cd /Users/admin/builder/spi-builder-workspace
    builtin-swiftTaskExecution -- /Applications/Xcode-16.1.0.app/Contents/Developer/Toolchains/XcodeDefault.xctoolchain/usr/bin/swift-frontend -frontend -c -primary-file /Users/admin/builder/spi-builder-workspace/Sources/Base32/Base16.swift /Users/admin/builder/spi-builder-workspace/Sources/Base32/Base32.swift /Users/admin/builder/spi-builder-workspace/Sources/Base32/shim.swift /Users/admin/builder/spi-builder-workspace/Sources/Base32/StringExtension.swift -emit-dependencies-path /Users/admin/builder/spi-builder-workspace/.derivedData/Build/Intermediates.noindex/Base32.build/Debug/Base32.build/Objects-normal/arm64/Base16.d -emit-const-values-path /Users/admin/builder/spi-builder-workspace/.derivedData/Build/Intermediates.noindex/Base32.build/Debug/Base32.build/Objects-normal/arm64/Base16.swiftconstvalues -emit-reference-dependencies-path /Users/admin/builder/spi-builder-workspace/.derivedData/Build/Intermediates.noindex/Base32.build/Debug/Base32.build/Objects-normal/arm64/Base16.swiftdeps -serialize-diagnostics-path /Users/admin/builder/spi-builder-workspace/.derivedData/Build/Intermediates.noindex/Base32.build/Debug/Base32.build/Objects-normal/arm64/Base16.dia -target arm64-apple-macos10.9 -Xllvm -aarch64-use-tbi -enable-objc-interop -sdk /Applications/Xcode-16.1.0.app/Contents/Developer/Platforms/MacOSX.platform/Developer/SDKs/MacOSX15.1.sdk -I /Users/admin/builder/spi-builder-workspace/.derivedData/Build/Products/Debug -F /Users/admin/builder/spi-builder-workspace/.derivedData/Build/Products/Debug -F /Applications/Xcode-16.1.0.app/Contents/Developer/Platforms/MacOSX.platform/Developer/Library/Frameworks -no-color-diagnostics -application-extension -enable-testing -g -debug-info-format\=dwarf -dwarf-version\=2 -module-cache-path /Users/admin/builder/spi-builder-workspace/.derivedData/ModuleCache.noindex -profile-generate -profile-coverage-mapping -swift-version 4.2 -enforce-exclusivity\=checked -stats-output-dir /Users/admin/builder/spi-builder-workspace/.stats -Onone -serialize-debugging-options -const-gather-protocols-file /Users/admin/builder/spi-builder-workspace/.derivedData/Build/Intermediates.noindex/Base32.build/Debug/Base32.build/Objects-normal/arm64/Base32_const_extract_protocols.json -enable-experimental-feature DebugDescriptionMacro -enable-experimental-feature OpaqueTypeErasure -enable-upcoming-feature StrictConcurrency -enable-upcoming-feature DisableOutwardActorInference -enable-upcoming-feature GlobalActorIsolatedTypesUsability -enable-upcoming-feature InferSendableFromCaptures -enable-bare-slash-regex -strict-concurrency\=complete -empty-abi-descriptor -validate-clang-modules-once -clang-build-session-file /Users/admin/builder/spi-builder-workspace/.derivedData/ModuleCache.noindex/Session.modulevalidation -Xcc -working-directory -Xcc /Users/admin/builder/spi-builder-workspace -resource-dir /Applications/Xcode-16.1.0.app/Contents/Developer/Toolchains/XcodeDefault.xctoolchain/usr/lib/swift -enable-anonymous-context-mangled-names -file-compilation-dir /Users/admin/builder/spi-builder-workspace -Xcc -ivfsstatcache -Xcc /Users/admin/builder/spi-builder-workspace/.derivedData/SDKStatCaches.noindex/macosx15.1-24B75-44d23fded74b714c58e69ec4af40d824.sdkstatcache -Xcc -I/Users/admin/builder/spi-builder-workspace/.derivedData/Build/Intermediates.noindex/Base32.build/Debug/Base32.build/swift-overrides.hmap -Xcc -I/Users/admin/builder/spi-builder-workspace/.derivedData/Build/Products/Debug/include -Xcc -I/Users/admin/builder/spi-builder-workspace/.derivedData/Build/Intermediates.noindex/Base32.build/Debug/Base32.build/DerivedSources-normal/arm64 -Xcc -I/Users/admin/builder/spi-builder-workspace/.derivedData/Build/Intermediates.noindex/Base32.build/Debug/Base32.build/DerivedSources/arm64 -Xcc -I/Users/admin/builder/spi-builder-workspace/.derivedData/Build/Intermediates.noindex/Base32.build/Debug/Base32.build/DerivedSources -module-name Base32 -frontend-parseable-output -disable-clang-spi -target-sdk-version 15.1 -target-sdk-name macosx15.1 -external-plugin-path /Applications/Xcode-16.1.0.app/Contents/Developer/Platforms/MacOSX.platform/Developer/usr/lib/swift/host/plugins\#/Applications/Xcode-16.1.0.app/Contents/Developer/Platforms/MacOSX.platform/Developer/usr/bin/swift-plugin-server -external-plugin-path /Applications/Xcode-16.1.0.app/Contents/Developer/Platforms/MacOSX.platform/Developer/usr/local/lib/swift/host/plugins\#/Applications/Xcode-16.1.0.app/Contents/Developer/Platforms/MacOSX.platform/Developer/usr/bin/swift-plugin-server -plugin-path /Applications/Xcode-16.1.0.app/Contents/Developer/Toolchains/XcodeDefault.xctoolchain/usr/lib/swift/host/plugins -plugin-path /Applications/Xcode-16.1.0.app/Contents/Developer/Toolchains/XcodeDefault.xctoolchain/usr/local/lib/swift/host/plugins -o /Users/admin/builder/spi-builder-workspace/.derivedData/Build/Intermediates.noindex/Base32.build/Debug/Base32.build/Objects-normal/arm64/Base16.o -index-unit-output-path /Base32.build/Debug/Base32.build/Objects-normal/arm64/Base16.o -index-store-path /Users/admin/builder/spi-builder-workspace/.derivedData/Index.noindex/DataStore -index-system-modules
SwiftCompile normal arm64 /Users/admin/builder/spi-builder-workspace/Sources/Base32/Base16.swift (in target 'Base32' from project 'Base32')
    cd /Users/admin/builder/spi-builder-workspace
    /Applications/Xcode-16.1.0.app/Contents/Developer/Toolchains/XcodeDefault.xctoolchain/usr/bin/swift-frontend -c -primary-file /Users/admin/builder/spi-builder-workspace/Sources/Base32/Base16.swift /Users/admin/builder/spi-builder-workspace/Sources/Base32/Base32.swift /Users/admin/builder/spi-builder-workspace/Sources/Base32/shim.swift /Users/admin/builder/spi-builder-workspace/Sources/Base32/StringExtension.swift -emit-dependencies-path /Users/admin/builder/spi-builder-workspace/.derivedData/Build/Intermediates.noindex/Base32.build/Debug/Base32.build/Objects-normal/arm64/Base16.d -emit-const-values-path /Users/admin/builder/spi-builder-workspace/.derivedData/Build/Intermediates.noindex/Base32.build/Debug/Base32.build/Objects-normal/arm64/Base16.swiftconstvalues -emit-reference-dependencies-path /Users/admin/builder/spi-builder-workspace/.derivedData/Build/Intermediates.noindex/Base32.build/Debug/Base32.build/Objects-normal/arm64/Base16.swiftdeps -serialize-diagnostics-path /Users/admin/builder/spi-builder-workspace/.derivedData/Build/Intermediates.noindex/Base32.build/Debug/Base32.build/Objects-normal/arm64/Base16.dia -target arm64-apple-macos10.9 -Xllvm -aarch64-use-tbi -enable-objc-interop -sdk /Applications/Xcode-16.1.0.app/Contents/Developer/Platforms/MacOSX.platform/Developer/SDKs/MacOSX15.1.sdk -I /Users/admin/builder/spi-builder-workspace/.derivedData/Build/Products/Debug -F /Users/admin/builder/spi-builder-workspace/.derivedData/Build/Products/Debug -F /Applications/Xcode-16.1.0.app/Contents/Developer/Platforms/MacOSX.platform/Developer/Library/Frameworks -no-color-diagnostics -application-extension -enable-testing -g -debug-info-format\=dwarf -dwarf-version\=2 -module-cache-path /Users/admin/builder/spi-builder-workspace/.derivedData/ModuleCache.noindex -profile-generate -profile-coverage-mapping -swift-version 4.2 -enforce-exclusivity\=checked -stats-output-dir /Users/admin/builder/spi-builder-workspace/.stats -Onone -serialize-debugging-options -const-gather-protocols-file /Users/admin/builder/spi-builder-workspace/.derivedData/Build/Intermediates.noindex/Base32.build/Debug/Base32.build/Objects-normal/arm64/Base32_const_extract_protocols.json -enable-experimental-feature DebugDescriptionMacro -enable-experimental-feature OpaqueTypeErasure -enable-upcoming-feature StrictConcurrency -enable-upcoming-feature DisableOutwardActorInference -enable-upcoming-feature GlobalActorIsolatedTypesUsability -enable-upcoming-feature InferSendableFromCaptures -enable-bare-slash-regex -strict-concurrency\=complete -empty-abi-descriptor -validate-clang-modules-once -clang-build-session-file /Users/admin/builder/spi-builder-workspace/.derivedData/ModuleCache.noindex/Session.modulevalidation -Xcc -working-directory -Xcc /Users/admin/builder/spi-builder-workspace -resource-dir /Applications/Xcode-16.1.0.app/Contents/Developer/Toolchains/XcodeDefault.xctoolchain/usr/lib/swift -enable-anonymous-context-mangled-names -file-compilation-dir /Users/admin/builder/spi-builder-workspace -Xcc -ivfsstatcache -Xcc /Users/admin/builder/spi-builder-workspace/.derivedData/SDKStatCaches.noindex/macosx15.1-24B75-44d23fded74b714c58e69ec4af40d824.sdkstatcache -Xcc -I/Users/admin/builder/spi-builder-workspace/.derivedData/Build/Intermediates.noindex/Base32.build/Debug/Base32.build/swift-overrides.hmap -Xcc -I/Users/admin/builder/spi-builder-workspace/.derivedData/Build/Products/Debug/include -Xcc -I/Users/admin/builder/spi-builder-workspace/.derivedData/Build/Intermediates.noindex/Base32.build/Debug/Base32.build/DerivedSources-normal/arm64 -Xcc -I/Users/admin/builder/spi-builder-workspace/.derivedData/Build/Intermediates.noindex/Base32.build/Debug/Base32.build/DerivedSources/arm64 -Xcc -I/Users/admin/builder/spi-builder-workspace/.derivedData/Build/Intermediates.noindex/Base32.build/Debug/Base32.build/DerivedSources -module-name Base32 -frontend-parseable-output -disable-clang-spi -target-sdk-version 15.1 -target-sdk-name macosx15.1 -external-plugin-path /Applications/Xcode-16.1.0.app/Contents/Developer/Platforms/MacOSX.platform/Developer/usr/lib/swift/host/plugins\#/Applications/Xcode-16.1.0.app/Contents/Developer/Platforms/MacOSX.platform/Developer/usr/bin/swift-plugin-server -external-plugin-path /Applications/Xcode-16.1.0.app/Contents/Developer/Platforms/MacOSX.platform/Developer/usr/local/lib/swift/host/plugins\#/Applications/Xcode-16.1.0.app/Contents/Developer/Platforms/MacOSX.platform/Developer/usr/bin/swift-plugin-server -plugin-path /Applications/Xcode-16.1.0.app/Contents/Developer/Toolchains/XcodeDefault.xctoolchain/usr/lib/swift/host/plugins -plugin-path /Applications/Xcode-16.1.0.app/Contents/Developer/Toolchains/XcodeDefault.xctoolchain/usr/local/lib/swift/host/plugins -o /Users/admin/builder/spi-builder-workspace/.derivedData/Build/Intermediates.noindex/Base32.build/Debug/Base32.build/Objects-normal/arm64/Base16.o -index-unit-output-path /Base32.build/Debug/Base32.build/Objects-normal/arm64/Base16.o -index-store-path /Users/admin/builder/spi-builder-workspace/.derivedData/Index.noindex/DataStore -index-system-modules
** BUILD FAILED **
The following build commands failed:
	EmitSwiftModule normal arm64 (in target 'Base32' from project 'Base32')
	SwiftEmitModule normal arm64 Emitting\ module\ for\ Base32 (in target 'Base32' from project 'Base32')
	Building project Base32 with scheme Base32
(3 failures)
BUILD FAILURE 6.0 macosXcodebuild