The Swift Package Index logo.Swift Package Index

Track the adoption of Swift 6 strict concurrency checks for data race safety. How many packages are Ready for Swift 6?

Build Information

Failed to build Workflow, reference main (20d302), with Swift 6.0 for watchOS using Xcode 16.2 on 5 May 2025 21:29:35 UTC.

Build Command

env DEVELOPER_DIR=/Applications/Xcode-16.2.0.app xcrun xcodebuild -IDEClonedSourcePackagesDirPathOverride=$PWD/.dependencies -skipMacroValidation -skipPackagePluginValidation -derivedDataPath $PWD/.derivedData build -scheme Workflow-Package -destination generic/platform=watchOS

Build Log

SwiftEmitModule normal arm64_32 Emitting\ module\ for\ WorkflowConcurrency (in target 'WorkflowConcurrency' from project 'Workflow')
    cd /Users/admin/builder/spi-builder-workspace/.swiftpm/xcode
    builtin-swiftTaskExecution -- /Applications/Xcode-16.2.0.app/Contents/Developer/Toolchains/XcodeDefault.xctoolchain/usr/bin/swift-frontend -frontend -emit-module -experimental-skip-non-inlinable-function-bodies-without-types /Users/admin/builder/spi-builder-workspace/WorkflowConcurrency/Sources/AsyncOperationWorker.swift /Users/admin/builder/spi-builder-workspace/WorkflowConcurrency/Sources/Logger.swift /Users/admin/builder/spi-builder-workspace/WorkflowConcurrency/Sources/Worker.swift -target arm64_32-apple-watchos8.0 -enable-objc-interop -sdk /Applications/Xcode-16.2.0.app/Contents/Developer/Platforms/WatchOS.platform/Developer/SDKs/WatchOS11.2.sdk -I /Users/admin/builder/spi-builder-workspace/.derivedData/Build/Products/Debug-watchos -I /Applications/Xcode-16.2.0.app/Contents/Developer/Platforms/WatchOS.platform/Developer/usr/lib -F /Users/admin/builder/spi-builder-workspace/.derivedData/Build/Products/Debug-watchos/PackageFrameworks -F /Users/admin/builder/spi-builder-workspace/.derivedData/Build/Products/Debug-watchos/PackageFrameworks -F /Users/admin/builder/spi-builder-workspace/.derivedData/Build/Products/Debug-watchos -F /Applications/Xcode-16.2.0.app/Contents/Developer/Platforms/WatchOS.platform/Developer/Library/Frameworks -F /Applications/Xcode-16.2.0.app/Contents/Developer/Platforms/WatchOS.platform/Developer/SDKs/WatchOS11.2.sdk/Developer/Library/Frameworks -no-color-diagnostics -enable-testing -g -debug-info-format\=dwarf -dwarf-version\=4 -module-cache-path /Users/admin/builder/spi-builder-workspace/.derivedData/ModuleCache.noindex -profile-generate -profile-coverage-mapping -swift-version 5 -enforce-exclusivity\=checked -Onone -D SWIFT_PACKAGE -D DEBUG -D Xcode -serialize-debugging-options -const-gather-protocols-file /Users/admin/builder/spi-builder-workspace/.derivedData/Build/Intermediates.noindex/Workflow.build/Debug-watchos/WorkflowConcurrency.build/Objects-normal/arm64_32/WorkflowConcurrency_const_extract_protocols.json -enable-experimental-feature StrictConcurrency\=targeted -enable-experimental-feature DebugDescriptionMacro -enable-experimental-feature OpaqueTypeErasure -empty-abi-descriptor -plugin-path /Applications/Xcode-16.2.0.app/Contents/Developer/Toolchains/XcodeDefault.xctoolchain/usr/lib/swift/host/plugins/testing -validate-clang-modules-once -clang-build-session-file /Users/admin/builder/spi-builder-workspace/.derivedData/ModuleCache.noindex/Session.modulevalidation -Xcc -working-directory -Xcc /Users/admin/builder/spi-builder-workspace/.swiftpm/xcode -resource-dir /Applications/Xcode-16.2.0.app/Contents/Developer/Toolchains/XcodeDefault.xctoolchain/usr/lib/swift -enable-anonymous-context-mangled-names -file-compilation-dir /Users/admin/builder/spi-builder-workspace/.swiftpm/xcode -Xcc -D_LIBCPP_HARDENING_MODE\=_LIBCPP_HARDENING_MODE_DEBUG -Xcc -ivfsstatcache -Xcc /Users/admin/builder/spi-builder-workspace/.derivedData/SDKStatCaches.noindex/watchos11.2-22S97-8cb5c683f5e64b0ecfc74e8d0065fbf6.sdkstatcache -Xcc -I/Users/admin/builder/spi-builder-workspace/.derivedData/Build/Intermediates.noindex/Workflow.build/Debug-watchos/WorkflowConcurrency.build/swift-overrides.hmap -Xcc -I/Users/admin/builder/spi-builder-workspace/.derivedData/Build/Products/Debug-watchos/include -Xcc -I/Users/admin/builder/spi-builder-workspace/.derivedData/Build/Intermediates.noindex/Workflow.build/Debug-watchos/WorkflowConcurrency.build/DerivedSources-normal/arm64_32 -Xcc -I/Users/admin/builder/spi-builder-workspace/.derivedData/Build/Intermediates.noindex/Workflow.build/Debug-watchos/WorkflowConcurrency.build/DerivedSources/arm64_32 -Xcc -I/Users/admin/builder/spi-builder-workspace/.derivedData/Build/Intermediates.noindex/Workflow.build/Debug-watchos/WorkflowConcurrency.build/DerivedSources -Xcc -DSWIFT_PACKAGE -Xcc -DDEBUG\=1 -module-name WorkflowConcurrency -package-name spi_builder_workspace -frontend-parseable-output -disable-clang-spi -target-sdk-version 11.2 -target-sdk-name watchos11.2 -external-plugin-path /Applications/Xcode-16.2.0.app/Contents/Developer/Platforms/WatchOS.platform/Developer/usr/lib/swift/host/plugins\#/Applications/Xcode-16.2.0.app/Contents/Developer/Platforms/WatchOS.platform/Developer/usr/bin/swift-plugin-server -external-plugin-path /Applications/Xcode-16.2.0.app/Contents/Developer/Platforms/WatchOS.platform/Developer/usr/local/lib/swift/host/plugins\#/Applications/Xcode-16.2.0.app/Contents/Developer/Platforms/WatchOS.platform/Developer/usr/bin/swift-plugin-server -plugin-path /Applications/Xcode-16.2.0.app/Contents/Developer/Toolchains/XcodeDefault.xctoolchain/usr/lib/swift/host/plugins -plugin-path /Applications/Xcode-16.2.0.app/Contents/Developer/Toolchains/XcodeDefault.xctoolchain/usr/local/lib/swift/host/plugins -emit-module-doc-path /Users/admin/builder/spi-builder-workspace/.derivedData/Build/Intermediates.noindex/Workflow.build/Debug-watchos/WorkflowConcurrency.build/Objects-normal/arm64_32/WorkflowConcurrency.swiftdoc -emit-module-source-info-path /Users/admin/builder/spi-builder-workspace/.derivedData/Build/Intermediates.noindex/Workflow.build/Debug-watchos/WorkflowConcurrency.build/Objects-normal/arm64_32/WorkflowConcurrency.swiftsourceinfo -emit-objc-header-path /Users/admin/builder/spi-builder-workspace/.derivedData/Build/Intermediates.noindex/Workflow.build/Debug-watchos/WorkflowConcurrency.build/Objects-normal/arm64_32/WorkflowConcurrency-Swift.h -serialize-diagnostics-path /Users/admin/builder/spi-builder-workspace/.derivedData/Build/Intermediates.noindex/Workflow.build/Debug-watchos/WorkflowConcurrency.build/Objects-normal/arm64_32/WorkflowConcurrency-master-emit-module.dia -emit-dependencies-path /Users/admin/builder/spi-builder-workspace/.derivedData/Build/Intermediates.noindex/Workflow.build/Debug-watchos/WorkflowConcurrency.build/Objects-normal/arm64_32/WorkflowConcurrency-master-emit-module.d -o /Users/admin/builder/spi-builder-workspace/.derivedData/Build/Intermediates.noindex/Workflow.build/Debug-watchos/WorkflowConcurrency.build/Objects-normal/arm64_32/WorkflowConcurrency.swiftmodule -emit-abi-descriptor-path /Users/admin/builder/spi-builder-workspace/.derivedData/Build/Intermediates.noindex/Workflow.build/Debug-watchos/WorkflowConcurrency.build/Objects-normal/arm64_32/WorkflowConcurrency.abi.json
EmitSwiftModule normal arm64_32 (in target 'WorkflowConcurrency' from project 'Workflow')
    cd /Users/admin/builder/spi-builder-workspace/.swiftpm/xcode
    /Applications/Xcode-16.2.0.app/Contents/Developer/Toolchains/XcodeDefault.xctoolchain/usr/bin/swift-frontend -emit-module -experimental-skip-non-inlinable-function-bodies-without-types /Users/admin/builder/spi-builder-workspace/WorkflowConcurrency/Sources/AsyncOperationWorker.swift /Users/admin/builder/spi-builder-workspace/WorkflowConcurrency/Sources/Logger.swift /Users/admin/builder/spi-builder-workspace/WorkflowConcurrency/Sources/Worker.swift -target arm64_32-apple-watchos8.0 -enable-objc-interop -sdk /Applications/Xcode-16.2.0.app/Contents/Developer/Platforms/WatchOS.platform/Developer/SDKs/WatchOS11.2.sdk -I /Users/admin/builder/spi-builder-workspace/.derivedData/Build/Products/Debug-watchos -I /Applications/Xcode-16.2.0.app/Contents/Developer/Platforms/WatchOS.platform/Developer/usr/lib -F /Users/admin/builder/spi-builder-workspace/.derivedData/Build/Products/Debug-watchos/PackageFrameworks -F /Users/admin/builder/spi-builder-workspace/.derivedData/Build/Products/Debug-watchos/PackageFrameworks -F /Users/admin/builder/spi-builder-workspace/.derivedData/Build/Products/Debug-watchos -F /Applications/Xcode-16.2.0.app/Contents/Developer/Platforms/WatchOS.platform/Developer/Library/Frameworks -F /Applications/Xcode-16.2.0.app/Contents/Developer/Platforms/WatchOS.platform/Developer/SDKs/WatchOS11.2.sdk/Developer/Library/Frameworks -no-color-diagnostics -enable-testing -g -debug-info-format\=dwarf -dwarf-version\=4 -module-cache-path /Users/admin/builder/spi-builder-workspace/.derivedData/ModuleCache.noindex -profile-generate -profile-coverage-mapping -swift-version 5 -enforce-exclusivity\=checked -Onone -D SWIFT_PACKAGE -D DEBUG -D Xcode -serialize-debugging-options -const-gather-protocols-file /Users/admin/builder/spi-builder-workspace/.derivedData/Build/Intermediates.noindex/Workflow.build/Debug-watchos/WorkflowConcurrency.build/Objects-normal/arm64_32/WorkflowConcurrency_const_extract_protocols.json -enable-experimental-feature StrictConcurrency\=targeted -enable-experimental-feature DebugDescriptionMacro -enable-experimental-feature OpaqueTypeErasure -empty-abi-descriptor -plugin-path /Applications/Xcode-16.2.0.app/Contents/Developer/Toolchains/XcodeDefault.xctoolchain/usr/lib/swift/host/plugins/testing -validate-clang-modules-once -clang-build-session-file /Users/admin/builder/spi-builder-workspace/.derivedData/ModuleCache.noindex/Session.modulevalidation -Xcc -working-directory -Xcc /Users/admin/builder/spi-builder-workspace/.swiftpm/xcode -resource-dir /Applications/Xcode-16.2.0.app/Contents/Developer/Toolchains/XcodeDefault.xctoolchain/usr/lib/swift -enable-anonymous-context-mangled-names -file-compilation-dir /Users/admin/builder/spi-builder-workspace/.swiftpm/xcode -Xcc -D_LIBCPP_HARDENING_MODE\=_LIBCPP_HARDENING_MODE_DEBUG -Xcc -ivfsstatcache -Xcc /Users/admin/builder/spi-builder-workspace/.derivedData/SDKStatCaches.noindex/watchos11.2-22S97-8cb5c683f5e64b0ecfc74e8d0065fbf6.sdkstatcache -Xcc -I/Users/admin/builder/spi-builder-workspace/.derivedData/Build/Intermediates.noindex/Workflow.build/Debug-watchos/WorkflowConcurrency.build/swift-overrides.hmap -Xcc -I/Users/admin/builder/spi-builder-workspace/.derivedData/Build/Products/Debug-watchos/include -Xcc -I/Users/admin/builder/spi-builder-workspace/.derivedData/Build/Intermediates.noindex/Workflow.build/Debug-watchos/WorkflowConcurrency.build/DerivedSources-normal/arm64_32 -Xcc -I/Users/admin/builder/spi-builder-workspace/.derivedData/Build/Intermediates.noindex/Workflow.build/Debug-watchos/WorkflowConcurrency.build/DerivedSources/arm64_32 -Xcc -I/Users/admin/builder/spi-builder-workspace/.derivedData/Build/Intermediates.noindex/Workflow.build/Debug-watchos/WorkflowConcurrency.build/DerivedSources -Xcc -DSWIFT_PACKAGE -Xcc -DDEBUG\=1 -module-name WorkflowConcurrency -package-name spi_builder_workspace -frontend-parseable-output -disable-clang-spi -target-sdk-version 11.2 -target-sdk-name watchos11.2 -external-plugin-path /Applications/Xcode-16.2.0.app/Contents/Developer/Platforms/WatchOS.platform/Developer/usr/lib/swift/host/plugins\#/Applications/Xcode-16.2.0.app/Contents/Developer/Platforms/WatchOS.platform/Developer/usr/bin/swift-plugin-server -external-plugin-path /Applications/Xcode-16.2.0.app/Contents/Developer/Platforms/WatchOS.platform/Developer/usr/local/lib/swift/host/plugins\#/Applications/Xcode-16.2.0.app/Contents/Developer/Platforms/WatchOS.platform/Developer/usr/bin/swift-plugin-server -plugin-path /Applications/Xcode-16.2.0.app/Contents/Developer/Toolchains/XcodeDefault.xctoolchain/usr/lib/swift/host/plugins -plugin-path /Applications/Xcode-16.2.0.app/Contents/Developer/Toolchains/XcodeDefault.xctoolchain/usr/local/lib/swift/host/plugins -emit-module-doc-path /Users/admin/builder/spi-builder-workspace/.derivedData/Build/Intermediates.noindex/Workflow.build/Debug-watchos/WorkflowConcurrency.build/Objects-normal/arm64_32/WorkflowConcurrency.swiftdoc -emit-module-source-info-path /Users/admin/builder/spi-builder-workspace/.derivedData/Build/Intermediates.noindex/Workflow.build/Debug-watchos/WorkflowConcurrency.build/Objects-normal/arm64_32/WorkflowConcurrency.swiftsourceinfo -emit-objc-header-path /Users/admin/builder/spi-builder-workspace/.derivedData/Build/Intermediates.noindex/Workflow.build/Debug-watchos/WorkflowConcurrency.build/Objects-normal/arm64_32/WorkflowConcurrency-Swift.h -serialize-diagnostics-path /Users/admin/builder/spi-builder-workspace/.derivedData/Build/Intermediates.noindex/Workflow.build/Debug-watchos/WorkflowConcurrency.build/Objects-normal/arm64_32/WorkflowConcurrency-master-emit-module.dia -emit-dependencies-path /Users/admin/builder/spi-builder-workspace/.derivedData/Build/Intermediates.noindex/Workflow.build/Debug-watchos/WorkflowConcurrency.build/Objects-normal/arm64_32/WorkflowConcurrency-master-emit-module.d -o /Users/admin/builder/spi-builder-workspace/.derivedData/Build/Intermediates.noindex/Workflow.build/Debug-watchos/WorkflowConcurrency.build/Objects-normal/arm64_32/WorkflowConcurrency.swiftmodule -emit-abi-descriptor-path /Users/admin/builder/spi-builder-workspace/.derivedData/Build/Intermediates.noindex/Workflow.build/Debug-watchos/WorkflowConcurrency.build/Objects-normal/arm64_32/WorkflowConcurrency.abi.json
SwiftEmitModule normal arm64_32 Emitting\ module\ for\ ViewEnvironmentUI (in target 'ViewEnvironmentUI' from project 'Workflow')
    cd /Users/admin/builder/spi-builder-workspace/.swiftpm/xcode
    builtin-swiftTaskExecution -- /Applications/Xcode-16.2.0.app/Contents/Developer/Toolchains/XcodeDefault.xctoolchain/usr/bin/swift-frontend -frontend -emit-module -experimental-skip-non-inlinable-function-bodies-without-types /Users/admin/builder/spi-builder-workspace/ViewEnvironmentUI/Sources/UIView+ViewEnvironmentPropagating.swift /Users/admin/builder/spi-builder-workspace/ViewEnvironmentUI/Sources/UIViewController+ViewEnvironmentPropagating.swift /Users/admin/builder/spi-builder-workspace/ViewEnvironmentUI/Sources/ViewEnvironmentObserving.swift /Users/admin/builder/spi-builder-workspace/ViewEnvironmentUI/Sources/ViewEnvironmentPropagating.swift /Users/admin/builder/spi-builder-workspace/ViewEnvironmentUI/Sources/ViewEnvironmentPropagationNode.swift -target arm64_32-apple-watchos8.0 -enable-objc-interop -sdk /Applications/Xcode-16.2.0.app/Contents/Developer/Platforms/WatchOS.platform/Developer/SDKs/WatchOS11.2.sdk -I /Users/admin/builder/spi-builder-workspace/.derivedData/Build/Products/Debug-watchos -I /Applications/Xcode-16.2.0.app/Contents/Developer/Platforms/WatchOS.platform/Developer/usr/lib -F /Users/admin/builder/spi-builder-workspace/.derivedData/Build/Products/Debug-watchos/PackageFrameworks -F /Users/admin/builder/spi-builder-workspace/.derivedData/Build/Products/Debug-watchos -F /Applications/Xcode-16.2.0.app/Contents/Developer/Platforms/WatchOS.platform/Developer/Library/Frameworks -F /Applications/Xcode-16.2.0.app/Contents/Developer/Platforms/WatchOS.platform/Developer/SDKs/WatchOS11.2.sdk/Developer/Library/Frameworks -no-color-diagnostics -enable-testing -g -debug-info-format\=dwarf -dwarf-version\=4 -module-cache-path /Users/admin/builder/spi-builder-workspace/.derivedData/ModuleCache.noindex -profile-generate -profile-coverage-mapping -swift-version 5 -enforce-exclusivity\=checked -Onone -D SWIFT_PACKAGE -D DEBUG -D Xcode -serialize-debugging-options -const-gather-protocols-file /Users/admin/builder/spi-builder-workspace/.derivedData/Build/Intermediates.noindex/Workflow.build/Debug-watchos/ViewEnvironmentUI.build/Objects-normal/arm64_32/ViewEnvironmentUI_const_extract_protocols.json -enable-experimental-feature StrictConcurrency\=targeted -enable-experimental-feature DebugDescriptionMacro -enable-experimental-feature OpaqueTypeErasure -empty-abi-descriptor -plugin-path /Applications/Xcode-16.2.0.app/Contents/Developer/Toolchains/XcodeDefault.xctoolchain/usr/lib/swift/host/plugins/testing -validate-clang-modules-once -clang-build-session-file /Users/admin/builder/spi-builder-workspace/.derivedData/ModuleCache.noindex/Session.modulevalidation -Xcc -working-directory -Xcc /Users/admin/builder/spi-builder-workspace/.swiftpm/xcode -resource-dir /Applications/Xcode-16.2.0.app/Contents/Developer/Toolchains/XcodeDefault.xctoolchain/usr/lib/swift -enable-anonymous-context-mangled-names -file-compilation-dir /Users/admin/builder/spi-builder-workspace/.swiftpm/xcode -Xcc -D_LIBCPP_HARDENING_MODE\=_LIBCPP_HARDENING_MODE_DEBUG -Xcc -ivfsstatcache -Xcc /Users/admin/builder/spi-builder-workspace/.derivedData/SDKStatCaches.noindex/watchos11.2-22S97-8cb5c683f5e64b0ecfc74e8d0065fbf6.sdkstatcache -Xcc -I/Users/admin/builder/spi-builder-workspace/.derivedData/Build/Intermediates.noindex/Workflow.build/Debug-watchos/ViewEnvironmentUI.build/swift-overrides.hmap -Xcc -I/Users/admin/builder/spi-builder-workspace/.derivedData/Build/Products/Debug-watchos/include -Xcc -I/Users/admin/builder/spi-builder-workspace/.derivedData/Build/Intermediates.noindex/Workflow.build/Debug-watchos/ViewEnvironmentUI.build/DerivedSources-normal/arm64_32 -Xcc -I/Users/admin/builder/spi-builder-workspace/.derivedData/Build/Intermediates.noindex/Workflow.build/Debug-watchos/ViewEnvironmentUI.build/DerivedSources/arm64_32 -Xcc -I/Users/admin/builder/spi-builder-workspace/.derivedData/Build/Intermediates.noindex/Workflow.build/Debug-watchos/ViewEnvironmentUI.build/DerivedSources -Xcc -DSWIFT_PACKAGE -Xcc -DDEBUG\=1 -module-name ViewEnvironmentUI -package-name spi_builder_workspace -frontend-parseable-output -disable-clang-spi -target-sdk-version 11.2 -target-sdk-name watchos11.2 -external-plugin-path /Applications/Xcode-16.2.0.app/Contents/Developer/Platforms/WatchOS.platform/Developer/usr/lib/swift/host/plugins\#/Applications/Xcode-16.2.0.app/Contents/Developer/Platforms/WatchOS.platform/Developer/usr/bin/swift-plugin-server -external-plugin-path /Applications/Xcode-16.2.0.app/Contents/Developer/Platforms/WatchOS.platform/Developer/usr/local/lib/swift/host/plugins\#/Applications/Xcode-16.2.0.app/Contents/Developer/Platforms/WatchOS.platform/Developer/usr/bin/swift-plugin-server -plugin-path /Applications/Xcode-16.2.0.app/Contents/Developer/Toolchains/XcodeDefault.xctoolchain/usr/lib/swift/host/plugins -plugin-path /Applications/Xcode-16.2.0.app/Contents/Developer/Toolchains/XcodeDefault.xctoolchain/usr/local/lib/swift/host/plugins -emit-module-doc-path /Users/admin/builder/spi-builder-workspace/.derivedData/Build/Intermediates.noindex/Workflow.build/Debug-watchos/ViewEnvironmentUI.build/Objects-normal/arm64_32/ViewEnvironmentUI.swiftdoc -emit-module-source-info-path /Users/admin/builder/spi-builder-workspace/.derivedData/Build/Intermediates.noindex/Workflow.build/Debug-watchos/ViewEnvironmentUI.build/Objects-normal/arm64_32/ViewEnvironmentUI.swiftsourceinfo -emit-objc-header-path /Users/admin/builder/spi-builder-workspace/.derivedData/Build/Intermediates.noindex/Workflow.build/Debug-watchos/ViewEnvironmentUI.build/Objects-normal/arm64_32/ViewEnvironmentUI-Swift.h -serialize-diagnostics-path /Users/admin/builder/spi-builder-workspace/.derivedData/Build/Intermediates.noindex/Workflow.build/Debug-watchos/ViewEnvironmentUI.build/Objects-normal/arm64_32/ViewEnvironmentUI-master-emit-module.dia -emit-dependencies-path /Users/admin/builder/spi-builder-workspace/.derivedData/Build/Intermediates.noindex/Workflow.build/Debug-watchos/ViewEnvironmentUI.build/Objects-normal/arm64_32/ViewEnvironmentUI-master-emit-module.d -o /Users/admin/builder/spi-builder-workspace/.derivedData/Build/Intermediates.noindex/Workflow.build/Debug-watchos/ViewEnvironmentUI.build/Objects-normal/arm64_32/ViewEnvironmentUI.swiftmodule -emit-abi-descriptor-path /Users/admin/builder/spi-builder-workspace/.derivedData/Build/Intermediates.noindex/Workflow.build/Debug-watchos/ViewEnvironmentUI.build/Objects-normal/arm64_32/ViewEnvironmentUI.abi.json
EmitSwiftModule normal arm64_32 (in target 'ViewEnvironmentUI' from project 'Workflow')
    cd /Users/admin/builder/spi-builder-workspace/.swiftpm/xcode
    /Applications/Xcode-16.2.0.app/Contents/Developer/Toolchains/XcodeDefault.xctoolchain/usr/bin/swift-frontend -emit-module -experimental-skip-non-inlinable-function-bodies-without-types /Users/admin/builder/spi-builder-workspace/ViewEnvironmentUI/Sources/UIView+ViewEnvironmentPropagating.swift /Users/admin/builder/spi-builder-workspace/ViewEnvironmentUI/Sources/UIViewController+ViewEnvironmentPropagating.swift /Users/admin/builder/spi-builder-workspace/ViewEnvironmentUI/Sources/ViewEnvironmentObserving.swift /Users/admin/builder/spi-builder-workspace/ViewEnvironmentUI/Sources/ViewEnvironmentPropagating.swift /Users/admin/builder/spi-builder-workspace/ViewEnvironmentUI/Sources/ViewEnvironmentPropagationNode.swift -target arm64_32-apple-watchos8.0 -enable-objc-interop -sdk /Applications/Xcode-16.2.0.app/Contents/Developer/Platforms/WatchOS.platform/Developer/SDKs/WatchOS11.2.sdk -I /Users/admin/builder/spi-builder-workspace/.derivedData/Build/Products/Debug-watchos -I /Applications/Xcode-16.2.0.app/Contents/Developer/Platforms/WatchOS.platform/Developer/usr/lib -F /Users/admin/builder/spi-builder-workspace/.derivedData/Build/Products/Debug-watchos/PackageFrameworks -F /Users/admin/builder/spi-builder-workspace/.derivedData/Build/Products/Debug-watchos -F /Applications/Xcode-16.2.0.app/Contents/Developer/Platforms/WatchOS.platform/Developer/Library/Frameworks -F /Applications/Xcode-16.2.0.app/Contents/Developer/Platforms/WatchOS.platform/Developer/SDKs/WatchOS11.2.sdk/Developer/Library/Frameworks -no-color-diagnostics -enable-testing -g -debug-info-format\=dwarf -dwarf-version\=4 -module-cache-path /Users/admin/builder/spi-builder-workspace/.derivedData/ModuleCache.noindex -profile-generate -profile-coverage-mapping -swift-version 5 -enforce-exclusivity\=checked -Onone -D SWIFT_PACKAGE -D DEBUG -D Xcode -serialize-debugging-options -const-gather-protocols-file /Users/admin/builder/spi-builder-workspace/.derivedData/Build/Intermediates.noindex/Workflow.build/Debug-watchos/ViewEnvironmentUI.build/Objects-normal/arm64_32/ViewEnvironmentUI_const_extract_protocols.json -enable-experimental-feature StrictConcurrency\=targeted -enable-experimental-feature DebugDescriptionMacro -enable-experimental-feature OpaqueTypeErasure -empty-abi-descriptor -plugin-path /Applications/Xcode-16.2.0.app/Contents/Developer/Toolchains/XcodeDefault.xctoolchain/usr/lib/swift/host/plugins/testing -validate-clang-modules-once -clang-build-session-file /Users/admin/builder/spi-builder-workspace/.derivedData/ModuleCache.noindex/Session.modulevalidation -Xcc -working-directory -Xcc /Users/admin/builder/spi-builder-workspace/.swiftpm/xcode -resource-dir /Applications/Xcode-16.2.0.app/Contents/Developer/Toolchains/XcodeDefault.xctoolchain/usr/lib/swift -enable-anonymous-context-mangled-names -file-compilation-dir /Users/admin/builder/spi-builder-workspace/.swiftpm/xcode -Xcc -D_LIBCPP_HARDENING_MODE\=_LIBCPP_HARDENING_MODE_DEBUG -Xcc -ivfsstatcache -Xcc /Users/admin/builder/spi-builder-workspace/.derivedData/SDKStatCaches.noindex/watchos11.2-22S97-8cb5c683f5e64b0ecfc74e8d0065fbf6.sdkstatcache -Xcc -I/Users/admin/builder/spi-builder-workspace/.derivedData/Build/Intermediates.noindex/Workflow.build/Debug-watchos/ViewEnvironmentUI.build/swift-overrides.hmap -Xcc -I/Users/admin/builder/spi-builder-workspace/.derivedData/Build/Products/Debug-watchos/include -Xcc -I/Users/admin/builder/spi-builder-workspace/.derivedData/Build/Intermediates.noindex/Workflow.build/Debug-watchos/ViewEnvironmentUI.build/DerivedSources-normal/arm64_32 -Xcc -I/Users/admin/builder/spi-builder-workspace/.derivedData/Build/Intermediates.noindex/Workflow.build/Debug-watchos/ViewEnvironmentUI.build/DerivedSources/arm64_32 -Xcc -I/Users/admin/builder/spi-builder-workspace/.derivedData/Build/Intermediates.noindex/Workflow.build/Debug-watchos/ViewEnvironmentUI.build/DerivedSources -Xcc -DSWIFT_PACKAGE -Xcc -DDEBUG\=1 -module-name ViewEnvironmentUI -package-name spi_builder_workspace -frontend-parseable-output -disable-clang-spi -target-sdk-version 11.2 -target-sdk-name watchos11.2 -external-plugin-path /Applications/Xcode-16.2.0.app/Contents/Developer/Platforms/WatchOS.platform/Developer/usr/lib/swift/host/plugins\#/Applications/Xcode-16.2.0.app/Contents/Developer/Platforms/WatchOS.platform/Developer/usr/bin/swift-plugin-server -external-plugin-path /Applications/Xcode-16.2.0.app/Contents/Developer/Platforms/WatchOS.platform/Developer/usr/local/lib/swift/host/plugins\#/Applications/Xcode-16.2.0.app/Contents/Developer/Platforms/WatchOS.platform/Developer/usr/bin/swift-plugin-server -plugin-path /Applications/Xcode-16.2.0.app/Contents/Developer/Toolchains/XcodeDefault.xctoolchain/usr/lib/swift/host/plugins -plugin-path /Applications/Xcode-16.2.0.app/Contents/Developer/Toolchains/XcodeDefault.xctoolchain/usr/local/lib/swift/host/plugins -emit-module-doc-path /Users/admin/builder/spi-builder-workspace/.derivedData/Build/Intermediates.noindex/Workflow.build/Debug-watchos/ViewEnvironmentUI.build/Objects-normal/arm64_32/ViewEnvironmentUI.swiftdoc -emit-module-source-info-path /Users/admin/builder/spi-builder-workspace/.derivedData/Build/Intermediates.noindex/Workflow.build/Debug-watchos/ViewEnvironmentUI.build/Objects-normal/arm64_32/ViewEnvironmentUI.swiftsourceinfo -emit-objc-header-path /Users/admin/builder/spi-builder-workspace/.derivedData/Build/Intermediates.noindex/Workflow.build/Debug-watchos/ViewEnvironmentUI.build/Objects-normal/arm64_32/ViewEnvironmentUI-Swift.h -serialize-diagnostics-path /Users/admin/builder/spi-builder-workspace/.derivedData/Build/Intermediates.noindex/Workflow.build/Debug-watchos/ViewEnvironmentUI.build/Objects-normal/arm64_32/ViewEnvironmentUI-master-emit-module.dia -emit-dependencies-path /Users/admin/builder/spi-builder-workspace/.derivedData/Build/Intermediates.noindex/Workflow.build/Debug-watchos/ViewEnvironmentUI.build/Objects-normal/arm64_32/ViewEnvironmentUI-master-emit-module.d -o /Users/admin/builder/spi-builder-workspace/.derivedData/Build/Intermediates.noindex/Workflow.build/Debug-watchos/ViewEnvironmentUI.build/Objects-normal/arm64_32/ViewEnvironmentUI.swiftmodule -emit-abi-descriptor-path /Users/admin/builder/spi-builder-workspace/.derivedData/Build/Intermediates.noindex/Workflow.build/Debug-watchos/ViewEnvironmentUI.build/Objects-normal/arm64_32/ViewEnvironmentUI.abi.json
SwiftEmitModule normal arm64 Emitting\ module\ for\ ViewEnvironmentUI (in target 'ViewEnvironmentUI' from project 'Workflow')
    cd /Users/admin/builder/spi-builder-workspace/.swiftpm/xcode
    builtin-swiftTaskExecution -- /Applications/Xcode-16.2.0.app/Contents/Developer/Toolchains/XcodeDefault.xctoolchain/usr/bin/swift-frontend -frontend -emit-module -experimental-skip-non-inlinable-function-bodies-without-types /Users/admin/builder/spi-builder-workspace/ViewEnvironmentUI/Sources/UIView+ViewEnvironmentPropagating.swift /Users/admin/builder/spi-builder-workspace/ViewEnvironmentUI/Sources/UIViewController+ViewEnvironmentPropagating.swift /Users/admin/builder/spi-builder-workspace/ViewEnvironmentUI/Sources/ViewEnvironmentObserving.swift /Users/admin/builder/spi-builder-workspace/ViewEnvironmentUI/Sources/ViewEnvironmentPropagating.swift /Users/admin/builder/spi-builder-workspace/ViewEnvironmentUI/Sources/ViewEnvironmentPropagationNode.swift -target arm64-apple-watchos8.0 -Xllvm -aarch64-use-tbi -enable-objc-interop -stack-check -sdk /Applications/Xcode-16.2.0.app/Contents/Developer/Platforms/WatchOS.platform/Developer/SDKs/WatchOS11.2.sdk -I /Users/admin/builder/spi-builder-workspace/.derivedData/Build/Products/Debug-watchos -I /Applications/Xcode-16.2.0.app/Contents/Developer/Platforms/WatchOS.platform/Developer/usr/lib -F /Users/admin/builder/spi-builder-workspace/.derivedData/Build/Products/Debug-watchos/PackageFrameworks -F /Users/admin/builder/spi-builder-workspace/.derivedData/Build/Products/Debug-watchos -F /Applications/Xcode-16.2.0.app/Contents/Developer/Platforms/WatchOS.platform/Developer/Library/Frameworks -F /Applications/Xcode-16.2.0.app/Contents/Developer/Platforms/WatchOS.platform/Developer/SDKs/WatchOS11.2.sdk/Developer/Library/Frameworks -no-color-diagnostics -enable-testing -g -debug-info-format\=dwarf -dwarf-version\=4 -module-cache-path /Users/admin/builder/spi-builder-workspace/.derivedData/ModuleCache.noindex -profile-generate -profile-coverage-mapping -swift-version 5 -enforce-exclusivity\=checked -Onone -D SWIFT_PACKAGE -D DEBUG -D Xcode -serialize-debugging-options -const-gather-protocols-file /Users/admin/builder/spi-builder-workspace/.derivedData/Build/Intermediates.noindex/Workflow.build/Debug-watchos/ViewEnvironmentUI.build/Objects-normal/arm64/ViewEnvironmentUI_const_extract_protocols.json -enable-experimental-feature StrictConcurrency\=targeted -enable-experimental-feature DebugDescriptionMacro -enable-experimental-feature OpaqueTypeErasure -empty-abi-descriptor -plugin-path /Applications/Xcode-16.2.0.app/Contents/Developer/Toolchains/XcodeDefault.xctoolchain/usr/lib/swift/host/plugins/testing -validate-clang-modules-once -clang-build-session-file /Users/admin/builder/spi-builder-workspace/.derivedData/ModuleCache.noindex/Session.modulevalidation -Xcc -working-directory -Xcc /Users/admin/builder/spi-builder-workspace/.swiftpm/xcode -resource-dir /Applications/Xcode-16.2.0.app/Contents/Developer/Toolchains/XcodeDefault.xctoolchain/usr/lib/swift -enable-anonymous-context-mangled-names -file-compilation-dir /Users/admin/builder/spi-builder-workspace/.swiftpm/xcode -Xcc -D_LIBCPP_HARDENING_MODE\=_LIBCPP_HARDENING_MODE_DEBUG -Xcc -ivfsstatcache -Xcc /Users/admin/builder/spi-builder-workspace/.derivedData/SDKStatCaches.noindex/watchos11.2-22S97-8cb5c683f5e64b0ecfc74e8d0065fbf6.sdkstatcache -Xcc -I/Users/admin/builder/spi-builder-workspace/.derivedData/Build/Intermediates.noindex/Workflow.build/Debug-watchos/ViewEnvironmentUI.build/swift-overrides.hmap -Xcc -I/Users/admin/builder/spi-builder-workspace/.derivedData/Build/Products/Debug-watchos/include -Xcc -I/Users/admin/builder/spi-builder-workspace/.derivedData/Build/Intermediates.noindex/Workflow.build/Debug-watchos/ViewEnvironmentUI.build/DerivedSources-normal/arm64 -Xcc -I/Users/admin/builder/spi-builder-workspace/.derivedData/Build/Intermediates.noindex/Workflow.build/Debug-watchos/ViewEnvironmentUI.build/DerivedSources/arm64 -Xcc -I/Users/admin/builder/spi-builder-workspace/.derivedData/Build/Intermediates.noindex/Workflow.build/Debug-watchos/ViewEnvironmentUI.build/DerivedSources -Xcc -DSWIFT_PACKAGE -Xcc -DDEBUG\=1 -module-name ViewEnvironmentUI -package-name spi_builder_workspace -frontend-parseable-output -disable-clang-spi -target-sdk-version 11.2 -target-sdk-name watchos11.2 -external-plugin-path /Applications/Xcode-16.2.0.app/Contents/Developer/Platforms/WatchOS.platform/Developer/usr/lib/swift/host/plugins\#/Applications/Xcode-16.2.0.app/Contents/Developer/Platforms/WatchOS.platform/Developer/usr/bin/swift-plugin-server -external-plugin-path /Applications/Xcode-16.2.0.app/Contents/Developer/Platforms/WatchOS.platform/Developer/usr/local/lib/swift/host/plugins\#/Applications/Xcode-16.2.0.app/Contents/Developer/Platforms/WatchOS.platform/Developer/usr/bin/swift-plugin-server -plugin-path /Applications/Xcode-16.2.0.app/Contents/Developer/Toolchains/XcodeDefault.xctoolchain/usr/lib/swift/host/plugins -plugin-path /Applications/Xcode-16.2.0.app/Contents/Developer/Toolchains/XcodeDefault.xctoolchain/usr/local/lib/swift/host/plugins -emit-module-doc-path /Users/admin/builder/spi-builder-workspace/.derivedData/Build/Intermediates.noindex/Workflow.build/Debug-watchos/ViewEnvironmentUI.build/Objects-normal/arm64/ViewEnvironmentUI.swiftdoc -emit-module-source-info-path /Users/admin/builder/spi-builder-workspace/.derivedData/Build/Intermediates.noindex/Workflow.build/Debug-watchos/ViewEnvironmentUI.build/Objects-normal/arm64/ViewEnvironmentUI.swiftsourceinfo -emit-objc-header-path /Users/admin/builder/spi-builder-workspace/.derivedData/Build/Intermediates.noindex/Workflow.build/Debug-watchos/ViewEnvironmentUI.build/Objects-normal/arm64/ViewEnvironmentUI-Swift.h -serialize-diagnostics-path /Users/admin/builder/spi-builder-workspace/.derivedData/Build/Intermediates.noindex/Workflow.build/Debug-watchos/ViewEnvironmentUI.build/Objects-normal/arm64/ViewEnvironmentUI-master-emit-module.dia -emit-dependencies-path /Users/admin/builder/spi-builder-workspace/.derivedData/Build/Intermediates.noindex/Workflow.build/Debug-watchos/ViewEnvironmentUI.build/Objects-normal/arm64/ViewEnvironmentUI-master-emit-module.d -o /Users/admin/builder/spi-builder-workspace/.derivedData/Build/Intermediates.noindex/Workflow.build/Debug-watchos/ViewEnvironmentUI.build/Objects-normal/arm64/ViewEnvironmentUI.swiftmodule -emit-abi-descriptor-path /Users/admin/builder/spi-builder-workspace/.derivedData/Build/Intermediates.noindex/Workflow.build/Debug-watchos/ViewEnvironmentUI.build/Objects-normal/arm64/ViewEnvironmentUI.abi.json
EmitSwiftModule normal arm64 (in target 'ViewEnvironmentUI' from project 'Workflow')
    cd /Users/admin/builder/spi-builder-workspace/.swiftpm/xcode
    /Applications/Xcode-16.2.0.app/Contents/Developer/Toolchains/XcodeDefault.xctoolchain/usr/bin/swift-frontend -emit-module -experimental-skip-non-inlinable-function-bodies-without-types /Users/admin/builder/spi-builder-workspace/ViewEnvironmentUI/Sources/UIView+ViewEnvironmentPropagating.swift /Users/admin/builder/spi-builder-workspace/ViewEnvironmentUI/Sources/UIViewController+ViewEnvironmentPropagating.swift /Users/admin/builder/spi-builder-workspace/ViewEnvironmentUI/Sources/ViewEnvironmentObserving.swift /Users/admin/builder/spi-builder-workspace/ViewEnvironmentUI/Sources/ViewEnvironmentPropagating.swift /Users/admin/builder/spi-builder-workspace/ViewEnvironmentUI/Sources/ViewEnvironmentPropagationNode.swift -target arm64-apple-watchos8.0 -Xllvm -aarch64-use-tbi -enable-objc-interop -stack-check -sdk /Applications/Xcode-16.2.0.app/Contents/Developer/Platforms/WatchOS.platform/Developer/SDKs/WatchOS11.2.sdk -I /Users/admin/builder/spi-builder-workspace/.derivedData/Build/Products/Debug-watchos -I /Applications/Xcode-16.2.0.app/Contents/Developer/Platforms/WatchOS.platform/Developer/usr/lib -F /Users/admin/builder/spi-builder-workspace/.derivedData/Build/Products/Debug-watchos/PackageFrameworks -F /Users/admin/builder/spi-builder-workspace/.derivedData/Build/Products/Debug-watchos -F /Applications/Xcode-16.2.0.app/Contents/Developer/Platforms/WatchOS.platform/Developer/Library/Frameworks -F /Applications/Xcode-16.2.0.app/Contents/Developer/Platforms/WatchOS.platform/Developer/SDKs/WatchOS11.2.sdk/Developer/Library/Frameworks -no-color-diagnostics -enable-testing -g -debug-info-format\=dwarf -dwarf-version\=4 -module-cache-path /Users/admin/builder/spi-builder-workspace/.derivedData/ModuleCache.noindex -profile-generate -profile-coverage-mapping -swift-version 5 -enforce-exclusivity\=checked -Onone -D SWIFT_PACKAGE -D DEBUG -D Xcode -serialize-debugging-options -const-gather-protocols-file /Users/admin/builder/spi-builder-workspace/.derivedData/Build/Intermediates.noindex/Workflow.build/Debug-watchos/ViewEnvironmentUI.build/Objects-normal/arm64/ViewEnvironmentUI_const_extract_protocols.json -enable-experimental-feature StrictConcurrency\=targeted -enable-experimental-feature DebugDescriptionMacro -enable-experimental-feature OpaqueTypeErasure -empty-abi-descriptor -plugin-path /Applications/Xcode-16.2.0.app/Contents/Developer/Toolchains/XcodeDefault.xctoolchain/usr/lib/swift/host/plugins/testing -validate-clang-modules-once -clang-build-session-file /Users/admin/builder/spi-builder-workspace/.derivedData/ModuleCache.noindex/Session.modulevalidation -Xcc -working-directory -Xcc /Users/admin/builder/spi-builder-workspace/.swiftpm/xcode -resource-dir /Applications/Xcode-16.2.0.app/Contents/Developer/Toolchains/XcodeDefault.xctoolchain/usr/lib/swift -enable-anonymous-context-mangled-names -file-compilation-dir /Users/admin/builder/spi-builder-workspace/.swiftpm/xcode -Xcc -D_LIBCPP_HARDENING_MODE\=_LIBCPP_HARDENING_MODE_DEBUG -Xcc -ivfsstatcache -Xcc /Users/admin/builder/spi-builder-workspace/.derivedData/SDKStatCaches.noindex/watchos11.2-22S97-8cb5c683f5e64b0ecfc74e8d0065fbf6.sdkstatcache -Xcc -I/Users/admin/builder/spi-builder-workspace/.derivedData/Build/Intermediates.noindex/Workflow.build/Debug-watchos/ViewEnvironmentUI.build/swift-overrides.hmap -Xcc -I/Users/admin/builder/spi-builder-workspace/.derivedData/Build/Products/Debug-watchos/include -Xcc -I/Users/admin/builder/spi-builder-workspace/.derivedData/Build/Intermediates.noindex/Workflow.build/Debug-watchos/ViewEnvironmentUI.build/DerivedSources-normal/arm64 -Xcc -I/Users/admin/builder/spi-builder-workspace/.derivedData/Build/Intermediates.noindex/Workflow.build/Debug-watchos/ViewEnvironmentUI.build/DerivedSources/arm64 -Xcc -I/Users/admin/builder/spi-builder-workspace/.derivedData/Build/Intermediates.noindex/Workflow.build/Debug-watchos/ViewEnvironmentUI.build/DerivedSources -Xcc -DSWIFT_PACKAGE -Xcc -DDEBUG\=1 -module-name ViewEnvironmentUI -package-name spi_builder_workspace -frontend-parseable-output -disable-clang-spi -target-sdk-version 11.2 -target-sdk-name watchos11.2 -external-plugin-path /Applications/Xcode-16.2.0.app/Contents/Developer/Platforms/WatchOS.platform/Developer/usr/lib/swift/host/plugins\#/Applications/Xcode-16.2.0.app/Contents/Developer/Platforms/WatchOS.platform/Developer/usr/bin/swift-plugin-server -external-plugin-path /Applications/Xcode-16.2.0.app/Contents/Developer/Platforms/WatchOS.platform/Developer/usr/local/lib/swift/host/plugins\#/Applications/Xcode-16.2.0.app/Contents/Developer/Platforms/WatchOS.platform/Developer/usr/bin/swift-plugin-server -plugin-path /Applications/Xcode-16.2.0.app/Contents/Developer/Toolchains/XcodeDefault.xctoolchain/usr/lib/swift/host/plugins -plugin-path /Applications/Xcode-16.2.0.app/Contents/Developer/Toolchains/XcodeDefault.xctoolchain/usr/local/lib/swift/host/plugins -emit-module-doc-path /Users/admin/builder/spi-builder-workspace/.derivedData/Build/Intermediates.noindex/Workflow.build/Debug-watchos/ViewEnvironmentUI.build/Objects-normal/arm64/ViewEnvironmentUI.swiftdoc -emit-module-source-info-path /Users/admin/builder/spi-builder-workspace/.derivedData/Build/Intermediates.noindex/Workflow.build/Debug-watchos/ViewEnvironmentUI.build/Objects-normal/arm64/ViewEnvironmentUI.swiftsourceinfo -emit-objc-header-path /Users/admin/builder/spi-builder-workspace/.derivedData/Build/Intermediates.noindex/Workflow.build/Debug-watchos/ViewEnvironmentUI.build/Objects-normal/arm64/ViewEnvironmentUI-Swift.h -serialize-diagnostics-path /Users/admin/builder/spi-builder-workspace/.derivedData/Build/Intermediates.noindex/Workflow.build/Debug-watchos/ViewEnvironmentUI.build/Objects-normal/arm64/ViewEnvironmentUI-master-emit-module.dia -emit-dependencies-path /Users/admin/builder/spi-builder-workspace/.derivedData/Build/Intermediates.noindex/Workflow.build/Debug-watchos/ViewEnvironmentUI.build/Objects-normal/arm64/ViewEnvironmentUI-master-emit-module.d -o /Users/admin/builder/spi-builder-workspace/.derivedData/Build/Intermediates.noindex/Workflow.build/Debug-watchos/ViewEnvironmentUI.build/Objects-normal/arm64/ViewEnvironmentUI.swiftmodule -emit-abi-descriptor-path /Users/admin/builder/spi-builder-workspace/.derivedData/Build/Intermediates.noindex/Workflow.build/Debug-watchos/ViewEnvironmentUI.build/Objects-normal/arm64/ViewEnvironmentUI.abi.json
SwiftEmitModule normal armv7k Emitting\ module\ for\ ViewEnvironmentUI (in target 'ViewEnvironmentUI' from project 'Workflow')
    cd /Users/admin/builder/spi-builder-workspace/.swiftpm/xcode
    builtin-swiftTaskExecution -- /Applications/Xcode-16.2.0.app/Contents/Developer/Toolchains/XcodeDefault.xctoolchain/usr/bin/swift-frontend -frontend -emit-module -experimental-skip-non-inlinable-function-bodies-without-types /Users/admin/builder/spi-builder-workspace/ViewEnvironmentUI/Sources/UIView+ViewEnvironmentPropagating.swift /Users/admin/builder/spi-builder-workspace/ViewEnvironmentUI/Sources/UIViewController+ViewEnvironmentPropagating.swift /Users/admin/builder/spi-builder-workspace/ViewEnvironmentUI/Sources/ViewEnvironmentObserving.swift /Users/admin/builder/spi-builder-workspace/ViewEnvironmentUI/Sources/ViewEnvironmentPropagating.swift /Users/admin/builder/spi-builder-workspace/ViewEnvironmentUI/Sources/ViewEnvironmentPropagationNode.swift -target armv7k-apple-watchos8.0 -enable-objc-interop -stack-check -sdk /Applications/Xcode-16.2.0.app/Contents/Developer/Platforms/WatchOS.platform/Developer/SDKs/WatchOS11.2.sdk -I /Users/admin/builder/spi-builder-workspace/.derivedData/Build/Products/Debug-watchos -I /Applications/Xcode-16.2.0.app/Contents/Developer/Platforms/WatchOS.platform/Developer/usr/lib -F /Users/admin/builder/spi-builder-workspace/.derivedData/Build/Products/Debug-watchos/PackageFrameworks -F /Users/admin/builder/spi-builder-workspace/.derivedData/Build/Products/Debug-watchos -F /Applications/Xcode-16.2.0.app/Contents/Developer/Platforms/WatchOS.platform/Developer/Library/Frameworks -F /Applications/Xcode-16.2.0.app/Contents/Developer/Platforms/WatchOS.platform/Developer/SDKs/WatchOS11.2.sdk/Developer/Library/Frameworks -no-color-diagnostics -enable-testing -g -debug-info-format\=dwarf -dwarf-version\=4 -module-cache-path /Users/admin/builder/spi-builder-workspace/.derivedData/ModuleCache.noindex -profile-generate -profile-coverage-mapping -swift-version 5 -enforce-exclusivity\=checked -Onone -D SWIFT_PACKAGE -D DEBUG -D Xcode -serialize-debugging-options -const-gather-protocols-file /Users/admin/builder/spi-builder-workspace/.derivedData/Build/Intermediates.noindex/Workflow.build/Debug-watchos/ViewEnvironmentUI.build/Objects-normal/armv7k/ViewEnvironmentUI_const_extract_protocols.json -enable-experimental-feature StrictConcurrency\=targeted -enable-experimental-feature DebugDescriptionMacro -enable-experimental-feature OpaqueTypeErasure -empty-abi-descriptor -plugin-path /Applications/Xcode-16.2.0.app/Contents/Developer/Toolchains/XcodeDefault.xctoolchain/usr/lib/swift/host/plugins/testing -validate-clang-modules-once -clang-build-session-file /Users/admin/builder/spi-builder-workspace/.derivedData/ModuleCache.noindex/Session.modulevalidation -Xcc -working-directory -Xcc /Users/admin/builder/spi-builder-workspace/.swiftpm/xcode -resource-dir /Applications/Xcode-16.2.0.app/Contents/Developer/Toolchains/XcodeDefault.xctoolchain/usr/lib/swift -enable-anonymous-context-mangled-names -file-compilation-dir /Users/admin/builder/spi-builder-workspace/.swiftpm/xcode -Xcc -D_LIBCPP_HARDENING_MODE\=_LIBCPP_HARDENING_MODE_DEBUG -Xcc -ivfsstatcache -Xcc /Users/admin/builder/spi-builder-workspace/.derivedData/SDKStatCaches.noindex/watchos11.2-22S97-8cb5c683f5e64b0ecfc74e8d0065fbf6.sdkstatcache -Xcc -I/Users/admin/builder/spi-builder-workspace/.derivedData/Build/Intermediates.noindex/Workflow.build/Debug-watchos/ViewEnvironmentUI.build/swift-overrides.hmap -Xcc -I/Users/admin/builder/spi-builder-workspace/.derivedData/Build/Products/Debug-watchos/include -Xcc -I/Users/admin/builder/spi-builder-workspace/.derivedData/Build/Intermediates.noindex/Workflow.build/Debug-watchos/ViewEnvironmentUI.build/DerivedSources-normal/armv7k -Xcc -I/Users/admin/builder/spi-builder-workspace/.derivedData/Build/Intermediates.noindex/Workflow.build/Debug-watchos/ViewEnvironmentUI.build/DerivedSources/armv7k -Xcc -I/Users/admin/builder/spi-builder-workspace/.derivedData/Build/Intermediates.noindex/Workflow.build/Debug-watchos/ViewEnvironmentUI.build/DerivedSources -Xcc -DSWIFT_PACKAGE -Xcc -DDEBUG\=1 -module-name ViewEnvironmentUI -package-name spi_builder_workspace -frontend-parseable-output -disable-clang-spi -target-sdk-version 11.2 -target-sdk-name watchos11.2 -external-plugin-path /Applications/Xcode-16.2.0.app/Contents/Developer/Platforms/WatchOS.platform/Developer/usr/lib/swift/host/plugins\#/Applications/Xcode-16.2.0.app/Contents/Developer/Platforms/WatchOS.platform/Developer/usr/bin/swift-plugin-server -external-plugin-path /Applications/Xcode-16.2.0.app/Contents/Developer/Platforms/WatchOS.platform/Developer/usr/local/lib/swift/host/plugins\#/Applications/Xcode-16.2.0.app/Contents/Developer/Platforms/WatchOS.platform/Developer/usr/bin/swift-plugin-server -plugin-path /Applications/Xcode-16.2.0.app/Contents/Developer/Toolchains/XcodeDefault.xctoolchain/usr/lib/swift/host/plugins -plugin-path /Applications/Xcode-16.2.0.app/Contents/Developer/Toolchains/XcodeDefault.xctoolchain/usr/local/lib/swift/host/plugins -emit-module-doc-path /Users/admin/builder/spi-builder-workspace/.derivedData/Build/Intermediates.noindex/Workflow.build/Debug-watchos/ViewEnvironmentUI.build/Objects-normal/armv7k/ViewEnvironmentUI.swiftdoc -emit-module-source-info-path /Users/admin/builder/spi-builder-workspace/.derivedData/Build/Intermediates.noindex/Workflow.build/Debug-watchos/ViewEnvironmentUI.build/Objects-normal/armv7k/ViewEnvironmentUI.swiftsourceinfo -emit-objc-header-path /Users/admin/builder/spi-builder-workspace/.derivedData/Build/Intermediates.noindex/Workflow.build/Debug-watchos/ViewEnvironmentUI.build/Objects-normal/armv7k/ViewEnvironmentUI-Swift.h -serialize-diagnostics-path /Users/admin/builder/spi-builder-workspace/.derivedData/Build/Intermediates.noindex/Workflow.build/Debug-watchos/ViewEnvironmentUI.build/Objects-normal/armv7k/ViewEnvironmentUI-master-emit-module.dia -emit-dependencies-path /Users/admin/builder/spi-builder-workspace/.derivedData/Build/Intermediates.noindex/Workflow.build/Debug-watchos/ViewEnvironmentUI.build/Objects-normal/armv7k/ViewEnvironmentUI-master-emit-module.d -o /Users/admin/builder/spi-builder-workspace/.derivedData/Build/Intermediates.noindex/Workflow.build/Debug-watchos/ViewEnvironmentUI.build/Objects-normal/armv7k/ViewEnvironmentUI.swiftmodule -emit-abi-descriptor-path /Users/admin/builder/spi-builder-workspace/.derivedData/Build/Intermediates.noindex/Workflow.build/Debug-watchos/ViewEnvironmentUI.build/Objects-normal/armv7k/ViewEnvironmentUI.abi.json
EmitSwiftModule normal armv7k (in target 'ViewEnvironmentUI' from project 'Workflow')
    cd /Users/admin/builder/spi-builder-workspace/.swiftpm/xcode
    /Applications/Xcode-16.2.0.app/Contents/Developer/Toolchains/XcodeDefault.xctoolchain/usr/bin/swift-frontend -emit-module -experimental-skip-non-inlinable-function-bodies-without-types /Users/admin/builder/spi-builder-workspace/ViewEnvironmentUI/Sources/UIView+ViewEnvironmentPropagating.swift /Users/admin/builder/spi-builder-workspace/ViewEnvironmentUI/Sources/UIViewController+ViewEnvironmentPropagating.swift /Users/admin/builder/spi-builder-workspace/ViewEnvironmentUI/Sources/ViewEnvironmentObserving.swift /Users/admin/builder/spi-builder-workspace/ViewEnvironmentUI/Sources/ViewEnvironmentPropagating.swift /Users/admin/builder/spi-builder-workspace/ViewEnvironmentUI/Sources/ViewEnvironmentPropagationNode.swift -target armv7k-apple-watchos8.0 -enable-objc-interop -stack-check -sdk /Applications/Xcode-16.2.0.app/Contents/Developer/Platforms/WatchOS.platform/Developer/SDKs/WatchOS11.2.sdk -I /Users/admin/builder/spi-builder-workspace/.derivedData/Build/Products/Debug-watchos -I /Applications/Xcode-16.2.0.app/Contents/Developer/Platforms/WatchOS.platform/Developer/usr/lib -F /Users/admin/builder/spi-builder-workspace/.derivedData/Build/Products/Debug-watchos/PackageFrameworks -F /Users/admin/builder/spi-builder-workspace/.derivedData/Build/Products/Debug-watchos -F /Applications/Xcode-16.2.0.app/Contents/Developer/Platforms/WatchOS.platform/Developer/Library/Frameworks -F /Applications/Xcode-16.2.0.app/Contents/Developer/Platforms/WatchOS.platform/Developer/SDKs/WatchOS11.2.sdk/Developer/Library/Frameworks -no-color-diagnostics -enable-testing -g -debug-info-format\=dwarf -dwarf-version\=4 -module-cache-path /Users/admin/builder/spi-builder-workspace/.derivedData/ModuleCache.noindex -profile-generate -profile-coverage-mapping -swift-version 5 -enforce-exclusivity\=checked -Onone -D SWIFT_PACKAGE -D DEBUG -D Xcode -serialize-debugging-options -const-gather-protocols-file /Users/admin/builder/spi-builder-workspace/.derivedData/Build/Intermediates.noindex/Workflow.build/Debug-watchos/ViewEnvironmentUI.build/Objects-normal/armv7k/ViewEnvironmentUI_const_extract_protocols.json -enable-experimental-feature StrictConcurrency\=targeted -enable-experimental-feature DebugDescriptionMacro -enable-experimental-feature OpaqueTypeErasure -empty-abi-descriptor -plugin-path /Applications/Xcode-16.2.0.app/Contents/Developer/Toolchains/XcodeDefault.xctoolchain/usr/lib/swift/host/plugins/testing -validate-clang-modules-once -clang-build-session-file /Users/admin/builder/spi-builder-workspace/.derivedData/ModuleCache.noindex/Session.modulevalidation -Xcc -working-directory -Xcc /Users/admin/builder/spi-builder-workspace/.swiftpm/xcode -resource-dir /Applications/Xcode-16.2.0.app/Contents/Developer/Toolchains/XcodeDefault.xctoolchain/usr/lib/swift -enable-anonymous-context-mangled-names -file-compilation-dir /Users/admin/builder/spi-builder-workspace/.swiftpm/xcode -Xcc -D_LIBCPP_HARDENING_MODE\=_LIBCPP_HARDENING_MODE_DEBUG -Xcc -ivfsstatcache -Xcc /Users/admin/builder/spi-builder-workspace/.derivedData/SDKStatCaches.noindex/watchos11.2-22S97-8cb5c683f5e64b0ecfc74e8d0065fbf6.sdkstatcache -Xcc -I/Users/admin/builder/spi-builder-workspace/.derivedData/Build/Intermediates.noindex/Workflow.build/Debug-watchos/ViewEnvironmentUI.build/swift-overrides.hmap -Xcc -I/Users/admin/builder/spi-builder-workspace/.derivedData/Build/Products/Debug-watchos/include -Xcc -I/Users/admin/builder/spi-builder-workspace/.derivedData/Build/Intermediates.noindex/Workflow.build/Debug-watchos/ViewEnvironmentUI.build/DerivedSources-normal/armv7k -Xcc -I/Users/admin/builder/spi-builder-workspace/.derivedData/Build/Intermediates.noindex/Workflow.build/Debug-watchos/ViewEnvironmentUI.build/DerivedSources/armv7k -Xcc -I/Users/admin/builder/spi-builder-workspace/.derivedData/Build/Intermediates.noindex/Workflow.build/Debug-watchos/ViewEnvironmentUI.build/DerivedSources -Xcc -DSWIFT_PACKAGE -Xcc -DDEBUG\=1 -module-name ViewEnvironmentUI -package-name spi_builder_workspace -frontend-parseable-output -disable-clang-spi -target-sdk-version 11.2 -target-sdk-name watchos11.2 -external-plugin-path /Applications/Xcode-16.2.0.app/Contents/Developer/Platforms/WatchOS.platform/Developer/usr/lib/swift/host/plugins\#/Applications/Xcode-16.2.0.app/Contents/Developer/Platforms/WatchOS.platform/Developer/usr/bin/swift-plugin-server -external-plugin-path /Applications/Xcode-16.2.0.app/Contents/Developer/Platforms/WatchOS.platform/Developer/usr/local/lib/swift/host/plugins\#/Applications/Xcode-16.2.0.app/Contents/Developer/Platforms/WatchOS.platform/Developer/usr/bin/swift-plugin-server -plugin-path /Applications/Xcode-16.2.0.app/Contents/Developer/Toolchains/XcodeDefault.xctoolchain/usr/lib/swift/host/plugins -plugin-path /Applications/Xcode-16.2.0.app/Contents/Developer/Toolchains/XcodeDefault.xctoolchain/usr/local/lib/swift/host/plugins -emit-module-doc-path /Users/admin/builder/spi-builder-workspace/.derivedData/Build/Intermediates.noindex/Workflow.build/Debug-watchos/ViewEnvironmentUI.build/Objects-normal/armv7k/ViewEnvironmentUI.swiftdoc -emit-module-source-info-path /Users/admin/builder/spi-builder-workspace/.derivedData/Build/Intermediates.noindex/Workflow.build/Debug-watchos/ViewEnvironmentUI.build/Objects-normal/armv7k/ViewEnvironmentUI.swiftsourceinfo -emit-objc-header-path /Users/admin/builder/spi-builder-workspace/.derivedData/Build/Intermediates.noindex/Workflow.build/Debug-watchos/ViewEnvironmentUI.build/Objects-normal/armv7k/ViewEnvironmentUI-Swift.h -serialize-diagnostics-path /Users/admin/builder/spi-builder-workspace/.derivedData/Build/Intermediates.noindex/Workflow.build/Debug-watchos/ViewEnvironmentUI.build/Objects-normal/armv7k/ViewEnvironmentUI-master-emit-module.dia -emit-dependencies-path /Users/admin/builder/spi-builder-workspace/.derivedData/Build/Intermediates.noindex/Workflow.build/Debug-watchos/ViewEnvironmentUI.build/Objects-normal/armv7k/ViewEnvironmentUI-master-emit-module.d -o /Users/admin/builder/spi-builder-workspace/.derivedData/Build/Intermediates.noindex/Workflow.build/Debug-watchos/ViewEnvironmentUI.build/Objects-normal/armv7k/ViewEnvironmentUI.swiftmodule -emit-abi-descriptor-path /Users/admin/builder/spi-builder-workspace/.derivedData/Build/Intermediates.noindex/Workflow.build/Debug-watchos/ViewEnvironmentUI.build/Objects-normal/armv7k/ViewEnvironmentUI.abi.json
/Users/admin/builder/spi-builder-workspace/ViewEnvironmentUI/Sources/UIView+ViewEnvironmentPropagating.swift:22:11: error: cannot find type 'UIView' in scope
extension UIView: ViewEnvironmentPropagating {
          ^~~~~~
/Applications/Xcode-16.2.0.app/Contents/Developer/Platforms/WatchOS.platform/Developer/SDKs/WatchOS11.2.sdk/System/Library/Frameworks/UIKit.framework/Headers/NSTextAttachment.h:23:1: note: interface 'UIView' forward declared here
@class UIView;
^
/Users/admin/builder/spi-builder-workspace/ViewEnvironmentUI/Sources/UIViewController+ViewEnvironmentPropagating.swift:22:11: error: cannot find type 'UIViewController' in scope
extension UIViewController: ViewEnvironmentPropagating {
          ^~~~~~~~~~~~~~~~
SwiftEmitModule normal armv7k Emitting\ module\ for\ WorkflowReactiveSwift (in target 'WorkflowReactiveSwift' from project 'Workflow')
    cd /Users/admin/builder/spi-builder-workspace/.swiftpm/xcode
    builtin-swiftTaskExecution -- /Applications/Xcode-16.2.0.app/Contents/Developer/Toolchains/XcodeDefault.xctoolchain/usr/bin/swift-frontend -frontend -emit-module -experimental-skip-non-inlinable-function-bodies-without-types /Users/admin/builder/spi-builder-workspace/WorkflowReactiveSwift/Sources/Logger.swift /Users/admin/builder/spi-builder-workspace/WorkflowReactiveSwift/Sources/QueueScheduler+Workflow.swift /Users/admin/builder/spi-builder-workspace/WorkflowReactiveSwift/Sources/SignalProducerWorkflow.swift /Users/admin/builder/spi-builder-workspace/WorkflowReactiveSwift/Sources/SignalWorker.swift /Users/admin/builder/spi-builder-workspace/WorkflowReactiveSwift/Sources/Worker.swift -target armv7k-apple-watchos8.0 -enable-objc-interop -stack-check -sdk /Applications/Xcode-16.2.0.app/Contents/Developer/Platforms/WatchOS.platform/Developer/SDKs/WatchOS11.2.sdk -I /Users/admin/builder/spi-builder-workspace/.derivedData/Build/Products/Debug-watchos -I /Applications/Xcode-16.2.0.app/Contents/Developer/Platforms/WatchOS.platform/Developer/usr/lib -F /Users/admin/builder/spi-builder-workspace/.derivedData/Build/Products/Debug-watchos/PackageFrameworks -F /Users/admin/builder/spi-builder-workspace/.derivedData/Build/Products/Debug-watchos/PackageFrameworks -F /Users/admin/builder/spi-builder-workspace/.derivedData/Build/Products/Debug-watchos -F /Applications/Xcode-16.2.0.app/Contents/Developer/Platforms/WatchOS.platform/Developer/Library/Frameworks -F /Applications/Xcode-16.2.0.app/Contents/Developer/Platforms/WatchOS.platform/Developer/SDKs/WatchOS11.2.sdk/Developer/Library/Frameworks -no-color-diagnostics -enable-testing -g -debug-info-format\=dwarf -dwarf-version\=4 -module-cache-path /Users/admin/builder/spi-builder-workspace/.derivedData/ModuleCache.noindex -profile-generate -profile-coverage-mapping -swift-version 5 -enforce-exclusivity\=checked -Onone -D SWIFT_PACKAGE -D DEBUG -D Xcode -serialize-debugging-options -const-gather-protocols-file /Users/admin/builder/spi-builder-workspace/.derivedData/Build/Intermediates.noindex/Workflow.build/Debug-watchos/WorkflowReactiveSwift.build/Objects-normal/armv7k/WorkflowReactiveSwift_const_extract_protocols.json -enable-experimental-feature StrictConcurrency\=targeted -enable-experimental-feature DebugDescriptionMacro -enable-experimental-feature OpaqueTypeErasure -empty-abi-descriptor -plugin-path /Applications/Xcode-16.2.0.app/Contents/Developer/Toolchains/XcodeDefault.xctoolchain/usr/lib/swift/host/plugins/testing -validate-clang-modules-once -clang-build-session-file /Users/admin/builder/spi-builder-workspace/.derivedData/ModuleCache.noindex/Session.modulevalidation -Xcc -working-directory -Xcc /Users/admin/builder/spi-builder-workspace/.swiftpm/xcode -resource-dir /Applications/Xcode-16.2.0.app/Contents/Developer/Toolchains/XcodeDefault.xctoolchain/usr/lib/swift -enable-anonymous-context-mangled-names -file-compilation-dir /Users/admin/builder/spi-builder-workspace/.swiftpm/xcode -Xcc -D_LIBCPP_HARDENING_MODE\=_LIBCPP_HARDENING_MODE_DEBUG -Xcc -ivfsstatcache -Xcc /Users/admin/builder/spi-builder-workspace/.derivedData/SDKStatCaches.noindex/watchos11.2-22S97-8cb5c683f5e64b0ecfc74e8d0065fbf6.sdkstatcache -Xcc -I/Users/admin/builder/spi-builder-workspace/.derivedData/Build/Intermediates.noindex/Workflow.build/Debug-watchos/WorkflowReactiveSwift.build/swift-overrides.hmap -Xcc -I/Users/admin/builder/spi-builder-workspace/.derivedData/Build/Products/Debug-watchos/include -Xcc -I/Users/admin/builder/spi-builder-workspace/.derivedData/Build/Intermediates.noindex/Workflow.build/Debug-watchos/WorkflowReactiveSwift.build/DerivedSources-normal/armv7k -Xcc -I/Users/admin/builder/spi-builder-workspace/.derivedData/Build/Intermediates.noindex/Workflow.build/Debug-watchos/WorkflowReactiveSwift.build/DerivedSources/armv7k -Xcc -I/Users/admin/builder/spi-builder-workspace/.derivedData/Build/Intermediates.noindex/Workflow.build/Debug-watchos/WorkflowReactiveSwift.build/DerivedSources -Xcc -DSWIFT_PACKAGE -Xcc -DDEBUG\=1 -module-name WorkflowReactiveSwift -package-name spi_builder_workspace -frontend-parseable-output -disable-clang-spi -target-sdk-version 11.2 -target-sdk-name watchos11.2 -external-plugin-path /Applications/Xcode-16.2.0.app/Contents/Developer/Platforms/WatchOS.platform/Developer/usr/lib/swift/host/plugins\#/Applications/Xcode-16.2.0.app/Contents/Developer/Platforms/WatchOS.platform/Developer/usr/bin/swift-plugin-server -external-plugin-path /Applications/Xcode-16.2.0.app/Contents/Developer/Platforms/WatchOS.platform/Developer/usr/local/lib/swift/host/plugins\#/Applications/Xcode-16.2.0.app/Contents/Developer/Platforms/WatchOS.platform/Developer/usr/bin/swift-plugin-server -plugin-path /Applications/Xcode-16.2.0.app/Contents/Developer/Toolchains/XcodeDefault.xctoolchain/usr/lib/swift/host/plugins -plugin-path /Applications/Xcode-16.2.0.app/Contents/Developer/Toolchains/XcodeDefault.xctoolchain/usr/local/lib/swift/host/plugins -emit-module-doc-path /Users/admin/builder/spi-builder-workspace/.derivedData/Build/Intermediates.noindex/Workflow.build/Debug-watchos/WorkflowReactiveSwift.build/Objects-normal/armv7k/WorkflowReactiveSwift.swiftdoc -emit-module-source-info-path /Users/admin/builder/spi-builder-workspace/.derivedData/Build/Intermediates.noindex/Workflow.build/Debug-watchos/WorkflowReactiveSwift.build/Objects-normal/armv7k/WorkflowReactiveSwift.swiftsourceinfo -emit-objc-header-path /Users/admin/builder/spi-builder-workspace/.derivedData/Build/Intermediates.noindex/Workflow.build/Debug-watchos/WorkflowReactiveSwift.build/Objects-normal/armv7k/WorkflowReactiveSwift-Swift.h -serialize-diagnostics-path /Users/admin/builder/spi-builder-workspace/.derivedData/Build/Intermediates.noindex/Workflow.build/Debug-watchos/WorkflowReactiveSwift.build/Objects-normal/armv7k/WorkflowReactiveSwift-master-emit-module.dia -emit-dependencies-path /Users/admin/builder/spi-builder-workspace/.derivedData/Build/Intermediates.noindex/Workflow.build/Debug-watchos/WorkflowReactiveSwift.build/Objects-normal/armv7k/WorkflowReactiveSwift-master-emit-module.d -o /Users/admin/builder/spi-builder-workspace/.derivedData/Build/Intermediates.noindex/Workflow.build/Debug-watchos/WorkflowReactiveSwift.build/Objects-normal/armv7k/WorkflowReactiveSwift.swiftmodule -emit-abi-descriptor-path /Users/admin/builder/spi-builder-workspace/.derivedData/Build/Intermediates.noindex/Workflow.build/Debug-watchos/WorkflowReactiveSwift.build/Objects-normal/armv7k/WorkflowReactiveSwift.abi.json
EmitSwiftModule normal armv7k (in target 'WorkflowReactiveSwift' from project 'Workflow')
    cd /Users/admin/builder/spi-builder-workspace/.swiftpm/xcode
    /Applications/Xcode-16.2.0.app/Contents/Developer/Toolchains/XcodeDefault.xctoolchain/usr/bin/swift-frontend -emit-module -experimental-skip-non-inlinable-function-bodies-without-types /Users/admin/builder/spi-builder-workspace/WorkflowReactiveSwift/Sources/Logger.swift /Users/admin/builder/spi-builder-workspace/WorkflowReactiveSwift/Sources/QueueScheduler+Workflow.swift /Users/admin/builder/spi-builder-workspace/WorkflowReactiveSwift/Sources/SignalProducerWorkflow.swift /Users/admin/builder/spi-builder-workspace/WorkflowReactiveSwift/Sources/SignalWorker.swift /Users/admin/builder/spi-builder-workspace/WorkflowReactiveSwift/Sources/Worker.swift -target armv7k-apple-watchos8.0 -enable-objc-interop -stack-check -sdk /Applications/Xcode-16.2.0.app/Contents/Developer/Platforms/WatchOS.platform/Developer/SDKs/WatchOS11.2.sdk -I /Users/admin/builder/spi-builder-workspace/.derivedData/Build/Products/Debug-watchos -I /Applications/Xcode-16.2.0.app/Contents/Developer/Platforms/WatchOS.platform/Developer/usr/lib -F /Users/admin/builder/spi-builder-workspace/.derivedData/Build/Products/Debug-watchos/PackageFrameworks -F /Users/admin/builder/spi-builder-workspace/.derivedData/Build/Products/Debug-watchos/PackageFrameworks -F /Users/admin/builder/spi-builder-workspace/.derivedData/Build/Products/Debug-watchos -F /Applications/Xcode-16.2.0.app/Contents/Developer/Platforms/WatchOS.platform/Developer/Library/Frameworks -F /Applications/Xcode-16.2.0.app/Contents/Developer/Platforms/WatchOS.platform/Developer/SDKs/WatchOS11.2.sdk/Developer/Library/Frameworks -no-color-diagnostics -enable-testing -g -debug-info-format\=dwarf -dwarf-version\=4 -module-cache-path /Users/admin/builder/spi-builder-workspace/.derivedData/ModuleCache.noindex -profile-generate -profile-coverage-mapping -swift-version 5 -enforce-exclusivity\=checked -Onone -D SWIFT_PACKAGE -D DEBUG -D Xcode -serialize-debugging-options -const-gather-protocols-file /Users/admin/builder/spi-builder-workspace/.derivedData/Build/Intermediates.noindex/Workflow.build/Debug-watchos/WorkflowReactiveSwift.build/Objects-normal/armv7k/WorkflowReactiveSwift_const_extract_protocols.json -enable-experimental-feature StrictConcurrency\=targeted -enable-experimental-feature DebugDescriptionMacro -enable-experimental-feature OpaqueTypeErasure -empty-abi-descriptor -plugin-path /Applications/Xcode-16.2.0.app/Contents/Developer/Toolchains/XcodeDefault.xctoolchain/usr/lib/swift/host/plugins/testing -validate-clang-modules-once -clang-build-session-file /Users/admin/builder/spi-builder-workspace/.derivedData/ModuleCache.noindex/Session.modulevalidation -Xcc -working-directory -Xcc /Users/admin/builder/spi-builder-workspace/.swiftpm/xcode -resource-dir /Applications/Xcode-16.2.0.app/Contents/Developer/Toolchains/XcodeDefault.xctoolchain/usr/lib/swift -enable-anonymous-context-mangled-names -file-compilation-dir /Users/admin/builder/spi-builder-workspace/.swiftpm/xcode -Xcc -D_LIBCPP_HARDENING_MODE\=_LIBCPP_HARDENING_MODE_DEBUG -Xcc -ivfsstatcache -Xcc /Users/admin/builder/spi-builder-workspace/.derivedData/SDKStatCaches.noindex/watchos11.2-22S97-8cb5c683f5e64b0ecfc74e8d0065fbf6.sdkstatcache -Xcc -I/Users/admin/builder/spi-builder-workspace/.derivedData/Build/Intermediates.noindex/Workflow.build/Debug-watchos/WorkflowReactiveSwift.build/swift-overrides.hmap -Xcc -I/Users/admin/builder/spi-builder-workspace/.derivedData/Build/Products/Debug-watchos/include -Xcc -I/Users/admin/builder/spi-builder-workspace/.derivedData/Build/Intermediates.noindex/Workflow.build/Debug-watchos/WorkflowReactiveSwift.build/DerivedSources-normal/armv7k -Xcc -I/Users/admin/builder/spi-builder-workspace/.derivedData/Build/Intermediates.noindex/Workflow.build/Debug-watchos/WorkflowReactiveSwift.build/DerivedSources/armv7k -Xcc -I/Users/admin/builder/spi-builder-workspace/.derivedData/Build/Intermediates.noindex/Workflow.build/Debug-watchos/WorkflowReactiveSwift.build/DerivedSources -Xcc -DSWIFT_PACKAGE -Xcc -DDEBUG\=1 -module-name WorkflowReactiveSwift -package-name spi_builder_workspace -frontend-parseable-output -disable-clang-spi -target-sdk-version 11.2 -target-sdk-name watchos11.2 -external-plugin-path /Applications/Xcode-16.2.0.app/Contents/Developer/Platforms/WatchOS.platform/Developer/usr/lib/swift/host/plugins\#/Applications/Xcode-16.2.0.app/Contents/Developer/Platforms/WatchOS.platform/Developer/usr/bin/swift-plugin-server -external-plugin-path /Applications/Xcode-16.2.0.app/Contents/Developer/Platforms/WatchOS.platform/Developer/usr/local/lib/swift/host/plugins\#/Applications/Xcode-16.2.0.app/Contents/Developer/Platforms/WatchOS.platform/Developer/usr/bin/swift-plugin-server -plugin-path /Applications/Xcode-16.2.0.app/Contents/Developer/Toolchains/XcodeDefault.xctoolchain/usr/lib/swift/host/plugins -plugin-path /Applications/Xcode-16.2.0.app/Contents/Developer/Toolchains/XcodeDefault.xctoolchain/usr/local/lib/swift/host/plugins -emit-module-doc-path /Users/admin/builder/spi-builder-workspace/.derivedData/Build/Intermediates.noindex/Workflow.build/Debug-watchos/WorkflowReactiveSwift.build/Objects-normal/armv7k/WorkflowReactiveSwift.swiftdoc -emit-module-source-info-path /Users/admin/builder/spi-builder-workspace/.derivedData/Build/Intermediates.noindex/Workflow.build/Debug-watchos/WorkflowReactiveSwift.build/Objects-normal/armv7k/WorkflowReactiveSwift.swiftsourceinfo -emit-objc-header-path /Users/admin/builder/spi-builder-workspace/.derivedData/Build/Intermediates.noindex/Workflow.build/Debug-watchos/WorkflowReactiveSwift.build/Objects-normal/armv7k/WorkflowReactiveSwift-Swift.h -serialize-diagnostics-path /Users/admin/builder/spi-builder-workspace/.derivedData/Build/Intermediates.noindex/Workflow.build/Debug-watchos/WorkflowReactiveSwift.build/Objects-normal/armv7k/WorkflowReactiveSwift-master-emit-module.dia -emit-dependencies-path /Users/admin/builder/spi-builder-workspace/.derivedData/Build/Intermediates.noindex/Workflow.build/Debug-watchos/WorkflowReactiveSwift.build/Objects-normal/armv7k/WorkflowReactiveSwift-master-emit-module.d -o /Users/admin/builder/spi-builder-workspace/.derivedData/Build/Intermediates.noindex/Workflow.build/Debug-watchos/WorkflowReactiveSwift.build/Objects-normal/armv7k/WorkflowReactiveSwift.swiftmodule -emit-abi-descriptor-path /Users/admin/builder/spi-builder-workspace/.derivedData/Build/Intermediates.noindex/Workflow.build/Debug-watchos/WorkflowReactiveSwift.build/Objects-normal/armv7k/WorkflowReactiveSwift.abi.json
SwiftEmitModule normal arm64_32 Emitting\ module\ for\ WorkflowReactiveSwift (in target 'WorkflowReactiveSwift' from project 'Workflow')
    cd /Users/admin/builder/spi-builder-workspace/.swiftpm/xcode
    builtin-swiftTaskExecution -- /Applications/Xcode-16.2.0.app/Contents/Developer/Toolchains/XcodeDefault.xctoolchain/usr/bin/swift-frontend -frontend -emit-module -experimental-skip-non-inlinable-function-bodies-without-types /Users/admin/builder/spi-builder-workspace/WorkflowReactiveSwift/Sources/Logger.swift /Users/admin/builder/spi-builder-workspace/WorkflowReactiveSwift/Sources/QueueScheduler+Workflow.swift /Users/admin/builder/spi-builder-workspace/WorkflowReactiveSwift/Sources/SignalProducerWorkflow.swift /Users/admin/builder/spi-builder-workspace/WorkflowReactiveSwift/Sources/SignalWorker.swift /Users/admin/builder/spi-builder-workspace/WorkflowReactiveSwift/Sources/Worker.swift -target arm64_32-apple-watchos8.0 -enable-objc-interop -sdk /Applications/Xcode-16.2.0.app/Contents/Developer/Platforms/WatchOS.platform/Developer/SDKs/WatchOS11.2.sdk -I /Users/admin/builder/spi-builder-workspace/.derivedData/Build/Products/Debug-watchos -I /Applications/Xcode-16.2.0.app/Contents/Developer/Platforms/WatchOS.platform/Developer/usr/lib -F /Users/admin/builder/spi-builder-workspace/.derivedData/Build/Products/Debug-watchos/PackageFrameworks -F /Users/admin/builder/spi-builder-workspace/.derivedData/Build/Products/Debug-watchos/PackageFrameworks -F /Users/admin/builder/spi-builder-workspace/.derivedData/Build/Products/Debug-watchos -F /Applications/Xcode-16.2.0.app/Contents/Developer/Platforms/WatchOS.platform/Developer/Library/Frameworks -F /Applications/Xcode-16.2.0.app/Contents/Developer/Platforms/WatchOS.platform/Developer/SDKs/WatchOS11.2.sdk/Developer/Library/Frameworks -no-color-diagnostics -enable-testing -g -debug-info-format\=dwarf -dwarf-version\=4 -module-cache-path /Users/admin/builder/spi-builder-workspace/.derivedData/ModuleCache.noindex -profile-generate -profile-coverage-mapping -swift-version 5 -enforce-exclusivity\=checked -Onone -D SWIFT_PACKAGE -D DEBUG -D Xcode -serialize-debugging-options -const-gather-protocols-file /Users/admin/builder/spi-builder-workspace/.derivedData/Build/Intermediates.noindex/Workflow.build/Debug-watchos/WorkflowReactiveSwift.build/Objects-normal/arm64_32/WorkflowReactiveSwift_const_extract_protocols.json -enable-experimental-feature StrictConcurrency\=targeted -enable-experimental-feature DebugDescriptionMacro -enable-experimental-feature OpaqueTypeErasure -empty-abi-descriptor -plugin-path /Applications/Xcode-16.2.0.app/Contents/Developer/Toolchains/XcodeDefault.xctoolchain/usr/lib/swift/host/plugins/testing -validate-clang-modules-once -clang-build-session-file /Users/admin/builder/spi-builder-workspace/.derivedData/ModuleCache.noindex/Session.modulevalidation -Xcc -working-directory -Xcc /Users/admin/builder/spi-builder-workspace/.swiftpm/xcode -resource-dir /Applications/Xcode-16.2.0.app/Contents/Developer/Toolchains/XcodeDefault.xctoolchain/usr/lib/swift -enable-anonymous-context-mangled-names -file-compilation-dir /Users/admin/builder/spi-builder-workspace/.swiftpm/xcode -Xcc -D_LIBCPP_HARDENING_MODE\=_LIBCPP_HARDENING_MODE_DEBUG -Xcc -ivfsstatcache -Xcc /Users/admin/builder/spi-builder-workspace/.derivedData/SDKStatCaches.noindex/watchos11.2-22S97-8cb5c683f5e64b0ecfc74e8d0065fbf6.sdkstatcache -Xcc -I/Users/admin/builder/spi-builder-workspace/.derivedData/Build/Intermediates.noindex/Workflow.build/Debug-watchos/WorkflowReactiveSwift.build/swift-overrides.hmap -Xcc -I/Users/admin/builder/spi-builder-workspace/.derivedData/Build/Products/Debug-watchos/include -Xcc -I/Users/admin/builder/spi-builder-workspace/.derivedData/Build/Intermediates.noindex/Workflow.build/Debug-watchos/WorkflowReactiveSwift.build/DerivedSources-normal/arm64_32 -Xcc -I/Users/admin/builder/spi-builder-workspace/.derivedData/Build/Intermediates.noindex/Workflow.build/Debug-watchos/WorkflowReactiveSwift.build/DerivedSources/arm64_32 -Xcc -I/Users/admin/builder/spi-builder-workspace/.derivedData/Build/Intermediates.noindex/Workflow.build/Debug-watchos/WorkflowReactiveSwift.build/DerivedSources -Xcc -DSWIFT_PACKAGE -Xcc -DDEBUG\=1 -module-name WorkflowReactiveSwift -package-name spi_builder_workspace -frontend-parseable-output -disable-clang-spi -target-sdk-version 11.2 -target-sdk-name watchos11.2 -external-plugin-path /Applications/Xcode-16.2.0.app/Contents/Developer/Platforms/WatchOS.platform/Developer/usr/lib/swift/host/plugins\#/Applications/Xcode-16.2.0.app/Contents/Developer/Platforms/WatchOS.platform/Developer/usr/bin/swift-plugin-server -external-plugin-path /Applications/Xcode-16.2.0.app/Contents/Developer/Platforms/WatchOS.platform/Developer/usr/local/lib/swift/host/plugins\#/Applications/Xcode-16.2.0.app/Contents/Developer/Platforms/WatchOS.platform/Developer/usr/bin/swift-plugin-server -plugin-path /Applications/Xcode-16.2.0.app/Contents/Developer/Toolchains/XcodeDefault.xctoolchain/usr/lib/swift/host/plugins -plugin-path /Applications/Xcode-16.2.0.app/Contents/Developer/Toolchains/XcodeDefault.xctoolchain/usr/local/lib/swift/host/plugins -emit-module-doc-path /Users/admin/builder/spi-builder-workspace/.derivedData/Build/Intermediates.noindex/Workflow.build/Debug-watchos/WorkflowReactiveSwift.build/Objects-normal/arm64_32/WorkflowReactiveSwift.swiftdoc -emit-module-source-info-path /Users/admin/builder/spi-builder-workspace/.derivedData/Build/Intermediates.noindex/Workflow.build/Debug-watchos/WorkflowReactiveSwift.build/Objects-normal/arm64_32/WorkflowReactiveSwift.swiftsourceinfo -emit-objc-header-path /Users/admin/builder/spi-builder-workspace/.derivedData/Build/Intermediates.noindex/Workflow.build/Debug-watchos/WorkflowReactiveSwift.build/Objects-normal/arm64_32/WorkflowReactiveSwift-Swift.h -serialize-diagnostics-path /Users/admin/builder/spi-builder-workspace/.derivedData/Build/Intermediates.noindex/Workflow.build/Debug-watchos/WorkflowReactiveSwift.build/Objects-normal/arm64_32/WorkflowReactiveSwift-master-emit-module.dia -emit-dependencies-path /Users/admin/builder/spi-builder-workspace/.derivedData/Build/Intermediates.noindex/Workflow.build/Debug-watchos/WorkflowReactiveSwift.build/Objects-normal/arm64_32/WorkflowReactiveSwift-master-emit-module.d -o /Users/admin/builder/spi-builder-workspace/.derivedData/Build/Intermediates.noindex/Workflow.build/Debug-watchos/WorkflowReactiveSwift.build/Objects-normal/arm64_32/WorkflowReactiveSwift.swiftmodule -emit-abi-descriptor-path /Users/admin/builder/spi-builder-workspace/.derivedData/Build/Intermediates.noindex/Workflow.build/Debug-watchos/WorkflowReactiveSwift.build/Objects-normal/arm64_32/WorkflowReactiveSwift.abi.json
EmitSwiftModule normal arm64_32 (in target 'WorkflowReactiveSwift' from project 'Workflow')
    cd /Users/admin/builder/spi-builder-workspace/.swiftpm/xcode
    /Applications/Xcode-16.2.0.app/Contents/Developer/Toolchains/XcodeDefault.xctoolchain/usr/bin/swift-frontend -emit-module -experimental-skip-non-inlinable-function-bodies-without-types /Users/admin/builder/spi-builder-workspace/WorkflowReactiveSwift/Sources/Logger.swift /Users/admin/builder/spi-builder-workspace/WorkflowReactiveSwift/Sources/QueueScheduler+Workflow.swift /Users/admin/builder/spi-builder-workspace/WorkflowReactiveSwift/Sources/SignalProducerWorkflow.swift /Users/admin/builder/spi-builder-workspace/WorkflowReactiveSwift/Sources/SignalWorker.swift /Users/admin/builder/spi-builder-workspace/WorkflowReactiveSwift/Sources/Worker.swift -target arm64_32-apple-watchos8.0 -enable-objc-interop -sdk /Applications/Xcode-16.2.0.app/Contents/Developer/Platforms/WatchOS.platform/Developer/SDKs/WatchOS11.2.sdk -I /Users/admin/builder/spi-builder-workspace/.derivedData/Build/Products/Debug-watchos -I /Applications/Xcode-16.2.0.app/Contents/Developer/Platforms/WatchOS.platform/Developer/usr/lib -F /Users/admin/builder/spi-builder-workspace/.derivedData/Build/Products/Debug-watchos/PackageFrameworks -F /Users/admin/builder/spi-builder-workspace/.derivedData/Build/Products/Debug-watchos/PackageFrameworks -F /Users/admin/builder/spi-builder-workspace/.derivedData/Build/Products/Debug-watchos -F /Applications/Xcode-16.2.0.app/Contents/Developer/Platforms/WatchOS.platform/Developer/Library/Frameworks -F /Applications/Xcode-16.2.0.app/Contents/Developer/Platforms/WatchOS.platform/Developer/SDKs/WatchOS11.2.sdk/Developer/Library/Frameworks -no-color-diagnostics -enable-testing -g -debug-info-format\=dwarf -dwarf-version\=4 -module-cache-path /Users/admin/builder/spi-builder-workspace/.derivedData/ModuleCache.noindex -profile-generate -profile-coverage-mapping -swift-version 5 -enforce-exclusivity\=checked -Onone -D SWIFT_PACKAGE -D DEBUG -D Xcode -serialize-debugging-options -const-gather-protocols-file /Users/admin/builder/spi-builder-workspace/.derivedData/Build/Intermediates.noindex/Workflow.build/Debug-watchos/WorkflowReactiveSwift.build/Objects-normal/arm64_32/WorkflowReactiveSwift_const_extract_protocols.json -enable-experimental-feature StrictConcurrency\=targeted -enable-experimental-feature DebugDescriptionMacro -enable-experimental-feature OpaqueTypeErasure -empty-abi-descriptor -plugin-path /Applications/Xcode-16.2.0.app/Contents/Developer/Toolchains/XcodeDefault.xctoolchain/usr/lib/swift/host/plugins/testing -validate-clang-modules-once -clang-build-session-file /Users/admin/builder/spi-builder-workspace/.derivedData/ModuleCache.noindex/Session.modulevalidation -Xcc -working-directory -Xcc /Users/admin/builder/spi-builder-workspace/.swiftpm/xcode -resource-dir /Applications/Xcode-16.2.0.app/Contents/Developer/Toolchains/XcodeDefault.xctoolchain/usr/lib/swift -enable-anonymous-context-mangled-names -file-compilation-dir /Users/admin/builder/spi-builder-workspace/.swiftpm/xcode -Xcc -D_LIBCPP_HARDENING_MODE\=_LIBCPP_HARDENING_MODE_DEBUG -Xcc -ivfsstatcache -Xcc /Users/admin/builder/spi-builder-workspace/.derivedData/SDKStatCaches.noindex/watchos11.2-22S97-8cb5c683f5e64b0ecfc74e8d0065fbf6.sdkstatcache -Xcc -I/Users/admin/builder/spi-builder-workspace/.derivedData/Build/Intermediates.noindex/Workflow.build/Debug-watchos/WorkflowReactiveSwift.build/swift-overrides.hmap -Xcc -I/Users/admin/builder/spi-builder-workspace/.derivedData/Build/Products/Debug-watchos/include -Xcc -I/Users/admin/builder/spi-builder-workspace/.derivedData/Build/Intermediates.noindex/Workflow.build/Debug-watchos/WorkflowReactiveSwift.build/DerivedSources-normal/arm64_32 -Xcc -I/Users/admin/builder/spi-builder-workspace/.derivedData/Build/Intermediates.noindex/Workflow.build/Debug-watchos/WorkflowReactiveSwift.build/DerivedSources/arm64_32 -Xcc -I/Users/admin/builder/spi-builder-workspace/.derivedData/Build/Intermediates.noindex/Workflow.build/Debug-watchos/WorkflowReactiveSwift.build/DerivedSources -Xcc -DSWIFT_PACKAGE -Xcc -DDEBUG\=1 -module-name WorkflowReactiveSwift -package-name spi_builder_workspace -frontend-parseable-output -disable-clang-spi -target-sdk-version 11.2 -target-sdk-name watchos11.2 -external-plugin-path /Applications/Xcode-16.2.0.app/Contents/Developer/Platforms/WatchOS.platform/Developer/usr/lib/swift/host/plugins\#/Applications/Xcode-16.2.0.app/Contents/Developer/Platforms/WatchOS.platform/Developer/usr/bin/swift-plugin-server -external-plugin-path /Applications/Xcode-16.2.0.app/Contents/Developer/Platforms/WatchOS.platform/Developer/usr/local/lib/swift/host/plugins\#/Applications/Xcode-16.2.0.app/Contents/Developer/Platforms/WatchOS.platform/Developer/usr/bin/swift-plugin-server -plugin-path /Applications/Xcode-16.2.0.app/Contents/Developer/Toolchains/XcodeDefault.xctoolchain/usr/lib/swift/host/plugins -plugin-path /Applications/Xcode-16.2.0.app/Contents/Developer/Toolchains/XcodeDefault.xctoolchain/usr/local/lib/swift/host/plugins -emit-module-doc-path /Users/admin/builder/spi-builder-workspace/.derivedData/Build/Intermediates.noindex/Workflow.build/Debug-watchos/WorkflowReactiveSwift.build/Objects-normal/arm64_32/WorkflowReactiveSwift.swiftdoc -emit-module-source-info-path /Users/admin/builder/spi-builder-workspace/.derivedData/Build/Intermediates.noindex/Workflow.build/Debug-watchos/WorkflowReactiveSwift.build/Objects-normal/arm64_32/WorkflowReactiveSwift.swiftsourceinfo -emit-objc-header-path /Users/admin/builder/spi-builder-workspace/.derivedData/Build/Intermediates.noindex/Workflow.build/Debug-watchos/WorkflowReactiveSwift.build/Objects-normal/arm64_32/WorkflowReactiveSwift-Swift.h -serialize-diagnostics-path /Users/admin/builder/spi-builder-workspace/.derivedData/Build/Intermediates.noindex/Workflow.build/Debug-watchos/WorkflowReactiveSwift.build/Objects-normal/arm64_32/WorkflowReactiveSwift-master-emit-module.dia -emit-dependencies-path /Users/admin/builder/spi-builder-workspace/.derivedData/Build/Intermediates.noindex/Workflow.build/Debug-watchos/WorkflowReactiveSwift.build/Objects-normal/arm64_32/WorkflowReactiveSwift-master-emit-module.d -o /Users/admin/builder/spi-builder-workspace/.derivedData/Build/Intermediates.noindex/Workflow.build/Debug-watchos/WorkflowReactiveSwift.build/Objects-normal/arm64_32/WorkflowReactiveSwift.swiftmodule -emit-abi-descriptor-path /Users/admin/builder/spi-builder-workspace/.derivedData/Build/Intermediates.noindex/Workflow.build/Debug-watchos/WorkflowReactiveSwift.build/Objects-normal/arm64_32/WorkflowReactiveSwift.abi.json
SwiftEmitModule normal armv7k Emitting\ module\ for\ WorkflowConcurrency (in target 'WorkflowConcurrency' from project 'Workflow')
    cd /Users/admin/builder/spi-builder-workspace/.swiftpm/xcode
    builtin-swiftTaskExecution -- /Applications/Xcode-16.2.0.app/Contents/Developer/Toolchains/XcodeDefault.xctoolchain/usr/bin/swift-frontend -frontend -emit-module -experimental-skip-non-inlinable-function-bodies-without-types /Users/admin/builder/spi-builder-workspace/WorkflowConcurrency/Sources/AsyncOperationWorker.swift /Users/admin/builder/spi-builder-workspace/WorkflowConcurrency/Sources/Logger.swift /Users/admin/builder/spi-builder-workspace/WorkflowConcurrency/Sources/Worker.swift -target armv7k-apple-watchos8.0 -enable-objc-interop -stack-check -sdk /Applications/Xcode-16.2.0.app/Contents/Developer/Platforms/WatchOS.platform/Developer/SDKs/WatchOS11.2.sdk -I /Users/admin/builder/spi-builder-workspace/.derivedData/Build/Products/Debug-watchos -I /Applications/Xcode-16.2.0.app/Contents/Developer/Platforms/WatchOS.platform/Developer/usr/lib -F /Users/admin/builder/spi-builder-workspace/.derivedData/Build/Products/Debug-watchos/PackageFrameworks -F /Users/admin/builder/spi-builder-workspace/.derivedData/Build/Products/Debug-watchos/PackageFrameworks -F /Users/admin/builder/spi-builder-workspace/.derivedData/Build/Products/Debug-watchos -F /Applications/Xcode-16.2.0.app/Contents/Developer/Platforms/WatchOS.platform/Developer/Library/Frameworks -F /Applications/Xcode-16.2.0.app/Contents/Developer/Platforms/WatchOS.platform/Developer/SDKs/WatchOS11.2.sdk/Developer/Library/Frameworks -no-color-diagnostics -enable-testing -g -debug-info-format\=dwarf -dwarf-version\=4 -module-cache-path /Users/admin/builder/spi-builder-workspace/.derivedData/ModuleCache.noindex -profile-generate -profile-coverage-mapping -swift-version 5 -enforce-exclusivity\=checked -Onone -D SWIFT_PACKAGE -D DEBUG -D Xcode -serialize-debugging-options -const-gather-protocols-file /Users/admin/builder/spi-builder-workspace/.derivedData/Build/Intermediates.noindex/Workflow.build/Debug-watchos/WorkflowConcurrency.build/Objects-normal/armv7k/WorkflowConcurrency_const_extract_protocols.json -enable-experimental-feature StrictConcurrency\=targeted -enable-experimental-feature DebugDescriptionMacro -enable-experimental-feature OpaqueTypeErasure -empty-abi-descriptor -plugin-path /Applications/Xcode-16.2.0.app/Contents/Developer/Toolchains/XcodeDefault.xctoolchain/usr/lib/swift/host/plugins/testing -validate-clang-modules-once -clang-build-session-file /Users/admin/builder/spi-builder-workspace/.derivedData/ModuleCache.noindex/Session.modulevalidation -Xcc -working-directory -Xcc /Users/admin/builder/spi-builder-workspace/.swiftpm/xcode -resource-dir /Applications/Xcode-16.2.0.app/Contents/Developer/Toolchains/XcodeDefault.xctoolchain/usr/lib/swift -enable-anonymous-context-mangled-names -file-compilation-dir /Users/admin/builder/spi-builder-workspace/.swiftpm/xcode -Xcc -D_LIBCPP_HARDENING_MODE\=_LIBCPP_HARDENING_MODE_DEBUG -Xcc -ivfsstatcache -Xcc /Users/admin/builder/spi-builder-workspace/.derivedData/SDKStatCaches.noindex/watchos11.2-22S97-8cb5c683f5e64b0ecfc74e8d0065fbf6.sdkstatcache -Xcc -I/Users/admin/builder/spi-builder-workspace/.derivedData/Build/Intermediates.noindex/Workflow.build/Debug-watchos/WorkflowConcurrency.build/swift-overrides.hmap -Xcc -I/Users/admin/builder/spi-builder-workspace/.derivedData/Build/Products/Debug-watchos/include -Xcc -I/Users/admin/builder/spi-builder-workspace/.derivedData/Build/Intermediates.noindex/Workflow.build/Debug-watchos/WorkflowConcurrency.build/DerivedSources-normal/armv7k -Xcc -I/Users/admin/builder/spi-builder-workspace/.derivedData/Build/Intermediates.noindex/Workflow.build/Debug-watchos/WorkflowConcurrency.build/DerivedSources/armv7k -Xcc -I/Users/admin/builder/spi-builder-workspace/.derivedData/Build/Intermediates.noindex/Workflow.build/Debug-watchos/WorkflowConcurrency.build/DerivedSources -Xcc -DSWIFT_PACKAGE -Xcc -DDEBUG\=1 -module-name WorkflowConcurrency -package-name spi_builder_workspace -frontend-parseable-output -disable-clang-spi -target-sdk-version 11.2 -target-sdk-name watchos11.2 -external-plugin-path /Applications/Xcode-16.2.0.app/Contents/Developer/Platforms/WatchOS.platform/Developer/usr/lib/swift/host/plugins\#/Applications/Xcode-16.2.0.app/Contents/Developer/Platforms/WatchOS.platform/Developer/usr/bin/swift-plugin-server -external-plugin-path /Applications/Xcode-16.2.0.app/Contents/Developer/Platforms/WatchOS.platform/Developer/usr/local/lib/swift/host/plugins\#/Applications/Xcode-16.2.0.app/Contents/Developer/Platforms/WatchOS.platform/Developer/usr/bin/swift-plugin-server -plugin-path /Applications/Xcode-16.2.0.app/Contents/Developer/Toolchains/XcodeDefault.xctoolchain/usr/lib/swift/host/plugins -plugin-path /Applications/Xcode-16.2.0.app/Contents/Developer/Toolchains/XcodeDefault.xctoolchain/usr/local/lib/swift/host/plugins -emit-module-doc-path /Users/admin/builder/spi-builder-workspace/.derivedData/Build/Intermediates.noindex/Workflow.build/Debug-watchos/WorkflowConcurrency.build/Objects-normal/armv7k/WorkflowConcurrency.swiftdoc -emit-module-source-info-path /Users/admin/builder/spi-builder-workspace/.derivedData/Build/Intermediates.noindex/Workflow.build/Debug-watchos/WorkflowConcurrency.build/Objects-normal/armv7k/WorkflowConcurrency.swiftsourceinfo -emit-objc-header-path /Users/admin/builder/spi-builder-workspace/.derivedData/Build/Intermediates.noindex/Workflow.build/Debug-watchos/WorkflowConcurrency.build/Objects-normal/armv7k/WorkflowConcurrency-Swift.h -serialize-diagnostics-path /Users/admin/builder/spi-builder-workspace/.derivedData/Build/Intermediates.noindex/Workflow.build/Debug-watchos/WorkflowConcurrency.build/Objects-normal/armv7k/WorkflowConcurrency-master-emit-module.dia -emit-dependencies-path /Users/admin/builder/spi-builder-workspace/.derivedData/Build/Intermediates.noindex/Workflow.build/Debug-watchos/WorkflowConcurrency.build/Objects-normal/armv7k/WorkflowConcurrency-master-emit-module.d -o /Users/admin/builder/spi-builder-workspace/.derivedData/Build/Intermediates.noindex/Workflow.build/Debug-watchos/WorkflowConcurrency.build/Objects-normal/armv7k/WorkflowConcurrency.swiftmodule -emit-abi-descriptor-path /Users/admin/builder/spi-builder-workspace/.derivedData/Build/Intermediates.noindex/Workflow.build/Debug-watchos/WorkflowConcurrency.build/Objects-normal/armv7k/WorkflowConcurrency.abi.json
EmitSwiftModule normal armv7k (in target 'WorkflowConcurrency' from project 'Workflow')
    cd /Users/admin/builder/spi-builder-workspace/.swiftpm/xcode
    /Applications/Xcode-16.2.0.app/Contents/Developer/Toolchains/XcodeDefault.xctoolchain/usr/bin/swift-frontend -emit-module -experimental-skip-non-inlinable-function-bodies-without-types /Users/admin/builder/spi-builder-workspace/WorkflowConcurrency/Sources/AsyncOperationWorker.swift /Users/admin/builder/spi-builder-workspace/WorkflowConcurrency/Sources/Logger.swift /Users/admin/builder/spi-builder-workspace/WorkflowConcurrency/Sources/Worker.swift -target armv7k-apple-watchos8.0 -enable-objc-interop -stack-check -sdk /Applications/Xcode-16.2.0.app/Contents/Developer/Platforms/WatchOS.platform/Developer/SDKs/WatchOS11.2.sdk -I /Users/admin/builder/spi-builder-workspace/.derivedData/Build/Products/Debug-watchos -I /Applications/Xcode-16.2.0.app/Contents/Developer/Platforms/WatchOS.platform/Developer/usr/lib -F /Users/admin/builder/spi-builder-workspace/.derivedData/Build/Products/Debug-watchos/PackageFrameworks -F /Users/admin/builder/spi-builder-workspace/.derivedData/Build/Products/Debug-watchos/PackageFrameworks -F /Users/admin/builder/spi-builder-workspace/.derivedData/Build/Products/Debug-watchos -F /Applications/Xcode-16.2.0.app/Contents/Developer/Platforms/WatchOS.platform/Developer/Library/Frameworks -F /Applications/Xcode-16.2.0.app/Contents/Developer/Platforms/WatchOS.platform/Developer/SDKs/WatchOS11.2.sdk/Developer/Library/Frameworks -no-color-diagnostics -enable-testing -g -debug-info-format\=dwarf -dwarf-version\=4 -module-cache-path /Users/admin/builder/spi-builder-workspace/.derivedData/ModuleCache.noindex -profile-generate -profile-coverage-mapping -swift-version 5 -enforce-exclusivity\=checked -Onone -D SWIFT_PACKAGE -D DEBUG -D Xcode -serialize-debugging-options -const-gather-protocols-file /Users/admin/builder/spi-builder-workspace/.derivedData/Build/Intermediates.noindex/Workflow.build/Debug-watchos/WorkflowConcurrency.build/Objects-normal/armv7k/WorkflowConcurrency_const_extract_protocols.json -enable-experimental-feature StrictConcurrency\=targeted -enable-experimental-feature DebugDescriptionMacro -enable-experimental-feature OpaqueTypeErasure -empty-abi-descriptor -plugin-path /Applications/Xcode-16.2.0.app/Contents/Developer/Toolchains/XcodeDefault.xctoolchain/usr/lib/swift/host/plugins/testing -validate-clang-modules-once -clang-build-session-file /Users/admin/builder/spi-builder-workspace/.derivedData/ModuleCache.noindex/Session.modulevalidation -Xcc -working-directory -Xcc /Users/admin/builder/spi-builder-workspace/.swiftpm/xcode -resource-dir /Applications/Xcode-16.2.0.app/Contents/Developer/Toolchains/XcodeDefault.xctoolchain/usr/lib/swift -enable-anonymous-context-mangled-names -file-compilation-dir /Users/admin/builder/spi-builder-workspace/.swiftpm/xcode -Xcc -D_LIBCPP_HARDENING_MODE\=_LIBCPP_HARDENING_MODE_DEBUG -Xcc -ivfsstatcache -Xcc /Users/admin/builder/spi-builder-workspace/.derivedData/SDKStatCaches.noindex/watchos11.2-22S97-8cb5c683f5e64b0ecfc74e8d0065fbf6.sdkstatcache -Xcc -I/Users/admin/builder/spi-builder-workspace/.derivedData/Build/Intermediates.noindex/Workflow.build/Debug-watchos/WorkflowConcurrency.build/swift-overrides.hmap -Xcc -I/Users/admin/builder/spi-builder-workspace/.derivedData/Build/Products/Debug-watchos/include -Xcc -I/Users/admin/builder/spi-builder-workspace/.derivedData/Build/Intermediates.noindex/Workflow.build/Debug-watchos/WorkflowConcurrency.build/DerivedSources-normal/armv7k -Xcc -I/Users/admin/builder/spi-builder-workspace/.derivedData/Build/Intermediates.noindex/Workflow.build/Debug-watchos/WorkflowConcurrency.build/DerivedSources/armv7k -Xcc -I/Users/admin/builder/spi-builder-workspace/.derivedData/Build/Intermediates.noindex/Workflow.build/Debug-watchos/WorkflowConcurrency.build/DerivedSources -Xcc -DSWIFT_PACKAGE -Xcc -DDEBUG\=1 -module-name WorkflowConcurrency -package-name spi_builder_workspace -frontend-parseable-output -disable-clang-spi -target-sdk-version 11.2 -target-sdk-name watchos11.2 -external-plugin-path /Applications/Xcode-16.2.0.app/Contents/Developer/Platforms/WatchOS.platform/Developer/usr/lib/swift/host/plugins\#/Applications/Xcode-16.2.0.app/Contents/Developer/Platforms/WatchOS.platform/Developer/usr/bin/swift-plugin-server -external-plugin-path /Applications/Xcode-16.2.0.app/Contents/Developer/Platforms/WatchOS.platform/Developer/usr/local/lib/swift/host/plugins\#/Applications/Xcode-16.2.0.app/Contents/Developer/Platforms/WatchOS.platform/Developer/usr/bin/swift-plugin-server -plugin-path /Applications/Xcode-16.2.0.app/Contents/Developer/Toolchains/XcodeDefault.xctoolchain/usr/lib/swift/host/plugins -plugin-path /Applications/Xcode-16.2.0.app/Contents/Developer/Toolchains/XcodeDefault.xctoolchain/usr/local/lib/swift/host/plugins -emit-module-doc-path /Users/admin/builder/spi-builder-workspace/.derivedData/Build/Intermediates.noindex/Workflow.build/Debug-watchos/WorkflowConcurrency.build/Objects-normal/armv7k/WorkflowConcurrency.swiftdoc -emit-module-source-info-path /Users/admin/builder/spi-builder-workspace/.derivedData/Build/Intermediates.noindex/Workflow.build/Debug-watchos/WorkflowConcurrency.build/Objects-normal/armv7k/WorkflowConcurrency.swiftsourceinfo -emit-objc-header-path /Users/admin/builder/spi-builder-workspace/.derivedData/Build/Intermediates.noindex/Workflow.build/Debug-watchos/WorkflowConcurrency.build/Objects-normal/armv7k/WorkflowConcurrency-Swift.h -serialize-diagnostics-path /Users/admin/builder/spi-builder-workspace/.derivedData/Build/Intermediates.noindex/Workflow.build/Debug-watchos/WorkflowConcurrency.build/Objects-normal/armv7k/WorkflowConcurrency-master-emit-module.dia -emit-dependencies-path /Users/admin/builder/spi-builder-workspace/.derivedData/Build/Intermediates.noindex/Workflow.build/Debug-watchos/WorkflowConcurrency.build/Objects-normal/armv7k/WorkflowConcurrency-master-emit-module.d -o /Users/admin/builder/spi-builder-workspace/.derivedData/Build/Intermediates.noindex/Workflow.build/Debug-watchos/WorkflowConcurrency.build/Objects-normal/armv7k/WorkflowConcurrency.swiftmodule -emit-abi-descriptor-path /Users/admin/builder/spi-builder-workspace/.derivedData/Build/Intermediates.noindex/Workflow.build/Debug-watchos/WorkflowConcurrency.build/Objects-normal/armv7k/WorkflowConcurrency.abi.json
SwiftEmitModule normal arm64 Emitting\ module\ for\ WorkflowConcurrency (in target 'WorkflowConcurrency' from project 'Workflow')
    cd /Users/admin/builder/spi-builder-workspace/.swiftpm/xcode
    builtin-swiftTaskExecution -- /Applications/Xcode-16.2.0.app/Contents/Developer/Toolchains/XcodeDefault.xctoolchain/usr/bin/swift-frontend -frontend -emit-module -experimental-skip-non-inlinable-function-bodies-without-types /Users/admin/builder/spi-builder-workspace/WorkflowConcurrency/Sources/AsyncOperationWorker.swift /Users/admin/builder/spi-builder-workspace/WorkflowConcurrency/Sources/Logger.swift /Users/admin/builder/spi-builder-workspace/WorkflowConcurrency/Sources/Worker.swift -target arm64-apple-watchos8.0 -Xllvm -aarch64-use-tbi -enable-objc-interop -stack-check -sdk /Applications/Xcode-16.2.0.app/Contents/Developer/Platforms/WatchOS.platform/Developer/SDKs/WatchOS11.2.sdk -I /Users/admin/builder/spi-builder-workspace/.derivedData/Build/Products/Debug-watchos -I /Applications/Xcode-16.2.0.app/Contents/Developer/Platforms/WatchOS.platform/Developer/usr/lib -F /Users/admin/builder/spi-builder-workspace/.derivedData/Build/Products/Debug-watchos/PackageFrameworks -F /Users/admin/builder/spi-builder-workspace/.derivedData/Build/Products/Debug-watchos/PackageFrameworks -F /Users/admin/builder/spi-builder-workspace/.derivedData/Build/Products/Debug-watchos -F /Applications/Xcode-16.2.0.app/Contents/Developer/Platforms/WatchOS.platform/Developer/Library/Frameworks -F /Applications/Xcode-16.2.0.app/Contents/Developer/Platforms/WatchOS.platform/Developer/SDKs/WatchOS11.2.sdk/Developer/Library/Frameworks -no-color-diagnostics -enable-testing -g -debug-info-format\=dwarf -dwarf-version\=4 -module-cache-path /Users/admin/builder/spi-builder-workspace/.derivedData/ModuleCache.noindex -profile-generate -profile-coverage-mapping -swift-version 5 -enforce-exclusivity\=checked -Onone -D SWIFT_PACKAGE -D DEBUG -D Xcode -serialize-debugging-options -const-gather-protocols-file /Users/admin/builder/spi-builder-workspace/.derivedData/Build/Intermediates.noindex/Workflow.build/Debug-watchos/WorkflowConcurrency.build/Objects-normal/arm64/WorkflowConcurrency_const_extract_protocols.json -enable-experimental-feature StrictConcurrency\=targeted -enable-experimental-feature DebugDescriptionMacro -enable-experimental-feature OpaqueTypeErasure -empty-abi-descriptor -plugin-path /Applications/Xcode-16.2.0.app/Contents/Developer/Toolchains/XcodeDefault.xctoolchain/usr/lib/swift/host/plugins/testing -validate-clang-modules-once -clang-build-session-file /Users/admin/builder/spi-builder-workspace/.derivedData/ModuleCache.noindex/Session.modulevalidation -Xcc -working-directory -Xcc /Users/admin/builder/spi-builder-workspace/.swiftpm/xcode -resource-dir /Applications/Xcode-16.2.0.app/Contents/Developer/Toolchains/XcodeDefault.xctoolchain/usr/lib/swift -enable-anonymous-context-mangled-names -file-compilation-dir /Users/admin/builder/spi-builder-workspace/.swiftpm/xcode -Xcc -D_LIBCPP_HARDENING_MODE\=_LIBCPP_HARDENING_MODE_DEBUG -Xcc -ivfsstatcache -Xcc /Users/admin/builder/spi-builder-workspace/.derivedData/SDKStatCaches.noindex/watchos11.2-22S97-8cb5c683f5e64b0ecfc74e8d0065fbf6.sdkstatcache -Xcc -I/Users/admin/builder/spi-builder-workspace/.derivedData/Build/Intermediates.noindex/Workflow.build/Debug-watchos/WorkflowConcurrency.build/swift-overrides.hmap -Xcc -I/Users/admin/builder/spi-builder-workspace/.derivedData/Build/Products/Debug-watchos/include -Xcc -I/Users/admin/builder/spi-builder-workspace/.derivedData/Build/Intermediates.noindex/Workflow.build/Debug-watchos/WorkflowConcurrency.build/DerivedSources-normal/arm64 -Xcc -I/Users/admin/builder/spi-builder-workspace/.derivedData/Build/Intermediates.noindex/Workflow.build/Debug-watchos/WorkflowConcurrency.build/DerivedSources/arm64 -Xcc -I/Users/admin/builder/spi-builder-workspace/.derivedData/Build/Intermediates.noindex/Workflow.build/Debug-watchos/WorkflowConcurrency.build/DerivedSources -Xcc -DSWIFT_PACKAGE -Xcc -DDEBUG\=1 -module-name WorkflowConcurrency -package-name spi_builder_workspace -frontend-parseable-output -disable-clang-spi -target-sdk-version 11.2 -target-sdk-name watchos11.2 -external-plugin-path /Applications/Xcode-16.2.0.app/Contents/Developer/Platforms/WatchOS.platform/Developer/usr/lib/swift/host/plugins\#/Applications/Xcode-16.2.0.app/Contents/Developer/Platforms/WatchOS.platform/Developer/usr/bin/swift-plugin-server -external-plugin-path /Applications/Xcode-16.2.0.app/Contents/Developer/Platforms/WatchOS.platform/Developer/usr/local/lib/swift/host/plugins\#/Applications/Xcode-16.2.0.app/Contents/Developer/Platforms/WatchOS.platform/Developer/usr/bin/swift-plugin-server -plugin-path /Applications/Xcode-16.2.0.app/Contents/Developer/Toolchains/XcodeDefault.xctoolchain/usr/lib/swift/host/plugins -plugin-path /Applications/Xcode-16.2.0.app/Contents/Developer/Toolchains/XcodeDefault.xctoolchain/usr/local/lib/swift/host/plugins -emit-module-doc-path /Users/admin/builder/spi-builder-workspace/.derivedData/Build/Intermediates.noindex/Workflow.build/Debug-watchos/WorkflowConcurrency.build/Objects-normal/arm64/WorkflowConcurrency.swiftdoc -emit-module-source-info-path /Users/admin/builder/spi-builder-workspace/.derivedData/Build/Intermediates.noindex/Workflow.build/Debug-watchos/WorkflowConcurrency.build/Objects-normal/arm64/WorkflowConcurrency.swiftsourceinfo -emit-objc-header-path /Users/admin/builder/spi-builder-workspace/.derivedData/Build/Intermediates.noindex/Workflow.build/Debug-watchos/WorkflowConcurrency.build/Objects-normal/arm64/WorkflowConcurrency-Swift.h -serialize-diagnostics-path /Users/admin/builder/spi-builder-workspace/.derivedData/Build/Intermediates.noindex/Workflow.build/Debug-watchos/WorkflowConcurrency.build/Objects-normal/arm64/WorkflowConcurrency-master-emit-module.dia -emit-dependencies-path /Users/admin/builder/spi-builder-workspace/.derivedData/Build/Intermediates.noindex/Workflow.build/Debug-watchos/WorkflowConcurrency.build/Objects-normal/arm64/WorkflowConcurrency-master-emit-module.d -o /Users/admin/builder/spi-builder-workspace/.derivedData/Build/Intermediates.noindex/Workflow.build/Debug-watchos/WorkflowConcurrency.build/Objects-normal/arm64/WorkflowConcurrency.swiftmodule -emit-abi-descriptor-path /Users/admin/builder/spi-builder-workspace/.derivedData/Build/Intermediates.noindex/Workflow.build/Debug-watchos/WorkflowConcurrency.build/Objects-normal/arm64/WorkflowConcurrency.abi.json
EmitSwiftModule normal arm64 (in target 'WorkflowConcurrency' from project 'Workflow')
    cd /Users/admin/builder/spi-builder-workspace/.swiftpm/xcode
    /Applications/Xcode-16.2.0.app/Contents/Developer/Toolchains/XcodeDefault.xctoolchain/usr/bin/swift-frontend -emit-module -experimental-skip-non-inlinable-function-bodies-without-types /Users/admin/builder/spi-builder-workspace/WorkflowConcurrency/Sources/AsyncOperationWorker.swift /Users/admin/builder/spi-builder-workspace/WorkflowConcurrency/Sources/Logger.swift /Users/admin/builder/spi-builder-workspace/WorkflowConcurrency/Sources/Worker.swift -target arm64-apple-watchos8.0 -Xllvm -aarch64-use-tbi -enable-objc-interop -stack-check -sdk /Applications/Xcode-16.2.0.app/Contents/Developer/Platforms/WatchOS.platform/Developer/SDKs/WatchOS11.2.sdk -I /Users/admin/builder/spi-builder-workspace/.derivedData/Build/Products/Debug-watchos -I /Applications/Xcode-16.2.0.app/Contents/Developer/Platforms/WatchOS.platform/Developer/usr/lib -F /Users/admin/builder/spi-builder-workspace/.derivedData/Build/Products/Debug-watchos/PackageFrameworks -F /Users/admin/builder/spi-builder-workspace/.derivedData/Build/Products/Debug-watchos/PackageFrameworks -F /Users/admin/builder/spi-builder-workspace/.derivedData/Build/Products/Debug-watchos -F /Applications/Xcode-16.2.0.app/Contents/Developer/Platforms/WatchOS.platform/Developer/Library/Frameworks -F /Applications/Xcode-16.2.0.app/Contents/Developer/Platforms/WatchOS.platform/Developer/SDKs/WatchOS11.2.sdk/Developer/Library/Frameworks -no-color-diagnostics -enable-testing -g -debug-info-format\=dwarf -dwarf-version\=4 -module-cache-path /Users/admin/builder/spi-builder-workspace/.derivedData/ModuleCache.noindex -profile-generate -profile-coverage-mapping -swift-version 5 -enforce-exclusivity\=checked -Onone -D SWIFT_PACKAGE -D DEBUG -D Xcode -serialize-debugging-options -const-gather-protocols-file /Users/admin/builder/spi-builder-workspace/.derivedData/Build/Intermediates.noindex/Workflow.build/Debug-watchos/WorkflowConcurrency.build/Objects-normal/arm64/WorkflowConcurrency_const_extract_protocols.json -enable-experimental-feature StrictConcurrency\=targeted -enable-experimental-feature DebugDescriptionMacro -enable-experimental-feature OpaqueTypeErasure -empty-abi-descriptor -plugin-path /Applications/Xcode-16.2.0.app/Contents/Developer/Toolchains/XcodeDefault.xctoolchain/usr/lib/swift/host/plugins/testing -validate-clang-modules-once -clang-build-session-file /Users/admin/builder/spi-builder-workspace/.derivedData/ModuleCache.noindex/Session.modulevalidation -Xcc -working-directory -Xcc /Users/admin/builder/spi-builder-workspace/.swiftpm/xcode -resource-dir /Applications/Xcode-16.2.0.app/Contents/Developer/Toolchains/XcodeDefault.xctoolchain/usr/lib/swift -enable-anonymous-context-mangled-names -file-compilation-dir /Users/admin/builder/spi-builder-workspace/.swiftpm/xcode -Xcc -D_LIBCPP_HARDENING_MODE\=_LIBCPP_HARDENING_MODE_DEBUG -Xcc -ivfsstatcache -Xcc /Users/admin/builder/spi-builder-workspace/.derivedData/SDKStatCaches.noindex/watchos11.2-22S97-8cb5c683f5e64b0ecfc74e8d0065fbf6.sdkstatcache -Xcc -I/Users/admin/builder/spi-builder-workspace/.derivedData/Build/Intermediates.noindex/Workflow.build/Debug-watchos/WorkflowConcurrency.build/swift-overrides.hmap -Xcc -I/Users/admin/builder/spi-builder-workspace/.derivedData/Build/Products/Debug-watchos/include -Xcc -I/Users/admin/builder/spi-builder-workspace/.derivedData/Build/Intermediates.noindex/Workflow.build/Debug-watchos/WorkflowConcurrency.build/DerivedSources-normal/arm64 -Xcc -I/Users/admin/builder/spi-builder-workspace/.derivedData/Build/Intermediates.noindex/Workflow.build/Debug-watchos/WorkflowConcurrency.build/DerivedSources/arm64 -Xcc -I/Users/admin/builder/spi-builder-workspace/.derivedData/Build/Intermediates.noindex/Workflow.build/Debug-watchos/WorkflowConcurrency.build/DerivedSources -Xcc -DSWIFT_PACKAGE -Xcc -DDEBUG\=1 -module-name WorkflowConcurrency -package-name spi_builder_workspace -frontend-parseable-output -disable-clang-spi -target-sdk-version 11.2 -target-sdk-name watchos11.2 -external-plugin-path /Applications/Xcode-16.2.0.app/Contents/Developer/Platforms/WatchOS.platform/Developer/usr/lib/swift/host/plugins\#/Applications/Xcode-16.2.0.app/Contents/Developer/Platforms/WatchOS.platform/Developer/usr/bin/swift-plugin-server -external-plugin-path /Applications/Xcode-16.2.0.app/Contents/Developer/Platforms/WatchOS.platform/Developer/usr/local/lib/swift/host/plugins\#/Applications/Xcode-16.2.0.app/Contents/Developer/Platforms/WatchOS.platform/Developer/usr/bin/swift-plugin-server -plugin-path /Applications/Xcode-16.2.0.app/Contents/Developer/Toolchains/XcodeDefault.xctoolchain/usr/lib/swift/host/plugins -plugin-path /Applications/Xcode-16.2.0.app/Contents/Developer/Toolchains/XcodeDefault.xctoolchain/usr/local/lib/swift/host/plugins -emit-module-doc-path /Users/admin/builder/spi-builder-workspace/.derivedData/Build/Intermediates.noindex/Workflow.build/Debug-watchos/WorkflowConcurrency.build/Objects-normal/arm64/WorkflowConcurrency.swiftdoc -emit-module-source-info-path /Users/admin/builder/spi-builder-workspace/.derivedData/Build/Intermediates.noindex/Workflow.build/Debug-watchos/WorkflowConcurrency.build/Objects-normal/arm64/WorkflowConcurrency.swiftsourceinfo -emit-objc-header-path /Users/admin/builder/spi-builder-workspace/.derivedData/Build/Intermediates.noindex/Workflow.build/Debug-watchos/WorkflowConcurrency.build/Objects-normal/arm64/WorkflowConcurrency-Swift.h -serialize-diagnostics-path /Users/admin/builder/spi-builder-workspace/.derivedData/Build/Intermediates.noindex/Workflow.build/Debug-watchos/WorkflowConcurrency.build/Objects-normal/arm64/WorkflowConcurrency-master-emit-module.dia -emit-dependencies-path /Users/admin/builder/spi-builder-workspace/.derivedData/Build/Intermediates.noindex/Workflow.build/Debug-watchos/WorkflowConcurrency.build/Objects-normal/arm64/WorkflowConcurrency-master-emit-module.d -o /Users/admin/builder/spi-builder-workspace/.derivedData/Build/Intermediates.noindex/Workflow.build/Debug-watchos/WorkflowConcurrency.build/Objects-normal/arm64/WorkflowConcurrency.swiftmodule -emit-abi-descriptor-path /Users/admin/builder/spi-builder-workspace/.derivedData/Build/Intermediates.noindex/Workflow.build/Debug-watchos/WorkflowConcurrency.build/Objects-normal/arm64/WorkflowConcurrency.abi.json
SwiftEmitModule normal arm64_32 Emitting\ module\ for\ Workflow (in target 'Workflow' from project 'Workflow')
    cd /Users/admin/builder/spi-builder-workspace/.swiftpm/xcode
    builtin-swiftTaskExecution -- /Applications/Xcode-16.2.0.app/Contents/Developer/Toolchains/XcodeDefault.xctoolchain/usr/bin/swift-frontend -frontend -emit-module -experimental-skip-non-inlinable-function-bodies-without-types /Users/admin/builder/spi-builder-workspace/Workflow/Sources/AnyWorkflow.swift /Users/admin/builder/spi-builder-workspace/Workflow/Sources/AnyWorkflowConvertible.swift /Users/admin/builder/spi-builder-workspace/Workflow/Sources/Debugging.swift /Users/admin/builder/spi-builder-workspace/Workflow/Sources/DispatchQueue+Workflow.swift /Users/admin/builder/spi-builder-workspace/Workflow/Sources/Lifetime.swift /Users/admin/builder/spi-builder-workspace/Workflow/Sources/RenderContext.swift /Users/admin/builder/spi-builder-workspace/Workflow/Sources/Sink.swift /Users/admin/builder/spi-builder-workspace/Workflow/Sources/StateMutationSink.swift /Users/admin/builder/spi-builder-workspace/Workflow/Sources/SubtreeManager.swift /Users/admin/builder/spi-builder-workspace/Workflow/Sources/Workflow.swift /Users/admin/builder/spi-builder-workspace/Workflow/Sources/WorkflowAction.swift /Users/admin/builder/spi-builder-workspace/Workflow/Sources/WorkflowHost.swift /Users/admin/builder/spi-builder-workspace/Workflow/Sources/WorkflowLogger.swift /Users/admin/builder/spi-builder-workspace/Workflow/Sources/WorkflowNode.swift /Users/admin/builder/spi-builder-workspace/Workflow/Sources/WorkflowObserver.swift -target arm64_32-apple-watchos8.0 -enable-objc-interop -sdk /Applications/Xcode-16.2.0.app/Contents/Developer/Platforms/WatchOS.platform/Developer/SDKs/WatchOS11.2.sdk -I /Users/admin/builder/spi-builder-workspace/.derivedData/Build/Products/Debug-watchos -I /Applications/Xcode-16.2.0.app/Contents/Developer/Platforms/WatchOS.platform/Developer/usr/lib -F /Users/admin/builder/spi-builder-workspace/.derivedData/Build/Products/Debug-watchos/PackageFrameworks -F /Users/admin/builder/spi-builder-workspace/.derivedData/Build/Products/Debug-watchos -F /Applications/Xcode-16.2.0.app/Contents/Developer/Platforms/WatchOS.platform/Developer/Library/Frameworks -F /Applications/Xcode-16.2.0.app/Contents/Developer/Platforms/WatchOS.platform/Developer/SDKs/WatchOS11.2.sdk/Developer/Library/Frameworks -no-color-diagnostics -enable-testing -g -debug-info-format\=dwarf -dwarf-version\=4 -module-cache-path /Users/admin/builder/spi-builder-workspace/.derivedData/ModuleCache.noindex -profile-generate -profile-coverage-mapping -swift-version 5 -enforce-exclusivity\=checked -Onone -D SWIFT_PACKAGE -D DEBUG -D Xcode -serialize-debugging-options -const-gather-protocols-file /Users/admin/builder/spi-builder-workspace/.derivedData/Build/Intermediates.noindex/Workflow.build/Debug-watchos/Workflow.build/Objects-normal/arm64_32/Workflow_const_extract_protocols.json -enable-experimental-feature StrictConcurrency\=targeted -enable-experimental-feature DebugDescriptionMacro -enable-experimental-feature OpaqueTypeErasure -empty-abi-descriptor -plugin-path /Applications/Xcode-16.2.0.app/Contents/Developer/Toolchains/XcodeDefault.xctoolchain/usr/lib/swift/host/plugins/testing -validate-clang-modules-once -clang-build-session-file /Users/admin/builder/spi-builder-workspace/.derivedData/ModuleCache.noindex/Session.modulevalidation -Xcc -working-directory -Xcc /Users/admin/builder/spi-builder-workspace/.swiftpm/xcode -resource-dir /Applications/Xcode-16.2.0.app/Contents/Developer/Toolchains/XcodeDefault.xctoolchain/usr/lib/swift -enable-anonymous-context-mangled-names -file-compilation-dir /Users/admin/builder/spi-builder-workspace/.swiftpm/xcode -Xcc -D_LIBCPP_HARDENING_MODE\=_LIBCPP_HARDENING_MODE_DEBUG -Xcc -ivfsstatcache -Xcc /Users/admin/builder/spi-builder-workspace/.derivedData/SDKStatCaches.noindex/watchos11.2-22S97-8cb5c683f5e64b0ecfc74e8d0065fbf6.sdkstatcache -Xcc -I/Users/admin/builder/spi-builder-workspace/.derivedData/Build/Intermediates.noindex/Workflow.build/Debug-watchos/Workflow.build/swift-overrides.hmap -Xcc -I/Users/admin/builder/spi-builder-workspace/.derivedData/Build/Products/Debug-watchos/include -Xcc -I/Users/admin/builder/spi-builder-workspace/.derivedData/Build/Intermediates.noindex/Workflow.build/Debug-watchos/Workflow.build/DerivedSources-normal/arm64_32 -Xcc -I/Users/admin/builder/spi-builder-workspace/.derivedData/Build/Intermediates.noindex/Workflow.build/Debug-watchos/Workflow.build/DerivedSources/arm64_32 -Xcc -I/Users/admin/builder/spi-builder-workspace/.derivedData/Build/Intermediates.noindex/Workflow.build/Debug-watchos/Workflow.build/DerivedSources -Xcc -DSWIFT_PACKAGE -Xcc -DDEBUG\=1 -module-name Workflow -package-name spi_builder_workspace -frontend-parseable-output -disable-clang-spi -target-sdk-version 11.2 -target-sdk-name watchos11.2 -external-plugin-path /Applications/Xcode-16.2.0.app/Contents/Developer/Platforms/WatchOS.platform/Developer/usr/lib/swift/host/plugins\#/Applications/Xcode-16.2.0.app/Contents/Developer/Platforms/WatchOS.platform/Developer/usr/bin/swift-plugin-server -external-plugin-path /Applications/Xcode-16.2.0.app/Contents/Developer/Platforms/WatchOS.platform/Developer/usr/local/lib/swift/host/plugins\#/Applications/Xcode-16.2.0.app/Contents/Developer/Platforms/WatchOS.platform/Developer/usr/bin/swift-plugin-server -plugin-path /Applications/Xcode-16.2.0.app/Contents/Developer/Toolchains/XcodeDefault.xctoolchain/usr/lib/swift/host/plugins -plugin-path /Applications/Xcode-16.2.0.app/Contents/Developer/Toolchains/XcodeDefault.xctoolchain/usr/local/lib/swift/host/plugins -emit-module-doc-path /Users/admin/builder/spi-builder-workspace/.derivedData/Build/Intermediates.noindex/Workflow.build/Debug-watchos/Workflow.build/Objects-normal/arm64_32/Workflow.swiftdoc -emit-module-source-info-path /Users/admin/builder/spi-builder-workspace/.derivedData/Build/Intermediates.noindex/Workflow.build/Debug-watchos/Workflow.build/Objects-normal/arm64_32/Workflow.swiftsourceinfo -emit-objc-header-path /Users/admin/builder/spi-builder-workspace/.derivedData/Build/Intermediates.noindex/Workflow.build/Debug-watchos/Workflow.build/Objects-normal/arm64_32/Workflow-Swift.h -serialize-diagnostics-path /Users/admin/builder/spi-builder-workspace/.derivedData/Build/Intermediates.noindex/Workflow.build/Debug-watchos/Workflow.build/Objects-normal/arm64_32/Workflow-master-emit-module.dia -emit-dependencies-path /Users/admin/builder/spi-builder-workspace/.derivedData/Build/Intermediates.noindex/Workflow.build/Debug-watchos/Workflow.build/Objects-normal/arm64_32/Workflow-master-emit-module.d -o /Users/admin/builder/spi-builder-workspace/.derivedData/Build/Intermediates.noindex/Workflow.build/Debug-watchos/Workflow.build/Objects-normal/arm64_32/Workflow.swiftmodule -emit-abi-descriptor-path /Users/admin/builder/spi-builder-workspace/.derivedData/Build/Intermediates.noindex/Workflow.build/Debug-watchos/Workflow.build/Objects-normal/arm64_32/Workflow.abi.json
EmitSwiftModule normal arm64_32 (in target 'Workflow' from project 'Workflow')
    cd /Users/admin/builder/spi-builder-workspace/.swiftpm/xcode
    /Applications/Xcode-16.2.0.app/Contents/Developer/Toolchains/XcodeDefault.xctoolchain/usr/bin/swift-frontend -emit-module -experimental-skip-non-inlinable-function-bodies-without-types /Users/admin/builder/spi-builder-workspace/Workflow/Sources/AnyWorkflow.swift /Users/admin/builder/spi-builder-workspace/Workflow/Sources/AnyWorkflowConvertible.swift /Users/admin/builder/spi-builder-workspace/Workflow/Sources/Debugging.swift /Users/admin/builder/spi-builder-workspace/Workflow/Sources/DispatchQueue+Workflow.swift /Users/admin/builder/spi-builder-workspace/Workflow/Sources/Lifetime.swift /Users/admin/builder/spi-builder-workspace/Workflow/Sources/RenderContext.swift /Users/admin/builder/spi-builder-workspace/Workflow/Sources/Sink.swift /Users/admin/builder/spi-builder-workspace/Workflow/Sources/StateMutationSink.swift /Users/admin/builder/spi-builder-workspace/Workflow/Sources/SubtreeManager.swift /Users/admin/builder/spi-builder-workspace/Workflow/Sources/Workflow.swift /Users/admin/builder/spi-builder-workspace/Workflow/Sources/WorkflowAction.swift /Users/admin/builder/spi-builder-workspace/Workflow/Sources/WorkflowHost.swift /Users/admin/builder/spi-builder-workspace/Workflow/Sources/WorkflowLogger.swift /Users/admin/builder/spi-builder-workspace/Workflow/Sources/WorkflowNode.swift /Users/admin/builder/spi-builder-workspace/Workflow/Sources/WorkflowObserver.swift -target arm64_32-apple-watchos8.0 -enable-objc-interop -sdk /Applications/Xcode-16.2.0.app/Contents/Developer/Platforms/WatchOS.platform/Developer/SDKs/WatchOS11.2.sdk -I /Users/admin/builder/spi-builder-workspace/.derivedData/Build/Products/Debug-watchos -I /Applications/Xcode-16.2.0.app/Contents/Developer/Platforms/WatchOS.platform/Developer/usr/lib -F /Users/admin/builder/spi-builder-workspace/.derivedData/Build/Products/Debug-watchos/PackageFrameworks -F /Users/admin/builder/spi-builder-workspace/.derivedData/Build/Products/Debug-watchos -F /Applications/Xcode-16.2.0.app/Contents/Developer/Platforms/WatchOS.platform/Developer/Library/Frameworks -F /Applications/Xcode-16.2.0.app/Contents/Developer/Platforms/WatchOS.platform/Developer/SDKs/WatchOS11.2.sdk/Developer/Library/Frameworks -no-color-diagnostics -enable-testing -g -debug-info-format\=dwarf -dwarf-version\=4 -module-cache-path /Users/admin/builder/spi-builder-workspace/.derivedData/ModuleCache.noindex -profile-generate -profile-coverage-mapping -swift-version 5 -enforce-exclusivity\=checked -Onone -D SWIFT_PACKAGE -D DEBUG -D Xcode -serialize-debugging-options -const-gather-protocols-file /Users/admin/builder/spi-builder-workspace/.derivedData/Build/Intermediates.noindex/Workflow.build/Debug-watchos/Workflow.build/Objects-normal/arm64_32/Workflow_const_extract_protocols.json -enable-experimental-feature StrictConcurrency\=targeted -enable-experimental-feature DebugDescriptionMacro -enable-experimental-feature OpaqueTypeErasure -empty-abi-descriptor -plugin-path /Applications/Xcode-16.2.0.app/Contents/Developer/Toolchains/XcodeDefault.xctoolchain/usr/lib/swift/host/plugins/testing -validate-clang-modules-once -clang-build-session-file /Users/admin/builder/spi-builder-workspace/.derivedData/ModuleCache.noindex/Session.modulevalidation -Xcc -working-directory -Xcc /Users/admin/builder/spi-builder-workspace/.swiftpm/xcode -resource-dir /Applications/Xcode-16.2.0.app/Contents/Developer/Toolchains/XcodeDefault.xctoolchain/usr/lib/swift -enable-anonymous-context-mangled-names -file-compilation-dir /Users/admin/builder/spi-builder-workspace/.swiftpm/xcode -Xcc -D_LIBCPP_HARDENING_MODE\=_LIBCPP_HARDENING_MODE_DEBUG -Xcc -ivfsstatcache -Xcc /Users/admin/builder/spi-builder-workspace/.derivedData/SDKStatCaches.noindex/watchos11.2-22S97-8cb5c683f5e64b0ecfc74e8d0065fbf6.sdkstatcache -Xcc -I/Users/admin/builder/spi-builder-workspace/.derivedData/Build/Intermediates.noindex/Workflow.build/Debug-watchos/Workflow.build/swift-overrides.hmap -Xcc -I/Users/admin/builder/spi-builder-workspace/.derivedData/Build/Products/Debug-watchos/include -Xcc -I/Users/admin/builder/spi-builder-workspace/.derivedData/Build/Intermediates.noindex/Workflow.build/Debug-watchos/Workflow.build/DerivedSources-normal/arm64_32 -Xcc -I/Users/admin/builder/spi-builder-workspace/.derivedData/Build/Intermediates.noindex/Workflow.build/Debug-watchos/Workflow.build/DerivedSources/arm64_32 -Xcc -I/Users/admin/builder/spi-builder-workspace/.derivedData/Build/Intermediates.noindex/Workflow.build/Debug-watchos/Workflow.build/DerivedSources -Xcc -DSWIFT_PACKAGE -Xcc -DDEBUG\=1 -module-name Workflow -package-name spi_builder_workspace -frontend-parseable-output -disable-clang-spi -target-sdk-version 11.2 -target-sdk-name watchos11.2 -external-plugin-path /Applications/Xcode-16.2.0.app/Contents/Developer/Platforms/WatchOS.platform/Developer/usr/lib/swift/host/plugins\#/Applications/Xcode-16.2.0.app/Contents/Developer/Platforms/WatchOS.platform/Developer/usr/bin/swift-plugin-server -external-plugin-path /Applications/Xcode-16.2.0.app/Contents/Developer/Platforms/WatchOS.platform/Developer/usr/local/lib/swift/host/plugins\#/Applications/Xcode-16.2.0.app/Contents/Developer/Platforms/WatchOS.platform/Developer/usr/bin/swift-plugin-server -plugin-path /Applications/Xcode-16.2.0.app/Contents/Developer/Toolchains/XcodeDefault.xctoolchain/usr/lib/swift/host/plugins -plugin-path /Applications/Xcode-16.2.0.app/Contents/Developer/Toolchains/XcodeDefault.xctoolchain/usr/local/lib/swift/host/plugins -emit-module-doc-path /Users/admin/builder/spi-builder-workspace/.derivedData/Build/Intermediates.noindex/Workflow.build/Debug-watchos/Workflow.build/Objects-normal/arm64_32/Workflow.swiftdoc -emit-module-source-info-path /Users/admin/builder/spi-builder-workspace/.derivedData/Build/Intermediates.noindex/Workflow.build/Debug-watchos/Workflow.build/Objects-normal/arm64_32/Workflow.swiftsourceinfo -emit-objc-header-path /Users/admin/builder/spi-builder-workspace/.derivedData/Build/Intermediates.noindex/Workflow.build/Debug-watchos/Workflow.build/Objects-normal/arm64_32/Workflow-Swift.h -serialize-diagnostics-path /Users/admin/builder/spi-builder-workspace/.derivedData/Build/Intermediates.noindex/Workflow.build/Debug-watchos/Workflow.build/Objects-normal/arm64_32/Workflow-master-emit-module.dia -emit-dependencies-path /Users/admin/builder/spi-builder-workspace/.derivedData/Build/Intermediates.noindex/Workflow.build/Debug-watchos/Workflow.build/Objects-normal/arm64_32/Workflow-master-emit-module.d -o /Users/admin/builder/spi-builder-workspace/.derivedData/Build/Intermediates.noindex/Workflow.build/Debug-watchos/Workflow.build/Objects-normal/arm64_32/Workflow.swiftmodule -emit-abi-descriptor-path /Users/admin/builder/spi-builder-workspace/.derivedData/Build/Intermediates.noindex/Workflow.build/Debug-watchos/Workflow.build/Objects-normal/arm64_32/Workflow.abi.json
SwiftEmitModule normal arm64 Emitting\ module\ for\ Workflow (in target 'Workflow' from project 'Workflow')
    cd /Users/admin/builder/spi-builder-workspace/.swiftpm/xcode
    builtin-swiftTaskExecution -- /Applications/Xcode-16.2.0.app/Contents/Developer/Toolchains/XcodeDefault.xctoolchain/usr/bin/swift-frontend -frontend -emit-module -experimental-skip-non-inlinable-function-bodies-without-types /Users/admin/builder/spi-builder-workspace/Workflow/Sources/AnyWorkflow.swift /Users/admin/builder/spi-builder-workspace/Workflow/Sources/AnyWorkflowConvertible.swift /Users/admin/builder/spi-builder-workspace/Workflow/Sources/Debugging.swift /Users/admin/builder/spi-builder-workspace/Workflow/Sources/DispatchQueue+Workflow.swift /Users/admin/builder/spi-builder-workspace/Workflow/Sources/Lifetime.swift /Users/admin/builder/spi-builder-workspace/Workflow/Sources/RenderContext.swift /Users/admin/builder/spi-builder-workspace/Workflow/Sources/Sink.swift /Users/admin/builder/spi-builder-workspace/Workflow/Sources/StateMutationSink.swift /Users/admin/builder/spi-builder-workspace/Workflow/Sources/SubtreeManager.swift /Users/admin/builder/spi-builder-workspace/Workflow/Sources/Workflow.swift /Users/admin/builder/spi-builder-workspace/Workflow/Sources/WorkflowAction.swift /Users/admin/builder/spi-builder-workspace/Workflow/Sources/WorkflowHost.swift /Users/admin/builder/spi-builder-workspace/Workflow/Sources/WorkflowLogger.swift /Users/admin/builder/spi-builder-workspace/Workflow/Sources/WorkflowNode.swift /Users/admin/builder/spi-builder-workspace/Workflow/Sources/WorkflowObserver.swift -target arm64-apple-watchos8.0 -Xllvm -aarch64-use-tbi -enable-objc-interop -stack-check -sdk /Applications/Xcode-16.2.0.app/Contents/Developer/Platforms/WatchOS.platform/Developer/SDKs/WatchOS11.2.sdk -I /Users/admin/builder/spi-builder-workspace/.derivedData/Build/Products/Debug-watchos -I /Applications/Xcode-16.2.0.app/Contents/Developer/Platforms/WatchOS.platform/Developer/usr/lib -F /Users/admin/builder/spi-builder-workspace/.derivedData/Build/Products/Debug-watchos/PackageFrameworks -F /Users/admin/builder/spi-builder-workspace/.derivedData/Build/Products/Debug-watchos -F /Applications/Xcode-16.2.0.app/Contents/Developer/Platforms/WatchOS.platform/Developer/Library/Frameworks -F /Applications/Xcode-16.2.0.app/Contents/Developer/Platforms/WatchOS.platform/Developer/SDKs/WatchOS11.2.sdk/Developer/Library/Frameworks -no-color-diagnostics -enable-testing -g -debug-info-format\=dwarf -dwarf-version\=4 -module-cache-path /Users/admin/builder/spi-builder-workspace/.derivedData/ModuleCache.noindex -profile-generate -profile-coverage-mapping -swift-version 5 -enforce-exclusivity\=checked -Onone -D SWIFT_PACKAGE -D DEBUG -D Xcode -serialize-debugging-options -const-gather-protocols-file /Users/admin/builder/spi-builder-workspace/.derivedData/Build/Intermediates.noindex/Workflow.build/Debug-watchos/Workflow.build/Objects-normal/arm64/Workflow_const_extract_protocols.json -enable-experimental-feature StrictConcurrency\=targeted -enable-experimental-feature DebugDescriptionMacro -enable-experimental-feature OpaqueTypeErasure -empty-abi-descriptor -plugin-path /Applications/Xcode-16.2.0.app/Contents/Developer/Toolchains/XcodeDefault.xctoolchain/usr/lib/swift/host/plugins/testing -validate-clang-modules-once -clang-build-session-file /Users/admin/builder/spi-builder-workspace/.derivedData/ModuleCache.noindex/Session.modulevalidation -Xcc -working-directory -Xcc /Users/admin/builder/spi-builder-workspace/.swiftpm/xcode -resource-dir /Applications/Xcode-16.2.0.app/Contents/Developer/Toolchains/XcodeDefault.xctoolchain/usr/lib/swift -enable-anonymous-context-mangled-names -file-compilation-dir /Users/admin/builder/spi-builder-workspace/.swiftpm/xcode -Xcc -D_LIBCPP_HARDENING_MODE\=_LIBCPP_HARDENING_MODE_DEBUG -Xcc -ivfsstatcache -Xcc /Users/admin/builder/spi-builder-workspace/.derivedData/SDKStatCaches.noindex/watchos11.2-22S97-8cb5c683f5e64b0ecfc74e8d0065fbf6.sdkstatcache -Xcc -I/Users/admin/builder/spi-builder-workspace/.derivedData/Build/Intermediates.noindex/Workflow.build/Debug-watchos/Workflow.build/swift-overrides.hmap -Xcc -I/Users/admin/builder/spi-builder-workspace/.derivedData/Build/Products/Debug-watchos/include -Xcc -I/Users/admin/builder/spi-builder-workspace/.derivedData/Build/Intermediates.noindex/Workflow.build/Debug-watchos/Workflow.build/DerivedSources-normal/arm64 -Xcc -I/Users/admin/builder/spi-builder-workspace/.derivedData/Build/Intermediates.noindex/Workflow.build/Debug-watchos/Workflow.build/DerivedSources/arm64 -Xcc -I/Users/admin/builder/spi-builder-workspace/.derivedData/Build/Intermediates.noindex/Workflow.build/Debug-watchos/Workflow.build/DerivedSources -Xcc -DSWIFT_PACKAGE -Xcc -DDEBUG\=1 -module-name Workflow -package-name spi_builder_workspace -frontend-parseable-output -disable-clang-spi -target-sdk-version 11.2 -target-sdk-name watchos11.2 -external-plugin-path /Applications/Xcode-16.2.0.app/Contents/Developer/Platforms/WatchOS.platform/Developer/usr/lib/swift/host/plugins\#/Applications/Xcode-16.2.0.app/Contents/Developer/Platforms/WatchOS.platform/Developer/usr/bin/swift-plugin-server -external-plugin-path /Applications/Xcode-16.2.0.app/Contents/Developer/Platforms/WatchOS.platform/Developer/usr/local/lib/swift/host/plugins\#/Applications/Xcode-16.2.0.app/Contents/Developer/Platforms/WatchOS.platform/Developer/usr/bin/swift-plugin-server -plugin-path /Applications/Xcode-16.2.0.app/Contents/Developer/Toolchains/XcodeDefault.xctoolchain/usr/lib/swift/host/plugins -plugin-path /Applications/Xcode-16.2.0.app/Contents/Developer/Toolchains/XcodeDefault.xctoolchain/usr/local/lib/swift/host/plugins -emit-module-doc-path /Users/admin/builder/spi-builder-workspace/.derivedData/Build/Intermediates.noindex/Workflow.build/Debug-watchos/Workflow.build/Objects-normal/arm64/Workflow.swiftdoc -emit-module-source-info-path /Users/admin/builder/spi-builder-workspace/.derivedData/Build/Intermediates.noindex/Workflow.build/Debug-watchos/Workflow.build/Objects-normal/arm64/Workflow.swiftsourceinfo -emit-objc-header-path /Users/admin/builder/spi-builder-workspace/.derivedData/Build/Intermediates.noindex/Workflow.build/Debug-watchos/Workflow.build/Objects-normal/arm64/Workflow-Swift.h -serialize-diagnostics-path /Users/admin/builder/spi-builder-workspace/.derivedData/Build/Intermediates.noindex/Workflow.build/Debug-watchos/Workflow.build/Objects-normal/arm64/Workflow-master-emit-module.dia -emit-dependencies-path /Users/admin/builder/spi-builder-workspace/.derivedData/Build/Intermediates.noindex/Workflow.build/Debug-watchos/Workflow.build/Objects-normal/arm64/Workflow-master-emit-module.d -o /Users/admin/builder/spi-builder-workspace/.derivedData/Build/Intermediates.noindex/Workflow.build/Debug-watchos/Workflow.build/Objects-normal/arm64/Workflow.swiftmodule -emit-abi-descriptor-path /Users/admin/builder/spi-builder-workspace/.derivedData/Build/Intermediates.noindex/Workflow.build/Debug-watchos/Workflow.build/Objects-normal/arm64/Workflow.abi.json
EmitSwiftModule normal arm64 (in target 'Workflow' from project 'Workflow')
    cd /Users/admin/builder/spi-builder-workspace/.swiftpm/xcode
    /Applications/Xcode-16.2.0.app/Contents/Developer/Toolchains/XcodeDefault.xctoolchain/usr/bin/swift-frontend -emit-module -experimental-skip-non-inlinable-function-bodies-without-types /Users/admin/builder/spi-builder-workspace/Workflow/Sources/AnyWorkflow.swift /Users/admin/builder/spi-builder-workspace/Workflow/Sources/AnyWorkflowConvertible.swift /Users/admin/builder/spi-builder-workspace/Workflow/Sources/Debugging.swift /Users/admin/builder/spi-builder-workspace/Workflow/Sources/DispatchQueue+Workflow.swift /Users/admin/builder/spi-builder-workspace/Workflow/Sources/Lifetime.swift /Users/admin/builder/spi-builder-workspace/Workflow/Sources/RenderContext.swift /Users/admin/builder/spi-builder-workspace/Workflow/Sources/Sink.swift /Users/admin/builder/spi-builder-workspace/Workflow/Sources/StateMutationSink.swift /Users/admin/builder/spi-builder-workspace/Workflow/Sources/SubtreeManager.swift /Users/admin/builder/spi-builder-workspace/Workflow/Sources/Workflow.swift /Users/admin/builder/spi-builder-workspace/Workflow/Sources/WorkflowAction.swift /Users/admin/builder/spi-builder-workspace/Workflow/Sources/WorkflowHost.swift /Users/admin/builder/spi-builder-workspace/Workflow/Sources/WorkflowLogger.swift /Users/admin/builder/spi-builder-workspace/Workflow/Sources/WorkflowNode.swift /Users/admin/builder/spi-builder-workspace/Workflow/Sources/WorkflowObserver.swift -target arm64-apple-watchos8.0 -Xllvm -aarch64-use-tbi -enable-objc-interop -stack-check -sdk /Applications/Xcode-16.2.0.app/Contents/Developer/Platforms/WatchOS.platform/Developer/SDKs/WatchOS11.2.sdk -I /Users/admin/builder/spi-builder-workspace/.derivedData/Build/Products/Debug-watchos -I /Applications/Xcode-16.2.0.app/Contents/Developer/Platforms/WatchOS.platform/Developer/usr/lib -F /Users/admin/builder/spi-builder-workspace/.derivedData/Build/Products/Debug-watchos/PackageFrameworks -F /Users/admin/builder/spi-builder-workspace/.derivedData/Build/Products/Debug-watchos -F /Applications/Xcode-16.2.0.app/Contents/Developer/Platforms/WatchOS.platform/Developer/Library/Frameworks -F /Applications/Xcode-16.2.0.app/Contents/Developer/Platforms/WatchOS.platform/Developer/SDKs/WatchOS11.2.sdk/Developer/Library/Frameworks -no-color-diagnostics -enable-testing -g -debug-info-format\=dwarf -dwarf-version\=4 -module-cache-path /Users/admin/builder/spi-builder-workspace/.derivedData/ModuleCache.noindex -profile-generate -profile-coverage-mapping -swift-version 5 -enforce-exclusivity\=checked -Onone -D SWIFT_PACKAGE -D DEBUG -D Xcode -serialize-debugging-options -const-gather-protocols-file /Users/admin/builder/spi-builder-workspace/.derivedData/Build/Intermediates.noindex/Workflow.build/Debug-watchos/Workflow.build/Objects-normal/arm64/Workflow_const_extract_protocols.json -enable-experimental-feature StrictConcurrency\=targeted -enable-experimental-feature DebugDescriptionMacro -enable-experimental-feature OpaqueTypeErasure -empty-abi-descriptor -plugin-path /Applications/Xcode-16.2.0.app/Contents/Developer/Toolchains/XcodeDefault.xctoolchain/usr/lib/swift/host/plugins/testing -validate-clang-modules-once -clang-build-session-file /Users/admin/builder/spi-builder-workspace/.derivedData/ModuleCache.noindex/Session.modulevalidation -Xcc -working-directory -Xcc /Users/admin/builder/spi-builder-workspace/.swiftpm/xcode -resource-dir /Applications/Xcode-16.2.0.app/Contents/Developer/Toolchains/XcodeDefault.xctoolchain/usr/lib/swift -enable-anonymous-context-mangled-names -file-compilation-dir /Users/admin/builder/spi-builder-workspace/.swiftpm/xcode -Xcc -D_LIBCPP_HARDENING_MODE\=_LIBCPP_HARDENING_MODE_DEBUG -Xcc -ivfsstatcache -Xcc /Users/admin/builder/spi-builder-workspace/.derivedData/SDKStatCaches.noindex/watchos11.2-22S97-8cb5c683f5e64b0ecfc74e8d0065fbf6.sdkstatcache -Xcc -I/Users/admin/builder/spi-builder-workspace/.derivedData/Build/Intermediates.noindex/Workflow.build/Debug-watchos/Workflow.build/swift-overrides.hmap -Xcc -I/Users/admin/builder/spi-builder-workspace/.derivedData/Build/Products/Debug-watchos/include -Xcc -I/Users/admin/builder/spi-builder-workspace/.derivedData/Build/Intermediates.noindex/Workflow.build/Debug-watchos/Workflow.build/DerivedSources-normal/arm64 -Xcc -I/Users/admin/builder/spi-builder-workspace/.derivedData/Build/Intermediates.noindex/Workflow.build/Debug-watchos/Workflow.build/DerivedSources/arm64 -Xcc -I/Users/admin/builder/spi-builder-workspace/.derivedData/Build/Intermediates.noindex/Workflow.build/Debug-watchos/Workflow.build/DerivedSources -Xcc -DSWIFT_PACKAGE -Xcc -DDEBUG\=1 -module-name Workflow -package-name spi_builder_workspace -frontend-parseable-output -disable-clang-spi -target-sdk-version 11.2 -target-sdk-name watchos11.2 -external-plugin-path /Applications/Xcode-16.2.0.app/Contents/Developer/Platforms/WatchOS.platform/Developer/usr/lib/swift/host/plugins\#/Applications/Xcode-16.2.0.app/Contents/Developer/Platforms/WatchOS.platform/Developer/usr/bin/swift-plugin-server -external-plugin-path /Applications/Xcode-16.2.0.app/Contents/Developer/Platforms/WatchOS.platform/Developer/usr/local/lib/swift/host/plugins\#/Applications/Xcode-16.2.0.app/Contents/Developer/Platforms/WatchOS.platform/Developer/usr/bin/swift-plugin-server -plugin-path /Applications/Xcode-16.2.0.app/Contents/Developer/Toolchains/XcodeDefault.xctoolchain/usr/lib/swift/host/plugins -plugin-path /Applications/Xcode-16.2.0.app/Contents/Developer/Toolchains/XcodeDefault.xctoolchain/usr/local/lib/swift/host/plugins -emit-module-doc-path /Users/admin/builder/spi-builder-workspace/.derivedData/Build/Intermediates.noindex/Workflow.build/Debug-watchos/Workflow.build/Objects-normal/arm64/Workflow.swiftdoc -emit-module-source-info-path /Users/admin/builder/spi-builder-workspace/.derivedData/Build/Intermediates.noindex/Workflow.build/Debug-watchos/Workflow.build/Objects-normal/arm64/Workflow.swiftsourceinfo -emit-objc-header-path /Users/admin/builder/spi-builder-workspace/.derivedData/Build/Intermediates.noindex/Workflow.build/Debug-watchos/Workflow.build/Objects-normal/arm64/Workflow-Swift.h -serialize-diagnostics-path /Users/admin/builder/spi-builder-workspace/.derivedData/Build/Intermediates.noindex/Workflow.build/Debug-watchos/Workflow.build/Objects-normal/arm64/Workflow-master-emit-module.dia -emit-dependencies-path /Users/admin/builder/spi-builder-workspace/.derivedData/Build/Intermediates.noindex/Workflow.build/Debug-watchos/Workflow.build/Objects-normal/arm64/Workflow-master-emit-module.d -o /Users/admin/builder/spi-builder-workspace/.derivedData/Build/Intermediates.noindex/Workflow.build/Debug-watchos/Workflow.build/Objects-normal/arm64/Workflow.swiftmodule -emit-abi-descriptor-path /Users/admin/builder/spi-builder-workspace/.derivedData/Build/Intermediates.noindex/Workflow.build/Debug-watchos/Workflow.build/Objects-normal/arm64/Workflow.abi.json
SwiftCompile normal arm64 Compiling\ Worker.swift /Users/admin/builder/spi-builder-workspace/WorkflowRxSwift/Sources/Worker.swift (in target 'WorkflowRxSwift' from project 'Workflow')
    cd /Users/admin/builder/spi-builder-workspace/.swiftpm/xcode
    builtin-swiftTaskExecution -- /Applications/Xcode-16.2.0.app/Contents/Developer/Toolchains/XcodeDefault.xctoolchain/usr/bin/swift-frontend -frontend -c /Users/admin/builder/spi-builder-workspace/WorkflowRxSwift/Sources/Logger.swift /Users/admin/builder/spi-builder-workspace/WorkflowRxSwift/Sources/ObservableWorkflow.swift -primary-file /Users/admin/builder/spi-builder-workspace/WorkflowRxSwift/Sources/Worker.swift -emit-dependencies-path /Users/admin/builder/spi-builder-workspace/.derivedData/Build/Intermediates.noindex/Workflow.build/Debug-watchos/WorkflowRxSwift.build/Objects-normal/arm64/Worker.d -emit-const-values-path /Users/admin/builder/spi-builder-workspace/.derivedData/Build/Intermediates.noindex/Workflow.build/Debug-watchos/WorkflowRxSwift.build/Objects-normal/arm64/Worker.swiftconstvalues -emit-reference-dependencies-path /Users/admin/builder/spi-builder-workspace/.derivedData/Build/Intermediates.noindex/Workflow.build/Debug-watchos/WorkflowRxSwift.build/Objects-normal/arm64/Worker.swiftdeps -serialize-diagnostics-path /Users/admin/builder/spi-builder-workspace/.derivedData/Build/Intermediates.noindex/Workflow.build/Debug-watchos/WorkflowRxSwift.build/Objects-normal/arm64/Worker.dia -target arm64-apple-watchos8.0 -Xllvm -aarch64-use-tbi -enable-objc-interop -stack-check -sdk /Applications/Xcode-16.2.0.app/Contents/Developer/Platforms/WatchOS.platform/Developer/SDKs/WatchOS11.2.sdk -I /Users/admin/builder/spi-builder-workspace/.derivedData/Build/Products/Debug-watchos -I /Applications/Xcode-16.2.0.app/Contents/Developer/Platforms/WatchOS.platform/Developer/usr/lib -F /Users/admin/builder/spi-builder-workspace/.derivedData/Build/Products/Debug-watchos/PackageFrameworks -F /Users/admin/builder/spi-builder-workspace/.derivedData/Build/Products/Debug-watchos/PackageFrameworks -F /Users/admin/builder/spi-builder-workspace/.derivedData/Build/Products/Debug-watchos/PackageFrameworks -F /Users/admin/builder/spi-builder-workspace/.derivedData/Build/Products/Debug-watchos -F /Applications/Xcode-16.2.0.app/Contents/Developer/Platforms/WatchOS.platform/Developer/Library/Frameworks -F /Applications/Xcode-16.2.0.app/Contents/Developer/Platforms/WatchOS.platform/Developer/SDKs/WatchOS11.2.sdk/Developer/Library/Frameworks -no-color-diagnostics -enable-testing -g -debug-info-format\=dwarf -dwarf-version\=4 -module-cache-path /Users/admin/builder/spi-builder-workspace/.derivedData/ModuleCache.noindex -profile-generate -profile-coverage-mapping -swift-version 5 -enforce-exclusivity\=checked -Onone -D SWIFT_PACKAGE -D DEBUG -D Xcode -serialize-debugging-options -const-gather-protocols-file /Users/admin/builder/spi-builder-workspace/.derivedData/Build/Intermediates.noindex/Workflow.build/Debug-watchos/WorkflowRxSwift.build/Objects-normal/arm64/WorkflowRxSwift_const_extract_protocols.json -enable-experimental-feature StrictConcurrency\=targeted -enable-experimental-feature DebugDescriptionMacro -enable-experimental-feature OpaqueTypeErasure -empty-abi-descriptor -plugin-path /Applications/Xcode-16.2.0.app/Contents/Developer/Toolchains/XcodeDefault.xctoolchain/usr/lib/swift/host/plugins/testing -validate-clang-modules-once -clang-build-session-file /Users/admin/builder/spi-builder-workspace/.derivedData/ModuleCache.noindex/Session.modulevalidation -Xcc -working-directory -Xcc /Users/admin/builder/spi-builder-workspace/.swiftpm/xcode -resource-dir /Applications/Xcode-16.2.0.app/Contents/Developer/Toolchains/XcodeDefault.xctoolchain/usr/lib/swift -enable-anonymous-context-mangled-names -file-compilation-dir /Users/admin/builder/spi-builder-workspace/.swiftpm/xcode -Xcc -D_LIBCPP_HARDENING_MODE\=_LIBCPP_HARDENING_MODE_DEBUG -Xcc -ivfsstatcache -Xcc /Users/admin/builder/spi-builder-workspace/.derivedData/SDKStatCaches.noindex/watchos11.2-22S97-8cb5c683f5e64b0ecfc74e8d0065fbf6.sdkstatcache -Xcc -I/Users/admin/builder/spi-builder-workspace/.derivedData/Build/Intermediates.noindex/Workflow.build/Debug-watchos/WorkflowRxSwift.build/swift-overrides.hmap -Xcc -I/Users/admin/builder/spi-builder-workspace/.derivedData/Build/Products/Debug-watchos/include -Xcc -I/Users/admin/builder/spi-builder-workspace/.derivedData/Build/Intermediates.noindex/Workflow.build/Debug-watchos/WorkflowRxSwift.build/DerivedSources-normal/arm64 -Xcc -I/Users/admin/builder/spi-builder-workspace/.derivedData/Build/Intermediates.noindex/Workflow.build/Debug-watchos/WorkflowRxSwift.build/DerivedSources/arm64 -Xcc -I/Users/admin/builder/spi-builder-workspace/.derivedData/Build/Intermediates.noindex/Workflow.build/Debug-watchos/WorkflowRxSwift.build/DerivedSources -Xcc -DSWIFT_PACKAGE -Xcc -DDEBUG\=1 -module-name WorkflowRxSwift -package-name spi_builder_workspace -frontend-parseable-output -disable-clang-spi -target-sdk-version 11.2 -target-sdk-name watchos11.2 -external-plugin-path /Applications/Xcode-16.2.0.app/Contents/Developer/Platforms/WatchOS.platform/Developer/usr/lib/swift/host/plugins\#/Applications/Xcode-16.2.0.app/Contents/Developer/Platforms/WatchOS.platform/Developer/usr/bin/swift-plugin-server -external-plugin-path /Applications/Xcode-16.2.0.app/Contents/Developer/Platforms/WatchOS.platform/Developer/usr/local/lib/swift/host/plugins\#/Applications/Xcode-16.2.0.app/Contents/Developer/Platforms/WatchOS.platform/Developer/usr/bin/swift-plugin-server -plugin-path /Applications/Xcode-16.2.0.app/Contents/Developer/Toolchains/XcodeDefault.xctoolchain/usr/lib/swift/host/plugins -plugin-path /Applications/Xcode-16.2.0.app/Contents/Developer/Toolchains/XcodeDefault.xctoolchain/usr/local/lib/swift/host/plugins -o /Users/admin/builder/spi-builder-workspace/.derivedData/Build/Intermediates.noindex/Workflow.build/Debug-watchos/WorkflowRxSwift.build/Objects-normal/arm64/Worker.o -index-unit-output-path /Workflow.build/Debug-watchos/WorkflowRxSwift.build/Objects-normal/arm64/Worker.o -index-store-path /Users/admin/builder/spi-builder-workspace/.derivedData/Index.noindex/DataStore -index-system-modules
SwiftCompile normal arm64 /Users/admin/builder/spi-builder-workspace/WorkflowRxSwift/Sources/Worker.swift (in target 'WorkflowRxSwift' from project 'Workflow')
    cd /Users/admin/builder/spi-builder-workspace/.swiftpm/xcode
    /Applications/Xcode-16.2.0.app/Contents/Developer/Toolchains/XcodeDefault.xctoolchain/usr/bin/swift-frontend -c /Users/admin/builder/spi-builder-workspace/WorkflowRxSwift/Sources/Logger.swift /Users/admin/builder/spi-builder-workspace/WorkflowRxSwift/Sources/ObservableWorkflow.swift -primary-file /Users/admin/builder/spi-builder-workspace/WorkflowRxSwift/Sources/Worker.swift -emit-dependencies-path /Users/admin/builder/spi-builder-workspace/.derivedData/Build/Intermediates.noindex/Workflow.build/Debug-watchos/WorkflowRxSwift.build/Objects-normal/arm64/Worker.d -emit-const-values-path /Users/admin/builder/spi-builder-workspace/.derivedData/Build/Intermediates.noindex/Workflow.build/Debug-watchos/WorkflowRxSwift.build/Objects-normal/arm64/Worker.swiftconstvalues -emit-reference-dependencies-path /Users/admin/builder/spi-builder-workspace/.derivedData/Build/Intermediates.noindex/Workflow.build/Debug-watchos/WorkflowRxSwift.build/Objects-normal/arm64/Worker.swiftdeps -serialize-diagnostics-path /Users/admin/builder/spi-builder-workspace/.derivedData/Build/Intermediates.noindex/Workflow.build/Debug-watchos/WorkflowRxSwift.build/Objects-normal/arm64/Worker.dia -target arm64-apple-watchos8.0 -Xllvm -aarch64-use-tbi -enable-objc-interop -stack-check -sdk /Applications/Xcode-16.2.0.app/Contents/Developer/Platforms/WatchOS.platform/Developer/SDKs/WatchOS11.2.sdk -I /Users/admin/builder/spi-builder-workspace/.derivedData/Build/Products/Debug-watchos -I /Applications/Xcode-16.2.0.app/Contents/Developer/Platforms/WatchOS.platform/Developer/usr/lib -F /Users/admin/builder/spi-builder-workspace/.derivedData/Build/Products/Debug-watchos/PackageFrameworks -F /Users/admin/builder/spi-builder-workspace/.derivedData/Build/Products/Debug-watchos/PackageFrameworks -F /Users/admin/builder/spi-builder-workspace/.derivedData/Build/Products/Debug-watchos/PackageFrameworks -F /Users/admin/builder/spi-builder-workspace/.derivedData/Build/Products/Debug-watchos -F /Applications/Xcode-16.2.0.app/Contents/Developer/Platforms/WatchOS.platform/Developer/Library/Frameworks -F /Applications/Xcode-16.2.0.app/Contents/Developer/Platforms/WatchOS.platform/Developer/SDKs/WatchOS11.2.sdk/Developer/Library/Frameworks -no-color-diagnostics -enable-testing -g -debug-info-format\=dwarf -dwarf-version\=4 -module-cache-path /Users/admin/builder/spi-builder-workspace/.derivedData/ModuleCache.noindex -profile-generate -profile-coverage-mapping -swift-version 5 -enforce-exclusivity\=checked -Onone -D SWIFT_PACKAGE -D DEBUG -D Xcode -serialize-debugging-options -const-gather-protocols-file /Users/admin/builder/spi-builder-workspace/.derivedData/Build/Intermediates.noindex/Workflow.build/Debug-watchos/WorkflowRxSwift.build/Objects-normal/arm64/WorkflowRxSwift_const_extract_protocols.json -enable-experimental-feature StrictConcurrency\=targeted -enable-experimental-feature DebugDescriptionMacro -enable-experimental-feature OpaqueTypeErasure -empty-abi-descriptor -plugin-path /Applications/Xcode-16.2.0.app/Contents/Developer/Toolchains/XcodeDefault.xctoolchain/usr/lib/swift/host/plugins/testing -validate-clang-modules-once -clang-build-session-file /Users/admin/builder/spi-builder-workspace/.derivedData/ModuleCache.noindex/Session.modulevalidation -Xcc -working-directory -Xcc /Users/admin/builder/spi-builder-workspace/.swiftpm/xcode -resource-dir /Applications/Xcode-16.2.0.app/Contents/Developer/Toolchains/XcodeDefault.xctoolchain/usr/lib/swift -enable-anonymous-context-mangled-names -file-compilation-dir /Users/admin/builder/spi-builder-workspace/.swiftpm/xcode -Xcc -D_LIBCPP_HARDENING_MODE\=_LIBCPP_HARDENING_MODE_DEBUG -Xcc -ivfsstatcache -Xcc /Users/admin/builder/spi-builder-workspace/.derivedData/SDKStatCaches.noindex/watchos11.2-22S97-8cb5c683f5e64b0ecfc74e8d0065fbf6.sdkstatcache -Xcc -I/Users/admin/builder/spi-builder-workspace/.derivedData/Build/Intermediates.noindex/Workflow.build/Debug-watchos/WorkflowRxSwift.build/swift-overrides.hmap -Xcc -I/Users/admin/builder/spi-builder-workspace/.derivedData/Build/Products/Debug-watchos/include -Xcc -I/Users/admin/builder/spi-builder-workspace/.derivedData/Build/Intermediates.noindex/Workflow.build/Debug-watchos/WorkflowRxSwift.build/DerivedSources-normal/arm64 -Xcc -I/Users/admin/builder/spi-builder-workspace/.derivedData/Build/Intermediates.noindex/Workflow.build/Debug-watchos/WorkflowRxSwift.build/DerivedSources/arm64 -Xcc -I/Users/admin/builder/spi-builder-workspace/.derivedData/Build/Intermediates.noindex/Workflow.build/Debug-watchos/WorkflowRxSwift.build/DerivedSources -Xcc -DSWIFT_PACKAGE -Xcc -DDEBUG\=1 -module-name WorkflowRxSwift -package-name spi_builder_workspace -frontend-parseable-output -disable-clang-spi -target-sdk-version 11.2 -target-sdk-name watchos11.2 -external-plugin-path /Applications/Xcode-16.2.0.app/Contents/Developer/Platforms/WatchOS.platform/Developer/usr/lib/swift/host/plugins\#/Applications/Xcode-16.2.0.app/Contents/Developer/Platforms/WatchOS.platform/Developer/usr/bin/swift-plugin-server -external-plugin-path /Applications/Xcode-16.2.0.app/Contents/Developer/Platforms/WatchOS.platform/Developer/usr/local/lib/swift/host/plugins\#/Applications/Xcode-16.2.0.app/Contents/Developer/Platforms/WatchOS.platform/Developer/usr/bin/swift-plugin-server -plugin-path /Applications/Xcode-16.2.0.app/Contents/Developer/Toolchains/XcodeDefault.xctoolchain/usr/lib/swift/host/plugins -plugin-path /Applications/Xcode-16.2.0.app/Contents/Developer/Toolchains/XcodeDefault.xctoolchain/usr/local/lib/swift/host/plugins -o /Users/admin/builder/spi-builder-workspace/.derivedData/Build/Intermediates.noindex/Workflow.build/Debug-watchos/WorkflowRxSwift.build/Objects-normal/arm64/Worker.o -index-unit-output-path /Workflow.build/Debug-watchos/WorkflowRxSwift.build/Objects-normal/arm64/Worker.o -index-store-path /Users/admin/builder/spi-builder-workspace/.derivedData/Index.noindex/DataStore -index-system-modules
SwiftDriverJobDiscovery normal arm64 Emitting module for WorkflowRxSwift (in target 'WorkflowRxSwift' from project 'Workflow')
SwiftDriverJobDiscovery normal armv7k Emitting module for WorkflowRxSwift (in target 'WorkflowRxSwift' from project 'Workflow')
SwiftDriverJobDiscovery normal arm64_32 Emitting module for WorkflowRxSwift (in target 'WorkflowRxSwift' from project 'Workflow')
SwiftDriverJobDiscovery normal arm64_32 Emitting module for WorkflowConcurrency (in target 'WorkflowConcurrency' from project 'Workflow')
SwiftDriverJobDiscovery normal arm64 Emitting module for WorkflowReactiveSwift (in target 'WorkflowReactiveSwift' from project 'Workflow')
SwiftDriverJobDiscovery normal arm64_32 Emitting module for WorkflowReactiveSwift (in target 'WorkflowReactiveSwift' from project 'Workflow')
SwiftDriver\ Compilation\ Requirements WorkflowRxSwift normal armv7k com.apple.xcode.tools.swift.compiler (in target 'WorkflowRxSwift' from project 'Workflow')
    cd /Users/admin/builder/spi-builder-workspace/.swiftpm/xcode
    builtin-Swift-Compilation-Requirements -- /Applications/Xcode-16.2.0.app/Contents/Developer/Toolchains/XcodeDefault.xctoolchain/usr/bin/swiftc -module-name WorkflowRxSwift -Onone -enforce-exclusivity\=checked @/Users/admin/builder/spi-builder-workspace/.derivedData/Build/Intermediates.noindex/Workflow.build/Debug-watchos/WorkflowRxSwift.build/Objects-normal/armv7k/WorkflowRxSwift.SwiftFileList -DSWIFT_PACKAGE -DDEBUG -DXcode -enable-experimental-feature StrictConcurrency\=targeted -plugin-path /Applications/Xcode-16.2.0.app/Contents/Developer/Toolchains/XcodeDefault.xctoolchain/usr/lib/swift/host/plugins/testing -enable-experimental-feature DebugDescriptionMacro -sdk /Applications/Xcode-16.2.0.app/Contents/Developer/Platforms/WatchOS.platform/Developer/SDKs/WatchOS11.2.sdk -target armv7k-apple-watchos8.0 -g -module-cache-path /Users/admin/builder/spi-builder-workspace/.derivedData/ModuleCache.noindex -Xfrontend -serialize-debugging-options -profile-coverage-mapping -profile-generate -enable-testing -index-store-path /Users/admin/builder/spi-builder-workspace/.derivedData/Index.noindex/DataStore -enable-experimental-feature OpaqueTypeErasure -Xcc -D_LIBCPP_HARDENING_MODE\=_LIBCPP_HARDENING_MODE_DEBUG -swift-version 5 -I /Users/admin/builder/spi-builder-workspace/.derivedData/Build/Products/Debug-watchos -I /Applications/Xcode-16.2.0.app/Contents/Developer/Platforms/WatchOS.platform/Developer/usr/lib -F /Users/admin/builder/spi-builder-workspace/.derivedData/Build/Products/Debug-watchos/PackageFrameworks -F /Users/admin/builder/spi-builder-workspace/.derivedData/Build/Products/Debug-watchos/PackageFrameworks -F /Users/admin/builder/spi-builder-workspace/.derivedData/Build/Products/Debug-watchos/PackageFrameworks -F /Users/admin/builder/spi-builder-workspace/.derivedData/Build/Products/Debug-watchos -F /Applications/Xcode-16.2.0.app/Contents/Developer/Platforms/WatchOS.platform/Developer/Library/Frameworks -F /Applications/Xcode-16.2.0.app/Contents/Developer/Platforms/WatchOS.platform/Developer/SDKs/WatchOS11.2.sdk/Developer/Library/Frameworks -c -j10 -enable-batch-mode -incremental -Xcc -ivfsstatcache -Xcc /Users/admin/builder/spi-builder-workspace/.derivedData/SDKStatCaches.noindex/watchos11.2-22S97-8cb5c683f5e64b0ecfc74e8d0065fbf6.sdkstatcache -output-file-map /Users/admin/builder/spi-builder-workspace/.derivedData/Build/Intermediates.noindex/Workflow.build/Debug-watchos/WorkflowRxSwift.build/Objects-normal/armv7k/WorkflowRxSwift-OutputFileMap.json -use-frontend-parseable-output -save-temps -no-color-diagnostics -serialize-diagnostics -emit-dependencies -emit-module -emit-module-path /Users/admin/builder/spi-builder-workspace/.derivedData/Build/Intermediates.noindex/Workflow.build/Debug-watchos/WorkflowRxSwift.build/Objects-normal/armv7k/WorkflowRxSwift.swiftmodule -validate-clang-modules-once -clang-build-session-file /Users/admin/builder/spi-builder-workspace/.derivedData/ModuleCache.noindex/Session.modulevalidation -package-name spi_builder_workspace -Xcc -I/Users/admin/builder/spi-builder-workspace/.derivedData/Build/Intermediates.noindex/Workflow.build/Debug-watchos/WorkflowRxSwift.build/swift-overrides.hmap -emit-const-values -Xfrontend -const-gather-protocols-file -Xfrontend /Users/admin/builder/spi-builder-workspace/.derivedData/Build/Intermediates.noindex/Workflow.build/Debug-watchos/WorkflowRxSwift.build/Objects-normal/armv7k/WorkflowRxSwift_const_extract_protocols.json -Xcc -I/Users/admin/builder/spi-builder-workspace/.derivedData/Build/Products/Debug-watchos/include -Xcc -I/Users/admin/builder/spi-builder-workspace/.derivedData/Build/Intermediates.noindex/Workflow.build/Debug-watchos/WorkflowRxSwift.build/DerivedSources-normal/armv7k -Xcc -I/Users/admin/builder/spi-builder-workspace/.derivedData/Build/Intermediates.noindex/Workflow.build/Debug-watchos/WorkflowRxSwift.build/DerivedSources/armv7k -Xcc -I/Users/admin/builder/spi-builder-workspace/.derivedData/Build/Intermediates.noindex/Workflow.build/Debug-watchos/WorkflowRxSwift.build/DerivedSources -Xcc -DSWIFT_PACKAGE -Xcc -DDEBUG\=1 -emit-objc-header -emit-objc-header-path /Users/admin/builder/spi-builder-workspace/.derivedData/Build/Intermediates.noindex/Workflow.build/Debug-watchos/WorkflowRxSwift.build/Objects-normal/armv7k/WorkflowRxSwift-Swift.h -working-directory /Users/admin/builder/spi-builder-workspace/.swiftpm/xcode -experimental-emit-module-separately -disable-cmo
SwiftDriver\ Compilation\ Requirements WorkflowRxSwift normal arm64_32 com.apple.xcode.tools.swift.compiler (in target 'WorkflowRxSwift' from project 'Workflow')
    cd /Users/admin/builder/spi-builder-workspace/.swiftpm/xcode
    builtin-Swift-Compilation-Requirements -- /Applications/Xcode-16.2.0.app/Contents/Developer/Toolchains/XcodeDefault.xctoolchain/usr/bin/swiftc -module-name WorkflowRxSwift -Onone -enforce-exclusivity\=checked @/Users/admin/builder/spi-builder-workspace/.derivedData/Build/Intermediates.noindex/Workflow.build/Debug-watchos/WorkflowRxSwift.build/Objects-normal/arm64_32/WorkflowRxSwift.SwiftFileList -DSWIFT_PACKAGE -DDEBUG -DXcode -enable-experimental-feature StrictConcurrency\=targeted -plugin-path /Applications/Xcode-16.2.0.app/Contents/Developer/Toolchains/XcodeDefault.xctoolchain/usr/lib/swift/host/plugins/testing -enable-experimental-feature DebugDescriptionMacro -sdk /Applications/Xcode-16.2.0.app/Contents/Developer/Platforms/WatchOS.platform/Developer/SDKs/WatchOS11.2.sdk -target arm64_32-apple-watchos8.0 -g -module-cache-path /Users/admin/builder/spi-builder-workspace/.derivedData/ModuleCache.noindex -Xfrontend -serialize-debugging-options -profile-coverage-mapping -profile-generate -enable-testing -index-store-path /Users/admin/builder/spi-builder-workspace/.derivedData/Index.noindex/DataStore -enable-experimental-feature OpaqueTypeErasure -Xcc -D_LIBCPP_HARDENING_MODE\=_LIBCPP_HARDENING_MODE_DEBUG -swift-version 5 -I /Users/admin/builder/spi-builder-workspace/.derivedData/Build/Products/Debug-watchos -I /Applications/Xcode-16.2.0.app/Contents/Developer/Platforms/WatchOS.platform/Developer/usr/lib -F /Users/admin/builder/spi-builder-workspace/.derivedData/Build/Products/Debug-watchos/PackageFrameworks -F /Users/admin/builder/spi-builder-workspace/.derivedData/Build/Products/Debug-watchos/PackageFrameworks -F /Users/admin/builder/spi-builder-workspace/.derivedData/Build/Products/Debug-watchos/PackageFrameworks -F /Users/admin/builder/spi-builder-workspace/.derivedData/Build/Products/Debug-watchos -F /Applications/Xcode-16.2.0.app/Contents/Developer/Platforms/WatchOS.platform/Developer/Library/Frameworks -F /Applications/Xcode-16.2.0.app/Contents/Developer/Platforms/WatchOS.platform/Developer/SDKs/WatchOS11.2.sdk/Developer/Library/Frameworks -c -j10 -enable-batch-mode -incremental -Xcc -ivfsstatcache -Xcc /Users/admin/builder/spi-builder-workspace/.derivedData/SDKStatCaches.noindex/watchos11.2-22S97-8cb5c683f5e64b0ecfc74e8d0065fbf6.sdkstatcache -output-file-map /Users/admin/builder/spi-builder-workspace/.derivedData/Build/Intermediates.noindex/Workflow.build/Debug-watchos/WorkflowRxSwift.build/Objects-normal/arm64_32/WorkflowRxSwift-OutputFileMap.json -use-frontend-parseable-output -save-temps -no-color-diagnostics -serialize-diagnostics -emit-dependencies -emit-module -emit-module-path /Users/admin/builder/spi-builder-workspace/.derivedData/Build/Intermediates.noindex/Workflow.build/Debug-watchos/WorkflowRxSwift.build/Objects-normal/arm64_32/WorkflowRxSwift.swiftmodule -validate-clang-modules-once -clang-build-session-file /Users/admin/builder/spi-builder-workspace/.derivedData/ModuleCache.noindex/Session.modulevalidation -package-name spi_builder_workspace -Xcc -I/Users/admin/builder/spi-builder-workspace/.derivedData/Build/Intermediates.noindex/Workflow.build/Debug-watchos/WorkflowRxSwift.build/swift-overrides.hmap -emit-const-values -Xfrontend -const-gather-protocols-file -Xfrontend /Users/admin/builder/spi-builder-workspace/.derivedData/Build/Intermediates.noindex/Workflow.build/Debug-watchos/WorkflowRxSwift.build/Objects-normal/arm64_32/WorkflowRxSwift_const_extract_protocols.json -Xcc -I/Users/admin/builder/spi-builder-workspace/.derivedData/Build/Products/Debug-watchos/include -Xcc -I/Users/admin/builder/spi-builder-workspace/.derivedData/Build/Intermediates.noindex/Workflow.build/Debug-watchos/WorkflowRxSwift.build/DerivedSources-normal/arm64_32 -Xcc -I/Users/admin/builder/spi-builder-workspace/.derivedData/Build/Intermediates.noindex/Workflow.build/Debug-watchos/WorkflowRxSwift.build/DerivedSources/arm64_32 -Xcc -I/Users/admin/builder/spi-builder-workspace/.derivedData/Build/Intermediates.noindex/Workflow.build/Debug-watchos/WorkflowRxSwift.build/DerivedSources -Xcc -DSWIFT_PACKAGE -Xcc -DDEBUG\=1 -emit-objc-header -emit-objc-header-path /Users/admin/builder/spi-builder-workspace/.derivedData/Build/Intermediates.noindex/Workflow.build/Debug-watchos/WorkflowRxSwift.build/Objects-normal/arm64_32/WorkflowRxSwift-Swift.h -working-directory /Users/admin/builder/spi-builder-workspace/.swiftpm/xcode -experimental-emit-module-separately -disable-cmo
SwiftDriver\ Compilation\ Requirements WorkflowRxSwift normal arm64 com.apple.xcode.tools.swift.compiler (in target 'WorkflowRxSwift' from project 'Workflow')
    cd /Users/admin/builder/spi-builder-workspace/.swiftpm/xcode
    builtin-Swift-Compilation-Requirements -- /Applications/Xcode-16.2.0.app/Contents/Developer/Toolchains/XcodeDefault.xctoolchain/usr/bin/swiftc -module-name WorkflowRxSwift -Onone -enforce-exclusivity\=checked @/Users/admin/builder/spi-builder-workspace/.derivedData/Build/Intermediates.noindex/Workflow.build/Debug-watchos/WorkflowRxSwift.build/Objects-normal/arm64/WorkflowRxSwift.SwiftFileList -DSWIFT_PACKAGE -DDEBUG -DXcode -enable-experimental-feature StrictConcurrency\=targeted -plugin-path /Applications/Xcode-16.2.0.app/Contents/Developer/Toolchains/XcodeDefault.xctoolchain/usr/lib/swift/host/plugins/testing -enable-experimental-feature DebugDescriptionMacro -sdk /Applications/Xcode-16.2.0.app/Contents/Developer/Platforms/WatchOS.platform/Developer/SDKs/WatchOS11.2.sdk -target arm64-apple-watchos8.0 -g -module-cache-path /Users/admin/builder/spi-builder-workspace/.derivedData/ModuleCache.noindex -Xfrontend -serialize-debugging-options -profile-coverage-mapping -profile-generate -enable-testing -index-store-path /Users/admin/builder/spi-builder-workspace/.derivedData/Index.noindex/DataStore -enable-experimental-feature OpaqueTypeErasure -Xcc -D_LIBCPP_HARDENING_MODE\=_LIBCPP_HARDENING_MODE_DEBUG -swift-version 5 -I /Users/admin/builder/spi-builder-workspace/.derivedData/Build/Products/Debug-watchos -I /Applications/Xcode-16.2.0.app/Contents/Developer/Platforms/WatchOS.platform/Developer/usr/lib -F /Users/admin/builder/spi-builder-workspace/.derivedData/Build/Products/Debug-watchos/PackageFrameworks -F /Users/admin/builder/spi-builder-workspace/.derivedData/Build/Products/Debug-watchos/PackageFrameworks -F /Users/admin/builder/spi-builder-workspace/.derivedData/Build/Products/Debug-watchos/PackageFrameworks -F /Users/admin/builder/spi-builder-workspace/.derivedData/Build/Products/Debug-watchos -F /Applications/Xcode-16.2.0.app/Contents/Developer/Platforms/WatchOS.platform/Developer/Library/Frameworks -F /Applications/Xcode-16.2.0.app/Contents/Developer/Platforms/WatchOS.platform/Developer/SDKs/WatchOS11.2.sdk/Developer/Library/Frameworks -c -j10 -enable-batch-mode -incremental -Xcc -ivfsstatcache -Xcc /Users/admin/builder/spi-builder-workspace/.derivedData/SDKStatCaches.noindex/watchos11.2-22S97-8cb5c683f5e64b0ecfc74e8d0065fbf6.sdkstatcache -output-file-map /Users/admin/builder/spi-builder-workspace/.derivedData/Build/Intermediates.noindex/Workflow.build/Debug-watchos/WorkflowRxSwift.build/Objects-normal/arm64/WorkflowRxSwift-OutputFileMap.json -use-frontend-parseable-output -save-temps -no-color-diagnostics -serialize-diagnostics -emit-dependencies -emit-module -emit-module-path /Users/admin/builder/spi-builder-workspace/.derivedData/Build/Intermediates.noindex/Workflow.build/Debug-watchos/WorkflowRxSwift.build/Objects-normal/arm64/WorkflowRxSwift.swiftmodule -validate-clang-modules-once -clang-build-session-file /Users/admin/builder/spi-builder-workspace/.derivedData/ModuleCache.noindex/Session.modulevalidation -package-name spi_builder_workspace -Xcc -I/Users/admin/builder/spi-builder-workspace/.derivedData/Build/Intermediates.noindex/Workflow.build/Debug-watchos/WorkflowRxSwift.build/swift-overrides.hmap -emit-const-values -Xfrontend -const-gather-protocols-file -Xfrontend /Users/admin/builder/spi-builder-workspace/.derivedData/Build/Intermediates.noindex/Workflow.build/Debug-watchos/WorkflowRxSwift.build/Objects-normal/arm64/WorkflowRxSwift_const_extract_protocols.json -Xcc -I/Users/admin/builder/spi-builder-workspace/.derivedData/Build/Products/Debug-watchos/include -Xcc -I/Users/admin/builder/spi-builder-workspace/.derivedData/Build/Intermediates.noindex/Workflow.build/Debug-watchos/WorkflowRxSwift.build/DerivedSources-normal/arm64 -Xcc -I/Users/admin/builder/spi-builder-workspace/.derivedData/Build/Intermediates.noindex/Workflow.build/Debug-watchos/WorkflowRxSwift.build/DerivedSources/arm64 -Xcc -I/Users/admin/builder/spi-builder-workspace/.derivedData/Build/Intermediates.noindex/Workflow.build/Debug-watchos/WorkflowRxSwift.build/DerivedSources -Xcc -DSWIFT_PACKAGE -Xcc -DDEBUG\=1 -emit-objc-header -emit-objc-header-path /Users/admin/builder/spi-builder-workspace/.derivedData/Build/Intermediates.noindex/Workflow.build/Debug-watchos/WorkflowRxSwift.build/Objects-normal/arm64/WorkflowRxSwift-Swift.h -working-directory /Users/admin/builder/spi-builder-workspace/.swiftpm/xcode -experimental-emit-module-separately -disable-cmo
SwiftDriverJobDiscovery normal armv7k Emitting module for WorkflowReactiveSwift (in target 'WorkflowReactiveSwift' from project 'Workflow')
Copy /Users/admin/builder/spi-builder-workspace/.derivedData/Build/Products/Debug-watchos/WorkflowRxSwift.swiftmodule/armv7k-apple-watchos.swiftmodule /Users/admin/builder/spi-builder-workspace/.derivedData/Build/Intermediates.noindex/Workflow.build/Debug-watchos/WorkflowRxSwift.build/Objects-normal/armv7k/WorkflowRxSwift.swiftmodule (in target 'WorkflowRxSwift' from project 'Workflow')
    cd /Users/admin/builder/spi-builder-workspace
    builtin-copy -exclude .DS_Store -exclude CVS -exclude .svn -exclude .git -exclude .hg -resolve-src-symlinks -rename /Users/admin/builder/spi-builder-workspace/.derivedData/Build/Intermediates.noindex/Workflow.build/Debug-watchos/WorkflowRxSwift.build/Objects-normal/armv7k/WorkflowRxSwift.swiftmodule /Users/admin/builder/spi-builder-workspace/.derivedData/Build/Products/Debug-watchos/WorkflowRxSwift.swiftmodule/armv7k-apple-watchos.swiftmodule
Copy /Users/admin/builder/spi-builder-workspace/.derivedData/Build/Products/Debug-watchos/WorkflowRxSwift.swiftmodule/armv7k-apple-watchos.swiftdoc /Users/admin/builder/spi-builder-workspace/.derivedData/Build/Intermediates.noindex/Workflow.build/Debug-watchos/WorkflowRxSwift.build/Objects-normal/armv7k/WorkflowRxSwift.swiftdoc (in target 'WorkflowRxSwift' from project 'Workflow')
    cd /Users/admin/builder/spi-builder-workspace
    builtin-copy -exclude .DS_Store -exclude CVS -exclude .svn -exclude .git -exclude .hg -resolve-src-symlinks -rename /Users/admin/builder/spi-builder-workspace/.derivedData/Build/Intermediates.noindex/Workflow.build/Debug-watchos/WorkflowRxSwift.build/Objects-normal/armv7k/WorkflowRxSwift.swiftdoc /Users/admin/builder/spi-builder-workspace/.derivedData/Build/Products/Debug-watchos/WorkflowRxSwift.swiftmodule/armv7k-apple-watchos.swiftdoc
SwiftMergeGeneratedHeaders /Users/admin/builder/spi-builder-workspace/.derivedData/Build/Intermediates.noindex/GeneratedModuleMaps-watchos/WorkflowRxSwift-Swift.h /Users/admin/builder/spi-builder-workspace/.derivedData/Build/Intermediates.noindex/Workflow.build/Debug-watchos/WorkflowRxSwift.build/Objects-normal/arm64/WorkflowRxSwift-Swift.h /Users/admin/builder/spi-builder-workspace/.derivedData/Build/Intermediates.noindex/Workflow.build/Debug-watchos/WorkflowRxSwift.build/Objects-normal/arm64_32/WorkflowRxSwift-Swift.h /Users/admin/builder/spi-builder-workspace/.derivedData/Build/Intermediates.noindex/Workflow.build/Debug-watchos/WorkflowRxSwift.build/Objects-normal/armv7k/WorkflowRxSwift-Swift.h (in target 'WorkflowRxSwift' from project 'Workflow')
    cd /Users/admin/builder/spi-builder-workspace
    builtin-swiftHeaderTool -arch arm64 /Users/admin/builder/spi-builder-workspace/.derivedData/Build/Intermediates.noindex/Workflow.build/Debug-watchos/WorkflowRxSwift.build/Objects-normal/arm64/WorkflowRxSwift-Swift.h -arch arm64_32 /Users/admin/builder/spi-builder-workspace/.derivedData/Build/Intermediates.noindex/Workflow.build/Debug-watchos/WorkflowRxSwift.build/Objects-normal/arm64_32/WorkflowRxSwift-Swift.h -arch armv7k /Users/admin/builder/spi-builder-workspace/.derivedData/Build/Intermediates.noindex/Workflow.build/Debug-watchos/WorkflowRxSwift.build/Objects-normal/armv7k/WorkflowRxSwift-Swift.h -o /Users/admin/builder/spi-builder-workspace/.derivedData/Build/Intermediates.noindex/GeneratedModuleMaps-watchos/WorkflowRxSwift-Swift.h
Copy /Users/admin/builder/spi-builder-workspace/.derivedData/Build/Products/Debug-watchos/WorkflowRxSwift.swiftmodule/armv7k-apple-watchos.abi.json /Users/admin/builder/spi-builder-workspace/.derivedData/Build/Intermediates.noindex/Workflow.build/Debug-watchos/WorkflowRxSwift.build/Objects-normal/armv7k/WorkflowRxSwift.abi.json (in target 'WorkflowRxSwift' from project 'Workflow')
    cd /Users/admin/builder/spi-builder-workspace
    builtin-copy -exclude .DS_Store -exclude CVS -exclude .svn -exclude .git -exclude .hg -resolve-src-symlinks -rename /Users/admin/builder/spi-builder-workspace/.derivedData/Build/Intermediates.noindex/Workflow.build/Debug-watchos/WorkflowRxSwift.build/Objects-normal/armv7k/WorkflowRxSwift.abi.json /Users/admin/builder/spi-builder-workspace/.derivedData/Build/Products/Debug-watchos/WorkflowRxSwift.swiftmodule/armv7k-apple-watchos.abi.json
Copy /Users/admin/builder/spi-builder-workspace/.derivedData/Build/Products/Debug-watchos/WorkflowRxSwift.swiftmodule/arm64_32-apple-watchos.swiftmodule /Users/admin/builder/spi-builder-workspace/.derivedData/Build/Intermediates.noindex/Workflow.build/Debug-watchos/WorkflowRxSwift.build/Objects-normal/arm64_32/WorkflowRxSwift.swiftmodule (in target 'WorkflowRxSwift' from project 'Workflow')
    cd /Users/admin/builder/spi-builder-workspace
    builtin-copy -exclude .DS_Store -exclude CVS -exclude .svn -exclude .git -exclude .hg -resolve-src-symlinks -rename /Users/admin/builder/spi-builder-workspace/.derivedData/Build/Intermediates.noindex/Workflow.build/Debug-watchos/WorkflowRxSwift.build/Objects-normal/arm64_32/WorkflowRxSwift.swiftmodule /Users/admin/builder/spi-builder-workspace/.derivedData/Build/Products/Debug-watchos/WorkflowRxSwift.swiftmodule/arm64_32-apple-watchos.swiftmodule
Copy /Users/admin/builder/spi-builder-workspace/.derivedData/Build/Products/Debug-watchos/WorkflowRxSwift.swiftmodule/arm64_32-apple-watchos.swiftdoc /Users/admin/builder/spi-builder-workspace/.derivedData/Build/Intermediates.noindex/Workflow.build/Debug-watchos/WorkflowRxSwift.build/Objects-normal/arm64_32/WorkflowRxSwift.swiftdoc (in target 'WorkflowRxSwift' from project 'Workflow')
    cd /Users/admin/builder/spi-builder-workspace
    builtin-copy -exclude .DS_Store -exclude CVS -exclude .svn -exclude .git -exclude .hg -resolve-src-symlinks -rename /Users/admin/builder/spi-builder-workspace/.derivedData/Build/Intermediates.noindex/Workflow.build/Debug-watchos/WorkflowRxSwift.build/Objects-normal/arm64_32/WorkflowRxSwift.swiftdoc /Users/admin/builder/spi-builder-workspace/.derivedData/Build/Products/Debug-watchos/WorkflowRxSwift.swiftmodule/arm64_32-apple-watchos.swiftdoc
Copy /Users/admin/builder/spi-builder-workspace/.derivedData/Build/Products/Debug-watchos/WorkflowRxSwift.swiftmodule/arm64_32-apple-watchos.abi.json /Users/admin/builder/spi-builder-workspace/.derivedData/Build/Intermediates.noindex/Workflow.build/Debug-watchos/WorkflowRxSwift.build/Objects-normal/arm64_32/WorkflowRxSwift.abi.json (in target 'WorkflowRxSwift' from project 'Workflow')
    cd /Users/admin/builder/spi-builder-workspace
    builtin-copy -exclude .DS_Store -exclude CVS -exclude .svn -exclude .git -exclude .hg -resolve-src-symlinks -rename /Users/admin/builder/spi-builder-workspace/.derivedData/Build/Intermediates.noindex/Workflow.build/Debug-watchos/WorkflowRxSwift.build/Objects-normal/arm64_32/WorkflowRxSwift.abi.json /Users/admin/builder/spi-builder-workspace/.derivedData/Build/Products/Debug-watchos/WorkflowRxSwift.swiftmodule/arm64_32-apple-watchos.abi.json
Copy /Users/admin/builder/spi-builder-workspace/.derivedData/Build/Products/Debug-watchos/WorkflowRxSwift.swiftmodule/arm64-apple-watchos.swiftmodule /Users/admin/builder/spi-builder-workspace/.derivedData/Build/Intermediates.noindex/Workflow.build/Debug-watchos/WorkflowRxSwift.build/Objects-normal/arm64/WorkflowRxSwift.swiftmodule (in target 'WorkflowRxSwift' from project 'Workflow')
    cd /Users/admin/builder/spi-builder-workspace
    builtin-copy -exclude .DS_Store -exclude CVS -exclude .svn -exclude .git -exclude .hg -resolve-src-symlinks -rename /Users/admin/builder/spi-builder-workspace/.derivedData/Build/Intermediates.noindex/Workflow.build/Debug-watchos/WorkflowRxSwift.build/Objects-normal/arm64/WorkflowRxSwift.swiftmodule /Users/admin/builder/spi-builder-workspace/.derivedData/Build/Products/Debug-watchos/WorkflowRxSwift.swiftmodule/arm64-apple-watchos.swiftmodule
Copy /Users/admin/builder/spi-builder-workspace/.derivedData/Build/Products/Debug-watchos/WorkflowRxSwift.swiftmodule/arm64-apple-watchos.swiftdoc /Users/admin/builder/spi-builder-workspace/.derivedData/Build/Intermediates.noindex/Workflow.build/Debug-watchos/WorkflowRxSwift.build/Objects-normal/arm64/WorkflowRxSwift.swiftdoc (in target 'WorkflowRxSwift' from project 'Workflow')
    cd /Users/admin/builder/spi-builder-workspace
    builtin-copy -exclude .DS_Store -exclude CVS -exclude .svn -exclude .git -exclude .hg -resolve-src-symlinks -rename /Users/admin/builder/spi-builder-workspace/.derivedData/Build/Intermediates.noindex/Workflow.build/Debug-watchos/WorkflowRxSwift.build/Objects-normal/arm64/WorkflowRxSwift.swiftdoc /Users/admin/builder/spi-builder-workspace/.derivedData/Build/Products/Debug-watchos/WorkflowRxSwift.swiftmodule/arm64-apple-watchos.swiftdoc
Copy /Users/admin/builder/spi-builder-workspace/.derivedData/Build/Products/Debug-watchos/WorkflowRxSwift.swiftmodule/arm64-apple-watchos.abi.json /Users/admin/builder/spi-builder-workspace/.derivedData/Build/Intermediates.noindex/Workflow.build/Debug-watchos/WorkflowRxSwift.build/Objects-normal/arm64/WorkflowRxSwift.abi.json (in target 'WorkflowRxSwift' from project 'Workflow')
    cd /Users/admin/builder/spi-builder-workspace
    builtin-copy -exclude .DS_Store -exclude CVS -exclude .svn -exclude .git -exclude .hg -resolve-src-symlinks -rename /Users/admin/builder/spi-builder-workspace/.derivedData/Build/Intermediates.noindex/Workflow.build/Debug-watchos/WorkflowRxSwift.build/Objects-normal/arm64/WorkflowRxSwift.abi.json /Users/admin/builder/spi-builder-workspace/.derivedData/Build/Products/Debug-watchos/WorkflowRxSwift.swiftmodule/arm64-apple-watchos.abi.json
Copy /Users/admin/builder/spi-builder-workspace/.derivedData/Build/Products/Debug-watchos/WorkflowRxSwift.swiftmodule/Project/armv7k-apple-watchos.swiftsourceinfo /Users/admin/builder/spi-builder-workspace/.derivedData/Build/Intermediates.noindex/Workflow.build/Debug-watchos/WorkflowRxSwift.build/Objects-normal/armv7k/WorkflowRxSwift.swiftsourceinfo (in target 'WorkflowRxSwift' from project 'Workflow')
    cd /Users/admin/builder/spi-builder-workspace
    builtin-copy -exclude .DS_Store -exclude CVS -exclude .svn -exclude .git -exclude .hg -resolve-src-symlinks -rename /Users/admin/builder/spi-builder-workspace/.derivedData/Build/Intermediates.noindex/Workflow.build/Debug-watchos/WorkflowRxSwift.build/Objects-normal/armv7k/WorkflowRxSwift.swiftsourceinfo /Users/admin/builder/spi-builder-workspace/.derivedData/Build/Products/Debug-watchos/WorkflowRxSwift.swiftmodule/Project/armv7k-apple-watchos.swiftsourceinfo
Copy /Users/admin/builder/spi-builder-workspace/.derivedData/Build/Products/Debug-watchos/WorkflowRxSwift.swiftmodule/Project/arm64_32-apple-watchos.swiftsourceinfo /Users/admin/builder/spi-builder-workspace/.derivedData/Build/Intermediates.noindex/Workflow.build/Debug-watchos/WorkflowRxSwift.build/Objects-normal/arm64_32/WorkflowRxSwift.swiftsourceinfo (in target 'WorkflowRxSwift' from project 'Workflow')
    cd /Users/admin/builder/spi-builder-workspace
    builtin-copy -exclude .DS_Store -exclude CVS -exclude .svn -exclude .git -exclude .hg -resolve-src-symlinks -rename /Users/admin/builder/spi-builder-workspace/.derivedData/Build/Intermediates.noindex/Workflow.build/Debug-watchos/WorkflowRxSwift.build/Objects-normal/arm64_32/WorkflowRxSwift.swiftsourceinfo /Users/admin/builder/spi-builder-workspace/.derivedData/Build/Products/Debug-watchos/WorkflowRxSwift.swiftmodule/Project/arm64_32-apple-watchos.swiftsourceinfo
Copy /Users/admin/builder/spi-builder-workspace/.derivedData/Build/Products/Debug-watchos/WorkflowRxSwift.swiftmodule/Project/arm64-apple-watchos.swiftsourceinfo /Users/admin/builder/spi-builder-workspace/.derivedData/Build/Intermediates.noindex/Workflow.build/Debug-watchos/WorkflowRxSwift.build/Objects-normal/arm64/WorkflowRxSwift.swiftsourceinfo (in target 'WorkflowRxSwift' from project 'Workflow')
    cd /Users/admin/builder/spi-builder-workspace
    builtin-copy -exclude .DS_Store -exclude CVS -exclude .svn -exclude .git -exclude .hg -resolve-src-symlinks -rename /Users/admin/builder/spi-builder-workspace/.derivedData/Build/Intermediates.noindex/Workflow.build/Debug-watchos/WorkflowRxSwift.build/Objects-normal/arm64/WorkflowRxSwift.swiftsourceinfo /Users/admin/builder/spi-builder-workspace/.derivedData/Build/Products/Debug-watchos/WorkflowRxSwift.swiftmodule/Project/arm64-apple-watchos.swiftsourceinfo
SwiftDriver\ Compilation\ Requirements WorkflowReactiveSwift normal armv7k com.apple.xcode.tools.swift.compiler (in target 'WorkflowReactiveSwift' from project 'Workflow')
    cd /Users/admin/builder/spi-builder-workspace/.swiftpm/xcode
    builtin-Swift-Compilation-Requirements -- /Applications/Xcode-16.2.0.app/Contents/Developer/Toolchains/XcodeDefault.xctoolchain/usr/bin/swiftc -module-name WorkflowReactiveSwift -Onone -enforce-exclusivity\=checked @/Users/admin/builder/spi-builder-workspace/.derivedData/Build/Intermediates.noindex/Workflow.build/Debug-watchos/WorkflowReactiveSwift.build/Objects-normal/armv7k/WorkflowReactiveSwift.SwiftFileList -DSWIFT_PACKAGE -DDEBUG -DXcode -enable-experimental-feature StrictConcurrency\=targeted -plugin-path /Applications/Xcode-16.2.0.app/Contents/Developer/Toolchains/XcodeDefault.xctoolchain/usr/lib/swift/host/plugins/testing -enable-experimental-feature DebugDescriptionMacro -sdk /Applications/Xcode-16.2.0.app/Contents/Developer/Platforms/WatchOS.platform/Developer/SDKs/WatchOS11.2.sdk -target armv7k-apple-watchos8.0 -g -module-cache-path /Users/admin/builder/spi-builder-workspace/.derivedData/ModuleCache.noindex -Xfrontend -serialize-debugging-options -profile-coverage-mapping -profile-generate -enable-testing -index-store-path /Users/admin/builder/spi-builder-workspace/.derivedData/Index.noindex/DataStore -enable-experimental-feature OpaqueTypeErasure -Xcc -D_LIBCPP_HARDENING_MODE\=_LIBCPP_HARDENING_MODE_DEBUG -swift-version 5 -I /Users/admin/builder/spi-builder-workspace/.derivedData/Build/Products/Debug-watchos -I /Applications/Xcode-16.2.0.app/Contents/Developer/Platforms/WatchOS.platform/Developer/usr/lib -F /Users/admin/builder/spi-builder-workspace/.derivedData/Build/Products/Debug-watchos/PackageFrameworks -F /Users/admin/builder/spi-builder-workspace/.derivedData/Build/Products/Debug-watchos/PackageFrameworks -F /Users/admin/builder/spi-builder-workspace/.derivedData/Build/Products/Debug-watchos -F /Applications/Xcode-16.2.0.app/Contents/Developer/Platforms/WatchOS.platform/Developer/Library/Frameworks -F /Applications/Xcode-16.2.0.app/Contents/Developer/Platforms/WatchOS.platform/Developer/SDKs/WatchOS11.2.sdk/Developer/Library/Frameworks -c -j10 -enable-batch-mode -incremental -Xcc -ivfsstatcache -Xcc /Users/admin/builder/spi-builder-workspace/.derivedData/SDKStatCaches.noindex/watchos11.2-22S97-8cb5c683f5e64b0ecfc74e8d0065fbf6.sdkstatcache -output-file-map /Users/admin/builder/spi-builder-workspace/.derivedData/Build/Intermediates.noindex/Workflow.build/Debug-watchos/WorkflowReactiveSwift.build/Objects-normal/armv7k/WorkflowReactiveSwift-OutputFileMap.json -use-frontend-parseable-output -save-temps -no-color-diagnostics -serialize-diagnostics -emit-dependencies -emit-module -emit-module-path /Users/admin/builder/spi-builder-workspace/.derivedData/Build/Intermediates.noindex/Workflow.build/Debug-watchos/WorkflowReactiveSwift.build/Objects-normal/armv7k/WorkflowReactiveSwift.swiftmodule -validate-clang-modules-once -clang-build-session-file /Users/admin/builder/spi-builder-workspace/.derivedData/ModuleCache.noindex/Session.modulevalidation -package-name spi_builder_workspace -Xcc -I/Users/admin/builder/spi-builder-workspace/.derivedData/Build/Intermediates.noindex/Workflow.build/Debug-watchos/WorkflowReactiveSwift.build/swift-overrides.hmap -emit-const-values -Xfrontend -const-gather-protocols-file -Xfrontend /Users/admin/builder/spi-builder-workspace/.derivedData/Build/Intermediates.noindex/Workflow.build/Debug-watchos/WorkflowReactiveSwift.build/Objects-normal/armv7k/WorkflowReactiveSwift_const_extract_protocols.json -Xcc -I/Users/admin/builder/spi-builder-workspace/.derivedData/Build/Products/Debug-watchos/include -Xcc -I/Users/admin/builder/spi-builder-workspace/.derivedData/Build/Intermediates.noindex/Workflow.build/Debug-watchos/WorkflowReactiveSwift.build/DerivedSources-normal/armv7k -Xcc -I/Users/admin/builder/spi-builder-workspace/.derivedData/Build/Intermediates.noindex/Workflow.build/Debug-watchos/WorkflowReactiveSwift.build/DerivedSources/armv7k -Xcc -I/Users/admin/builder/spi-builder-workspace/.derivedData/Build/Intermediates.noindex/Workflow.build/Debug-watchos/WorkflowReactiveSwift.build/DerivedSources -Xcc -DSWIFT_PACKAGE -Xcc -DDEBUG\=1 -emit-objc-header -emit-objc-header-path /Users/admin/builder/spi-builder-workspace/.derivedData/Build/Intermediates.noindex/Workflow.build/Debug-watchos/WorkflowReactiveSwift.build/Objects-normal/armv7k/WorkflowReactiveSwift-Swift.h -working-directory /Users/admin/builder/spi-builder-workspace/.swiftpm/xcode -experimental-emit-module-separately -disable-cmo
SwiftDriver\ Compilation\ Requirements WorkflowReactiveSwift normal arm64_32 com.apple.xcode.tools.swift.compiler (in target 'WorkflowReactiveSwift' from project 'Workflow')
    cd /Users/admin/builder/spi-builder-workspace/.swiftpm/xcode
    builtin-Swift-Compilation-Requirements -- /Applications/Xcode-16.2.0.app/Contents/Developer/Toolchains/XcodeDefault.xctoolchain/usr/bin/swiftc -module-name WorkflowReactiveSwift -Onone -enforce-exclusivity\=checked @/Users/admin/builder/spi-builder-workspace/.derivedData/Build/Intermediates.noindex/Workflow.build/Debug-watchos/WorkflowReactiveSwift.build/Objects-normal/arm64_32/WorkflowReactiveSwift.SwiftFileList -DSWIFT_PACKAGE -DDEBUG -DXcode -enable-experimental-feature StrictConcurrency\=targeted -plugin-path /Applications/Xcode-16.2.0.app/Contents/Developer/Toolchains/XcodeDefault.xctoolchain/usr/lib/swift/host/plugins/testing -enable-experimental-feature DebugDescriptionMacro -sdk /Applications/Xcode-16.2.0.app/Contents/Developer/Platforms/WatchOS.platform/Developer/SDKs/WatchOS11.2.sdk -target arm64_32-apple-watchos8.0 -g -module-cache-path /Users/admin/builder/spi-builder-workspace/.derivedData/ModuleCache.noindex -Xfrontend -serialize-debugging-options -profile-coverage-mapping -profile-generate -enable-testing -index-store-path /Users/admin/builder/spi-builder-workspace/.derivedData/Index.noindex/DataStore -enable-experimental-feature OpaqueTypeErasure -Xcc -D_LIBCPP_HARDENING_MODE\=_LIBCPP_HARDENING_MODE_DEBUG -swift-version 5 -I /Users/admin/builder/spi-builder-workspace/.derivedData/Build/Products/Debug-watchos -I /Applications/Xcode-16.2.0.app/Contents/Developer/Platforms/WatchOS.platform/Developer/usr/lib -F /Users/admin/builder/spi-builder-workspace/.derivedData/Build/Products/Debug-watchos/PackageFrameworks -F /Users/admin/builder/spi-builder-workspace/.derivedData/Build/Products/Debug-watchos/PackageFrameworks -F /Users/admin/builder/spi-builder-workspace/.derivedData/Build/Products/Debug-watchos -F /Applications/Xcode-16.2.0.app/Contents/Developer/Platforms/WatchOS.platform/Developer/Library/Frameworks -F /Applications/Xcode-16.2.0.app/Contents/Developer/Platforms/WatchOS.platform/Developer/SDKs/WatchOS11.2.sdk/Developer/Library/Frameworks -c -j10 -enable-batch-mode -incremental -Xcc -ivfsstatcache -Xcc /Users/admin/builder/spi-builder-workspace/.derivedData/SDKStatCaches.noindex/watchos11.2-22S97-8cb5c683f5e64b0ecfc74e8d0065fbf6.sdkstatcache -output-file-map /Users/admin/builder/spi-builder-workspace/.derivedData/Build/Intermediates.noindex/Workflow.build/Debug-watchos/WorkflowReactiveSwift.build/Objects-normal/arm64_32/WorkflowReactiveSwift-OutputFileMap.json -use-frontend-parseable-output -save-temps -no-color-diagnostics -serialize-diagnostics -emit-dependencies -emit-module -emit-module-path /Users/admin/builder/spi-builder-workspace/.derivedData/Build/Intermediates.noindex/Workflow.build/Debug-watchos/WorkflowReactiveSwift.build/Objects-normal/arm64_32/WorkflowReactiveSwift.swiftmodule -validate-clang-modules-once -clang-build-session-file /Users/admin/builder/spi-builder-workspace/.derivedData/ModuleCache.noindex/Session.modulevalidation -package-name spi_builder_workspace -Xcc -I/Users/admin/builder/spi-builder-workspace/.derivedData/Build/Intermediates.noindex/Workflow.build/Debug-watchos/WorkflowReactiveSwift.build/swift-overrides.hmap -emit-const-values -Xfrontend -const-gather-protocols-file -Xfrontend /Users/admin/builder/spi-builder-workspace/.derivedData/Build/Intermediates.noindex/Workflow.build/Debug-watchos/WorkflowReactiveSwift.build/Objects-normal/arm64_32/WorkflowReactiveSwift_const_extract_protocols.json -Xcc -I/Users/admin/builder/spi-builder-workspace/.derivedData/Build/Products/Debug-watchos/include -Xcc -I/Users/admin/builder/spi-builder-workspace/.derivedData/Build/Intermediates.noindex/Workflow.build/Debug-watchos/WorkflowReactiveSwift.build/DerivedSources-normal/arm64_32 -Xcc -I/Users/admin/builder/spi-builder-workspace/.derivedData/Build/Intermediates.noindex/Workflow.build/Debug-watchos/WorkflowReactiveSwift.build/DerivedSources/arm64_32 -Xcc -I/Users/admin/builder/spi-builder-workspace/.derivedData/Build/Intermediates.noindex/Workflow.build/Debug-watchos/WorkflowReactiveSwift.build/DerivedSources -Xcc -DSWIFT_PACKAGE -Xcc -DDEBUG\=1 -emit-objc-header -emit-objc-header-path /Users/admin/builder/spi-builder-workspace/.derivedData/Build/Intermediates.noindex/Workflow.build/Debug-watchos/WorkflowReactiveSwift.build/Objects-normal/arm64_32/WorkflowReactiveSwift-Swift.h -working-directory /Users/admin/builder/spi-builder-workspace/.swiftpm/xcode -experimental-emit-module-separately -disable-cmo
SwiftDriver\ Compilation\ Requirements WorkflowReactiveSwift normal arm64 com.apple.xcode.tools.swift.compiler (in target 'WorkflowReactiveSwift' from project 'Workflow')
    cd /Users/admin/builder/spi-builder-workspace/.swiftpm/xcode
    builtin-Swift-Compilation-Requirements -- /Applications/Xcode-16.2.0.app/Contents/Developer/Toolchains/XcodeDefault.xctoolchain/usr/bin/swiftc -module-name WorkflowReactiveSwift -Onone -enforce-exclusivity\=checked @/Users/admin/builder/spi-builder-workspace/.derivedData/Build/Intermediates.noindex/Workflow.build/Debug-watchos/WorkflowReactiveSwift.build/Objects-normal/arm64/WorkflowReactiveSwift.SwiftFileList -DSWIFT_PACKAGE -DDEBUG -DXcode -enable-experimental-feature StrictConcurrency\=targeted -plugin-path /Applications/Xcode-16.2.0.app/Contents/Developer/Toolchains/XcodeDefault.xctoolchain/usr/lib/swift/host/plugins/testing -enable-experimental-feature DebugDescriptionMacro -sdk /Applications/Xcode-16.2.0.app/Contents/Developer/Platforms/WatchOS.platform/Developer/SDKs/WatchOS11.2.sdk -target arm64-apple-watchos8.0 -g -module-cache-path /Users/admin/builder/spi-builder-workspace/.derivedData/ModuleCache.noindex -Xfrontend -serialize-debugging-options -profile-coverage-mapping -profile-generate -enable-testing -index-store-path /Users/admin/builder/spi-builder-workspace/.derivedData/Index.noindex/DataStore -enable-experimental-feature OpaqueTypeErasure -Xcc -D_LIBCPP_HARDENING_MODE\=_LIBCPP_HARDENING_MODE_DEBUG -swift-version 5 -I /Users/admin/builder/spi-builder-workspace/.derivedData/Build/Products/Debug-watchos -I /Applications/Xcode-16.2.0.app/Contents/Developer/Platforms/WatchOS.platform/Developer/usr/lib -F /Users/admin/builder/spi-builder-workspace/.derivedData/Build/Products/Debug-watchos/PackageFrameworks -F /Users/admin/builder/spi-builder-workspace/.derivedData/Build/Products/Debug-watchos/PackageFrameworks -F /Users/admin/builder/spi-builder-workspace/.derivedData/Build/Products/Debug-watchos -F /Applications/Xcode-16.2.0.app/Contents/Developer/Platforms/WatchOS.platform/Developer/Library/Frameworks -F /Applications/Xcode-16.2.0.app/Contents/Developer/Platforms/WatchOS.platform/Developer/SDKs/WatchOS11.2.sdk/Developer/Library/Frameworks -c -j10 -enable-batch-mode -incremental -Xcc -ivfsstatcache -Xcc /Users/admin/builder/spi-builder-workspace/.derivedData/SDKStatCaches.noindex/watchos11.2-22S97-8cb5c683f5e64b0ecfc74e8d0065fbf6.sdkstatcache -output-file-map /Users/admin/builder/spi-builder-workspace/.derivedData/Build/Intermediates.noindex/Workflow.build/Debug-watchos/WorkflowReactiveSwift.build/Objects-normal/arm64/WorkflowReactiveSwift-OutputFileMap.json -use-frontend-parseable-output -save-temps -no-color-diagnostics -serialize-diagnostics -emit-dependencies -emit-module -emit-module-path /Users/admin/builder/spi-builder-workspace/.derivedData/Build/Intermediates.noindex/Workflow.build/Debug-watchos/WorkflowReactiveSwift.build/Objects-normal/arm64/WorkflowReactiveSwift.swiftmodule -validate-clang-modules-once -clang-build-session-file /Users/admin/builder/spi-builder-workspace/.derivedData/ModuleCache.noindex/Session.modulevalidation -package-name spi_builder_workspace -Xcc -I/Users/admin/builder/spi-builder-workspace/.derivedData/Build/Intermediates.noindex/Workflow.build/Debug-watchos/WorkflowReactiveSwift.build/swift-overrides.hmap -emit-const-values -Xfrontend -const-gather-protocols-file -Xfrontend /Users/admin/builder/spi-builder-workspace/.derivedData/Build/Intermediates.noindex/Workflow.build/Debug-watchos/WorkflowReactiveSwift.build/Objects-normal/arm64/WorkflowReactiveSwift_const_extract_protocols.json -Xcc -I/Users/admin/builder/spi-builder-workspace/.derivedData/Build/Products/Debug-watchos/include -Xcc -I/Users/admin/builder/spi-builder-workspace/.derivedData/Build/Intermediates.noindex/Workflow.build/Debug-watchos/WorkflowReactiveSwift.build/DerivedSources-normal/arm64 -Xcc -I/Users/admin/builder/spi-builder-workspace/.derivedData/Build/Intermediates.noindex/Workflow.build/Debug-watchos/WorkflowReactiveSwift.build/DerivedSources/arm64 -Xcc -I/Users/admin/builder/spi-builder-workspace/.derivedData/Build/Intermediates.noindex/Workflow.build/Debug-watchos/WorkflowReactiveSwift.build/DerivedSources -Xcc -DSWIFT_PACKAGE -Xcc -DDEBUG\=1 -emit-objc-header -emit-objc-header-path /Users/admin/builder/spi-builder-workspace/.derivedData/Build/Intermediates.noindex/Workflow.build/Debug-watchos/WorkflowReactiveSwift.build/Objects-normal/arm64/WorkflowReactiveSwift-Swift.h -working-directory /Users/admin/builder/spi-builder-workspace/.swiftpm/xcode -experimental-emit-module-separately -disable-cmo
Copy /Users/admin/builder/spi-builder-workspace/.derivedData/Build/Products/Debug-watchos/WorkflowReactiveSwift.swiftmodule/armv7k-apple-watchos.swiftmodule /Users/admin/builder/spi-builder-workspace/.derivedData/Build/Intermediates.noindex/Workflow.build/Debug-watchos/WorkflowReactiveSwift.build/Objects-normal/armv7k/WorkflowReactiveSwift.swiftmodule (in target 'WorkflowReactiveSwift' from project 'Workflow')
    cd /Users/admin/builder/spi-builder-workspace
    builtin-copy -exclude .DS_Store -exclude CVS -exclude .svn -exclude .git -exclude .hg -resolve-src-symlinks -rename /Users/admin/builder/spi-builder-workspace/.derivedData/Build/Intermediates.noindex/Workflow.build/Debug-watchos/WorkflowReactiveSwift.build/Objects-normal/armv7k/WorkflowReactiveSwift.swiftmodule /Users/admin/builder/spi-builder-workspace/.derivedData/Build/Products/Debug-watchos/WorkflowReactiveSwift.swiftmodule/armv7k-apple-watchos.swiftmodule
Copy /Users/admin/builder/spi-builder-workspace/.derivedData/Build/Products/Debug-watchos/WorkflowReactiveSwift.swiftmodule/armv7k-apple-watchos.swiftdoc /Users/admin/builder/spi-builder-workspace/.derivedData/Build/Intermediates.noindex/Workflow.build/Debug-watchos/WorkflowReactiveSwift.build/Objects-normal/armv7k/WorkflowReactiveSwift.swiftdoc (in target 'WorkflowReactiveSwift' from project 'Workflow')
    cd /Users/admin/builder/spi-builder-workspace
    builtin-copy -exclude .DS_Store -exclude CVS -exclude .svn -exclude .git -exclude .hg -resolve-src-symlinks -rename /Users/admin/builder/spi-builder-workspace/.derivedData/Build/Intermediates.noindex/Workflow.build/Debug-watchos/WorkflowReactiveSwift.build/Objects-normal/armv7k/WorkflowReactiveSwift.swiftdoc /Users/admin/builder/spi-builder-workspace/.derivedData/Build/Products/Debug-watchos/WorkflowReactiveSwift.swiftmodule/armv7k-apple-watchos.swiftdoc
SwiftMergeGeneratedHeaders /Users/admin/builder/spi-builder-workspace/.derivedData/Build/Intermediates.noindex/GeneratedModuleMaps-watchos/WorkflowReactiveSwift-Swift.h /Users/admin/builder/spi-builder-workspace/.derivedData/Build/Intermediates.noindex/Workflow.build/Debug-watchos/WorkflowReactiveSwift.build/Objects-normal/arm64/WorkflowReactiveSwift-Swift.h /Users/admin/builder/spi-builder-workspace/.derivedData/Build/Intermediates.noindex/Workflow.build/Debug-watchos/WorkflowReactiveSwift.build/Objects-normal/arm64_32/WorkflowReactiveSwift-Swift.h /Users/admin/builder/spi-builder-workspace/.derivedData/Build/Intermediates.noindex/Workflow.build/Debug-watchos/WorkflowReactiveSwift.build/Objects-normal/armv7k/WorkflowReactiveSwift-Swift.h (in target 'WorkflowReactiveSwift' from project 'Workflow')
    cd /Users/admin/builder/spi-builder-workspace
    builtin-swiftHeaderTool -arch arm64 /Users/admin/builder/spi-builder-workspace/.derivedData/Build/Intermediates.noindex/Workflow.build/Debug-watchos/WorkflowReactiveSwift.build/Objects-normal/arm64/WorkflowReactiveSwift-Swift.h -arch arm64_32 /Users/admin/builder/spi-builder-workspace/.derivedData/Build/Intermediates.noindex/Workflow.build/Debug-watchos/WorkflowReactiveSwift.build/Objects-normal/arm64_32/WorkflowReactiveSwift-Swift.h -arch armv7k /Users/admin/builder/spi-builder-workspace/.derivedData/Build/Intermediates.noindex/Workflow.build/Debug-watchos/WorkflowReactiveSwift.build/Objects-normal/armv7k/WorkflowReactiveSwift-Swift.h -o /Users/admin/builder/spi-builder-workspace/.derivedData/Build/Intermediates.noindex/GeneratedModuleMaps-watchos/WorkflowReactiveSwift-Swift.h
Copy /Users/admin/builder/spi-builder-workspace/.derivedData/Build/Products/Debug-watchos/WorkflowReactiveSwift.swiftmodule/armv7k-apple-watchos.abi.json /Users/admin/builder/spi-builder-workspace/.derivedData/Build/Intermediates.noindex/Workflow.build/Debug-watchos/WorkflowReactiveSwift.build/Objects-normal/armv7k/WorkflowReactiveSwift.abi.json (in target 'WorkflowReactiveSwift' from project 'Workflow')
    cd /Users/admin/builder/spi-builder-workspace
    builtin-copy -exclude .DS_Store -exclude CVS -exclude .svn -exclude .git -exclude .hg -resolve-src-symlinks -rename /Users/admin/builder/spi-builder-workspace/.derivedData/Build/Intermediates.noindex/Workflow.build/Debug-watchos/WorkflowReactiveSwift.build/Objects-normal/armv7k/WorkflowReactiveSwift.abi.json /Users/admin/builder/spi-builder-workspace/.derivedData/Build/Products/Debug-watchos/WorkflowReactiveSwift.swiftmodule/armv7k-apple-watchos.abi.json
Copy /Users/admin/builder/spi-builder-workspace/.derivedData/Build/Products/Debug-watchos/WorkflowReactiveSwift.swiftmodule/arm64_32-apple-watchos.swiftmodule /Users/admin/builder/spi-builder-workspace/.derivedData/Build/Intermediates.noindex/Workflow.build/Debug-watchos/WorkflowReactiveSwift.build/Objects-normal/arm64_32/WorkflowReactiveSwift.swiftmodule (in target 'WorkflowReactiveSwift' from project 'Workflow')
    cd /Users/admin/builder/spi-builder-workspace
    builtin-copy -exclude .DS_Store -exclude CVS -exclude .svn -exclude .git -exclude .hg -resolve-src-symlinks -rename /Users/admin/builder/spi-builder-workspace/.derivedData/Build/Intermediates.noindex/Workflow.build/Debug-watchos/WorkflowReactiveSwift.build/Objects-normal/arm64_32/WorkflowReactiveSwift.swiftmodule /Users/admin/builder/spi-builder-workspace/.derivedData/Build/Products/Debug-watchos/WorkflowReactiveSwift.swiftmodule/arm64_32-apple-watchos.swiftmodule
Copy /Users/admin/builder/spi-builder-workspace/.derivedData/Build/Products/Debug-watchos/WorkflowReactiveSwift.swiftmodule/arm64_32-apple-watchos.swiftdoc /Users/admin/builder/spi-builder-workspace/.derivedData/Build/Intermediates.noindex/Workflow.build/Debug-watchos/WorkflowReactiveSwift.build/Objects-normal/arm64_32/WorkflowReactiveSwift.swiftdoc (in target 'WorkflowReactiveSwift' from project 'Workflow')
    cd /Users/admin/builder/spi-builder-workspace
    builtin-copy -exclude .DS_Store -exclude CVS -exclude .svn -exclude .git -exclude .hg -resolve-src-symlinks -rename /Users/admin/builder/spi-builder-workspace/.derivedData/Build/Intermediates.noindex/Workflow.build/Debug-watchos/WorkflowReactiveSwift.build/Objects-normal/arm64_32/WorkflowReactiveSwift.swiftdoc /Users/admin/builder/spi-builder-workspace/.derivedData/Build/Products/Debug-watchos/WorkflowReactiveSwift.swiftmodule/arm64_32-apple-watchos.swiftdoc
Copy /Users/admin/builder/spi-builder-workspace/.derivedData/Build/Products/Debug-watchos/WorkflowReactiveSwift.swiftmodule/arm64_32-apple-watchos.abi.json /Users/admin/builder/spi-builder-workspace/.derivedData/Build/Intermediates.noindex/Workflow.build/Debug-watchos/WorkflowReactiveSwift.build/Objects-normal/arm64_32/WorkflowReactiveSwift.abi.json (in target 'WorkflowReactiveSwift' from project 'Workflow')
    cd /Users/admin/builder/spi-builder-workspace
    builtin-copy -exclude .DS_Store -exclude CVS -exclude .svn -exclude .git -exclude .hg -resolve-src-symlinks -rename /Users/admin/builder/spi-builder-workspace/.derivedData/Build/Intermediates.noindex/Workflow.build/Debug-watchos/WorkflowReactiveSwift.build/Objects-normal/arm64_32/WorkflowReactiveSwift.abi.json /Users/admin/builder/spi-builder-workspace/.derivedData/Build/Products/Debug-watchos/WorkflowReactiveSwift.swiftmodule/arm64_32-apple-watchos.abi.json
Copy /Users/admin/builder/spi-builder-workspace/.derivedData/Build/Products/Debug-watchos/WorkflowReactiveSwift.swiftmodule/arm64-apple-watchos.swiftmodule /Users/admin/builder/spi-builder-workspace/.derivedData/Build/Intermediates.noindex/Workflow.build/Debug-watchos/WorkflowReactiveSwift.build/Objects-normal/arm64/WorkflowReactiveSwift.swiftmodule (in target 'WorkflowReactiveSwift' from project 'Workflow')
    cd /Users/admin/builder/spi-builder-workspace
    builtin-copy -exclude .DS_Store -exclude CVS -exclude .svn -exclude .git -exclude .hg -resolve-src-symlinks -rename /Users/admin/builder/spi-builder-workspace/.derivedData/Build/Intermediates.noindex/Workflow.build/Debug-watchos/WorkflowReactiveSwift.build/Objects-normal/arm64/WorkflowReactiveSwift.swiftmodule /Users/admin/builder/spi-builder-workspace/.derivedData/Build/Products/Debug-watchos/WorkflowReactiveSwift.swiftmodule/arm64-apple-watchos.swiftmodule
Copy /Users/admin/builder/spi-builder-workspace/.derivedData/Build/Products/Debug-watchos/WorkflowReactiveSwift.swiftmodule/arm64-apple-watchos.swiftdoc /Users/admin/builder/spi-builder-workspace/.derivedData/Build/Intermediates.noindex/Workflow.build/Debug-watchos/WorkflowReactiveSwift.build/Objects-normal/arm64/WorkflowReactiveSwift.swiftdoc (in target 'WorkflowReactiveSwift' from project 'Workflow')
    cd /Users/admin/builder/spi-builder-workspace
    builtin-copy -exclude .DS_Store -exclude CVS -exclude .svn -exclude .git -exclude .hg -resolve-src-symlinks -rename /Users/admin/builder/spi-builder-workspace/.derivedData/Build/Intermediates.noindex/Workflow.build/Debug-watchos/WorkflowReactiveSwift.build/Objects-normal/arm64/WorkflowReactiveSwift.swiftdoc /Users/admin/builder/spi-builder-workspace/.derivedData/Build/Products/Debug-watchos/WorkflowReactiveSwift.swiftmodule/arm64-apple-watchos.swiftdoc
Copy /Users/admin/builder/spi-builder-workspace/.derivedData/Build/Products/Debug-watchos/WorkflowReactiveSwift.swiftmodule/arm64-apple-watchos.abi.json /Users/admin/builder/spi-builder-workspace/.derivedData/Build/Intermediates.noindex/Workflow.build/Debug-watchos/WorkflowReactiveSwift.build/Objects-normal/arm64/WorkflowReactiveSwift.abi.json (in target 'WorkflowReactiveSwift' from project 'Workflow')
    cd /Users/admin/builder/spi-builder-workspace
    builtin-copy -exclude .DS_Store -exclude CVS -exclude .svn -exclude .git -exclude .hg -resolve-src-symlinks -rename /Users/admin/builder/spi-builder-workspace/.derivedData/Build/Intermediates.noindex/Workflow.build/Debug-watchos/WorkflowReactiveSwift.build/Objects-normal/arm64/WorkflowReactiveSwift.abi.json /Users/admin/builder/spi-builder-workspace/.derivedData/Build/Products/Debug-watchos/WorkflowReactiveSwift.swiftmodule/arm64-apple-watchos.abi.json
Copy /Users/admin/builder/spi-builder-workspace/.derivedData/Build/Products/Debug-watchos/WorkflowReactiveSwift.swiftmodule/Project/armv7k-apple-watchos.swiftsourceinfo /Users/admin/builder/spi-builder-workspace/.derivedData/Build/Intermediates.noindex/Workflow.build/Debug-watchos/WorkflowReactiveSwift.build/Objects-normal/armv7k/WorkflowReactiveSwift.swiftsourceinfo (in target 'WorkflowReactiveSwift' from project 'Workflow')
    cd /Users/admin/builder/spi-builder-workspace
    builtin-copy -exclude .DS_Store -exclude CVS -exclude .svn -exclude .git -exclude .hg -resolve-src-symlinks -rename /Users/admin/builder/spi-builder-workspace/.derivedData/Build/Intermediates.noindex/Workflow.build/Debug-watchos/WorkflowReactiveSwift.build/Objects-normal/armv7k/WorkflowReactiveSwift.swiftsourceinfo /Users/admin/builder/spi-builder-workspace/.derivedData/Build/Products/Debug-watchos/WorkflowReactiveSwift.swiftmodule/Project/armv7k-apple-watchos.swiftsourceinfo
** BUILD FAILED **
The following build commands failed:
	SwiftEmitModule normal armv7k Emitting\ module\ for\ ViewEnvironmentUI (in target 'ViewEnvironmentUI' from project 'Workflow')
	EmitSwiftModule normal armv7k (in target 'ViewEnvironmentUI' from project 'Workflow')
	Building workspace spi-builder-workspace with scheme Workflow-Package
(3 failures)
BUILD FAILURE 6.0 watchOS