The Swift Package Index logo.Swift Package Index

Track the adoption of Swift 6 strict concurrency checks for data race safety. How many packages are Ready for Swift 6?

Build Information

Failed to build StickyTabBarViewController, reference 1.0.6 (d4695d), with Swift 6.1 for visionOS using Xcode 16.3 on 26 Apr 2025 19:15:29 UTC.

Build Command

env DEVELOPER_DIR=/Applications/Xcode-16.3.0.app xcrun xcodebuild -IDEClonedSourcePackagesDirPathOverride=$PWD/.dependencies -skipMacroValidation -skipPackagePluginValidation -derivedDataPath $PWD/.derivedData build -scheme StickyTabBarViewController -destination generic/platform=xrOS

Build Log

========================================
RunAll
========================================
Builder version: 4.61.0
Interrupt handler set up.
========================================
Checkout
========================================
Clone URL: https://github.com/emrepun/StickyTabBarViewController.git
Reference: 1.0.6
Initialized empty Git repository in /Users/admin/builder/spi-builder-workspace/.git/
From https://github.com/emrepun/StickyTabBarViewController
 * tag               1.0.6      -> FETCH_HEAD
HEAD is now at d4695db Merge pull request #27 from emrepun/improvement/load-view-if-needed
Cloned https://github.com/emrepun/StickyTabBarViewController.git
Revision (git rev-parse @):
d4695db804d081f7a41b28e1fffdf1f0182b2ba9
SUCCESS checkout https://github.com/emrepun/StickyTabBarViewController.git at 1.0.6
========================================
Build
========================================
Selected platform:         visionOS
Swift version:             6.1
Building package at path:  $PWD
https://github.com/emrepun/StickyTabBarViewController.git
https://github.com/emrepun/StickyTabBarViewController.git
{
  "dependencies" : [
  ],
  "manifest_display_name" : "StickyTabBarViewController",
  "name" : "StickyTabBarViewController",
  "path" : "/Users/admin/builder/spi-builder-workspace",
  "platforms" : [
    {
      "name" : "ios",
      "version" : "10.0"
    }
  ],
  "products" : [
    {
      "name" : "StickyTabBarViewController",
      "targets" : [
        "StickyTabBarViewController"
      ],
      "type" : {
        "library" : [
          "automatic"
        ]
      }
    }
  ],
  "swift_languages_versions" : [
    "5"
  ],
  "targets" : [
    {
      "c99name" : "StickyTabBarViewController",
      "module_type" : "SwiftTarget",
      "name" : "StickyTabBarViewController",
      "path" : "StickyTabBarViewController/Classes",
      "product_memberships" : [
        "StickyTabBarViewController"
      ],
      "sources" : [
        "ExpandableViewController.swift",
        "StickyViewControllerSupportingTabBarController.swift"
      ],
      "type" : "library"
    }
  ],
  "tools_version" : "5.1"
}
Command line invocation:
    /Applications/Xcode-16.3.0.app/Contents/Developer/usr/bin/xcodebuild -IDEClonedSourcePackagesDirPathOverride=/Users/admin/builder/spi-builder-workspace/.dependencies -resolvePackageDependencies
Resolve Package Graph
Resolved source packages:
  StickyTabBarViewController: /Users/admin/builder/spi-builder-workspace
resolved source packages: StickyTabBarViewController
{
  "dependencies" : [
  ],
  "manifest_display_name" : "StickyTabBarViewController",
  "name" : "StickyTabBarViewController",
  "path" : "/Users/admin/builder/spi-builder-workspace",
  "platforms" : [
    {
      "name" : "ios",
      "version" : "10.0"
    }
  ],
  "products" : [
    {
      "name" : "StickyTabBarViewController",
      "targets" : [
        "StickyTabBarViewController"
      ],
      "type" : {
        "library" : [
          "automatic"
        ]
      }
    }
  ],
  "swift_languages_versions" : [
    "5"
  ],
  "targets" : [
    {
      "c99name" : "StickyTabBarViewController",
      "module_type" : "SwiftTarget",
      "name" : "StickyTabBarViewController",
      "path" : "StickyTabBarViewController/Classes",
      "product_memberships" : [
        "StickyTabBarViewController"
      ],
      "sources" : [
        "ExpandableViewController.swift",
        "StickyViewControllerSupportingTabBarController.swift"
      ],
      "type" : "library"
    }
  ],
  "tools_version" : "5.1"
}
{
  "workspace" : {
    "name" : "spi-builder-workspace",
    "schemes" : [
      "StickyTabBarViewController"
    ]
  }
}
Running build ...
env DEVELOPER_DIR=/Applications/Xcode-16.3.0.app xcrun xcodebuild -IDEClonedSourcePackagesDirPathOverride=$PWD/.dependencies -skipMacroValidation -skipPackagePluginValidation -derivedDataPath $PWD/.derivedData build -scheme StickyTabBarViewController -destination generic/platform=xrOS OTHER_SWIFT_FLAGS=-stats-output-dir .stats -strict-concurrency=complete -enable-upcoming-feature StrictConcurrency -enable-upcoming-feature DisableOutwardActorInference -enable-upcoming-feature GlobalActorIsolatedTypesUsability -enable-upcoming-feature InferSendableFromCaptures
Command line invocation:
    /Applications/Xcode-16.3.0.app/Contents/Developer/usr/bin/xcodebuild -IDEClonedSourcePackagesDirPathOverride=/Users/admin/builder/spi-builder-workspace/.dependencies -skipMacroValidation -skipPackagePluginValidation -derivedDataPath /Users/admin/builder/spi-builder-workspace/.derivedData build -scheme StickyTabBarViewController -destination generic/platform=xrOS "OTHER_SWIFT_FLAGS=-stats-output-dir .stats -strict-concurrency=complete -enable-upcoming-feature StrictConcurrency -enable-upcoming-feature DisableOutwardActorInference -enable-upcoming-feature GlobalActorIsolatedTypesUsability -enable-upcoming-feature InferSendableFromCaptures"
Build settings from command line:
    OTHER_SWIFT_FLAGS = -stats-output-dir .stats -strict-concurrency=complete -enable-upcoming-feature StrictConcurrency -enable-upcoming-feature DisableOutwardActorInference -enable-upcoming-feature GlobalActorIsolatedTypesUsability -enable-upcoming-feature InferSendableFromCaptures
Resolve Package Graph
Resolved source packages:
  StickyTabBarViewController: /Users/admin/builder/spi-builder-workspace
ComputePackagePrebuildTargetDependencyGraph
Prepare packages
CreateBuildRequest
SendProjectDescription
CreateBuildOperation
ComputeTargetDependencyGraph
note: Building targets in dependency order
note: Target dependency graph (2 targets)
    Target 'StickyTabBarViewController' in project 'StickyTabBarViewController'
        ➜ Explicit dependency on target 'StickyTabBarViewController' in project 'StickyTabBarViewController'
    Target 'StickyTabBarViewController' in project 'StickyTabBarViewController' (no dependencies)
GatherProvisioningInputs
CreateBuildDescription
ExecuteExternalTool /Applications/Xcode-16.3.0.app/Contents/Developer/Toolchains/XcodeDefault.xctoolchain/usr/bin/clang -v -E -dM -isysroot /Applications/Xcode-16.3.0.app/Contents/Developer/Platforms/XROS.platform/Developer/SDKs/XROS2.4.sdk -x c -c /dev/null
ExecuteExternalTool /Applications/Xcode-16.3.0.app/Contents/Developer/Toolchains/XcodeDefault.xctoolchain/usr/bin/swiftc --version
ExecuteExternalTool /Applications/Xcode-16.3.0.app/Contents/Developer/Toolchains/XcodeDefault.xctoolchain/usr/bin/ld -version_details
Build description signature: ee44d02bfec435e8572dd5f3afafcb10
Build description path: /Users/admin/builder/spi-builder-workspace/.derivedData/Build/Intermediates.noindex/XCBuildData/ee44d02bfec435e8572dd5f3afafcb10.xcbuilddata
ClangStatCache /Applications/Xcode-16.3.0.app/Contents/Developer/Toolchains/XcodeDefault.xctoolchain/usr/bin/clang-stat-cache /Applications/Xcode-16.3.0.app/Contents/Developer/Platforms/XROS.platform/Developer/SDKs/XROS2.4.sdk /Users/admin/builder/spi-builder-workspace/.derivedData/SDKStatCaches.noindex/xros2.4-22O233-407b76dbb837030756cbe1ab3f0b01b6.sdkstatcache
    cd /Users/admin/builder/spi-builder-workspace/.swiftpm/xcode
    /Applications/Xcode-16.3.0.app/Contents/Developer/Toolchains/XcodeDefault.xctoolchain/usr/bin/clang-stat-cache /Applications/Xcode-16.3.0.app/Contents/Developer/Platforms/XROS.platform/Developer/SDKs/XROS2.4.sdk -o /Users/admin/builder/spi-builder-workspace/.derivedData/SDKStatCaches.noindex/xros2.4-22O233-407b76dbb837030756cbe1ab3f0b01b6.sdkstatcache
CreateBuildDirectory /Users/admin/builder/spi-builder-workspace/.derivedData/Build/Products
    cd /Users/admin/builder/spi-builder-workspace/.swiftpm/xcode
    builtin-create-build-directory /Users/admin/builder/spi-builder-workspace/.derivedData/Build/Products
CreateBuildDirectory /Users/admin/builder/spi-builder-workspace/.derivedData/Build/Intermediates.noindex
    cd /Users/admin/builder/spi-builder-workspace/.swiftpm/xcode
    builtin-create-build-directory /Users/admin/builder/spi-builder-workspace/.derivedData/Build/Intermediates.noindex
CreateBuildDirectory /Users/admin/builder/spi-builder-workspace/.derivedData/Build/Intermediates.noindex/EagerLinkingTBDs/Debug-xros
    cd /Users/admin/builder/spi-builder-workspace/.swiftpm/xcode
    builtin-create-build-directory /Users/admin/builder/spi-builder-workspace/.derivedData/Build/Intermediates.noindex/EagerLinkingTBDs/Debug-xros
CreateBuildDirectory /Users/admin/builder/spi-builder-workspace/.derivedData/Build/Products/Debug-xros
    cd /Users/admin/builder/spi-builder-workspace/.swiftpm/xcode
    builtin-create-build-directory /Users/admin/builder/spi-builder-workspace/.derivedData/Build/Products/Debug-xros
CreateBuildDirectory /Users/admin/builder/spi-builder-workspace/.derivedData/Build/Products/Debug-xros/PackageFrameworks
    cd /Users/admin/builder/spi-builder-workspace/.swiftpm/xcode
    builtin-create-build-directory /Users/admin/builder/spi-builder-workspace/.derivedData/Build/Products/Debug-xros/PackageFrameworks
WriteAuxiliaryFile /Users/admin/builder/spi-builder-workspace/.derivedData/Build/Intermediates.noindex/StickyTabBarViewController.build/Debug-xros/StickyTabBarViewController.build/StickyTabBarViewController.DependencyStaticMetadataFileList (in target 'StickyTabBarViewController' from project 'StickyTabBarViewController')
    cd /Users/admin/builder/spi-builder-workspace
    write-file /Users/admin/builder/spi-builder-workspace/.derivedData/Build/Intermediates.noindex/StickyTabBarViewController.build/Debug-xros/StickyTabBarViewController.build/StickyTabBarViewController.DependencyStaticMetadataFileList
WriteAuxiliaryFile /Users/admin/builder/spi-builder-workspace/.derivedData/Build/Intermediates.noindex/StickyTabBarViewController.build/Debug-xros/StickyTabBarViewController.build/StickyTabBarViewController.DependencyMetadataFileList (in target 'StickyTabBarViewController' from project 'StickyTabBarViewController')
    cd /Users/admin/builder/spi-builder-workspace
    write-file /Users/admin/builder/spi-builder-workspace/.derivedData/Build/Intermediates.noindex/StickyTabBarViewController.build/Debug-xros/StickyTabBarViewController.build/StickyTabBarViewController.DependencyMetadataFileList
WriteAuxiliaryFile /Users/admin/builder/spi-builder-workspace/.derivedData/Build/Intermediates.noindex/StickyTabBarViewController.build/Debug-xros/StickyTabBarViewController.build/StickyTabBarViewController.modulemap (in target 'StickyTabBarViewController' from project 'StickyTabBarViewController')
    cd /Users/admin/builder/spi-builder-workspace
    write-file /Users/admin/builder/spi-builder-workspace/.derivedData/Build/Intermediates.noindex/StickyTabBarViewController.build/Debug-xros/StickyTabBarViewController.build/StickyTabBarViewController.modulemap
WriteAuxiliaryFile /Users/admin/builder/spi-builder-workspace/.derivedData/Build/Intermediates.noindex/StickyTabBarViewController.build/Debug-xros/StickyTabBarViewController.build/Objects-normal/arm64/StickyTabBarViewController.SwiftFileList (in target 'StickyTabBarViewController' from project 'StickyTabBarViewController')
    cd /Users/admin/builder/spi-builder-workspace
    write-file /Users/admin/builder/spi-builder-workspace/.derivedData/Build/Intermediates.noindex/StickyTabBarViewController.build/Debug-xros/StickyTabBarViewController.build/Objects-normal/arm64/StickyTabBarViewController.SwiftFileList
WriteAuxiliaryFile /Users/admin/builder/spi-builder-workspace/.derivedData/Build/Intermediates.noindex/StickyTabBarViewController.build/Debug-xros/StickyTabBarViewController.build/Objects-normal/arm64/StickyTabBarViewController.SwiftConstValuesFileList (in target 'StickyTabBarViewController' from project 'StickyTabBarViewController')
    cd /Users/admin/builder/spi-builder-workspace
    write-file /Users/admin/builder/spi-builder-workspace/.derivedData/Build/Intermediates.noindex/StickyTabBarViewController.build/Debug-xros/StickyTabBarViewController.build/Objects-normal/arm64/StickyTabBarViewController.SwiftConstValuesFileList
WriteAuxiliaryFile /Users/admin/builder/spi-builder-workspace/.derivedData/Build/Intermediates.noindex/StickyTabBarViewController.build/Debug-xros/StickyTabBarViewController.build/Objects-normal/arm64/StickyTabBarViewController_const_extract_protocols.json (in target 'StickyTabBarViewController' from project 'StickyTabBarViewController')
    cd /Users/admin/builder/spi-builder-workspace
    write-file /Users/admin/builder/spi-builder-workspace/.derivedData/Build/Intermediates.noindex/StickyTabBarViewController.build/Debug-xros/StickyTabBarViewController.build/Objects-normal/arm64/StickyTabBarViewController_const_extract_protocols.json
WriteAuxiliaryFile /Users/admin/builder/spi-builder-workspace/.derivedData/Build/Intermediates.noindex/StickyTabBarViewController.build/Debug-xros/StickyTabBarViewController.build/Objects-normal/arm64/StickyTabBarViewController-OutputFileMap.json (in target 'StickyTabBarViewController' from project 'StickyTabBarViewController')
    cd /Users/admin/builder/spi-builder-workspace
    write-file /Users/admin/builder/spi-builder-workspace/.derivedData/Build/Intermediates.noindex/StickyTabBarViewController.build/Debug-xros/StickyTabBarViewController.build/Objects-normal/arm64/StickyTabBarViewController-OutputFileMap.json
WriteAuxiliaryFile /Users/admin/builder/spi-builder-workspace/.derivedData/Build/Intermediates.noindex/StickyTabBarViewController.build/Debug-xros/StickyTabBarViewController.build/Objects-normal/arm64/StickyTabBarViewController.LinkFileList (in target 'StickyTabBarViewController' from project 'StickyTabBarViewController')
    cd /Users/admin/builder/spi-builder-workspace
    write-file /Users/admin/builder/spi-builder-workspace/.derivedData/Build/Intermediates.noindex/StickyTabBarViewController.build/Debug-xros/StickyTabBarViewController.build/Objects-normal/arm64/StickyTabBarViewController.LinkFileList
Copy /Users/admin/builder/spi-builder-workspace/.derivedData/Build/Intermediates.noindex/GeneratedModuleMaps-xros/StickyTabBarViewController.modulemap /Users/admin/builder/spi-builder-workspace/.derivedData/Build/Intermediates.noindex/StickyTabBarViewController.build/Debug-xros/StickyTabBarViewController.build/StickyTabBarViewController.modulemap (in target 'StickyTabBarViewController' from project 'StickyTabBarViewController')
    cd /Users/admin/builder/spi-builder-workspace
    builtin-copy -exclude .DS_Store -exclude CVS -exclude .svn -exclude .git -exclude .hg -resolve-src-symlinks /Users/admin/builder/spi-builder-workspace/.derivedData/Build/Intermediates.noindex/StickyTabBarViewController.build/Debug-xros/StickyTabBarViewController.build/StickyTabBarViewController.modulemap /Users/admin/builder/spi-builder-workspace/.derivedData/Build/Intermediates.noindex/GeneratedModuleMaps-xros
SwiftDriver StickyTabBarViewController normal arm64 com.apple.xcode.tools.swift.compiler (in target 'StickyTabBarViewController' from project 'StickyTabBarViewController')
    cd /Users/admin/builder/spi-builder-workspace/.swiftpm/xcode
    builtin-SwiftDriver -- /Applications/Xcode-16.3.0.app/Contents/Developer/Toolchains/XcodeDefault.xctoolchain/usr/bin/swiftc -module-name StickyTabBarViewController -Onone -enforce-exclusivity\=checked @/Users/admin/builder/spi-builder-workspace/.derivedData/Build/Intermediates.noindex/StickyTabBarViewController.build/Debug-xros/StickyTabBarViewController.build/Objects-normal/arm64/StickyTabBarViewController.SwiftFileList -DSWIFT_PACKAGE -DDEBUG -stats-output-dir .stats -strict-concurrency\=complete -enable-upcoming-feature StrictConcurrency -enable-upcoming-feature DisableOutwardActorInference -enable-upcoming-feature GlobalActorIsolatedTypesUsability -enable-upcoming-feature InferSendableFromCaptures -plugin-path /Applications/Xcode-16.3.0.app/Contents/Developer/Toolchains/XcodeDefault.xctoolchain/usr/lib/swift/host/plugins/testing -enable-experimental-feature DebugDescriptionMacro -sdk /Applications/Xcode-16.3.0.app/Contents/Developer/Platforms/XROS.platform/Developer/SDKs/XROS2.4.sdk -target arm64-apple-xros1.0 -g -module-cache-path /Users/admin/builder/spi-builder-workspace/.derivedData/ModuleCache.noindex -Xfrontend -serialize-debugging-options -enable-testing -index-store-path /Users/admin/builder/spi-builder-workspace/.derivedData/Index.noindex/DataStore -swift-version 5 -I /Users/admin/builder/spi-builder-workspace/.derivedData/Build/Products/Debug-xros -I /Applications/Xcode-16.3.0.app/Contents/Developer/Platforms/XROS.platform/Developer/usr/lib -F /Users/admin/builder/spi-builder-workspace/.derivedData/Build/Products/Debug-xros -F /Applications/Xcode-16.3.0.app/Contents/Developer/Platforms/XROS.platform/Developer/Library/Frameworks -F /Applications/Xcode-16.3.0.app/Contents/Developer/Platforms/XROS.platform/Developer/SDKs/XROS2.4.sdk/Developer/Library/Frameworks -c -j10 -enable-batch-mode -incremental -Xcc -ivfsstatcache -Xcc /Users/admin/builder/spi-builder-workspace/.derivedData/SDKStatCaches.noindex/xros2.4-22O233-407b76dbb837030756cbe1ab3f0b01b6.sdkstatcache -output-file-map /Users/admin/builder/spi-builder-workspace/.derivedData/Build/Intermediates.noindex/StickyTabBarViewController.build/Debug-xros/StickyTabBarViewController.build/Objects-normal/arm64/StickyTabBarViewController-OutputFileMap.json -use-frontend-parseable-output -save-temps -no-color-diagnostics -serialize-diagnostics -emit-dependencies -emit-module -emit-module-path /Users/admin/builder/spi-builder-workspace/.derivedData/Build/Intermediates.noindex/StickyTabBarViewController.build/Debug-xros/StickyTabBarViewController.build/Objects-normal/arm64/StickyTabBarViewController.swiftmodule -validate-clang-modules-once -clang-build-session-file /Users/admin/builder/spi-builder-workspace/.derivedData/ModuleCache.noindex/Session.modulevalidation -Xcc -I/Users/admin/builder/spi-builder-workspace/.derivedData/Build/Intermediates.noindex/StickyTabBarViewController.build/Debug-xros/StickyTabBarViewController.build/swift-overrides.hmap -emit-const-values -Xfrontend -const-gather-protocols-file -Xfrontend /Users/admin/builder/spi-builder-workspace/.derivedData/Build/Intermediates.noindex/StickyTabBarViewController.build/Debug-xros/StickyTabBarViewController.build/Objects-normal/arm64/StickyTabBarViewController_const_extract_protocols.json -Xcc -I/Users/admin/builder/spi-builder-workspace/.derivedData/Build/Products/Debug-xros/include -Xcc -I/Users/admin/builder/spi-builder-workspace/.derivedData/Build/Intermediates.noindex/StickyTabBarViewController.build/Debug-xros/StickyTabBarViewController.build/DerivedSources-normal/arm64 -Xcc -I/Users/admin/builder/spi-builder-workspace/.derivedData/Build/Intermediates.noindex/StickyTabBarViewController.build/Debug-xros/StickyTabBarViewController.build/DerivedSources/arm64 -Xcc -I/Users/admin/builder/spi-builder-workspace/.derivedData/Build/Intermediates.noindex/StickyTabBarViewController.build/Debug-xros/StickyTabBarViewController.build/DerivedSources -Xcc -DSWIFT_PACKAGE -Xcc -DDEBUG\=1 -emit-objc-header -emit-objc-header-path /Users/admin/builder/spi-builder-workspace/.derivedData/Build/Intermediates.noindex/StickyTabBarViewController.build/Debug-xros/StickyTabBarViewController.build/Objects-normal/arm64/StickyTabBarViewController-Swift.h -working-directory /Users/admin/builder/spi-builder-workspace/.swiftpm/xcode -experimental-emit-module-separately -disable-cmo
SwiftEmitModule normal arm64 Emitting\ module\ for\ StickyTabBarViewController (in target 'StickyTabBarViewController' from project 'StickyTabBarViewController')
EmitSwiftModule normal arm64 (in target 'StickyTabBarViewController' from project 'StickyTabBarViewController')
    cd /Users/admin/builder/spi-builder-workspace/.swiftpm/xcode

/Users/admin/builder/spi-builder-workspace/StickyTabBarViewController/Classes/ExpandableViewController.swift:33:33: error: 'UIScreen' is unavailable in visionOS
    let deviceHeight: CGFloat = UIScreen.main.bounds.height
                                ^~~~~~~~
/Applications/Xcode-16.3.0.app/Contents/Developer/Platforms/XROS.platform/Developer/SDKs/XROS2.4.sdk/System/Library/Frameworks/UIKit.framework/Headers/UIScreen.h:54:12: note: 'UIScreen' has been explicitly marked unavailable here
@interface UIScreen : NSObject <UITraitEnvironment>
           ^
Failed frontend command:
/Applications/Xcode-16.3.0.app/Contents/Developer/Toolchains/XcodeDefault.xctoolchain/usr/bin/swift-frontend -frontend -emit-module -experimental-skip-non-inlinable-function-bodies-without-types /Users/admin/builder/spi-builder-workspace/StickyTabBarViewController/Classes/ExpandableViewController.swift /Users/admin/builder/spi-builder-workspace/StickyTabBarViewController/Classes/StickyViewControllerSupportingTabBarController.swift -target arm64-apple-xros1.0 -Xllvm -aarch64-use-tbi -enable-objc-interop -stack-check -sdk /Applications/Xcode-16.3.0.app/Contents/Developer/Platforms/XROS.platform/Developer/SDKs/XROS2.4.sdk -I /Users/admin/builder/spi-builder-workspace/.derivedData/Build/Products/Debug-xros -I /Applications/Xcode-16.3.0.app/Contents/Developer/Platforms/XROS.platform/Developer/usr/lib -F /Users/admin/builder/spi-builder-workspace/.derivedData/Build/Products/Debug-xros -F /Applications/Xcode-16.3.0.app/Contents/Developer/Platforms/XROS.platform/Developer/Library/Frameworks -F /Applications/Xcode-16.3.0.app/Contents/Developer/Platforms/XROS.platform/Developer/SDKs/XROS2.4.sdk/Developer/Library/Frameworks -no-color-diagnostics -enable-testing -g -debug-info-format\=dwarf -dwarf-version\=4 -module-cache-path /Users/admin/builder/spi-builder-workspace/.derivedData/ModuleCache.noindex -swift-version 5 -enforce-exclusivity\=checked -stats-output-dir /Users/admin/builder/spi-builder-workspace/.swiftpm/xcode/.stats -Onone -D SWIFT_PACKAGE -D DEBUG -serialize-debugging-options -const-gather-protocols-file /Users/admin/builder/spi-builder-workspace/.derivedData/Build/Intermediates.noindex/StickyTabBarViewController.build/Debug-xros/StickyTabBarViewController.build/Objects-normal/arm64/StickyTabBarViewController_const_extract_protocols.json -enable-upcoming-feature StrictConcurrency -enable-upcoming-feature DisableOutwardActorInference -enable-upcoming-feature GlobalActorIsolatedTypesUsability -enable-upcoming-feature InferSendableFromCaptures -enable-experimental-feature DebugDescriptionMacro -strict-concurrency\=complete -empty-abi-descriptor -plugin-path /Applications/Xcode-16.3.0.app/Contents/Developer/Toolchains/XcodeDefault.xctoolchain/usr/lib/swift/host/plugins/testing -validate-clang-modules-once -clang-build-session-file /Users/admin/builder/spi-builder-workspace/.derivedData/ModuleCache.noindex/Session.modulevalidation -Xcc -working-directory -Xcc /Users/admin/builder/spi-builder-workspace/.swiftpm/xcode -resource-dir /Applications/Xcode-16.3.0.app/Contents/Developer/Toolchains/XcodeDefault.xctoolchain/usr/lib/swift -enable-anonymous-context-mangled-names -file-compilation-dir /Users/admin/builder/spi-builder-workspace/.swiftpm/xcode -Xcc -ivfsstatcache -Xcc /Users/admin/builder/spi-builder-workspace/.derivedData/SDKStatCaches.noindex/xros2.4-22O233-407b76dbb837030756cbe1ab3f0b01b6.sdkstatcache -Xcc -I/Users/admin/builder/spi-builder-workspace/.derivedData/Build/Intermediates.noindex/StickyTabBarViewController.build/Debug-xros/StickyTabBarViewController.build/swift-overrides.hmap -Xcc -I/Users/admin/builder/spi-builder-workspace/.derivedData/Build/Products/Debug-xros/include -Xcc -I/Users/admin/builder/spi-builder-workspace/.derivedData/Build/Intermediates.noindex/StickyTabBarViewController.build/Debug-xros/StickyTabBarViewController.build/DerivedSources-normal/arm64 -Xcc -I/Users/admin/builder/spi-builder-workspace/.derivedData/Build/Intermediates.noindex/StickyTabBarViewController.build/Debug-xros/StickyTabBarViewController.build/DerivedSources/arm64 -Xcc -I/Users/admin/builder/spi-builder-workspace/.derivedData/Build/Intermediates.noindex/StickyTabBarViewController.build/Debug-xros/StickyTabBarViewController.build/DerivedSources -Xcc -DSWIFT_PACKAGE -Xcc -DDEBUG\=1 -module-name StickyTabBarViewController -frontend-parseable-output -disable-clang-spi -target-sdk-version 2.4 -target-sdk-name xros2.4 -external-plugin-path /Applications/Xcode-16.3.0.app/Contents/Developer/Platforms/XROS.platform/Developer/usr/lib/swift/host/plugins\#/Applications/Xcode-16.3.0.app/Contents/Developer/Platforms/XROS.platform/Developer/usr/bin/swift-plugin-server -external-plugin-path /Applications/Xcode-16.3.0.app/Contents/Developer/Platforms/XROS.platform/Developer/usr/local/lib/swift/host/plugins\#/Applications/Xcode-16.3.0.app/Contents/Developer/Platforms/XROS.platform/Developer/usr/bin/swift-plugin-server -in-process-plugin-server-path /Applications/Xcode-16.3.0.app/Contents/Developer/Toolchains/XcodeDefault.xctoolchain/usr/lib/swift/host/libSwiftInProcPluginServer.dylib -plugin-path /Applications/Xcode-16.3.0.app/Contents/Developer/Toolchains/XcodeDefault.xctoolchain/usr/lib/swift/host/plugins -plugin-path /Applications/Xcode-16.3.0.app/Contents/Developer/Toolchains/XcodeDefault.xctoolchain/usr/local/lib/swift/host/plugins -emit-module-doc-path /Users/admin/builder/spi-builder-workspace/.derivedData/Build/Intermediates.noindex/StickyTabBarViewController.build/Debug-xros/StickyTabBarViewController.build/Objects-normal/arm64/StickyTabBarViewController.swiftdoc -emit-module-source-info-path /Users/admin/builder/spi-builder-workspace/.derivedData/Build/Intermediates.noindex/StickyTabBarViewController.build/Debug-xros/StickyTabBarViewController.build/Objects-normal/arm64/StickyTabBarViewController.swiftsourceinfo -emit-objc-header-path /Users/admin/builder/spi-builder-workspace/.derivedData/Build/Intermediates.noindex/StickyTabBarViewController.build/Debug-xros/StickyTabBarViewController.build/Objects-normal/arm64/StickyTabBarViewController-Swift.h -serialize-diagnostics-path /Users/admin/builder/spi-builder-workspace/.derivedData/Build/Intermediates.noindex/StickyTabBarViewController.build/Debug-xros/StickyTabBarViewController.build/Objects-normal/arm64/StickyTabBarViewController-master-emit-module.dia -emit-dependencies-path /Users/admin/builder/spi-builder-workspace/.derivedData/Build/Intermediates.noindex/StickyTabBarViewController.build/Debug-xros/StickyTabBarViewController.build/Objects-normal/arm64/StickyTabBarViewController-master-emit-module.d -o /Users/admin/builder/spi-builder-workspace/.derivedData/Build/Intermediates.noindex/StickyTabBarViewController.build/Debug-xros/StickyTabBarViewController.build/Objects-normal/arm64/StickyTabBarViewController.swiftmodule -emit-abi-descriptor-path /Users/admin/builder/spi-builder-workspace/.derivedData/Build/Intermediates.noindex/StickyTabBarViewController.build/Debug-xros/StickyTabBarViewController.build/Objects-normal/arm64/StickyTabBarViewController.abi.json
SwiftCompile normal arm64 Compiling\ StickyViewControllerSupportingTabBarController.swift /Users/admin/builder/spi-builder-workspace/StickyTabBarViewController/Classes/StickyViewControllerSupportingTabBarController.swift (in target 'StickyTabBarViewController' from project 'StickyTabBarViewController')
SwiftCompile normal arm64 /Users/admin/builder/spi-builder-workspace/StickyTabBarViewController/Classes/StickyViewControllerSupportingTabBarController.swift (in target 'StickyTabBarViewController' from project 'StickyTabBarViewController')
    cd /Users/admin/builder/spi-builder-workspace/.swiftpm/xcode

SwiftCompile normal arm64 Compiling\ ExpandableViewController.swift /Users/admin/builder/spi-builder-workspace/StickyTabBarViewController/Classes/ExpandableViewController.swift (in target 'StickyTabBarViewController' from project 'StickyTabBarViewController')
SwiftCompile normal arm64 /Users/admin/builder/spi-builder-workspace/StickyTabBarViewController/Classes/ExpandableViewController.swift (in target 'StickyTabBarViewController' from project 'StickyTabBarViewController')
    cd /Users/admin/builder/spi-builder-workspace/.swiftpm/xcode

** BUILD FAILED **
The following build commands failed:
	EmitSwiftModule normal arm64 (in target 'StickyTabBarViewController' from project 'StickyTabBarViewController')
	SwiftEmitModule normal arm64 Emitting\ module\ for\ StickyTabBarViewController (in target 'StickyTabBarViewController' from project 'StickyTabBarViewController')
	Building workspace spi-builder-workspace with scheme StickyTabBarViewController
(3 failures)
Command line invocation:
    /Applications/Xcode-16.3.0.app/Contents/Developer/usr/bin/xcodebuild -IDEClonedSourcePackagesDirPathOverride=/Users/admin/builder/spi-builder-workspace/.dependencies -resolvePackageDependencies
Resolve Package Graph
Resolved source packages:
  StickyTabBarViewController: /Users/admin/builder/spi-builder-workspace
resolved source packages: StickyTabBarViewController
{
  "dependencies" : [
  ],
  "manifest_display_name" : "StickyTabBarViewController",
  "name" : "StickyTabBarViewController",
  "path" : "/Users/admin/builder/spi-builder-workspace",
  "platforms" : [
    {
      "name" : "ios",
      "version" : "10.0"
    }
  ],
  "products" : [
    {
      "name" : "StickyTabBarViewController",
      "targets" : [
        "StickyTabBarViewController"
      ],
      "type" : {
        "library" : [
          "automatic"
        ]
      }
    }
  ],
  "swift_languages_versions" : [
    "5"
  ],
  "targets" : [
    {
      "c99name" : "StickyTabBarViewController",
      "module_type" : "SwiftTarget",
      "name" : "StickyTabBarViewController",
      "path" : "StickyTabBarViewController/Classes",
      "product_memberships" : [
        "StickyTabBarViewController"
      ],
      "sources" : [
        "ExpandableViewController.swift",
        "StickyViewControllerSupportingTabBarController.swift"
      ],
      "type" : "library"
    }
  ],
  "tools_version" : "5.1"
}
{
  "workspace" : {
    "name" : "spi-builder-workspace",
    "schemes" : [
      "StickyTabBarViewController"
    ]
  }
}
Running build ...
env DEVELOPER_DIR=/Applications/Xcode-16.3.0.app xcrun xcodebuild -IDEClonedSourcePackagesDirPathOverride=$PWD/.dependencies -skipMacroValidation -skipPackagePluginValidation -derivedDataPath $PWD/.derivedData build -scheme StickyTabBarViewController -destination generic/platform=xrOS
Command line invocation:
    /Applications/Xcode-16.3.0.app/Contents/Developer/usr/bin/xcodebuild -IDEClonedSourcePackagesDirPathOverride=/Users/admin/builder/spi-builder-workspace/.dependencies -skipMacroValidation -skipPackagePluginValidation -derivedDataPath /Users/admin/builder/spi-builder-workspace/.derivedData build -scheme StickyTabBarViewController -destination generic/platform=xrOS
Resolve Package Graph
Resolved source packages:
  StickyTabBarViewController: /Users/admin/builder/spi-builder-workspace
ComputePackagePrebuildTargetDependencyGraph
Prepare packages
CreateBuildRequest
SendProjectDescription
CreateBuildOperation
ComputeTargetDependencyGraph
note: Building targets in dependency order
note: Target dependency graph (2 targets)
    Target 'StickyTabBarViewController' in project 'StickyTabBarViewController'
        ➜ Explicit dependency on target 'StickyTabBarViewController' in project 'StickyTabBarViewController'
    Target 'StickyTabBarViewController' in project 'StickyTabBarViewController' (no dependencies)
GatherProvisioningInputs
CreateBuildDescription
ExecuteExternalTool /Applications/Xcode-16.3.0.app/Contents/Developer/Toolchains/XcodeDefault.xctoolchain/usr/bin/clang -v -E -dM -isysroot /Applications/Xcode-16.3.0.app/Contents/Developer/Platforms/XROS.platform/Developer/SDKs/XROS2.4.sdk -x c -c /dev/null
ExecuteExternalTool /Applications/Xcode-16.3.0.app/Contents/Developer/Toolchains/XcodeDefault.xctoolchain/usr/bin/swiftc --version
ExecuteExternalTool /Applications/Xcode-16.3.0.app/Contents/Developer/Toolchains/XcodeDefault.xctoolchain/usr/bin/ld -version_details
Build description signature: 013913b0edf2d32de5361e24a795b0bf
Build description path: /Users/admin/builder/spi-builder-workspace/.derivedData/Build/Intermediates.noindex/XCBuildData/013913b0edf2d32de5361e24a795b0bf.xcbuilddata
ClangStatCache /Applications/Xcode-16.3.0.app/Contents/Developer/Toolchains/XcodeDefault.xctoolchain/usr/bin/clang-stat-cache /Applications/Xcode-16.3.0.app/Contents/Developer/Platforms/XROS.platform/Developer/SDKs/XROS2.4.sdk /Users/admin/builder/spi-builder-workspace/.derivedData/SDKStatCaches.noindex/xros2.4-22O233-407b76dbb837030756cbe1ab3f0b01b6.sdkstatcache
    cd /Users/admin/builder/spi-builder-workspace/.swiftpm/xcode
    /Applications/Xcode-16.3.0.app/Contents/Developer/Toolchains/XcodeDefault.xctoolchain/usr/bin/clang-stat-cache /Applications/Xcode-16.3.0.app/Contents/Developer/Platforms/XROS.platform/Developer/SDKs/XROS2.4.sdk -o /Users/admin/builder/spi-builder-workspace/.derivedData/SDKStatCaches.noindex/xros2.4-22O233-407b76dbb837030756cbe1ab3f0b01b6.sdkstatcache
SwiftDriver StickyTabBarViewController normal arm64 com.apple.xcode.tools.swift.compiler (in target 'StickyTabBarViewController' from project 'StickyTabBarViewController')
    cd /Users/admin/builder/spi-builder-workspace/.swiftpm/xcode
    builtin-SwiftDriver -- /Applications/Xcode-16.3.0.app/Contents/Developer/Toolchains/XcodeDefault.xctoolchain/usr/bin/swiftc -module-name StickyTabBarViewController -Onone -enforce-exclusivity\=checked @/Users/admin/builder/spi-builder-workspace/.derivedData/Build/Intermediates.noindex/StickyTabBarViewController.build/Debug-xros/StickyTabBarViewController.build/Objects-normal/arm64/StickyTabBarViewController.SwiftFileList -DSWIFT_PACKAGE -DDEBUG -DXcode -plugin-path /Applications/Xcode-16.3.0.app/Contents/Developer/Toolchains/XcodeDefault.xctoolchain/usr/lib/swift/host/plugins/testing -enable-experimental-feature DebugDescriptionMacro -sdk /Applications/Xcode-16.3.0.app/Contents/Developer/Platforms/XROS.platform/Developer/SDKs/XROS2.4.sdk -target arm64-apple-xros1.0 -g -module-cache-path /Users/admin/builder/spi-builder-workspace/.derivedData/ModuleCache.noindex -Xfrontend -serialize-debugging-options -enable-testing -index-store-path /Users/admin/builder/spi-builder-workspace/.derivedData/Index.noindex/DataStore -swift-version 5 -I /Users/admin/builder/spi-builder-workspace/.derivedData/Build/Products/Debug-xros -I /Applications/Xcode-16.3.0.app/Contents/Developer/Platforms/XROS.platform/Developer/usr/lib -F /Users/admin/builder/spi-builder-workspace/.derivedData/Build/Products/Debug-xros -F /Applications/Xcode-16.3.0.app/Contents/Developer/Platforms/XROS.platform/Developer/Library/Frameworks -F /Applications/Xcode-16.3.0.app/Contents/Developer/Platforms/XROS.platform/Developer/SDKs/XROS2.4.sdk/Developer/Library/Frameworks -c -j10 -enable-batch-mode -incremental -Xcc -ivfsstatcache -Xcc /Users/admin/builder/spi-builder-workspace/.derivedData/SDKStatCaches.noindex/xros2.4-22O233-407b76dbb837030756cbe1ab3f0b01b6.sdkstatcache -output-file-map /Users/admin/builder/spi-builder-workspace/.derivedData/Build/Intermediates.noindex/StickyTabBarViewController.build/Debug-xros/StickyTabBarViewController.build/Objects-normal/arm64/StickyTabBarViewController-OutputFileMap.json -use-frontend-parseable-output -save-temps -no-color-diagnostics -serialize-diagnostics -emit-dependencies -emit-module -emit-module-path /Users/admin/builder/spi-builder-workspace/.derivedData/Build/Intermediates.noindex/StickyTabBarViewController.build/Debug-xros/StickyTabBarViewController.build/Objects-normal/arm64/StickyTabBarViewController.swiftmodule -validate-clang-modules-once -clang-build-session-file /Users/admin/builder/spi-builder-workspace/.derivedData/ModuleCache.noindex/Session.modulevalidation -Xcc -I/Users/admin/builder/spi-builder-workspace/.derivedData/Build/Intermediates.noindex/StickyTabBarViewController.build/Debug-xros/StickyTabBarViewController.build/swift-overrides.hmap -emit-const-values -Xfrontend -const-gather-protocols-file -Xfrontend /Users/admin/builder/spi-builder-workspace/.derivedData/Build/Intermediates.noindex/StickyTabBarViewController.build/Debug-xros/StickyTabBarViewController.build/Objects-normal/arm64/StickyTabBarViewController_const_extract_protocols.json -Xcc -I/Users/admin/builder/spi-builder-workspace/.derivedData/Build/Products/Debug-xros/include -Xcc -I/Users/admin/builder/spi-builder-workspace/.derivedData/Build/Intermediates.noindex/StickyTabBarViewController.build/Debug-xros/StickyTabBarViewController.build/DerivedSources-normal/arm64 -Xcc -I/Users/admin/builder/spi-builder-workspace/.derivedData/Build/Intermediates.noindex/StickyTabBarViewController.build/Debug-xros/StickyTabBarViewController.build/DerivedSources/arm64 -Xcc -I/Users/admin/builder/spi-builder-workspace/.derivedData/Build/Intermediates.noindex/StickyTabBarViewController.build/Debug-xros/StickyTabBarViewController.build/DerivedSources -Xcc -DSWIFT_PACKAGE -Xcc -DDEBUG\=1 -emit-objc-header -emit-objc-header-path /Users/admin/builder/spi-builder-workspace/.derivedData/Build/Intermediates.noindex/StickyTabBarViewController.build/Debug-xros/StickyTabBarViewController.build/Objects-normal/arm64/StickyTabBarViewController-Swift.h -working-directory /Users/admin/builder/spi-builder-workspace/.swiftpm/xcode -experimental-emit-module-separately -disable-cmo
SwiftEmitModule normal arm64 Emitting\ module\ for\ StickyTabBarViewController (in target 'StickyTabBarViewController' from project 'StickyTabBarViewController')
EmitSwiftModule normal arm64 (in target 'StickyTabBarViewController' from project 'StickyTabBarViewController')
    cd /Users/admin/builder/spi-builder-workspace/.swiftpm/xcode

/Users/admin/builder/spi-builder-workspace/StickyTabBarViewController/Classes/ExpandableViewController.swift:33:33: error: 'UIScreen' is unavailable in visionOS
    let deviceHeight: CGFloat = UIScreen.main.bounds.height
                                ^~~~~~~~
/Applications/Xcode-16.3.0.app/Contents/Developer/Platforms/XROS.platform/Developer/SDKs/XROS2.4.sdk/System/Library/Frameworks/UIKit.framework/Headers/UIScreen.h:54:12: note: 'UIScreen' has been explicitly marked unavailable here
@interface UIScreen : NSObject <UITraitEnvironment>
           ^
Failed frontend command:
/Applications/Xcode-16.3.0.app/Contents/Developer/Toolchains/XcodeDefault.xctoolchain/usr/bin/swift-frontend -frontend -emit-module -experimental-skip-non-inlinable-function-bodies-without-types /Users/admin/builder/spi-builder-workspace/StickyTabBarViewController/Classes/ExpandableViewController.swift /Users/admin/builder/spi-builder-workspace/StickyTabBarViewController/Classes/StickyViewControllerSupportingTabBarController.swift -target arm64-apple-xros1.0 -Xllvm -aarch64-use-tbi -enable-objc-interop -stack-check -sdk /Applications/Xcode-16.3.0.app/Contents/Developer/Platforms/XROS.platform/Developer/SDKs/XROS2.4.sdk -I /Users/admin/builder/spi-builder-workspace/.derivedData/Build/Products/Debug-xros -I /Applications/Xcode-16.3.0.app/Contents/Developer/Platforms/XROS.platform/Developer/usr/lib -F /Users/admin/builder/spi-builder-workspace/.derivedData/Build/Products/Debug-xros -F /Applications/Xcode-16.3.0.app/Contents/Developer/Platforms/XROS.platform/Developer/Library/Frameworks -F /Applications/Xcode-16.3.0.app/Contents/Developer/Platforms/XROS.platform/Developer/SDKs/XROS2.4.sdk/Developer/Library/Frameworks -no-color-diagnostics -enable-testing -g -debug-info-format\=dwarf -dwarf-version\=4 -module-cache-path /Users/admin/builder/spi-builder-workspace/.derivedData/ModuleCache.noindex -swift-version 5 -enforce-exclusivity\=checked -Onone -D SWIFT_PACKAGE -D DEBUG -D Xcode -serialize-debugging-options -const-gather-protocols-file /Users/admin/builder/spi-builder-workspace/.derivedData/Build/Intermediates.noindex/StickyTabBarViewController.build/Debug-xros/StickyTabBarViewController.build/Objects-normal/arm64/StickyTabBarViewController_const_extract_protocols.json -enable-experimental-feature DebugDescriptionMacro -empty-abi-descriptor -plugin-path /Applications/Xcode-16.3.0.app/Contents/Developer/Toolchains/XcodeDefault.xctoolchain/usr/lib/swift/host/plugins/testing -validate-clang-modules-once -clang-build-session-file /Users/admin/builder/spi-builder-workspace/.derivedData/ModuleCache.noindex/Session.modulevalidation -Xcc -working-directory -Xcc /Users/admin/builder/spi-builder-workspace/.swiftpm/xcode -resource-dir /Applications/Xcode-16.3.0.app/Contents/Developer/Toolchains/XcodeDefault.xctoolchain/usr/lib/swift -enable-anonymous-context-mangled-names -file-compilation-dir /Users/admin/builder/spi-builder-workspace/.swiftpm/xcode -Xcc -ivfsstatcache -Xcc /Users/admin/builder/spi-builder-workspace/.derivedData/SDKStatCaches.noindex/xros2.4-22O233-407b76dbb837030756cbe1ab3f0b01b6.sdkstatcache -Xcc -I/Users/admin/builder/spi-builder-workspace/.derivedData/Build/Intermediates.noindex/StickyTabBarViewController.build/Debug-xros/StickyTabBarViewController.build/swift-overrides.hmap -Xcc -I/Users/admin/builder/spi-builder-workspace/.derivedData/Build/Products/Debug-xros/include -Xcc -I/Users/admin/builder/spi-builder-workspace/.derivedData/Build/Intermediates.noindex/StickyTabBarViewController.build/Debug-xros/StickyTabBarViewController.build/DerivedSources-normal/arm64 -Xcc -I/Users/admin/builder/spi-builder-workspace/.derivedData/Build/Intermediates.noindex/StickyTabBarViewController.build/Debug-xros/StickyTabBarViewController.build/DerivedSources/arm64 -Xcc -I/Users/admin/builder/spi-builder-workspace/.derivedData/Build/Intermediates.noindex/StickyTabBarViewController.build/Debug-xros/StickyTabBarViewController.build/DerivedSources -Xcc -DSWIFT_PACKAGE -Xcc -DDEBUG\=1 -module-name StickyTabBarViewController -frontend-parseable-output -disable-clang-spi -target-sdk-version 2.4 -target-sdk-name xros2.4 -external-plugin-path /Applications/Xcode-16.3.0.app/Contents/Developer/Platforms/XROS.platform/Developer/usr/lib/swift/host/plugins\#/Applications/Xcode-16.3.0.app/Contents/Developer/Platforms/XROS.platform/Developer/usr/bin/swift-plugin-server -external-plugin-path /Applications/Xcode-16.3.0.app/Contents/Developer/Platforms/XROS.platform/Developer/usr/local/lib/swift/host/plugins\#/Applications/Xcode-16.3.0.app/Contents/Developer/Platforms/XROS.platform/Developer/usr/bin/swift-plugin-server -in-process-plugin-server-path /Applications/Xcode-16.3.0.app/Contents/Developer/Toolchains/XcodeDefault.xctoolchain/usr/lib/swift/host/libSwiftInProcPluginServer.dylib -plugin-path /Applications/Xcode-16.3.0.app/Contents/Developer/Toolchains/XcodeDefault.xctoolchain/usr/lib/swift/host/plugins -plugin-path /Applications/Xcode-16.3.0.app/Contents/Developer/Toolchains/XcodeDefault.xctoolchain/usr/local/lib/swift/host/plugins -emit-module-doc-path /Users/admin/builder/spi-builder-workspace/.derivedData/Build/Intermediates.noindex/StickyTabBarViewController.build/Debug-xros/StickyTabBarViewController.build/Objects-normal/arm64/StickyTabBarViewController.swiftdoc -emit-module-source-info-path /Users/admin/builder/spi-builder-workspace/.derivedData/Build/Intermediates.noindex/StickyTabBarViewController.build/Debug-xros/StickyTabBarViewController.build/Objects-normal/arm64/StickyTabBarViewController.swiftsourceinfo -emit-objc-header-path /Users/admin/builder/spi-builder-workspace/.derivedData/Build/Intermediates.noindex/StickyTabBarViewController.build/Debug-xros/StickyTabBarViewController.build/Objects-normal/arm64/StickyTabBarViewController-Swift.h -serialize-diagnostics-path /Users/admin/builder/spi-builder-workspace/.derivedData/Build/Intermediates.noindex/StickyTabBarViewController.build/Debug-xros/StickyTabBarViewController.build/Objects-normal/arm64/StickyTabBarViewController-master-emit-module.dia -emit-dependencies-path /Users/admin/builder/spi-builder-workspace/.derivedData/Build/Intermediates.noindex/StickyTabBarViewController.build/Debug-xros/StickyTabBarViewController.build/Objects-normal/arm64/StickyTabBarViewController-master-emit-module.d -o /Users/admin/builder/spi-builder-workspace/.derivedData/Build/Intermediates.noindex/StickyTabBarViewController.build/Debug-xros/StickyTabBarViewController.build/Objects-normal/arm64/StickyTabBarViewController.swiftmodule -emit-abi-descriptor-path /Users/admin/builder/spi-builder-workspace/.derivedData/Build/Intermediates.noindex/StickyTabBarViewController.build/Debug-xros/StickyTabBarViewController.build/Objects-normal/arm64/StickyTabBarViewController.abi.json
SwiftCompile normal arm64 Compiling\ StickyViewControllerSupportingTabBarController.swift /Users/admin/builder/spi-builder-workspace/StickyTabBarViewController/Classes/StickyViewControllerSupportingTabBarController.swift (in target 'StickyTabBarViewController' from project 'StickyTabBarViewController')
SwiftCompile normal arm64 /Users/admin/builder/spi-builder-workspace/StickyTabBarViewController/Classes/StickyViewControllerSupportingTabBarController.swift (in target 'StickyTabBarViewController' from project 'StickyTabBarViewController')
    cd /Users/admin/builder/spi-builder-workspace/.swiftpm/xcode

SwiftCompile normal arm64 Compiling\ ExpandableViewController.swift /Users/admin/builder/spi-builder-workspace/StickyTabBarViewController/Classes/ExpandableViewController.swift (in target 'StickyTabBarViewController' from project 'StickyTabBarViewController')
SwiftCompile normal arm64 /Users/admin/builder/spi-builder-workspace/StickyTabBarViewController/Classes/ExpandableViewController.swift (in target 'StickyTabBarViewController' from project 'StickyTabBarViewController')
    cd /Users/admin/builder/spi-builder-workspace/.swiftpm/xcode

** BUILD FAILED **
The following build commands failed:
	EmitSwiftModule normal arm64 (in target 'StickyTabBarViewController' from project 'StickyTabBarViewController')
	SwiftEmitModule normal arm64 Emitting\ module\ for\ StickyTabBarViewController (in target 'StickyTabBarViewController' from project 'StickyTabBarViewController')
	Building workspace spi-builder-workspace with scheme StickyTabBarViewController
(3 failures)
BUILD FAILURE 6.1 visionOS