Build Information
Failed to build swift-system, reference master (f51eba
), with Swift 6.0 for watchOS using Xcode 16.2 on 30 Nov 2024 10:07:51 UTC.
Build Command
env DEVELOPER_DIR=/Applications/Xcode-16.1.0.app xcrun xcodebuild -IDEClonedSourcePackagesDirPathOverride=$PWD/.dependencies -skipMacroValidation -skipPackagePluginValidation -derivedDataPath $PWD/.derivedData build -scheme swift-system -destination generic/platform=watchOS OTHER_SWIFT_FLAGS=-stats-output-dir .stats -strict-concurrency=complete -enable-upcoming-feature StrictConcurrency -enable-upcoming-feature DisableOutwardActorInference -enable-upcoming-feature GlobalActorIsolatedTypesUsability -enable-upcoming-feature InferSendableFromCaptures
Build Log
SwiftCompile normal arm64_32 /Users/admin/builder/spi-builder-workspace/Sources/System/Time/TimeIntervalNanoseconds.swift (in target 'SystemPackage' from project 'swift-system')
cd /Users/admin/builder/spi-builder-workspace/.swiftpm/xcode
/Applications/Xcode-16.1.0.app/Contents/Developer/Toolchains/XcodeDefault.xctoolchain/usr/bin/swift-frontend -c /Users/admin/builder/spi-builder-workspace/Sources/System/AsyncFileOperations.swift /Users/admin/builder/spi-builder-workspace/Sources/System/Errno.swift /Users/admin/builder/spi-builder-workspace/Sources/System/FileChange.swift /Users/admin/builder/spi-builder-workspace/Sources/System/FileDescriptor.swift /Users/admin/builder/spi-builder-workspace/Sources/System/FileDescriptorSet.swift /Users/admin/builder/spi-builder-workspace/Sources/System/FileEvent.swift /Users/admin/builder/spi-builder-workspace/Sources/System/FileHelpers.swift /Users/admin/builder/spi-builder-workspace/Sources/System/FileOperations.swift /Users/admin/builder/spi-builder-workspace/Sources/System/FilePath/FilePath.swift /Users/admin/builder/spi-builder-workspace/Sources/System/FilePath/FilePathComponentView.swift /Users/admin/builder/spi-builder-workspace/Sources/System/FilePath/FilePathComponents.swift /Users/admin/builder/spi-builder-workspace/Sources/System/FilePath/FilePathParsing.swift /Users/admin/builder/spi-builder-workspace/Sources/System/FilePath/FilePathString.swift /Users/admin/builder/spi-builder-workspace/Sources/System/FilePath/FilePathSyntax.swift /Users/admin/builder/spi-builder-workspace/Sources/System/FilePath/FilePathWindows.swift /Users/admin/builder/spi-builder-workspace/Sources/System/FilePermissions.swift /Users/admin/builder/spi-builder-workspace/Sources/System/InputOutput/IOControl.swift /Users/admin/builder/spi-builder-workspace/Sources/System/InputOutput/IODirection.swift /Users/admin/builder/spi-builder-workspace/Sources/System/InputOutput/IOOperations.swift /Users/admin/builder/spi-builder-workspace/Sources/System/InputOutput/IOType.swift /Users/admin/builder/spi-builder-workspace/Sources/System/InputOutput/TerminalIO.swift /Users/admin/builder/spi-builder-workspace/Sources/System/Internals/CInternetAddress.swift /Users/admin/builder/spi-builder-workspace/Sources/System/Internals/CInterop.swift /Users/admin/builder/spi-builder-workspace/Sources/System/Internals/CSocketAddress.swift /Users/admin/builder/spi-builder-workspace/Sources/System/Internals/Compatibility.swift /Users/admin/builder/spi-builder-workspace/Sources/System/Internals/Constants.swift /Users/admin/builder/spi-builder-workspace/Sources/System/Internals/Exports.swift /Users/admin/builder/spi-builder-workspace/Sources/System/Internals/IOCTL.swift /Users/admin/builder/spi-builder-workspace/Sources/System/Internals/Mocking.swift /Users/admin/builder/spi-builder-workspace/Sources/System/Internals/NetworkOrder.swift /Users/admin/builder/spi-builder-workspace/Sources/System/Internals/Syscalls.swift /Users/admin/builder/spi-builder-workspace/Sources/System/Internals/WindowsSyscallAdapters.swift /Users/admin/builder/spi-builder-workspace/Sources/System/InternetProtocol.swift /Users/admin/builder/spi-builder-workspace/Sources/System/PlatformString.swift /Users/admin/builder/spi-builder-workspace/Sources/System/ProcessID.swift /Users/admin/builder/spi-builder-workspace/Sources/System/Signal/Signal.swift /Users/admin/builder/spi-builder-workspace/Sources/System/Signal/SignalAction.swift /Users/admin/builder/spi-builder-workspace/Sources/System/Signal/SignalHandler.swift /Users/admin/builder/spi-builder-workspace/Sources/System/Signal/SignalInformation.swift /Users/admin/builder/spi-builder-workspace/Sources/System/Signal/SignalSet.swift /Users/admin/builder/spi-builder-workspace/Sources/System/Socket/AsyncSocketOperations.swift /Users/admin/builder/spi-builder-workspace/Sources/System/Socket/MessageFlags.swift /Users/admin/builder/spi-builder-workspace/Sources/System/Socket/Poll.swift /Users/admin/builder/spi-builder-workspace/Sources/System/Socket/SocketAddress.swift /Users/admin/builder/spi-builder-workspace/Sources/System/Socket/SocketAddressFamily.swift /Users/admin/builder/spi-builder-workspace/Sources/System/Socket/SocketFlags.swift /Users/admin/builder/spi-builder-workspace/Sources/System/Socket/SocketOperations.swift /Users/admin/builder/spi-builder-workspace/Sources/System/Socket/SocketOption.swift /Users/admin/builder/spi-builder-workspace/Sources/System/Socket/SocketOptionID.swift /Users/admin/builder/spi-builder-workspace/Sources/System/Socket/SocketOptionLevel.swift /Users/admin/builder/spi-builder-workspace/Sources/System/Socket/SocketProtocol.swift /Users/admin/builder/spi-builder-workspace/Sources/System/Socket/SocketType.swift /Users/admin/builder/spi-builder-workspace/Sources/System/SystemInfo.swift /Users/admin/builder/spi-builder-workspace/Sources/System/SystemString.swift /Users/admin/builder/spi-builder-workspace/Sources/System/Time/Clock.swift /Users/admin/builder/spi-builder-workspace/Sources/System/Time/Microseconds.swift /Users/admin/builder/spi-builder-workspace/Sources/System/Time/Nanoseconds.swift /Users/admin/builder/spi-builder-workspace/Sources/System/Time/ProcessorTime.swift /Users/admin/builder/spi-builder-workspace/Sources/System/Time/Time.swift /Users/admin/builder/spi-builder-workspace/Sources/System/Time/TimeComponents.swift -primary-file /Users/admin/builder/spi-builder-workspace/Sources/System/Time/TimeInterval.swift -primary-file /Users/admin/builder/spi-builder-workspace/Sources/System/Time/TimeIntervalMicroseconds.swift -primary-file /Users/admin/builder/spi-builder-workspace/Sources/System/Time/TimeIntervalNanoseconds.swift -primary-file /Users/admin/builder/spi-builder-workspace/Sources/System/UserID.swift -primary-file /Users/admin/builder/spi-builder-workspace/Sources/System/Util.swift -primary-file /Users/admin/builder/spi-builder-workspace/Sources/System/UtilConsumers.swift -supplementary-output-file-map /Users/admin/builder/spi-builder-workspace/.derivedData/Build/Intermediates.noindex/swift-system.build/Debug-watchos/SystemPackage.build/Objects-normal/arm64_32/supplementaryOutputs-27 -target arm64_32-apple-watchos5.0 -enable-objc-interop -sdk /Applications/Xcode-16.1.0.app/Contents/Developer/Platforms/WatchOS.platform/Developer/SDKs/WatchOS11.1.sdk -I /Users/admin/builder/spi-builder-workspace/.derivedData/Build/Products/Debug-watchos -I /Applications/Xcode-16.1.0.app/Contents/Developer/Platforms/WatchOS.platform/Developer/usr/lib -F /Users/admin/builder/spi-builder-workspace/.derivedData/Build/Products/Debug-watchos/PackageFrameworks -F /Users/admin/builder/spi-builder-workspace/.derivedData/Build/Products/Debug-watchos -F /Applications/Xcode-16.1.0.app/Contents/Developer/Platforms/WatchOS.platform/Developer/Library/Frameworks -F /Applications/Xcode-16.1.0.app/Contents/Developer/Platforms/WatchOS.platform/Developer/SDKs/WatchOS11.1.sdk/Developer/Library/Frameworks -no-color-diagnostics -enable-testing -g -debug-info-format\=dwarf -dwarf-version\=4 -module-cache-path /Users/admin/builder/spi-builder-workspace/.derivedData/ModuleCache.noindex -profile-generate -profile-coverage-mapping -swift-version 5 -enforce-exclusivity\=checked -stats-output-dir /Users/admin/builder/spi-builder-workspace/.swiftpm/xcode/.stats -Onone -D SWIFT_PACKAGE -D DEBUG -D SYSTEM_PACKAGE -D ENABLE_MOCKING -serialize-debugging-options -const-gather-protocols-file /Users/admin/builder/spi-builder-workspace/.derivedData/Build/Intermediates.noindex/swift-system.build/Debug-watchos/SystemPackage.build/Objects-normal/arm64_32/SystemPackage_const_extract_protocols.json -enable-experimental-feature DebugDescriptionMacro -enable-experimental-feature OpaqueTypeErasure -enable-upcoming-feature StrictConcurrency -enable-upcoming-feature DisableOutwardActorInference -enable-upcoming-feature GlobalActorIsolatedTypesUsability -enable-upcoming-feature InferSendableFromCaptures -strict-concurrency\=complete -empty-abi-descriptor -plugin-path /Applications/Xcode-16.1.0.app/Contents/Developer/Toolchains/XcodeDefault.xctoolchain/usr/lib/swift/host/plugins/testing -validate-clang-modules-once -clang-build-session-file /Users/admin/builder/spi-builder-workspace/.derivedData/ModuleCache.noindex/Session.modulevalidation -Xcc -working-directory -Xcc /Users/admin/builder/spi-builder-workspace/.swiftpm/xcode -resource-dir /Applications/Xcode-16.1.0.app/Contents/Developer/Toolchains/XcodeDefault.xctoolchain/usr/lib/swift -enable-anonymous-context-mangled-names -file-compilation-dir /Users/admin/builder/spi-builder-workspace/.swiftpm/xcode -Xcc -D_LIBCPP_HARDENING_MODE\=_LIBCPP_HARDENING_MODE_DEBUG -Xcc -ivfsstatcache -Xcc /Users/admin/builder/spi-builder-workspace/.derivedData/SDKStatCaches.noindex/watchos11.1-22R574-7b9df0bda16bb4641b33636c68f04660.sdkstatcache -Xcc -I/Users/admin/builder/spi-builder-workspace/.derivedData/Build/Intermediates.noindex/swift-system.build/Debug-watchos/SystemPackage.build/swift-overrides.hmap -Xcc -I/Users/admin/builder/spi-builder-workspace/Sources/CSystem/include -Xcc -I/Users/admin/builder/spi-builder-workspace/.derivedData/Build/Products/Debug-watchos/include -Xcc -I/Users/admin/builder/spi-builder-workspace/.derivedData/Build/Intermediates.noindex/swift-system.build/Debug-watchos/SystemPackage.build/DerivedSources-normal/arm64_32 -Xcc -I/Users/admin/builder/spi-builder-workspace/.derivedData/Build/Intermediates.noindex/swift-system.build/Debug-watchos/SystemPackage.build/DerivedSources/arm64_32 -Xcc -I/Users/admin/builder/spi-builder-workspace/.derivedData/Build/Intermediates.noindex/swift-system.build/Debug-watchos/SystemPackage.build/DerivedSources -Xcc -DSWIFT_PACKAGE -Xcc -DDEBUG\=1 -Xcc -D_CRT_SECURE_NO_WARNINGS -module-name SystemPackage -frontend-parseable-output -disable-clang-spi -target-sdk-version 11.1 -target-sdk-name watchos11.1 -external-plugin-path /Applications/Xcode-16.1.0.app/Contents/Developer/Platforms/WatchOS.platform/Developer/usr/lib/swift/host/plugins\#/Applications/Xcode-16.1.0.app/Contents/Developer/Platforms/WatchOS.platform/Developer/usr/bin/swift-plugin-server -external-plugin-path /Applications/Xcode-16.1.0.app/Contents/Developer/Platforms/WatchOS.platform/Developer/usr/local/lib/swift/host/plugins\#/Applications/Xcode-16.1.0.app/Contents/Developer/Platforms/WatchOS.platform/Developer/usr/bin/swift-plugin-server -plugin-path /Applications/Xcode-16.1.0.app/Contents/Developer/Toolchains/XcodeDefault.xctoolchain/usr/lib/swift/host/plugins -plugin-path /Applications/Xcode-16.1.0.app/Contents/Developer/Toolchains/XcodeDefault.xctoolchain/usr/local/lib/swift/host/plugins -o /Users/admin/builder/spi-builder-workspace/.derivedData/Build/Intermediates.noindex/swift-system.build/Debug-watchos/SystemPackage.build/Objects-normal/arm64_32/TimeInterval.o -o /Users/admin/builder/spi-builder-workspace/.derivedData/Build/Intermediates.noindex/swift-system.build/Debug-watchos/SystemPackage.build/Objects-normal/arm64_32/TimeIntervalMicroseconds.o -o /Users/admin/builder/spi-builder-workspace/.derivedData/Build/Intermediates.noindex/swift-system.build/Debug-watchos/SystemPackage.build/Objects-normal/arm64_32/TimeIntervalNanoseconds.o -o /Users/admin/builder/spi-builder-workspace/.derivedData/Build/Intermediates.noindex/swift-system.build/Debug-watchos/SystemPackage.build/Objects-normal/arm64_32/UserID.o -o /Users/admin/builder/spi-builder-workspace/.derivedData/Build/Intermediates.noindex/swift-system.build/Debug-watchos/SystemPackage.build/Objects-normal/arm64_32/Util.o -o /Users/admin/builder/spi-builder-workspace/.derivedData/Build/Intermediates.noindex/swift-system.build/Debug-watchos/SystemPackage.build/Objects-normal/arm64_32/UtilConsumers.o -index-unit-output-path /swift-system.build/Debug-watchos/SystemPackage.build/Objects-normal/arm64_32/TimeInterval.o -index-unit-output-path /swift-system.build/Debug-watchos/SystemPackage.build/Objects-normal/arm64_32/TimeIntervalMicroseconds.o -index-unit-output-path /swift-system.build/Debug-watchos/SystemPackage.build/Objects-normal/arm64_32/TimeIntervalNanoseconds.o -index-unit-output-path /swift-system.build/Debug-watchos/SystemPackage.build/Objects-normal/arm64_32/UserID.o -index-unit-output-path /swift-system.build/Debug-watchos/SystemPackage.build/Objects-normal/arm64_32/Util.o -index-unit-output-path /swift-system.build/Debug-watchos/SystemPackage.build/Objects-normal/arm64_32/UtilConsumers.o -index-store-path /Users/admin/builder/spi-builder-workspace/.derivedData/Index.noindex/DataStore -index-system-modules
SwiftCompile normal arm64_32 /Users/admin/builder/spi-builder-workspace/Sources/System/UserID.swift (in target 'SystemPackage' from project 'swift-system')
cd /Users/admin/builder/spi-builder-workspace/.swiftpm/xcode
/Applications/Xcode-16.1.0.app/Contents/Developer/Toolchains/XcodeDefault.xctoolchain/usr/bin/swift-frontend -c /Users/admin/builder/spi-builder-workspace/Sources/System/AsyncFileOperations.swift /Users/admin/builder/spi-builder-workspace/Sources/System/Errno.swift /Users/admin/builder/spi-builder-workspace/Sources/System/FileChange.swift /Users/admin/builder/spi-builder-workspace/Sources/System/FileDescriptor.swift /Users/admin/builder/spi-builder-workspace/Sources/System/FileDescriptorSet.swift /Users/admin/builder/spi-builder-workspace/Sources/System/FileEvent.swift /Users/admin/builder/spi-builder-workspace/Sources/System/FileHelpers.swift /Users/admin/builder/spi-builder-workspace/Sources/System/FileOperations.swift /Users/admin/builder/spi-builder-workspace/Sources/System/FilePath/FilePath.swift /Users/admin/builder/spi-builder-workspace/Sources/System/FilePath/FilePathComponentView.swift /Users/admin/builder/spi-builder-workspace/Sources/System/FilePath/FilePathComponents.swift /Users/admin/builder/spi-builder-workspace/Sources/System/FilePath/FilePathParsing.swift /Users/admin/builder/spi-builder-workspace/Sources/System/FilePath/FilePathString.swift /Users/admin/builder/spi-builder-workspace/Sources/System/FilePath/FilePathSyntax.swift /Users/admin/builder/spi-builder-workspace/Sources/System/FilePath/FilePathWindows.swift /Users/admin/builder/spi-builder-workspace/Sources/System/FilePermissions.swift /Users/admin/builder/spi-builder-workspace/Sources/System/InputOutput/IOControl.swift /Users/admin/builder/spi-builder-workspace/Sources/System/InputOutput/IODirection.swift /Users/admin/builder/spi-builder-workspace/Sources/System/InputOutput/IOOperations.swift /Users/admin/builder/spi-builder-workspace/Sources/System/InputOutput/IOType.swift /Users/admin/builder/spi-builder-workspace/Sources/System/InputOutput/TerminalIO.swift /Users/admin/builder/spi-builder-workspace/Sources/System/Internals/CInternetAddress.swift /Users/admin/builder/spi-builder-workspace/Sources/System/Internals/CInterop.swift /Users/admin/builder/spi-builder-workspace/Sources/System/Internals/CSocketAddress.swift /Users/admin/builder/spi-builder-workspace/Sources/System/Internals/Compatibility.swift /Users/admin/builder/spi-builder-workspace/Sources/System/Internals/Constants.swift /Users/admin/builder/spi-builder-workspace/Sources/System/Internals/Exports.swift /Users/admin/builder/spi-builder-workspace/Sources/System/Internals/IOCTL.swift /Users/admin/builder/spi-builder-workspace/Sources/System/Internals/Mocking.swift /Users/admin/builder/spi-builder-workspace/Sources/System/Internals/NetworkOrder.swift /Users/admin/builder/spi-builder-workspace/Sources/System/Internals/Syscalls.swift /Users/admin/builder/spi-builder-workspace/Sources/System/Internals/WindowsSyscallAdapters.swift /Users/admin/builder/spi-builder-workspace/Sources/System/InternetProtocol.swift /Users/admin/builder/spi-builder-workspace/Sources/System/PlatformString.swift /Users/admin/builder/spi-builder-workspace/Sources/System/ProcessID.swift /Users/admin/builder/spi-builder-workspace/Sources/System/Signal/Signal.swift /Users/admin/builder/spi-builder-workspace/Sources/System/Signal/SignalAction.swift /Users/admin/builder/spi-builder-workspace/Sources/System/Signal/SignalHandler.swift /Users/admin/builder/spi-builder-workspace/Sources/System/Signal/SignalInformation.swift /Users/admin/builder/spi-builder-workspace/Sources/System/Signal/SignalSet.swift /Users/admin/builder/spi-builder-workspace/Sources/System/Socket/AsyncSocketOperations.swift /Users/admin/builder/spi-builder-workspace/Sources/System/Socket/MessageFlags.swift /Users/admin/builder/spi-builder-workspace/Sources/System/Socket/Poll.swift /Users/admin/builder/spi-builder-workspace/Sources/System/Socket/SocketAddress.swift /Users/admin/builder/spi-builder-workspace/Sources/System/Socket/SocketAddressFamily.swift /Users/admin/builder/spi-builder-workspace/Sources/System/Socket/SocketFlags.swift /Users/admin/builder/spi-builder-workspace/Sources/System/Socket/SocketOperations.swift /Users/admin/builder/spi-builder-workspace/Sources/System/Socket/SocketOption.swift /Users/admin/builder/spi-builder-workspace/Sources/System/Socket/SocketOptionID.swift /Users/admin/builder/spi-builder-workspace/Sources/System/Socket/SocketOptionLevel.swift /Users/admin/builder/spi-builder-workspace/Sources/System/Socket/SocketProtocol.swift /Users/admin/builder/spi-builder-workspace/Sources/System/Socket/SocketType.swift /Users/admin/builder/spi-builder-workspace/Sources/System/SystemInfo.swift /Users/admin/builder/spi-builder-workspace/Sources/System/SystemString.swift /Users/admin/builder/spi-builder-workspace/Sources/System/Time/Clock.swift /Users/admin/builder/spi-builder-workspace/Sources/System/Time/Microseconds.swift /Users/admin/builder/spi-builder-workspace/Sources/System/Time/Nanoseconds.swift /Users/admin/builder/spi-builder-workspace/Sources/System/Time/ProcessorTime.swift /Users/admin/builder/spi-builder-workspace/Sources/System/Time/Time.swift /Users/admin/builder/spi-builder-workspace/Sources/System/Time/TimeComponents.swift -primary-file /Users/admin/builder/spi-builder-workspace/Sources/System/Time/TimeInterval.swift -primary-file /Users/admin/builder/spi-builder-workspace/Sources/System/Time/TimeIntervalMicroseconds.swift -primary-file /Users/admin/builder/spi-builder-workspace/Sources/System/Time/TimeIntervalNanoseconds.swift -primary-file /Users/admin/builder/spi-builder-workspace/Sources/System/UserID.swift -primary-file /Users/admin/builder/spi-builder-workspace/Sources/System/Util.swift -primary-file /Users/admin/builder/spi-builder-workspace/Sources/System/UtilConsumers.swift -supplementary-output-file-map /Users/admin/builder/spi-builder-workspace/.derivedData/Build/Intermediates.noindex/swift-system.build/Debug-watchos/SystemPackage.build/Objects-normal/arm64_32/supplementaryOutputs-27 -target arm64_32-apple-watchos5.0 -enable-objc-interop -sdk /Applications/Xcode-16.1.0.app/Contents/Developer/Platforms/WatchOS.platform/Developer/SDKs/WatchOS11.1.sdk -I /Users/admin/builder/spi-builder-workspace/.derivedData/Build/Products/Debug-watchos -I /Applications/Xcode-16.1.0.app/Contents/Developer/Platforms/WatchOS.platform/Developer/usr/lib -F /Users/admin/builder/spi-builder-workspace/.derivedData/Build/Products/Debug-watchos/PackageFrameworks -F /Users/admin/builder/spi-builder-workspace/.derivedData/Build/Products/Debug-watchos -F /Applications/Xcode-16.1.0.app/Contents/Developer/Platforms/WatchOS.platform/Developer/Library/Frameworks -F /Applications/Xcode-16.1.0.app/Contents/Developer/Platforms/WatchOS.platform/Developer/SDKs/WatchOS11.1.sdk/Developer/Library/Frameworks -no-color-diagnostics -enable-testing -g -debug-info-format\=dwarf -dwarf-version\=4 -module-cache-path /Users/admin/builder/spi-builder-workspace/.derivedData/ModuleCache.noindex -profile-generate -profile-coverage-mapping -swift-version 5 -enforce-exclusivity\=checked -stats-output-dir /Users/admin/builder/spi-builder-workspace/.swiftpm/xcode/.stats -Onone -D SWIFT_PACKAGE -D DEBUG -D SYSTEM_PACKAGE -D ENABLE_MOCKING -serialize-debugging-options -const-gather-protocols-file /Users/admin/builder/spi-builder-workspace/.derivedData/Build/Intermediates.noindex/swift-system.build/Debug-watchos/SystemPackage.build/Objects-normal/arm64_32/SystemPackage_const_extract_protocols.json -enable-experimental-feature DebugDescriptionMacro -enable-experimental-feature OpaqueTypeErasure -enable-upcoming-feature StrictConcurrency -enable-upcoming-feature DisableOutwardActorInference -enable-upcoming-feature GlobalActorIsolatedTypesUsability -enable-upcoming-feature InferSendableFromCaptures -strict-concurrency\=complete -empty-abi-descriptor -plugin-path /Applications/Xcode-16.1.0.app/Contents/Developer/Toolchains/XcodeDefault.xctoolchain/usr/lib/swift/host/plugins/testing -validate-clang-modules-once -clang-build-session-file /Users/admin/builder/spi-builder-workspace/.derivedData/ModuleCache.noindex/Session.modulevalidation -Xcc -working-directory -Xcc /Users/admin/builder/spi-builder-workspace/.swiftpm/xcode -resource-dir /Applications/Xcode-16.1.0.app/Contents/Developer/Toolchains/XcodeDefault.xctoolchain/usr/lib/swift -enable-anonymous-context-mangled-names -file-compilation-dir /Users/admin/builder/spi-builder-workspace/.swiftpm/xcode -Xcc -D_LIBCPP_HARDENING_MODE\=_LIBCPP_HARDENING_MODE_DEBUG -Xcc -ivfsstatcache -Xcc /Users/admin/builder/spi-builder-workspace/.derivedData/SDKStatCaches.noindex/watchos11.1-22R574-7b9df0bda16bb4641b33636c68f04660.sdkstatcache -Xcc -I/Users/admin/builder/spi-builder-workspace/.derivedData/Build/Intermediates.noindex/swift-system.build/Debug-watchos/SystemPackage.build/swift-overrides.hmap -Xcc -I/Users/admin/builder/spi-builder-workspace/Sources/CSystem/include -Xcc -I/Users/admin/builder/spi-builder-workspace/.derivedData/Build/Products/Debug-watchos/include -Xcc -I/Users/admin/builder/spi-builder-workspace/.derivedData/Build/Intermediates.noindex/swift-system.build/Debug-watchos/SystemPackage.build/DerivedSources-normal/arm64_32 -Xcc -I/Users/admin/builder/spi-builder-workspace/.derivedData/Build/Intermediates.noindex/swift-system.build/Debug-watchos/SystemPackage.build/DerivedSources/arm64_32 -Xcc -I/Users/admin/builder/spi-builder-workspace/.derivedData/Build/Intermediates.noindex/swift-system.build/Debug-watchos/SystemPackage.build/DerivedSources -Xcc -DSWIFT_PACKAGE -Xcc -DDEBUG\=1 -Xcc -D_CRT_SECURE_NO_WARNINGS -module-name SystemPackage -frontend-parseable-output -disable-clang-spi -target-sdk-version 11.1 -target-sdk-name watchos11.1 -external-plugin-path /Applications/Xcode-16.1.0.app/Contents/Developer/Platforms/WatchOS.platform/Developer/usr/lib/swift/host/plugins\#/Applications/Xcode-16.1.0.app/Contents/Developer/Platforms/WatchOS.platform/Developer/usr/bin/swift-plugin-server -external-plugin-path /Applications/Xcode-16.1.0.app/Contents/Developer/Platforms/WatchOS.platform/Developer/usr/local/lib/swift/host/plugins\#/Applications/Xcode-16.1.0.app/Contents/Developer/Platforms/WatchOS.platform/Developer/usr/bin/swift-plugin-server -plugin-path /Applications/Xcode-16.1.0.app/Contents/Developer/Toolchains/XcodeDefault.xctoolchain/usr/lib/swift/host/plugins -plugin-path /Applications/Xcode-16.1.0.app/Contents/Developer/Toolchains/XcodeDefault.xctoolchain/usr/local/lib/swift/host/plugins -o /Users/admin/builder/spi-builder-workspace/.derivedData/Build/Intermediates.noindex/swift-system.build/Debug-watchos/SystemPackage.build/Objects-normal/arm64_32/TimeInterval.o -o /Users/admin/builder/spi-builder-workspace/.derivedData/Build/Intermediates.noindex/swift-system.build/Debug-watchos/SystemPackage.build/Objects-normal/arm64_32/TimeIntervalMicroseconds.o -o /Users/admin/builder/spi-builder-workspace/.derivedData/Build/Intermediates.noindex/swift-system.build/Debug-watchos/SystemPackage.build/Objects-normal/arm64_32/TimeIntervalNanoseconds.o -o /Users/admin/builder/spi-builder-workspace/.derivedData/Build/Intermediates.noindex/swift-system.build/Debug-watchos/SystemPackage.build/Objects-normal/arm64_32/UserID.o -o /Users/admin/builder/spi-builder-workspace/.derivedData/Build/Intermediates.noindex/swift-system.build/Debug-watchos/SystemPackage.build/Objects-normal/arm64_32/Util.o -o /Users/admin/builder/spi-builder-workspace/.derivedData/Build/Intermediates.noindex/swift-system.build/Debug-watchos/SystemPackage.build/Objects-normal/arm64_32/UtilConsumers.o -index-unit-output-path /swift-system.build/Debug-watchos/SystemPackage.build/Objects-normal/arm64_32/TimeInterval.o -index-unit-output-path /swift-system.build/Debug-watchos/SystemPackage.build/Objects-normal/arm64_32/TimeIntervalMicroseconds.o -index-unit-output-path /swift-system.build/Debug-watchos/SystemPackage.build/Objects-normal/arm64_32/TimeIntervalNanoseconds.o -index-unit-output-path /swift-system.build/Debug-watchos/SystemPackage.build/Objects-normal/arm64_32/UserID.o -index-unit-output-path /swift-system.build/Debug-watchos/SystemPackage.build/Objects-normal/arm64_32/Util.o -index-unit-output-path /swift-system.build/Debug-watchos/SystemPackage.build/Objects-normal/arm64_32/UtilConsumers.o -index-store-path /Users/admin/builder/spi-builder-workspace/.derivedData/Index.noindex/DataStore -index-system-modules
SwiftCompile normal arm64_32 /Users/admin/builder/spi-builder-workspace/Sources/System/Util.swift (in target 'SystemPackage' from project 'swift-system')
cd /Users/admin/builder/spi-builder-workspace/.swiftpm/xcode
/Applications/Xcode-16.1.0.app/Contents/Developer/Toolchains/XcodeDefault.xctoolchain/usr/bin/swift-frontend -c /Users/admin/builder/spi-builder-workspace/Sources/System/AsyncFileOperations.swift /Users/admin/builder/spi-builder-workspace/Sources/System/Errno.swift /Users/admin/builder/spi-builder-workspace/Sources/System/FileChange.swift /Users/admin/builder/spi-builder-workspace/Sources/System/FileDescriptor.swift /Users/admin/builder/spi-builder-workspace/Sources/System/FileDescriptorSet.swift /Users/admin/builder/spi-builder-workspace/Sources/System/FileEvent.swift /Users/admin/builder/spi-builder-workspace/Sources/System/FileHelpers.swift /Users/admin/builder/spi-builder-workspace/Sources/System/FileOperations.swift /Users/admin/builder/spi-builder-workspace/Sources/System/FilePath/FilePath.swift /Users/admin/builder/spi-builder-workspace/Sources/System/FilePath/FilePathComponentView.swift /Users/admin/builder/spi-builder-workspace/Sources/System/FilePath/FilePathComponents.swift /Users/admin/builder/spi-builder-workspace/Sources/System/FilePath/FilePathParsing.swift /Users/admin/builder/spi-builder-workspace/Sources/System/FilePath/FilePathString.swift /Users/admin/builder/spi-builder-workspace/Sources/System/FilePath/FilePathSyntax.swift /Users/admin/builder/spi-builder-workspace/Sources/System/FilePath/FilePathWindows.swift /Users/admin/builder/spi-builder-workspace/Sources/System/FilePermissions.swift /Users/admin/builder/spi-builder-workspace/Sources/System/InputOutput/IOControl.swift /Users/admin/builder/spi-builder-workspace/Sources/System/InputOutput/IODirection.swift /Users/admin/builder/spi-builder-workspace/Sources/System/InputOutput/IOOperations.swift /Users/admin/builder/spi-builder-workspace/Sources/System/InputOutput/IOType.swift /Users/admin/builder/spi-builder-workspace/Sources/System/InputOutput/TerminalIO.swift /Users/admin/builder/spi-builder-workspace/Sources/System/Internals/CInternetAddress.swift /Users/admin/builder/spi-builder-workspace/Sources/System/Internals/CInterop.swift /Users/admin/builder/spi-builder-workspace/Sources/System/Internals/CSocketAddress.swift /Users/admin/builder/spi-builder-workspace/Sources/System/Internals/Compatibility.swift /Users/admin/builder/spi-builder-workspace/Sources/System/Internals/Constants.swift /Users/admin/builder/spi-builder-workspace/Sources/System/Internals/Exports.swift /Users/admin/builder/spi-builder-workspace/Sources/System/Internals/IOCTL.swift /Users/admin/builder/spi-builder-workspace/Sources/System/Internals/Mocking.swift /Users/admin/builder/spi-builder-workspace/Sources/System/Internals/NetworkOrder.swift /Users/admin/builder/spi-builder-workspace/Sources/System/Internals/Syscalls.swift /Users/admin/builder/spi-builder-workspace/Sources/System/Internals/WindowsSyscallAdapters.swift /Users/admin/builder/spi-builder-workspace/Sources/System/InternetProtocol.swift /Users/admin/builder/spi-builder-workspace/Sources/System/PlatformString.swift /Users/admin/builder/spi-builder-workspace/Sources/System/ProcessID.swift /Users/admin/builder/spi-builder-workspace/Sources/System/Signal/Signal.swift /Users/admin/builder/spi-builder-workspace/Sources/System/Signal/SignalAction.swift /Users/admin/builder/spi-builder-workspace/Sources/System/Signal/SignalHandler.swift /Users/admin/builder/spi-builder-workspace/Sources/System/Signal/SignalInformation.swift /Users/admin/builder/spi-builder-workspace/Sources/System/Signal/SignalSet.swift /Users/admin/builder/spi-builder-workspace/Sources/System/Socket/AsyncSocketOperations.swift /Users/admin/builder/spi-builder-workspace/Sources/System/Socket/MessageFlags.swift /Users/admin/builder/spi-builder-workspace/Sources/System/Socket/Poll.swift /Users/admin/builder/spi-builder-workspace/Sources/System/Socket/SocketAddress.swift /Users/admin/builder/spi-builder-workspace/Sources/System/Socket/SocketAddressFamily.swift /Users/admin/builder/spi-builder-workspace/Sources/System/Socket/SocketFlags.swift /Users/admin/builder/spi-builder-workspace/Sources/System/Socket/SocketOperations.swift /Users/admin/builder/spi-builder-workspace/Sources/System/Socket/SocketOption.swift /Users/admin/builder/spi-builder-workspace/Sources/System/Socket/SocketOptionID.swift /Users/admin/builder/spi-builder-workspace/Sources/System/Socket/SocketOptionLevel.swift /Users/admin/builder/spi-builder-workspace/Sources/System/Socket/SocketProtocol.swift /Users/admin/builder/spi-builder-workspace/Sources/System/Socket/SocketType.swift /Users/admin/builder/spi-builder-workspace/Sources/System/SystemInfo.swift /Users/admin/builder/spi-builder-workspace/Sources/System/SystemString.swift /Users/admin/builder/spi-builder-workspace/Sources/System/Time/Clock.swift /Users/admin/builder/spi-builder-workspace/Sources/System/Time/Microseconds.swift /Users/admin/builder/spi-builder-workspace/Sources/System/Time/Nanoseconds.swift /Users/admin/builder/spi-builder-workspace/Sources/System/Time/ProcessorTime.swift /Users/admin/builder/spi-builder-workspace/Sources/System/Time/Time.swift /Users/admin/builder/spi-builder-workspace/Sources/System/Time/TimeComponents.swift -primary-file /Users/admin/builder/spi-builder-workspace/Sources/System/Time/TimeInterval.swift -primary-file /Users/admin/builder/spi-builder-workspace/Sources/System/Time/TimeIntervalMicroseconds.swift -primary-file /Users/admin/builder/spi-builder-workspace/Sources/System/Time/TimeIntervalNanoseconds.swift -primary-file /Users/admin/builder/spi-builder-workspace/Sources/System/UserID.swift -primary-file /Users/admin/builder/spi-builder-workspace/Sources/System/Util.swift -primary-file /Users/admin/builder/spi-builder-workspace/Sources/System/UtilConsumers.swift -supplementary-output-file-map /Users/admin/builder/spi-builder-workspace/.derivedData/Build/Intermediates.noindex/swift-system.build/Debug-watchos/SystemPackage.build/Objects-normal/arm64_32/supplementaryOutputs-27 -target arm64_32-apple-watchos5.0 -enable-objc-interop -sdk /Applications/Xcode-16.1.0.app/Contents/Developer/Platforms/WatchOS.platform/Developer/SDKs/WatchOS11.1.sdk -I /Users/admin/builder/spi-builder-workspace/.derivedData/Build/Products/Debug-watchos -I /Applications/Xcode-16.1.0.app/Contents/Developer/Platforms/WatchOS.platform/Developer/usr/lib -F /Users/admin/builder/spi-builder-workspace/.derivedData/Build/Products/Debug-watchos/PackageFrameworks -F /Users/admin/builder/spi-builder-workspace/.derivedData/Build/Products/Debug-watchos -F /Applications/Xcode-16.1.0.app/Contents/Developer/Platforms/WatchOS.platform/Developer/Library/Frameworks -F /Applications/Xcode-16.1.0.app/Contents/Developer/Platforms/WatchOS.platform/Developer/SDKs/WatchOS11.1.sdk/Developer/Library/Frameworks -no-color-diagnostics -enable-testing -g -debug-info-format\=dwarf -dwarf-version\=4 -module-cache-path /Users/admin/builder/spi-builder-workspace/.derivedData/ModuleCache.noindex -profile-generate -profile-coverage-mapping -swift-version 5 -enforce-exclusivity\=checked -stats-output-dir /Users/admin/builder/spi-builder-workspace/.swiftpm/xcode/.stats -Onone -D SWIFT_PACKAGE -D DEBUG -D SYSTEM_PACKAGE -D ENABLE_MOCKING -serialize-debugging-options -const-gather-protocols-file /Users/admin/builder/spi-builder-workspace/.derivedData/Build/Intermediates.noindex/swift-system.build/Debug-watchos/SystemPackage.build/Objects-normal/arm64_32/SystemPackage_const_extract_protocols.json -enable-experimental-feature DebugDescriptionMacro -enable-experimental-feature OpaqueTypeErasure -enable-upcoming-feature StrictConcurrency -enable-upcoming-feature DisableOutwardActorInference -enable-upcoming-feature GlobalActorIsolatedTypesUsability -enable-upcoming-feature InferSendableFromCaptures -strict-concurrency\=complete -empty-abi-descriptor -plugin-path /Applications/Xcode-16.1.0.app/Contents/Developer/Toolchains/XcodeDefault.xctoolchain/usr/lib/swift/host/plugins/testing -validate-clang-modules-once -clang-build-session-file /Users/admin/builder/spi-builder-workspace/.derivedData/ModuleCache.noindex/Session.modulevalidation -Xcc -working-directory -Xcc /Users/admin/builder/spi-builder-workspace/.swiftpm/xcode -resource-dir /Applications/Xcode-16.1.0.app/Contents/Developer/Toolchains/XcodeDefault.xctoolchain/usr/lib/swift -enable-anonymous-context-mangled-names -file-compilation-dir /Users/admin/builder/spi-builder-workspace/.swiftpm/xcode -Xcc -D_LIBCPP_HARDENING_MODE\=_LIBCPP_HARDENING_MODE_DEBUG -Xcc -ivfsstatcache -Xcc /Users/admin/builder/spi-builder-workspace/.derivedData/SDKStatCaches.noindex/watchos11.1-22R574-7b9df0bda16bb4641b33636c68f04660.sdkstatcache -Xcc -I/Users/admin/builder/spi-builder-workspace/.derivedData/Build/Intermediates.noindex/swift-system.build/Debug-watchos/SystemPackage.build/swift-overrides.hmap -Xcc -I/Users/admin/builder/spi-builder-workspace/Sources/CSystem/include -Xcc -I/Users/admin/builder/spi-builder-workspace/.derivedData/Build/Products/Debug-watchos/include -Xcc -I/Users/admin/builder/spi-builder-workspace/.derivedData/Build/Intermediates.noindex/swift-system.build/Debug-watchos/SystemPackage.build/DerivedSources-normal/arm64_32 -Xcc -I/Users/admin/builder/spi-builder-workspace/.derivedData/Build/Intermediates.noindex/swift-system.build/Debug-watchos/SystemPackage.build/DerivedSources/arm64_32 -Xcc -I/Users/admin/builder/spi-builder-workspace/.derivedData/Build/Intermediates.noindex/swift-system.build/Debug-watchos/SystemPackage.build/DerivedSources -Xcc -DSWIFT_PACKAGE -Xcc -DDEBUG\=1 -Xcc -D_CRT_SECURE_NO_WARNINGS -module-name SystemPackage -frontend-parseable-output -disable-clang-spi -target-sdk-version 11.1 -target-sdk-name watchos11.1 -external-plugin-path /Applications/Xcode-16.1.0.app/Contents/Developer/Platforms/WatchOS.platform/Developer/usr/lib/swift/host/plugins\#/Applications/Xcode-16.1.0.app/Contents/Developer/Platforms/WatchOS.platform/Developer/usr/bin/swift-plugin-server -external-plugin-path /Applications/Xcode-16.1.0.app/Contents/Developer/Platforms/WatchOS.platform/Developer/usr/local/lib/swift/host/plugins\#/Applications/Xcode-16.1.0.app/Contents/Developer/Platforms/WatchOS.platform/Developer/usr/bin/swift-plugin-server -plugin-path /Applications/Xcode-16.1.0.app/Contents/Developer/Toolchains/XcodeDefault.xctoolchain/usr/lib/swift/host/plugins -plugin-path /Applications/Xcode-16.1.0.app/Contents/Developer/Toolchains/XcodeDefault.xctoolchain/usr/local/lib/swift/host/plugins -o /Users/admin/builder/spi-builder-workspace/.derivedData/Build/Intermediates.noindex/swift-system.build/Debug-watchos/SystemPackage.build/Objects-normal/arm64_32/TimeInterval.o -o /Users/admin/builder/spi-builder-workspace/.derivedData/Build/Intermediates.noindex/swift-system.build/Debug-watchos/SystemPackage.build/Objects-normal/arm64_32/TimeIntervalMicroseconds.o -o /Users/admin/builder/spi-builder-workspace/.derivedData/Build/Intermediates.noindex/swift-system.build/Debug-watchos/SystemPackage.build/Objects-normal/arm64_32/TimeIntervalNanoseconds.o -o /Users/admin/builder/spi-builder-workspace/.derivedData/Build/Intermediates.noindex/swift-system.build/Debug-watchos/SystemPackage.build/Objects-normal/arm64_32/UserID.o -o /Users/admin/builder/spi-builder-workspace/.derivedData/Build/Intermediates.noindex/swift-system.build/Debug-watchos/SystemPackage.build/Objects-normal/arm64_32/Util.o -o /Users/admin/builder/spi-builder-workspace/.derivedData/Build/Intermediates.noindex/swift-system.build/Debug-watchos/SystemPackage.build/Objects-normal/arm64_32/UtilConsumers.o -index-unit-output-path /swift-system.build/Debug-watchos/SystemPackage.build/Objects-normal/arm64_32/TimeInterval.o -index-unit-output-path /swift-system.build/Debug-watchos/SystemPackage.build/Objects-normal/arm64_32/TimeIntervalMicroseconds.o -index-unit-output-path /swift-system.build/Debug-watchos/SystemPackage.build/Objects-normal/arm64_32/TimeIntervalNanoseconds.o -index-unit-output-path /swift-system.build/Debug-watchos/SystemPackage.build/Objects-normal/arm64_32/UserID.o -index-unit-output-path /swift-system.build/Debug-watchos/SystemPackage.build/Objects-normal/arm64_32/Util.o -index-unit-output-path /swift-system.build/Debug-watchos/SystemPackage.build/Objects-normal/arm64_32/UtilConsumers.o -index-store-path /Users/admin/builder/spi-builder-workspace/.derivedData/Index.noindex/DataStore -index-system-modules
SwiftCompile normal arm64_32 /Users/admin/builder/spi-builder-workspace/Sources/System/UtilConsumers.swift (in target 'SystemPackage' from project 'swift-system')
cd /Users/admin/builder/spi-builder-workspace/.swiftpm/xcode
/Applications/Xcode-16.1.0.app/Contents/Developer/Toolchains/XcodeDefault.xctoolchain/usr/bin/swift-frontend -c /Users/admin/builder/spi-builder-workspace/Sources/System/AsyncFileOperations.swift /Users/admin/builder/spi-builder-workspace/Sources/System/Errno.swift /Users/admin/builder/spi-builder-workspace/Sources/System/FileChange.swift /Users/admin/builder/spi-builder-workspace/Sources/System/FileDescriptor.swift /Users/admin/builder/spi-builder-workspace/Sources/System/FileDescriptorSet.swift /Users/admin/builder/spi-builder-workspace/Sources/System/FileEvent.swift /Users/admin/builder/spi-builder-workspace/Sources/System/FileHelpers.swift /Users/admin/builder/spi-builder-workspace/Sources/System/FileOperations.swift /Users/admin/builder/spi-builder-workspace/Sources/System/FilePath/FilePath.swift /Users/admin/builder/spi-builder-workspace/Sources/System/FilePath/FilePathComponentView.swift /Users/admin/builder/spi-builder-workspace/Sources/System/FilePath/FilePathComponents.swift /Users/admin/builder/spi-builder-workspace/Sources/System/FilePath/FilePathParsing.swift /Users/admin/builder/spi-builder-workspace/Sources/System/FilePath/FilePathString.swift /Users/admin/builder/spi-builder-workspace/Sources/System/FilePath/FilePathSyntax.swift /Users/admin/builder/spi-builder-workspace/Sources/System/FilePath/FilePathWindows.swift /Users/admin/builder/spi-builder-workspace/Sources/System/FilePermissions.swift /Users/admin/builder/spi-builder-workspace/Sources/System/InputOutput/IOControl.swift /Users/admin/builder/spi-builder-workspace/Sources/System/InputOutput/IODirection.swift /Users/admin/builder/spi-builder-workspace/Sources/System/InputOutput/IOOperations.swift /Users/admin/builder/spi-builder-workspace/Sources/System/InputOutput/IOType.swift /Users/admin/builder/spi-builder-workspace/Sources/System/InputOutput/TerminalIO.swift /Users/admin/builder/spi-builder-workspace/Sources/System/Internals/CInternetAddress.swift /Users/admin/builder/spi-builder-workspace/Sources/System/Internals/CInterop.swift /Users/admin/builder/spi-builder-workspace/Sources/System/Internals/CSocketAddress.swift /Users/admin/builder/spi-builder-workspace/Sources/System/Internals/Compatibility.swift /Users/admin/builder/spi-builder-workspace/Sources/System/Internals/Constants.swift /Users/admin/builder/spi-builder-workspace/Sources/System/Internals/Exports.swift /Users/admin/builder/spi-builder-workspace/Sources/System/Internals/IOCTL.swift /Users/admin/builder/spi-builder-workspace/Sources/System/Internals/Mocking.swift /Users/admin/builder/spi-builder-workspace/Sources/System/Internals/NetworkOrder.swift /Users/admin/builder/spi-builder-workspace/Sources/System/Internals/Syscalls.swift /Users/admin/builder/spi-builder-workspace/Sources/System/Internals/WindowsSyscallAdapters.swift /Users/admin/builder/spi-builder-workspace/Sources/System/InternetProtocol.swift /Users/admin/builder/spi-builder-workspace/Sources/System/PlatformString.swift /Users/admin/builder/spi-builder-workspace/Sources/System/ProcessID.swift /Users/admin/builder/spi-builder-workspace/Sources/System/Signal/Signal.swift /Users/admin/builder/spi-builder-workspace/Sources/System/Signal/SignalAction.swift /Users/admin/builder/spi-builder-workspace/Sources/System/Signal/SignalHandler.swift /Users/admin/builder/spi-builder-workspace/Sources/System/Signal/SignalInformation.swift /Users/admin/builder/spi-builder-workspace/Sources/System/Signal/SignalSet.swift /Users/admin/builder/spi-builder-workspace/Sources/System/Socket/AsyncSocketOperations.swift /Users/admin/builder/spi-builder-workspace/Sources/System/Socket/MessageFlags.swift /Users/admin/builder/spi-builder-workspace/Sources/System/Socket/Poll.swift /Users/admin/builder/spi-builder-workspace/Sources/System/Socket/SocketAddress.swift /Users/admin/builder/spi-builder-workspace/Sources/System/Socket/SocketAddressFamily.swift /Users/admin/builder/spi-builder-workspace/Sources/System/Socket/SocketFlags.swift /Users/admin/builder/spi-builder-workspace/Sources/System/Socket/SocketOperations.swift /Users/admin/builder/spi-builder-workspace/Sources/System/Socket/SocketOption.swift /Users/admin/builder/spi-builder-workspace/Sources/System/Socket/SocketOptionID.swift /Users/admin/builder/spi-builder-workspace/Sources/System/Socket/SocketOptionLevel.swift /Users/admin/builder/spi-builder-workspace/Sources/System/Socket/SocketProtocol.swift /Users/admin/builder/spi-builder-workspace/Sources/System/Socket/SocketType.swift /Users/admin/builder/spi-builder-workspace/Sources/System/SystemInfo.swift /Users/admin/builder/spi-builder-workspace/Sources/System/SystemString.swift /Users/admin/builder/spi-builder-workspace/Sources/System/Time/Clock.swift /Users/admin/builder/spi-builder-workspace/Sources/System/Time/Microseconds.swift /Users/admin/builder/spi-builder-workspace/Sources/System/Time/Nanoseconds.swift /Users/admin/builder/spi-builder-workspace/Sources/System/Time/ProcessorTime.swift /Users/admin/builder/spi-builder-workspace/Sources/System/Time/Time.swift /Users/admin/builder/spi-builder-workspace/Sources/System/Time/TimeComponents.swift -primary-file /Users/admin/builder/spi-builder-workspace/Sources/System/Time/TimeInterval.swift -primary-file /Users/admin/builder/spi-builder-workspace/Sources/System/Time/TimeIntervalMicroseconds.swift -primary-file /Users/admin/builder/spi-builder-workspace/Sources/System/Time/TimeIntervalNanoseconds.swift -primary-file /Users/admin/builder/spi-builder-workspace/Sources/System/UserID.swift -primary-file /Users/admin/builder/spi-builder-workspace/Sources/System/Util.swift -primary-file /Users/admin/builder/spi-builder-workspace/Sources/System/UtilConsumers.swift -supplementary-output-file-map /Users/admin/builder/spi-builder-workspace/.derivedData/Build/Intermediates.noindex/swift-system.build/Debug-watchos/SystemPackage.build/Objects-normal/arm64_32/supplementaryOutputs-27 -target arm64_32-apple-watchos5.0 -enable-objc-interop -sdk /Applications/Xcode-16.1.0.app/Contents/Developer/Platforms/WatchOS.platform/Developer/SDKs/WatchOS11.1.sdk -I /Users/admin/builder/spi-builder-workspace/.derivedData/Build/Products/Debug-watchos -I /Applications/Xcode-16.1.0.app/Contents/Developer/Platforms/WatchOS.platform/Developer/usr/lib -F /Users/admin/builder/spi-builder-workspace/.derivedData/Build/Products/Debug-watchos/PackageFrameworks -F /Users/admin/builder/spi-builder-workspace/.derivedData/Build/Products/Debug-watchos -F /Applications/Xcode-16.1.0.app/Contents/Developer/Platforms/WatchOS.platform/Developer/Library/Frameworks -F /Applications/Xcode-16.1.0.app/Contents/Developer/Platforms/WatchOS.platform/Developer/SDKs/WatchOS11.1.sdk/Developer/Library/Frameworks -no-color-diagnostics -enable-testing -g -debug-info-format\=dwarf -dwarf-version\=4 -module-cache-path /Users/admin/builder/spi-builder-workspace/.derivedData/ModuleCache.noindex -profile-generate -profile-coverage-mapping -swift-version 5 -enforce-exclusivity\=checked -stats-output-dir /Users/admin/builder/spi-builder-workspace/.swiftpm/xcode/.stats -Onone -D SWIFT_PACKAGE -D DEBUG -D SYSTEM_PACKAGE -D ENABLE_MOCKING -serialize-debugging-options -const-gather-protocols-file /Users/admin/builder/spi-builder-workspace/.derivedData/Build/Intermediates.noindex/swift-system.build/Debug-watchos/SystemPackage.build/Objects-normal/arm64_32/SystemPackage_const_extract_protocols.json -enable-experimental-feature DebugDescriptionMacro -enable-experimental-feature OpaqueTypeErasure -enable-upcoming-feature StrictConcurrency -enable-upcoming-feature DisableOutwardActorInference -enable-upcoming-feature GlobalActorIsolatedTypesUsability -enable-upcoming-feature InferSendableFromCaptures -strict-concurrency\=complete -empty-abi-descriptor -plugin-path /Applications/Xcode-16.1.0.app/Contents/Developer/Toolchains/XcodeDefault.xctoolchain/usr/lib/swift/host/plugins/testing -validate-clang-modules-once -clang-build-session-file /Users/admin/builder/spi-builder-workspace/.derivedData/ModuleCache.noindex/Session.modulevalidation -Xcc -working-directory -Xcc /Users/admin/builder/spi-builder-workspace/.swiftpm/xcode -resource-dir /Applications/Xcode-16.1.0.app/Contents/Developer/Toolchains/XcodeDefault.xctoolchain/usr/lib/swift -enable-anonymous-context-mangled-names -file-compilation-dir /Users/admin/builder/spi-builder-workspace/.swiftpm/xcode -Xcc -D_LIBCPP_HARDENING_MODE\=_LIBCPP_HARDENING_MODE_DEBUG -Xcc -ivfsstatcache -Xcc /Users/admin/builder/spi-builder-workspace/.derivedData/SDKStatCaches.noindex/watchos11.1-22R574-7b9df0bda16bb4641b33636c68f04660.sdkstatcache -Xcc -I/Users/admin/builder/spi-builder-workspace/.derivedData/Build/Intermediates.noindex/swift-system.build/Debug-watchos/SystemPackage.build/swift-overrides.hmap -Xcc -I/Users/admin/builder/spi-builder-workspace/Sources/CSystem/include -Xcc -I/Users/admin/builder/spi-builder-workspace/.derivedData/Build/Products/Debug-watchos/include -Xcc -I/Users/admin/builder/spi-builder-workspace/.derivedData/Build/Intermediates.noindex/swift-system.build/Debug-watchos/SystemPackage.build/DerivedSources-normal/arm64_32 -Xcc -I/Users/admin/builder/spi-builder-workspace/.derivedData/Build/Intermediates.noindex/swift-system.build/Debug-watchos/SystemPackage.build/DerivedSources/arm64_32 -Xcc -I/Users/admin/builder/spi-builder-workspace/.derivedData/Build/Intermediates.noindex/swift-system.build/Debug-watchos/SystemPackage.build/DerivedSources -Xcc -DSWIFT_PACKAGE -Xcc -DDEBUG\=1 -Xcc -D_CRT_SECURE_NO_WARNINGS -module-name SystemPackage -frontend-parseable-output -disable-clang-spi -target-sdk-version 11.1 -target-sdk-name watchos11.1 -external-plugin-path /Applications/Xcode-16.1.0.app/Contents/Developer/Platforms/WatchOS.platform/Developer/usr/lib/swift/host/plugins\#/Applications/Xcode-16.1.0.app/Contents/Developer/Platforms/WatchOS.platform/Developer/usr/bin/swift-plugin-server -external-plugin-path /Applications/Xcode-16.1.0.app/Contents/Developer/Platforms/WatchOS.platform/Developer/usr/local/lib/swift/host/plugins\#/Applications/Xcode-16.1.0.app/Contents/Developer/Platforms/WatchOS.platform/Developer/usr/bin/swift-plugin-server -plugin-path /Applications/Xcode-16.1.0.app/Contents/Developer/Toolchains/XcodeDefault.xctoolchain/usr/lib/swift/host/plugins -plugin-path /Applications/Xcode-16.1.0.app/Contents/Developer/Toolchains/XcodeDefault.xctoolchain/usr/local/lib/swift/host/plugins -o /Users/admin/builder/spi-builder-workspace/.derivedData/Build/Intermediates.noindex/swift-system.build/Debug-watchos/SystemPackage.build/Objects-normal/arm64_32/TimeInterval.o -o /Users/admin/builder/spi-builder-workspace/.derivedData/Build/Intermediates.noindex/swift-system.build/Debug-watchos/SystemPackage.build/Objects-normal/arm64_32/TimeIntervalMicroseconds.o -o /Users/admin/builder/spi-builder-workspace/.derivedData/Build/Intermediates.noindex/swift-system.build/Debug-watchos/SystemPackage.build/Objects-normal/arm64_32/TimeIntervalNanoseconds.o -o /Users/admin/builder/spi-builder-workspace/.derivedData/Build/Intermediates.noindex/swift-system.build/Debug-watchos/SystemPackage.build/Objects-normal/arm64_32/UserID.o -o /Users/admin/builder/spi-builder-workspace/.derivedData/Build/Intermediates.noindex/swift-system.build/Debug-watchos/SystemPackage.build/Objects-normal/arm64_32/Util.o -o /Users/admin/builder/spi-builder-workspace/.derivedData/Build/Intermediates.noindex/swift-system.build/Debug-watchos/SystemPackage.build/Objects-normal/arm64_32/UtilConsumers.o -index-unit-output-path /swift-system.build/Debug-watchos/SystemPackage.build/Objects-normal/arm64_32/TimeInterval.o -index-unit-output-path /swift-system.build/Debug-watchos/SystemPackage.build/Objects-normal/arm64_32/TimeIntervalMicroseconds.o -index-unit-output-path /swift-system.build/Debug-watchos/SystemPackage.build/Objects-normal/arm64_32/TimeIntervalNanoseconds.o -index-unit-output-path /swift-system.build/Debug-watchos/SystemPackage.build/Objects-normal/arm64_32/UserID.o -index-unit-output-path /swift-system.build/Debug-watchos/SystemPackage.build/Objects-normal/arm64_32/Util.o -index-unit-output-path /swift-system.build/Debug-watchos/SystemPackage.build/Objects-normal/arm64_32/UtilConsumers.o -index-store-path /Users/admin/builder/spi-builder-workspace/.derivedData/Index.noindex/DataStore -index-system-modules
SwiftCompile normal arm64_32 Compiling\ AsyncFileOperations.swift,\ Errno.swift,\ FileChange.swift,\ FileDescriptor.swift,\ FileDescriptorSet.swift,\ FileEvent.swift,\ FileHelpers.swift /Users/admin/builder/spi-builder-workspace/Sources/System/AsyncFileOperations.swift /Users/admin/builder/spi-builder-workspace/Sources/System/Errno.swift /Users/admin/builder/spi-builder-workspace/Sources/System/FileChange.swift /Users/admin/builder/spi-builder-workspace/Sources/System/FileDescriptor.swift /Users/admin/builder/spi-builder-workspace/Sources/System/FileDescriptorSet.swift /Users/admin/builder/spi-builder-workspace/Sources/System/FileEvent.swift /Users/admin/builder/spi-builder-workspace/Sources/System/FileHelpers.swift (in target 'SystemPackage' from project 'swift-system')
cd /Users/admin/builder/spi-builder-workspace/.swiftpm/xcode
builtin-swiftTaskExecution -- /Applications/Xcode-16.1.0.app/Contents/Developer/Toolchains/XcodeDefault.xctoolchain/usr/bin/swift-frontend -frontend -c -primary-file /Users/admin/builder/spi-builder-workspace/Sources/System/AsyncFileOperations.swift -primary-file /Users/admin/builder/spi-builder-workspace/Sources/System/Errno.swift -primary-file /Users/admin/builder/spi-builder-workspace/Sources/System/FileChange.swift -primary-file /Users/admin/builder/spi-builder-workspace/Sources/System/FileDescriptor.swift -primary-file /Users/admin/builder/spi-builder-workspace/Sources/System/FileDescriptorSet.swift -primary-file /Users/admin/builder/spi-builder-workspace/Sources/System/FileEvent.swift -primary-file /Users/admin/builder/spi-builder-workspace/Sources/System/FileHelpers.swift /Users/admin/builder/spi-builder-workspace/Sources/System/FileOperations.swift /Users/admin/builder/spi-builder-workspace/Sources/System/FilePath/FilePath.swift /Users/admin/builder/spi-builder-workspace/Sources/System/FilePath/FilePathComponentView.swift /Users/admin/builder/spi-builder-workspace/Sources/System/FilePath/FilePathComponents.swift /Users/admin/builder/spi-builder-workspace/Sources/System/FilePath/FilePathParsing.swift /Users/admin/builder/spi-builder-workspace/Sources/System/FilePath/FilePathString.swift /Users/admin/builder/spi-builder-workspace/Sources/System/FilePath/FilePathSyntax.swift /Users/admin/builder/spi-builder-workspace/Sources/System/FilePath/FilePathWindows.swift /Users/admin/builder/spi-builder-workspace/Sources/System/FilePermissions.swift /Users/admin/builder/spi-builder-workspace/Sources/System/InputOutput/IOControl.swift /Users/admin/builder/spi-builder-workspace/Sources/System/InputOutput/IODirection.swift /Users/admin/builder/spi-builder-workspace/Sources/System/InputOutput/IOOperations.swift /Users/admin/builder/spi-builder-workspace/Sources/System/InputOutput/IOType.swift /Users/admin/builder/spi-builder-workspace/Sources/System/InputOutput/TerminalIO.swift /Users/admin/builder/spi-builder-workspace/Sources/System/Internals/CInternetAddress.swift /Users/admin/builder/spi-builder-workspace/Sources/System/Internals/CInterop.swift /Users/admin/builder/spi-builder-workspace/Sources/System/Internals/CSocketAddress.swift /Users/admin/builder/spi-builder-workspace/Sources/System/Internals/Compatibility.swift /Users/admin/builder/spi-builder-workspace/Sources/System/Internals/Constants.swift /Users/admin/builder/spi-builder-workspace/Sources/System/Internals/Exports.swift /Users/admin/builder/spi-builder-workspace/Sources/System/Internals/IOCTL.swift /Users/admin/builder/spi-builder-workspace/Sources/System/Internals/Mocking.swift /Users/admin/builder/spi-builder-workspace/Sources/System/Internals/NetworkOrder.swift /Users/admin/builder/spi-builder-workspace/Sources/System/Internals/Syscalls.swift /Users/admin/builder/spi-builder-workspace/Sources/System/Internals/WindowsSyscallAdapters.swift /Users/admin/builder/spi-builder-workspace/Sources/System/InternetProtocol.swift /Users/admin/builder/spi-builder-workspace/Sources/System/PlatformString.swift /Users/admin/builder/spi-builder-workspace/Sources/System/ProcessID.swift /Users/admin/builder/spi-builder-workspace/Sources/System/Signal/Signal.swift /Users/admin/builder/spi-builder-workspace/Sources/System/Signal/SignalAction.swift /Users/admin/builder/spi-builder-workspace/Sources/System/Signal/SignalHandler.swift /Users/admin/builder/spi-builder-workspace/Sources/System/Signal/SignalInformation.swift /Users/admin/builder/spi-builder-workspace/Sources/System/Signal/SignalSet.swift /Users/admin/builder/spi-builder-workspace/Sources/System/Socket/AsyncSocketOperations.swift /Users/admin/builder/spi-builder-workspace/Sources/System/Socket/MessageFlags.swift /Users/admin/builder/spi-builder-workspace/Sources/System/Socket/Poll.swift /Users/admin/builder/spi-builder-workspace/Sources/System/Socket/SocketAddress.swift /Users/admin/builder/spi-builder-workspace/Sources/System/Socket/SocketAddressFamily.swift /Users/admin/builder/spi-builder-workspace/Sources/System/Socket/SocketFlags.swift /Users/admin/builder/spi-builder-workspace/Sources/System/Socket/SocketOperations.swift /Users/admin/builder/spi-builder-workspace/Sources/System/Socket/SocketOption.swift /Users/admin/builder/spi-builder-workspace/Sources/System/Socket/SocketOptionID.swift /Users/admin/builder/spi-builder-workspace/Sources/System/Socket/SocketOptionLevel.swift /Users/admin/builder/spi-builder-workspace/Sources/System/Socket/SocketProtocol.swift /Users/admin/builder/spi-builder-workspace/Sources/System/Socket/SocketType.swift /Users/admin/builder/spi-builder-workspace/Sources/System/SystemInfo.swift /Users/admin/builder/spi-builder-workspace/Sources/System/SystemString.swift /Users/admin/builder/spi-builder-workspace/Sources/System/Time/Clock.swift /Users/admin/builder/spi-builder-workspace/Sources/System/Time/Microseconds.swift /Users/admin/builder/spi-builder-workspace/Sources/System/Time/Nanoseconds.swift /Users/admin/builder/spi-builder-workspace/Sources/System/Time/ProcessorTime.swift /Users/admin/builder/spi-builder-workspace/Sources/System/Time/Time.swift /Users/admin/builder/spi-builder-workspace/Sources/System/Time/TimeComponents.swift /Users/admin/builder/spi-builder-workspace/Sources/System/Time/TimeInterval.swift /Users/admin/builder/spi-builder-workspace/Sources/System/Time/TimeIntervalMicroseconds.swift /Users/admin/builder/spi-builder-workspace/Sources/System/Time/TimeIntervalNanoseconds.swift /Users/admin/builder/spi-builder-workspace/Sources/System/UserID.swift /Users/admin/builder/spi-builder-workspace/Sources/System/Util.swift /Users/admin/builder/spi-builder-workspace/Sources/System/UtilConsumers.swift -supplementary-output-file-map /Users/admin/builder/spi-builder-workspace/.derivedData/Build/Intermediates.noindex/swift-system.build/Debug-watchos/SystemPackage.build/Objects-normal/arm64_32/supplementaryOutputs-1 -target arm64_32-apple-watchos5.0 -enable-objc-interop -sdk /Applications/Xcode-16.1.0.app/Contents/Developer/Platforms/WatchOS.platform/Developer/SDKs/WatchOS11.1.sdk -I /Users/admin/builder/spi-builder-workspace/.derivedData/Build/Products/Debug-watchos -I /Applications/Xcode-16.1.0.app/Contents/Developer/Platforms/WatchOS.platform/Developer/usr/lib -F /Users/admin/builder/spi-builder-workspace/.derivedData/Build/Products/Debug-watchos/PackageFrameworks -F /Users/admin/builder/spi-builder-workspace/.derivedData/Build/Products/Debug-watchos -F /Applications/Xcode-16.1.0.app/Contents/Developer/Platforms/WatchOS.platform/Developer/Library/Frameworks -F /Applications/Xcode-16.1.0.app/Contents/Developer/Platforms/WatchOS.platform/Developer/SDKs/WatchOS11.1.sdk/Developer/Library/Frameworks -no-color-diagnostics -enable-testing -g -debug-info-format\=dwarf -dwarf-version\=4 -module-cache-path /Users/admin/builder/spi-builder-workspace/.derivedData/ModuleCache.noindex -profile-generate -profile-coverage-mapping -swift-version 5 -enforce-exclusivity\=checked -stats-output-dir /Users/admin/builder/spi-builder-workspace/.swiftpm/xcode/.stats -Onone -D SWIFT_PACKAGE -D DEBUG -D SYSTEM_PACKAGE -D ENABLE_MOCKING -serialize-debugging-options -const-gather-protocols-file /Users/admin/builder/spi-builder-workspace/.derivedData/Build/Intermediates.noindex/swift-system.build/Debug-watchos/SystemPackage.build/Objects-normal/arm64_32/SystemPackage_const_extract_protocols.json -enable-experimental-feature DebugDescriptionMacro -enable-experimental-feature OpaqueTypeErasure -enable-upcoming-feature StrictConcurrency -enable-upcoming-feature DisableOutwardActorInference -enable-upcoming-feature GlobalActorIsolatedTypesUsability -enable-upcoming-feature InferSendableFromCaptures -strict-concurrency\=complete -empty-abi-descriptor -plugin-path /Applications/Xcode-16.1.0.app/Contents/Developer/Toolchains/XcodeDefault.xctoolchain/usr/lib/swift/host/plugins/testing -validate-clang-modules-once -clang-build-session-file /Users/admin/builder/spi-builder-workspace/.derivedData/ModuleCache.noindex/Session.modulevalidation -Xcc -working-directory -Xcc /Users/admin/builder/spi-builder-workspace/.swiftpm/xcode -resource-dir /Applications/Xcode-16.1.0.app/Contents/Developer/Toolchains/XcodeDefault.xctoolchain/usr/lib/swift -enable-anonymous-context-mangled-names -file-compilation-dir /Users/admin/builder/spi-builder-workspace/.swiftpm/xcode -Xcc -D_LIBCPP_HARDENING_MODE\=_LIBCPP_HARDENING_MODE_DEBUG -Xcc -ivfsstatcache -Xcc /Users/admin/builder/spi-builder-workspace/.derivedData/SDKStatCaches.noindex/watchos11.1-22R574-7b9df0bda16bb4641b33636c68f04660.sdkstatcache -Xcc -I/Users/admin/builder/spi-builder-workspace/.derivedData/Build/Intermediates.noindex/swift-system.build/Debug-watchos/SystemPackage.build/swift-overrides.hmap -Xcc -I/Users/admin/builder/spi-builder-workspace/Sources/CSystem/include -Xcc -I/Users/admin/builder/spi-builder-workspace/.derivedData/Build/Products/Debug-watchos/include -Xcc -I/Users/admin/builder/spi-builder-workspace/.derivedData/Build/Intermediates.noindex/swift-system.build/Debug-watchos/SystemPackage.build/DerivedSources-normal/arm64_32 -Xcc -I/Users/admin/builder/spi-builder-workspace/.derivedData/Build/Intermediates.noindex/swift-system.build/Debug-watchos/SystemPackage.build/DerivedSources/arm64_32 -Xcc -I/Users/admin/builder/spi-builder-workspace/.derivedData/Build/Intermediates.noindex/swift-system.build/Debug-watchos/SystemPackage.build/DerivedSources -Xcc -DSWIFT_PACKAGE -Xcc -DDEBUG\=1 -Xcc -D_CRT_SECURE_NO_WARNINGS -module-name SystemPackage -frontend-parseable-output -disable-clang-spi -target-sdk-version 11.1 -target-sdk-name watchos11.1 -external-plugin-path /Applications/Xcode-16.1.0.app/Contents/Developer/Platforms/WatchOS.platform/Developer/usr/lib/swift/host/plugins\#/Applications/Xcode-16.1.0.app/Contents/Developer/Platforms/WatchOS.platform/Developer/usr/bin/swift-plugin-server -external-plugin-path /Applications/Xcode-16.1.0.app/Contents/Developer/Platforms/WatchOS.platform/Developer/usr/local/lib/swift/host/plugins\#/Applications/Xcode-16.1.0.app/Contents/Developer/Platforms/WatchOS.platform/Developer/usr/bin/swift-plugin-server -plugin-path /Applications/Xcode-16.1.0.app/Contents/Developer/Toolchains/XcodeDefault.xctoolchain/usr/lib/swift/host/plugins -plugin-path /Applications/Xcode-16.1.0.app/Contents/Developer/Toolchains/XcodeDefault.xctoolchain/usr/local/lib/swift/host/plugins -o /Users/admin/builder/spi-builder-workspace/.derivedData/Build/Intermediates.noindex/swift-system.build/Debug-watchos/SystemPackage.build/Objects-normal/arm64_32/AsyncFileOperations.o -o /Users/admin/builder/spi-builder-workspace/.derivedData/Build/Intermediates.noindex/swift-system.build/Debug-watchos/SystemPackage.build/Objects-normal/arm64_32/Errno.o -o /Users/admin/builder/spi-builder-workspace/.derivedData/Build/Intermediates.noindex/swift-system.build/Debug-watchos/SystemPackage.build/Objects-normal/arm64_32/FileChange.o -o /Users/admin/builder/spi-builder-workspace/.derivedData/Build/Intermediates.noindex/swift-system.build/Debug-watchos/SystemPackage.build/Objects-normal/arm64_32/FileDescriptor.o -o /Users/admin/builder/spi-builder-workspace/.derivedData/Build/Intermediates.noindex/swift-system.build/Debug-watchos/SystemPackage.build/Objects-normal/arm64_32/FileDescriptorSet.o -o /Users/admin/builder/spi-builder-workspace/.derivedData/Build/Intermediates.noindex/swift-system.build/Debug-watchos/SystemPackage.build/Objects-normal/arm64_32/FileEvent.o -o /Users/admin/builder/spi-builder-workspace/.derivedData/Build/Intermediates.noindex/swift-system.build/Debug-watchos/SystemPackage.build/Objects-normal/arm64_32/FileHelpers.o -index-unit-output-path /swift-system.build/Debug-watchos/SystemPackage.build/Objects-normal/arm64_32/AsyncFileOperations.o -index-unit-output-path /swift-system.build/Debug-watchos/SystemPackage.build/Objects-normal/arm64_32/Errno.o -index-unit-output-path /swift-system.build/Debug-watchos/SystemPackage.build/Objects-normal/arm64_32/FileChange.o -index-unit-output-path /swift-system.build/Debug-watchos/SystemPackage.build/Objects-normal/arm64_32/FileDescriptor.o -index-unit-output-path /swift-system.build/Debug-watchos/SystemPackage.build/Objects-normal/arm64_32/FileDescriptorSet.o -index-unit-output-path /swift-system.build/Debug-watchos/SystemPackage.build/Objects-normal/arm64_32/FileEvent.o -index-unit-output-path /swift-system.build/Debug-watchos/SystemPackage.build/Objects-normal/arm64_32/FileHelpers.o -index-store-path /Users/admin/builder/spi-builder-workspace/.derivedData/Index.noindex/DataStore -index-system-modules
SwiftCompile normal arm64_32 /Users/admin/builder/spi-builder-workspace/Sources/System/AsyncFileOperations.swift (in target 'SystemPackage' from project 'swift-system')
cd /Users/admin/builder/spi-builder-workspace/.swiftpm/xcode
/Applications/Xcode-16.1.0.app/Contents/Developer/Toolchains/XcodeDefault.xctoolchain/usr/bin/swift-frontend -c -primary-file /Users/admin/builder/spi-builder-workspace/Sources/System/AsyncFileOperations.swift -primary-file /Users/admin/builder/spi-builder-workspace/Sources/System/Errno.swift -primary-file /Users/admin/builder/spi-builder-workspace/Sources/System/FileChange.swift -primary-file /Users/admin/builder/spi-builder-workspace/Sources/System/FileDescriptor.swift -primary-file /Users/admin/builder/spi-builder-workspace/Sources/System/FileDescriptorSet.swift -primary-file /Users/admin/builder/spi-builder-workspace/Sources/System/FileEvent.swift -primary-file /Users/admin/builder/spi-builder-workspace/Sources/System/FileHelpers.swift /Users/admin/builder/spi-builder-workspace/Sources/System/FileOperations.swift /Users/admin/builder/spi-builder-workspace/Sources/System/FilePath/FilePath.swift /Users/admin/builder/spi-builder-workspace/Sources/System/FilePath/FilePathComponentView.swift /Users/admin/builder/spi-builder-workspace/Sources/System/FilePath/FilePathComponents.swift /Users/admin/builder/spi-builder-workspace/Sources/System/FilePath/FilePathParsing.swift /Users/admin/builder/spi-builder-workspace/Sources/System/FilePath/FilePathString.swift /Users/admin/builder/spi-builder-workspace/Sources/System/FilePath/FilePathSyntax.swift /Users/admin/builder/spi-builder-workspace/Sources/System/FilePath/FilePathWindows.swift /Users/admin/builder/spi-builder-workspace/Sources/System/FilePermissions.swift /Users/admin/builder/spi-builder-workspace/Sources/System/InputOutput/IOControl.swift /Users/admin/builder/spi-builder-workspace/Sources/System/InputOutput/IODirection.swift /Users/admin/builder/spi-builder-workspace/Sources/System/InputOutput/IOOperations.swift /Users/admin/builder/spi-builder-workspace/Sources/System/InputOutput/IOType.swift /Users/admin/builder/spi-builder-workspace/Sources/System/InputOutput/TerminalIO.swift /Users/admin/builder/spi-builder-workspace/Sources/System/Internals/CInternetAddress.swift /Users/admin/builder/spi-builder-workspace/Sources/System/Internals/CInterop.swift /Users/admin/builder/spi-builder-workspace/Sources/System/Internals/CSocketAddress.swift /Users/admin/builder/spi-builder-workspace/Sources/System/Internals/Compatibility.swift /Users/admin/builder/spi-builder-workspace/Sources/System/Internals/Constants.swift /Users/admin/builder/spi-builder-workspace/Sources/System/Internals/Exports.swift /Users/admin/builder/spi-builder-workspace/Sources/System/Internals/IOCTL.swift /Users/admin/builder/spi-builder-workspace/Sources/System/Internals/Mocking.swift /Users/admin/builder/spi-builder-workspace/Sources/System/Internals/NetworkOrder.swift /Users/admin/builder/spi-builder-workspace/Sources/System/Internals/Syscalls.swift /Users/admin/builder/spi-builder-workspace/Sources/System/Internals/WindowsSyscallAdapters.swift /Users/admin/builder/spi-builder-workspace/Sources/System/InternetProtocol.swift /Users/admin/builder/spi-builder-workspace/Sources/System/PlatformString.swift /Users/admin/builder/spi-builder-workspace/Sources/System/ProcessID.swift /Users/admin/builder/spi-builder-workspace/Sources/System/Signal/Signal.swift /Users/admin/builder/spi-builder-workspace/Sources/System/Signal/SignalAction.swift /Users/admin/builder/spi-builder-workspace/Sources/System/Signal/SignalHandler.swift /Users/admin/builder/spi-builder-workspace/Sources/System/Signal/SignalInformation.swift /Users/admin/builder/spi-builder-workspace/Sources/System/Signal/SignalSet.swift /Users/admin/builder/spi-builder-workspace/Sources/System/Socket/AsyncSocketOperations.swift /Users/admin/builder/spi-builder-workspace/Sources/System/Socket/MessageFlags.swift /Users/admin/builder/spi-builder-workspace/Sources/System/Socket/Poll.swift /Users/admin/builder/spi-builder-workspace/Sources/System/Socket/SocketAddress.swift /Users/admin/builder/spi-builder-workspace/Sources/System/Socket/SocketAddressFamily.swift /Users/admin/builder/spi-builder-workspace/Sources/System/Socket/SocketFlags.swift /Users/admin/builder/spi-builder-workspace/Sources/System/Socket/SocketOperations.swift /Users/admin/builder/spi-builder-workspace/Sources/System/Socket/SocketOption.swift /Users/admin/builder/spi-builder-workspace/Sources/System/Socket/SocketOptionID.swift /Users/admin/builder/spi-builder-workspace/Sources/System/Socket/SocketOptionLevel.swift /Users/admin/builder/spi-builder-workspace/Sources/System/Socket/SocketProtocol.swift /Users/admin/builder/spi-builder-workspace/Sources/System/Socket/SocketType.swift /Users/admin/builder/spi-builder-workspace/Sources/System/SystemInfo.swift /Users/admin/builder/spi-builder-workspace/Sources/System/SystemString.swift /Users/admin/builder/spi-builder-workspace/Sources/System/Time/Clock.swift /Users/admin/builder/spi-builder-workspace/Sources/System/Time/Microseconds.swift /Users/admin/builder/spi-builder-workspace/Sources/System/Time/Nanoseconds.swift /Users/admin/builder/spi-builder-workspace/Sources/System/Time/ProcessorTime.swift /Users/admin/builder/spi-builder-workspace/Sources/System/Time/Time.swift /Users/admin/builder/spi-builder-workspace/Sources/System/Time/TimeComponents.swift /Users/admin/builder/spi-builder-workspace/Sources/System/Time/TimeInterval.swift /Users/admin/builder/spi-builder-workspace/Sources/System/Time/TimeIntervalMicroseconds.swift /Users/admin/builder/spi-builder-workspace/Sources/System/Time/TimeIntervalNanoseconds.swift /Users/admin/builder/spi-builder-workspace/Sources/System/UserID.swift /Users/admin/builder/spi-builder-workspace/Sources/System/Util.swift /Users/admin/builder/spi-builder-workspace/Sources/System/UtilConsumers.swift -supplementary-output-file-map /Users/admin/builder/spi-builder-workspace/.derivedData/Build/Intermediates.noindex/swift-system.build/Debug-watchos/SystemPackage.build/Objects-normal/arm64_32/supplementaryOutputs-1 -target arm64_32-apple-watchos5.0 -enable-objc-interop -sdk /Applications/Xcode-16.1.0.app/Contents/Developer/Platforms/WatchOS.platform/Developer/SDKs/WatchOS11.1.sdk -I /Users/admin/builder/spi-builder-workspace/.derivedData/Build/Products/Debug-watchos -I /Applications/Xcode-16.1.0.app/Contents/Developer/Platforms/WatchOS.platform/Developer/usr/lib -F /Users/admin/builder/spi-builder-workspace/.derivedData/Build/Products/Debug-watchos/PackageFrameworks -F /Users/admin/builder/spi-builder-workspace/.derivedData/Build/Products/Debug-watchos -F /Applications/Xcode-16.1.0.app/Contents/Developer/Platforms/WatchOS.platform/Developer/Library/Frameworks -F /Applications/Xcode-16.1.0.app/Contents/Developer/Platforms/WatchOS.platform/Developer/SDKs/WatchOS11.1.sdk/Developer/Library/Frameworks -no-color-diagnostics -enable-testing -g -debug-info-format\=dwarf -dwarf-version\=4 -module-cache-path /Users/admin/builder/spi-builder-workspace/.derivedData/ModuleCache.noindex -profile-generate -profile-coverage-mapping -swift-version 5 -enforce-exclusivity\=checked -stats-output-dir /Users/admin/builder/spi-builder-workspace/.swiftpm/xcode/.stats -Onone -D SWIFT_PACKAGE -D DEBUG -D SYSTEM_PACKAGE -D ENABLE_MOCKING -serialize-debugging-options -const-gather-protocols-file /Users/admin/builder/spi-builder-workspace/.derivedData/Build/Intermediates.noindex/swift-system.build/Debug-watchos/SystemPackage.build/Objects-normal/arm64_32/SystemPackage_const_extract_protocols.json -enable-experimental-feature DebugDescriptionMacro -enable-experimental-feature OpaqueTypeErasure -enable-upcoming-feature StrictConcurrency -enable-upcoming-feature DisableOutwardActorInference -enable-upcoming-feature GlobalActorIsolatedTypesUsability -enable-upcoming-feature InferSendableFromCaptures -strict-concurrency\=complete -empty-abi-descriptor -plugin-path /Applications/Xcode-16.1.0.app/Contents/Developer/Toolchains/XcodeDefault.xctoolchain/usr/lib/swift/host/plugins/testing -validate-clang-modules-once -clang-build-session-file /Users/admin/builder/spi-builder-workspace/.derivedData/ModuleCache.noindex/Session.modulevalidation -Xcc -working-directory -Xcc /Users/admin/builder/spi-builder-workspace/.swiftpm/xcode -resource-dir /Applications/Xcode-16.1.0.app/Contents/Developer/Toolchains/XcodeDefault.xctoolchain/usr/lib/swift -enable-anonymous-context-mangled-names -file-compilation-dir /Users/admin/builder/spi-builder-workspace/.swiftpm/xcode -Xcc -D_LIBCPP_HARDENING_MODE\=_LIBCPP_HARDENING_MODE_DEBUG -Xcc -ivfsstatcache -Xcc /Users/admin/builder/spi-builder-workspace/.derivedData/SDKStatCaches.noindex/watchos11.1-22R574-7b9df0bda16bb4641b33636c68f04660.sdkstatcache -Xcc -I/Users/admin/builder/spi-builder-workspace/.derivedData/Build/Intermediates.noindex/swift-system.build/Debug-watchos/SystemPackage.build/swift-overrides.hmap -Xcc -I/Users/admin/builder/spi-builder-workspace/Sources/CSystem/include -Xcc -I/Users/admin/builder/spi-builder-workspace/.derivedData/Build/Products/Debug-watchos/include -Xcc -I/Users/admin/builder/spi-builder-workspace/.derivedData/Build/Intermediates.noindex/swift-system.build/Debug-watchos/SystemPackage.build/DerivedSources-normal/arm64_32 -Xcc -I/Users/admin/builder/spi-builder-workspace/.derivedData/Build/Intermediates.noindex/swift-system.build/Debug-watchos/SystemPackage.build/DerivedSources/arm64_32 -Xcc -I/Users/admin/builder/spi-builder-workspace/.derivedData/Build/Intermediates.noindex/swift-system.build/Debug-watchos/SystemPackage.build/DerivedSources -Xcc -DSWIFT_PACKAGE -Xcc -DDEBUG\=1 -Xcc -D_CRT_SECURE_NO_WARNINGS -module-name SystemPackage -frontend-parseable-output -disable-clang-spi -target-sdk-version 11.1 -target-sdk-name watchos11.1 -external-plugin-path /Applications/Xcode-16.1.0.app/Contents/Developer/Platforms/WatchOS.platform/Developer/usr/lib/swift/host/plugins\#/Applications/Xcode-16.1.0.app/Contents/Developer/Platforms/WatchOS.platform/Developer/usr/bin/swift-plugin-server -external-plugin-path /Applications/Xcode-16.1.0.app/Contents/Developer/Platforms/WatchOS.platform/Developer/usr/local/lib/swift/host/plugins\#/Applications/Xcode-16.1.0.app/Contents/Developer/Platforms/WatchOS.platform/Developer/usr/bin/swift-plugin-server -plugin-path /Applications/Xcode-16.1.0.app/Contents/Developer/Toolchains/XcodeDefault.xctoolchain/usr/lib/swift/host/plugins -plugin-path /Applications/Xcode-16.1.0.app/Contents/Developer/Toolchains/XcodeDefault.xctoolchain/usr/local/lib/swift/host/plugins -o /Users/admin/builder/spi-builder-workspace/.derivedData/Build/Intermediates.noindex/swift-system.build/Debug-watchos/SystemPackage.build/Objects-normal/arm64_32/AsyncFileOperations.o -o /Users/admin/builder/spi-builder-workspace/.derivedData/Build/Intermediates.noindex/swift-system.build/Debug-watchos/SystemPackage.build/Objects-normal/arm64_32/Errno.o -o /Users/admin/builder/spi-builder-workspace/.derivedData/Build/Intermediates.noindex/swift-system.build/Debug-watchos/SystemPackage.build/Objects-normal/arm64_32/FileChange.o -o /Users/admin/builder/spi-builder-workspace/.derivedData/Build/Intermediates.noindex/swift-system.build/Debug-watchos/SystemPackage.build/Objects-normal/arm64_32/FileDescriptor.o -o /Users/admin/builder/spi-builder-workspace/.derivedData/Build/Intermediates.noindex/swift-system.build/Debug-watchos/SystemPackage.build/Objects-normal/arm64_32/FileDescriptorSet.o -o /Users/admin/builder/spi-builder-workspace/.derivedData/Build/Intermediates.noindex/swift-system.build/Debug-watchos/SystemPackage.build/Objects-normal/arm64_32/FileEvent.o -o /Users/admin/builder/spi-builder-workspace/.derivedData/Build/Intermediates.noindex/swift-system.build/Debug-watchos/SystemPackage.build/Objects-normal/arm64_32/FileHelpers.o -index-unit-output-path /swift-system.build/Debug-watchos/SystemPackage.build/Objects-normal/arm64_32/AsyncFileOperations.o -index-unit-output-path /swift-system.build/Debug-watchos/SystemPackage.build/Objects-normal/arm64_32/Errno.o -index-unit-output-path /swift-system.build/Debug-watchos/SystemPackage.build/Objects-normal/arm64_32/FileChange.o -index-unit-output-path /swift-system.build/Debug-watchos/SystemPackage.build/Objects-normal/arm64_32/FileDescriptor.o -index-unit-output-path /swift-system.build/Debug-watchos/SystemPackage.build/Objects-normal/arm64_32/FileDescriptorSet.o -index-unit-output-path /swift-system.build/Debug-watchos/SystemPackage.build/Objects-normal/arm64_32/FileEvent.o -index-unit-output-path /swift-system.build/Debug-watchos/SystemPackage.build/Objects-normal/arm64_32/FileHelpers.o -index-store-path /Users/admin/builder/spi-builder-workspace/.derivedData/Index.noindex/DataStore -index-system-modules
SwiftCompile normal arm64_32 /Users/admin/builder/spi-builder-workspace/Sources/System/Errno.swift (in target 'SystemPackage' from project 'swift-system')
cd /Users/admin/builder/spi-builder-workspace/.swiftpm/xcode
/Applications/Xcode-16.1.0.app/Contents/Developer/Toolchains/XcodeDefault.xctoolchain/usr/bin/swift-frontend -c -primary-file /Users/admin/builder/spi-builder-workspace/Sources/System/AsyncFileOperations.swift -primary-file /Users/admin/builder/spi-builder-workspace/Sources/System/Errno.swift -primary-file /Users/admin/builder/spi-builder-workspace/Sources/System/FileChange.swift -primary-file /Users/admin/builder/spi-builder-workspace/Sources/System/FileDescriptor.swift -primary-file /Users/admin/builder/spi-builder-workspace/Sources/System/FileDescriptorSet.swift -primary-file /Users/admin/builder/spi-builder-workspace/Sources/System/FileEvent.swift -primary-file /Users/admin/builder/spi-builder-workspace/Sources/System/FileHelpers.swift /Users/admin/builder/spi-builder-workspace/Sources/System/FileOperations.swift /Users/admin/builder/spi-builder-workspace/Sources/System/FilePath/FilePath.swift /Users/admin/builder/spi-builder-workspace/Sources/System/FilePath/FilePathComponentView.swift /Users/admin/builder/spi-builder-workspace/Sources/System/FilePath/FilePathComponents.swift /Users/admin/builder/spi-builder-workspace/Sources/System/FilePath/FilePathParsing.swift /Users/admin/builder/spi-builder-workspace/Sources/System/FilePath/FilePathString.swift /Users/admin/builder/spi-builder-workspace/Sources/System/FilePath/FilePathSyntax.swift /Users/admin/builder/spi-builder-workspace/Sources/System/FilePath/FilePathWindows.swift /Users/admin/builder/spi-builder-workspace/Sources/System/FilePermissions.swift /Users/admin/builder/spi-builder-workspace/Sources/System/InputOutput/IOControl.swift /Users/admin/builder/spi-builder-workspace/Sources/System/InputOutput/IODirection.swift /Users/admin/builder/spi-builder-workspace/Sources/System/InputOutput/IOOperations.swift /Users/admin/builder/spi-builder-workspace/Sources/System/InputOutput/IOType.swift /Users/admin/builder/spi-builder-workspace/Sources/System/InputOutput/TerminalIO.swift /Users/admin/builder/spi-builder-workspace/Sources/System/Internals/CInternetAddress.swift /Users/admin/builder/spi-builder-workspace/Sources/System/Internals/CInterop.swift /Users/admin/builder/spi-builder-workspace/Sources/System/Internals/CSocketAddress.swift /Users/admin/builder/spi-builder-workspace/Sources/System/Internals/Compatibility.swift /Users/admin/builder/spi-builder-workspace/Sources/System/Internals/Constants.swift /Users/admin/builder/spi-builder-workspace/Sources/System/Internals/Exports.swift /Users/admin/builder/spi-builder-workspace/Sources/System/Internals/IOCTL.swift /Users/admin/builder/spi-builder-workspace/Sources/System/Internals/Mocking.swift /Users/admin/builder/spi-builder-workspace/Sources/System/Internals/NetworkOrder.swift /Users/admin/builder/spi-builder-workspace/Sources/System/Internals/Syscalls.swift /Users/admin/builder/spi-builder-workspace/Sources/System/Internals/WindowsSyscallAdapters.swift /Users/admin/builder/spi-builder-workspace/Sources/System/InternetProtocol.swift /Users/admin/builder/spi-builder-workspace/Sources/System/PlatformString.swift /Users/admin/builder/spi-builder-workspace/Sources/System/ProcessID.swift /Users/admin/builder/spi-builder-workspace/Sources/System/Signal/Signal.swift /Users/admin/builder/spi-builder-workspace/Sources/System/Signal/SignalAction.swift /Users/admin/builder/spi-builder-workspace/Sources/System/Signal/SignalHandler.swift /Users/admin/builder/spi-builder-workspace/Sources/System/Signal/SignalInformation.swift /Users/admin/builder/spi-builder-workspace/Sources/System/Signal/SignalSet.swift /Users/admin/builder/spi-builder-workspace/Sources/System/Socket/AsyncSocketOperations.swift /Users/admin/builder/spi-builder-workspace/Sources/System/Socket/MessageFlags.swift /Users/admin/builder/spi-builder-workspace/Sources/System/Socket/Poll.swift /Users/admin/builder/spi-builder-workspace/Sources/System/Socket/SocketAddress.swift /Users/admin/builder/spi-builder-workspace/Sources/System/Socket/SocketAddressFamily.swift /Users/admin/builder/spi-builder-workspace/Sources/System/Socket/SocketFlags.swift /Users/admin/builder/spi-builder-workspace/Sources/System/Socket/SocketOperations.swift /Users/admin/builder/spi-builder-workspace/Sources/System/Socket/SocketOption.swift /Users/admin/builder/spi-builder-workspace/Sources/System/Socket/SocketOptionID.swift /Users/admin/builder/spi-builder-workspace/Sources/System/Socket/SocketOptionLevel.swift /Users/admin/builder/spi-builder-workspace/Sources/System/Socket/SocketProtocol.swift /Users/admin/builder/spi-builder-workspace/Sources/System/Socket/SocketType.swift /Users/admin/builder/spi-builder-workspace/Sources/System/SystemInfo.swift /Users/admin/builder/spi-builder-workspace/Sources/System/SystemString.swift /Users/admin/builder/spi-builder-workspace/Sources/System/Time/Clock.swift /Users/admin/builder/spi-builder-workspace/Sources/System/Time/Microseconds.swift /Users/admin/builder/spi-builder-workspace/Sources/System/Time/Nanoseconds.swift /Users/admin/builder/spi-builder-workspace/Sources/System/Time/ProcessorTime.swift /Users/admin/builder/spi-builder-workspace/Sources/System/Time/Time.swift /Users/admin/builder/spi-builder-workspace/Sources/System/Time/TimeComponents.swift /Users/admin/builder/spi-builder-workspace/Sources/System/Time/TimeInterval.swift /Users/admin/builder/spi-builder-workspace/Sources/System/Time/TimeIntervalMicroseconds.swift /Users/admin/builder/spi-builder-workspace/Sources/System/Time/TimeIntervalNanoseconds.swift /Users/admin/builder/spi-builder-workspace/Sources/System/UserID.swift /Users/admin/builder/spi-builder-workspace/Sources/System/Util.swift /Users/admin/builder/spi-builder-workspace/Sources/System/UtilConsumers.swift -supplementary-output-file-map /Users/admin/builder/spi-builder-workspace/.derivedData/Build/Intermediates.noindex/swift-system.build/Debug-watchos/SystemPackage.build/Objects-normal/arm64_32/supplementaryOutputs-1 -target arm64_32-apple-watchos5.0 -enable-objc-interop -sdk /Applications/Xcode-16.1.0.app/Contents/Developer/Platforms/WatchOS.platform/Developer/SDKs/WatchOS11.1.sdk -I /Users/admin/builder/spi-builder-workspace/.derivedData/Build/Products/Debug-watchos -I /Applications/Xcode-16.1.0.app/Contents/Developer/Platforms/WatchOS.platform/Developer/usr/lib -F /Users/admin/builder/spi-builder-workspace/.derivedData/Build/Products/Debug-watchos/PackageFrameworks -F /Users/admin/builder/spi-builder-workspace/.derivedData/Build/Products/Debug-watchos -F /Applications/Xcode-16.1.0.app/Contents/Developer/Platforms/WatchOS.platform/Developer/Library/Frameworks -F /Applications/Xcode-16.1.0.app/Contents/Developer/Platforms/WatchOS.platform/Developer/SDKs/WatchOS11.1.sdk/Developer/Library/Frameworks -no-color-diagnostics -enable-testing -g -debug-info-format\=dwarf -dwarf-version\=4 -module-cache-path /Users/admin/builder/spi-builder-workspace/.derivedData/ModuleCache.noindex -profile-generate -profile-coverage-mapping -swift-version 5 -enforce-exclusivity\=checked -stats-output-dir /Users/admin/builder/spi-builder-workspace/.swiftpm/xcode/.stats -Onone -D SWIFT_PACKAGE -D DEBUG -D SYSTEM_PACKAGE -D ENABLE_MOCKING -serialize-debugging-options -const-gather-protocols-file /Users/admin/builder/spi-builder-workspace/.derivedData/Build/Intermediates.noindex/swift-system.build/Debug-watchos/SystemPackage.build/Objects-normal/arm64_32/SystemPackage_const_extract_protocols.json -enable-experimental-feature DebugDescriptionMacro -enable-experimental-feature OpaqueTypeErasure -enable-upcoming-feature StrictConcurrency -enable-upcoming-feature DisableOutwardActorInference -enable-upcoming-feature GlobalActorIsolatedTypesUsability -enable-upcoming-feature InferSendableFromCaptures -strict-concurrency\=complete -empty-abi-descriptor -plugin-path /Applications/Xcode-16.1.0.app/Contents/Developer/Toolchains/XcodeDefault.xctoolchain/usr/lib/swift/host/plugins/testing -validate-clang-modules-once -clang-build-session-file /Users/admin/builder/spi-builder-workspace/.derivedData/ModuleCache.noindex/Session.modulevalidation -Xcc -working-directory -Xcc /Users/admin/builder/spi-builder-workspace/.swiftpm/xcode -resource-dir /Applications/Xcode-16.1.0.app/Contents/Developer/Toolchains/XcodeDefault.xctoolchain/usr/lib/swift -enable-anonymous-context-mangled-names -file-compilation-dir /Users/admin/builder/spi-builder-workspace/.swiftpm/xcode -Xcc -D_LIBCPP_HARDENING_MODE\=_LIBCPP_HARDENING_MODE_DEBUG -Xcc -ivfsstatcache -Xcc /Users/admin/builder/spi-builder-workspace/.derivedData/SDKStatCaches.noindex/watchos11.1-22R574-7b9df0bda16bb4641b33636c68f04660.sdkstatcache -Xcc -I/Users/admin/builder/spi-builder-workspace/.derivedData/Build/Intermediates.noindex/swift-system.build/Debug-watchos/SystemPackage.build/swift-overrides.hmap -Xcc -I/Users/admin/builder/spi-builder-workspace/Sources/CSystem/include -Xcc -I/Users/admin/builder/spi-builder-workspace/.derivedData/Build/Products/Debug-watchos/include -Xcc -I/Users/admin/builder/spi-builder-workspace/.derivedData/Build/Intermediates.noindex/swift-system.build/Debug-watchos/SystemPackage.build/DerivedSources-normal/arm64_32 -Xcc -I/Users/admin/builder/spi-builder-workspace/.derivedData/Build/Intermediates.noindex/swift-system.build/Debug-watchos/SystemPackage.build/DerivedSources/arm64_32 -Xcc -I/Users/admin/builder/spi-builder-workspace/.derivedData/Build/Intermediates.noindex/swift-system.build/Debug-watchos/SystemPackage.build/DerivedSources -Xcc -DSWIFT_PACKAGE -Xcc -DDEBUG\=1 -Xcc -D_CRT_SECURE_NO_WARNINGS -module-name SystemPackage -frontend-parseable-output -disable-clang-spi -target-sdk-version 11.1 -target-sdk-name watchos11.1 -external-plugin-path /Applications/Xcode-16.1.0.app/Contents/Developer/Platforms/WatchOS.platform/Developer/usr/lib/swift/host/plugins\#/Applications/Xcode-16.1.0.app/Contents/Developer/Platforms/WatchOS.platform/Developer/usr/bin/swift-plugin-server -external-plugin-path /Applications/Xcode-16.1.0.app/Contents/Developer/Platforms/WatchOS.platform/Developer/usr/local/lib/swift/host/plugins\#/Applications/Xcode-16.1.0.app/Contents/Developer/Platforms/WatchOS.platform/Developer/usr/bin/swift-plugin-server -plugin-path /Applications/Xcode-16.1.0.app/Contents/Developer/Toolchains/XcodeDefault.xctoolchain/usr/lib/swift/host/plugins -plugin-path /Applications/Xcode-16.1.0.app/Contents/Developer/Toolchains/XcodeDefault.xctoolchain/usr/local/lib/swift/host/plugins -o /Users/admin/builder/spi-builder-workspace/.derivedData/Build/Intermediates.noindex/swift-system.build/Debug-watchos/SystemPackage.build/Objects-normal/arm64_32/AsyncFileOperations.o -o /Users/admin/builder/spi-builder-workspace/.derivedData/Build/Intermediates.noindex/swift-system.build/Debug-watchos/SystemPackage.build/Objects-normal/arm64_32/Errno.o -o /Users/admin/builder/spi-builder-workspace/.derivedData/Build/Intermediates.noindex/swift-system.build/Debug-watchos/SystemPackage.build/Objects-normal/arm64_32/FileChange.o -o /Users/admin/builder/spi-builder-workspace/.derivedData/Build/Intermediates.noindex/swift-system.build/Debug-watchos/SystemPackage.build/Objects-normal/arm64_32/FileDescriptor.o -o /Users/admin/builder/spi-builder-workspace/.derivedData/Build/Intermediates.noindex/swift-system.build/Debug-watchos/SystemPackage.build/Objects-normal/arm64_32/FileDescriptorSet.o -o /Users/admin/builder/spi-builder-workspace/.derivedData/Build/Intermediates.noindex/swift-system.build/Debug-watchos/SystemPackage.build/Objects-normal/arm64_32/FileEvent.o -o /Users/admin/builder/spi-builder-workspace/.derivedData/Build/Intermediates.noindex/swift-system.build/Debug-watchos/SystemPackage.build/Objects-normal/arm64_32/FileHelpers.o -index-unit-output-path /swift-system.build/Debug-watchos/SystemPackage.build/Objects-normal/arm64_32/AsyncFileOperations.o -index-unit-output-path /swift-system.build/Debug-watchos/SystemPackage.build/Objects-normal/arm64_32/Errno.o -index-unit-output-path /swift-system.build/Debug-watchos/SystemPackage.build/Objects-normal/arm64_32/FileChange.o -index-unit-output-path /swift-system.build/Debug-watchos/SystemPackage.build/Objects-normal/arm64_32/FileDescriptor.o -index-unit-output-path /swift-system.build/Debug-watchos/SystemPackage.build/Objects-normal/arm64_32/FileDescriptorSet.o -index-unit-output-path /swift-system.build/Debug-watchos/SystemPackage.build/Objects-normal/arm64_32/FileEvent.o -index-unit-output-path /swift-system.build/Debug-watchos/SystemPackage.build/Objects-normal/arm64_32/FileHelpers.o -index-store-path /Users/admin/builder/spi-builder-workspace/.derivedData/Index.noindex/DataStore -index-system-modules
SwiftCompile normal arm64_32 /Users/admin/builder/spi-builder-workspace/Sources/System/FileChange.swift (in target 'SystemPackage' from project 'swift-system')
cd /Users/admin/builder/spi-builder-workspace/.swiftpm/xcode
/Applications/Xcode-16.1.0.app/Contents/Developer/Toolchains/XcodeDefault.xctoolchain/usr/bin/swift-frontend -c -primary-file /Users/admin/builder/spi-builder-workspace/Sources/System/AsyncFileOperations.swift -primary-file /Users/admin/builder/spi-builder-workspace/Sources/System/Errno.swift -primary-file /Users/admin/builder/spi-builder-workspace/Sources/System/FileChange.swift -primary-file /Users/admin/builder/spi-builder-workspace/Sources/System/FileDescriptor.swift -primary-file /Users/admin/builder/spi-builder-workspace/Sources/System/FileDescriptorSet.swift -primary-file /Users/admin/builder/spi-builder-workspace/Sources/System/FileEvent.swift -primary-file /Users/admin/builder/spi-builder-workspace/Sources/System/FileHelpers.swift /Users/admin/builder/spi-builder-workspace/Sources/System/FileOperations.swift /Users/admin/builder/spi-builder-workspace/Sources/System/FilePath/FilePath.swift /Users/admin/builder/spi-builder-workspace/Sources/System/FilePath/FilePathComponentView.swift /Users/admin/builder/spi-builder-workspace/Sources/System/FilePath/FilePathComponents.swift /Users/admin/builder/spi-builder-workspace/Sources/System/FilePath/FilePathParsing.swift /Users/admin/builder/spi-builder-workspace/Sources/System/FilePath/FilePathString.swift /Users/admin/builder/spi-builder-workspace/Sources/System/FilePath/FilePathSyntax.swift /Users/admin/builder/spi-builder-workspace/Sources/System/FilePath/FilePathWindows.swift /Users/admin/builder/spi-builder-workspace/Sources/System/FilePermissions.swift /Users/admin/builder/spi-builder-workspace/Sources/System/InputOutput/IOControl.swift /Users/admin/builder/spi-builder-workspace/Sources/System/InputOutput/IODirection.swift /Users/admin/builder/spi-builder-workspace/Sources/System/InputOutput/IOOperations.swift /Users/admin/builder/spi-builder-workspace/Sources/System/InputOutput/IOType.swift /Users/admin/builder/spi-builder-workspace/Sources/System/InputOutput/TerminalIO.swift /Users/admin/builder/spi-builder-workspace/Sources/System/Internals/CInternetAddress.swift /Users/admin/builder/spi-builder-workspace/Sources/System/Internals/CInterop.swift /Users/admin/builder/spi-builder-workspace/Sources/System/Internals/CSocketAddress.swift /Users/admin/builder/spi-builder-workspace/Sources/System/Internals/Compatibility.swift /Users/admin/builder/spi-builder-workspace/Sources/System/Internals/Constants.swift /Users/admin/builder/spi-builder-workspace/Sources/System/Internals/Exports.swift /Users/admin/builder/spi-builder-workspace/Sources/System/Internals/IOCTL.swift /Users/admin/builder/spi-builder-workspace/Sources/System/Internals/Mocking.swift /Users/admin/builder/spi-builder-workspace/Sources/System/Internals/NetworkOrder.swift /Users/admin/builder/spi-builder-workspace/Sources/System/Internals/Syscalls.swift /Users/admin/builder/spi-builder-workspace/Sources/System/Internals/WindowsSyscallAdapters.swift /Users/admin/builder/spi-builder-workspace/Sources/System/InternetProtocol.swift /Users/admin/builder/spi-builder-workspace/Sources/System/PlatformString.swift /Users/admin/builder/spi-builder-workspace/Sources/System/ProcessID.swift /Users/admin/builder/spi-builder-workspace/Sources/System/Signal/Signal.swift /Users/admin/builder/spi-builder-workspace/Sources/System/Signal/SignalAction.swift /Users/admin/builder/spi-builder-workspace/Sources/System/Signal/SignalHandler.swift /Users/admin/builder/spi-builder-workspace/Sources/System/Signal/SignalInformation.swift /Users/admin/builder/spi-builder-workspace/Sources/System/Signal/SignalSet.swift /Users/admin/builder/spi-builder-workspace/Sources/System/Socket/AsyncSocketOperations.swift /Users/admin/builder/spi-builder-workspace/Sources/System/Socket/MessageFlags.swift /Users/admin/builder/spi-builder-workspace/Sources/System/Socket/Poll.swift /Users/admin/builder/spi-builder-workspace/Sources/System/Socket/SocketAddress.swift /Users/admin/builder/spi-builder-workspace/Sources/System/Socket/SocketAddressFamily.swift /Users/admin/builder/spi-builder-workspace/Sources/System/Socket/SocketFlags.swift /Users/admin/builder/spi-builder-workspace/Sources/System/Socket/SocketOperations.swift /Users/admin/builder/spi-builder-workspace/Sources/System/Socket/SocketOption.swift /Users/admin/builder/spi-builder-workspace/Sources/System/Socket/SocketOptionID.swift /Users/admin/builder/spi-builder-workspace/Sources/System/Socket/SocketOptionLevel.swift /Users/admin/builder/spi-builder-workspace/Sources/System/Socket/SocketProtocol.swift /Users/admin/builder/spi-builder-workspace/Sources/System/Socket/SocketType.swift /Users/admin/builder/spi-builder-workspace/Sources/System/SystemInfo.swift /Users/admin/builder/spi-builder-workspace/Sources/System/SystemString.swift /Users/admin/builder/spi-builder-workspace/Sources/System/Time/Clock.swift /Users/admin/builder/spi-builder-workspace/Sources/System/Time/Microseconds.swift /Users/admin/builder/spi-builder-workspace/Sources/System/Time/Nanoseconds.swift /Users/admin/builder/spi-builder-workspace/Sources/System/Time/ProcessorTime.swift /Users/admin/builder/spi-builder-workspace/Sources/System/Time/Time.swift /Users/admin/builder/spi-builder-workspace/Sources/System/Time/TimeComponents.swift /Users/admin/builder/spi-builder-workspace/Sources/System/Time/TimeInterval.swift /Users/admin/builder/spi-builder-workspace/Sources/System/Time/TimeIntervalMicroseconds.swift /Users/admin/builder/spi-builder-workspace/Sources/System/Time/TimeIntervalNanoseconds.swift /Users/admin/builder/spi-builder-workspace/Sources/System/UserID.swift /Users/admin/builder/spi-builder-workspace/Sources/System/Util.swift /Users/admin/builder/spi-builder-workspace/Sources/System/UtilConsumers.swift -supplementary-output-file-map /Users/admin/builder/spi-builder-workspace/.derivedData/Build/Intermediates.noindex/swift-system.build/Debug-watchos/SystemPackage.build/Objects-normal/arm64_32/supplementaryOutputs-1 -target arm64_32-apple-watchos5.0 -enable-objc-interop -sdk /Applications/Xcode-16.1.0.app/Contents/Developer/Platforms/WatchOS.platform/Developer/SDKs/WatchOS11.1.sdk -I /Users/admin/builder/spi-builder-workspace/.derivedData/Build/Products/Debug-watchos -I /Applications/Xcode-16.1.0.app/Contents/Developer/Platforms/WatchOS.platform/Developer/usr/lib -F /Users/admin/builder/spi-builder-workspace/.derivedData/Build/Products/Debug-watchos/PackageFrameworks -F /Users/admin/builder/spi-builder-workspace/.derivedData/Build/Products/Debug-watchos -F /Applications/Xcode-16.1.0.app/Contents/Developer/Platforms/WatchOS.platform/Developer/Library/Frameworks -F /Applications/Xcode-16.1.0.app/Contents/Developer/Platforms/WatchOS.platform/Developer/SDKs/WatchOS11.1.sdk/Developer/Library/Frameworks -no-color-diagnostics -enable-testing -g -debug-info-format\=dwarf -dwarf-version\=4 -module-cache-path /Users/admin/builder/spi-builder-workspace/.derivedData/ModuleCache.noindex -profile-generate -profile-coverage-mapping -swift-version 5 -enforce-exclusivity\=checked -stats-output-dir /Users/admin/builder/spi-builder-workspace/.swiftpm/xcode/.stats -Onone -D SWIFT_PACKAGE -D DEBUG -D SYSTEM_PACKAGE -D ENABLE_MOCKING -serialize-debugging-options -const-gather-protocols-file /Users/admin/builder/spi-builder-workspace/.derivedData/Build/Intermediates.noindex/swift-system.build/Debug-watchos/SystemPackage.build/Objects-normal/arm64_32/SystemPackage_const_extract_protocols.json -enable-experimental-feature DebugDescriptionMacro -enable-experimental-feature OpaqueTypeErasure -enable-upcoming-feature StrictConcurrency -enable-upcoming-feature DisableOutwardActorInference -enable-upcoming-feature GlobalActorIsolatedTypesUsability -enable-upcoming-feature InferSendableFromCaptures -strict-concurrency\=complete -empty-abi-descriptor -plugin-path /Applications/Xcode-16.1.0.app/Contents/Developer/Toolchains/XcodeDefault.xctoolchain/usr/lib/swift/host/plugins/testing -validate-clang-modules-once -clang-build-session-file /Users/admin/builder/spi-builder-workspace/.derivedData/ModuleCache.noindex/Session.modulevalidation -Xcc -working-directory -Xcc /Users/admin/builder/spi-builder-workspace/.swiftpm/xcode -resource-dir /Applications/Xcode-16.1.0.app/Contents/Developer/Toolchains/XcodeDefault.xctoolchain/usr/lib/swift -enable-anonymous-context-mangled-names -file-compilation-dir /Users/admin/builder/spi-builder-workspace/.swiftpm/xcode -Xcc -D_LIBCPP_HARDENING_MODE\=_LIBCPP_HARDENING_MODE_DEBUG -Xcc -ivfsstatcache -Xcc /Users/admin/builder/spi-builder-workspace/.derivedData/SDKStatCaches.noindex/watchos11.1-22R574-7b9df0bda16bb4641b33636c68f04660.sdkstatcache -Xcc -I/Users/admin/builder/spi-builder-workspace/.derivedData/Build/Intermediates.noindex/swift-system.build/Debug-watchos/SystemPackage.build/swift-overrides.hmap -Xcc -I/Users/admin/builder/spi-builder-workspace/Sources/CSystem/include -Xcc -I/Users/admin/builder/spi-builder-workspace/.derivedData/Build/Products/Debug-watchos/include -Xcc -I/Users/admin/builder/spi-builder-workspace/.derivedData/Build/Intermediates.noindex/swift-system.build/Debug-watchos/SystemPackage.build/DerivedSources-normal/arm64_32 -Xcc -I/Users/admin/builder/spi-builder-workspace/.derivedData/Build/Intermediates.noindex/swift-system.build/Debug-watchos/SystemPackage.build/DerivedSources/arm64_32 -Xcc -I/Users/admin/builder/spi-builder-workspace/.derivedData/Build/Intermediates.noindex/swift-system.build/Debug-watchos/SystemPackage.build/DerivedSources -Xcc -DSWIFT_PACKAGE -Xcc -DDEBUG\=1 -Xcc -D_CRT_SECURE_NO_WARNINGS -module-name SystemPackage -frontend-parseable-output -disable-clang-spi -target-sdk-version 11.1 -target-sdk-name watchos11.1 -external-plugin-path /Applications/Xcode-16.1.0.app/Contents/Developer/Platforms/WatchOS.platform/Developer/usr/lib/swift/host/plugins\#/Applications/Xcode-16.1.0.app/Contents/Developer/Platforms/WatchOS.platform/Developer/usr/bin/swift-plugin-server -external-plugin-path /Applications/Xcode-16.1.0.app/Contents/Developer/Platforms/WatchOS.platform/Developer/usr/local/lib/swift/host/plugins\#/Applications/Xcode-16.1.0.app/Contents/Developer/Platforms/WatchOS.platform/Developer/usr/bin/swift-plugin-server -plugin-path /Applications/Xcode-16.1.0.app/Contents/Developer/Toolchains/XcodeDefault.xctoolchain/usr/lib/swift/host/plugins -plugin-path /Applications/Xcode-16.1.0.app/Contents/Developer/Toolchains/XcodeDefault.xctoolchain/usr/local/lib/swift/host/plugins -o /Users/admin/builder/spi-builder-workspace/.derivedData/Build/Intermediates.noindex/swift-system.build/Debug-watchos/SystemPackage.build/Objects-normal/arm64_32/AsyncFileOperations.o -o /Users/admin/builder/spi-builder-workspace/.derivedData/Build/Intermediates.noindex/swift-system.build/Debug-watchos/SystemPackage.build/Objects-normal/arm64_32/Errno.o -o /Users/admin/builder/spi-builder-workspace/.derivedData/Build/Intermediates.noindex/swift-system.build/Debug-watchos/SystemPackage.build/Objects-normal/arm64_32/FileChange.o -o /Users/admin/builder/spi-builder-workspace/.derivedData/Build/Intermediates.noindex/swift-system.build/Debug-watchos/SystemPackage.build/Objects-normal/arm64_32/FileDescriptor.o -o /Users/admin/builder/spi-builder-workspace/.derivedData/Build/Intermediates.noindex/swift-system.build/Debug-watchos/SystemPackage.build/Objects-normal/arm64_32/FileDescriptorSet.o -o /Users/admin/builder/spi-builder-workspace/.derivedData/Build/Intermediates.noindex/swift-system.build/Debug-watchos/SystemPackage.build/Objects-normal/arm64_32/FileEvent.o -o /Users/admin/builder/spi-builder-workspace/.derivedData/Build/Intermediates.noindex/swift-system.build/Debug-watchos/SystemPackage.build/Objects-normal/arm64_32/FileHelpers.o -index-unit-output-path /swift-system.build/Debug-watchos/SystemPackage.build/Objects-normal/arm64_32/AsyncFileOperations.o -index-unit-output-path /swift-system.build/Debug-watchos/SystemPackage.build/Objects-normal/arm64_32/Errno.o -index-unit-output-path /swift-system.build/Debug-watchos/SystemPackage.build/Objects-normal/arm64_32/FileChange.o -index-unit-output-path /swift-system.build/Debug-watchos/SystemPackage.build/Objects-normal/arm64_32/FileDescriptor.o -index-unit-output-path /swift-system.build/Debug-watchos/SystemPackage.build/Objects-normal/arm64_32/FileDescriptorSet.o -index-unit-output-path /swift-system.build/Debug-watchos/SystemPackage.build/Objects-normal/arm64_32/FileEvent.o -index-unit-output-path /swift-system.build/Debug-watchos/SystemPackage.build/Objects-normal/arm64_32/FileHelpers.o -index-store-path /Users/admin/builder/spi-builder-workspace/.derivedData/Index.noindex/DataStore -index-system-modules
SwiftCompile normal arm64_32 /Users/admin/builder/spi-builder-workspace/Sources/System/FileDescriptor.swift (in target 'SystemPackage' from project 'swift-system')
cd /Users/admin/builder/spi-builder-workspace/.swiftpm/xcode
/Applications/Xcode-16.1.0.app/Contents/Developer/Toolchains/XcodeDefault.xctoolchain/usr/bin/swift-frontend -c -primary-file /Users/admin/builder/spi-builder-workspace/Sources/System/AsyncFileOperations.swift -primary-file /Users/admin/builder/spi-builder-workspace/Sources/System/Errno.swift -primary-file /Users/admin/builder/spi-builder-workspace/Sources/System/FileChange.swift -primary-file /Users/admin/builder/spi-builder-workspace/Sources/System/FileDescriptor.swift -primary-file /Users/admin/builder/spi-builder-workspace/Sources/System/FileDescriptorSet.swift -primary-file /Users/admin/builder/spi-builder-workspace/Sources/System/FileEvent.swift -primary-file /Users/admin/builder/spi-builder-workspace/Sources/System/FileHelpers.swift /Users/admin/builder/spi-builder-workspace/Sources/System/FileOperations.swift /Users/admin/builder/spi-builder-workspace/Sources/System/FilePath/FilePath.swift /Users/admin/builder/spi-builder-workspace/Sources/System/FilePath/FilePathComponentView.swift /Users/admin/builder/spi-builder-workspace/Sources/System/FilePath/FilePathComponents.swift /Users/admin/builder/spi-builder-workspace/Sources/System/FilePath/FilePathParsing.swift /Users/admin/builder/spi-builder-workspace/Sources/System/FilePath/FilePathString.swift /Users/admin/builder/spi-builder-workspace/Sources/System/FilePath/FilePathSyntax.swift /Users/admin/builder/spi-builder-workspace/Sources/System/FilePath/FilePathWindows.swift /Users/admin/builder/spi-builder-workspace/Sources/System/FilePermissions.swift /Users/admin/builder/spi-builder-workspace/Sources/System/InputOutput/IOControl.swift /Users/admin/builder/spi-builder-workspace/Sources/System/InputOutput/IODirection.swift /Users/admin/builder/spi-builder-workspace/Sources/System/InputOutput/IOOperations.swift /Users/admin/builder/spi-builder-workspace/Sources/System/InputOutput/IOType.swift /Users/admin/builder/spi-builder-workspace/Sources/System/InputOutput/TerminalIO.swift /Users/admin/builder/spi-builder-workspace/Sources/System/Internals/CInternetAddress.swift /Users/admin/builder/spi-builder-workspace/Sources/System/Internals/CInterop.swift /Users/admin/builder/spi-builder-workspace/Sources/System/Internals/CSocketAddress.swift /Users/admin/builder/spi-builder-workspace/Sources/System/Internals/Compatibility.swift /Users/admin/builder/spi-builder-workspace/Sources/System/Internals/Constants.swift /Users/admin/builder/spi-builder-workspace/Sources/System/Internals/Exports.swift /Users/admin/builder/spi-builder-workspace/Sources/System/Internals/IOCTL.swift /Users/admin/builder/spi-builder-workspace/Sources/System/Internals/Mocking.swift /Users/admin/builder/spi-builder-workspace/Sources/System/Internals/NetworkOrder.swift /Users/admin/builder/spi-builder-workspace/Sources/System/Internals/Syscalls.swift /Users/admin/builder/spi-builder-workspace/Sources/System/Internals/WindowsSyscallAdapters.swift /Users/admin/builder/spi-builder-workspace/Sources/System/InternetProtocol.swift /Users/admin/builder/spi-builder-workspace/Sources/System/PlatformString.swift /Users/admin/builder/spi-builder-workspace/Sources/System/ProcessID.swift /Users/admin/builder/spi-builder-workspace/Sources/System/Signal/Signal.swift /Users/admin/builder/spi-builder-workspace/Sources/System/Signal/SignalAction.swift /Users/admin/builder/spi-builder-workspace/Sources/System/Signal/SignalHandler.swift /Users/admin/builder/spi-builder-workspace/Sources/System/Signal/SignalInformation.swift /Users/admin/builder/spi-builder-workspace/Sources/System/Signal/SignalSet.swift /Users/admin/builder/spi-builder-workspace/Sources/System/Socket/AsyncSocketOperations.swift /Users/admin/builder/spi-builder-workspace/Sources/System/Socket/MessageFlags.swift /Users/admin/builder/spi-builder-workspace/Sources/System/Socket/Poll.swift /Users/admin/builder/spi-builder-workspace/Sources/System/Socket/SocketAddress.swift /Users/admin/builder/spi-builder-workspace/Sources/System/Socket/SocketAddressFamily.swift /Users/admin/builder/spi-builder-workspace/Sources/System/Socket/SocketFlags.swift /Users/admin/builder/spi-builder-workspace/Sources/System/Socket/SocketOperations.swift /Users/admin/builder/spi-builder-workspace/Sources/System/Socket/SocketOption.swift /Users/admin/builder/spi-builder-workspace/Sources/System/Socket/SocketOptionID.swift /Users/admin/builder/spi-builder-workspace/Sources/System/Socket/SocketOptionLevel.swift /Users/admin/builder/spi-builder-workspace/Sources/System/Socket/SocketProtocol.swift /Users/admin/builder/spi-builder-workspace/Sources/System/Socket/SocketType.swift /Users/admin/builder/spi-builder-workspace/Sources/System/SystemInfo.swift /Users/admin/builder/spi-builder-workspace/Sources/System/SystemString.swift /Users/admin/builder/spi-builder-workspace/Sources/System/Time/Clock.swift /Users/admin/builder/spi-builder-workspace/Sources/System/Time/Microseconds.swift /Users/admin/builder/spi-builder-workspace/Sources/System/Time/Nanoseconds.swift /Users/admin/builder/spi-builder-workspace/Sources/System/Time/ProcessorTime.swift /Users/admin/builder/spi-builder-workspace/Sources/System/Time/Time.swift /Users/admin/builder/spi-builder-workspace/Sources/System/Time/TimeComponents.swift /Users/admin/builder/spi-builder-workspace/Sources/System/Time/TimeInterval.swift /Users/admin/builder/spi-builder-workspace/Sources/System/Time/TimeIntervalMicroseconds.swift /Users/admin/builder/spi-builder-workspace/Sources/System/Time/TimeIntervalNanoseconds.swift /Users/admin/builder/spi-builder-workspace/Sources/System/UserID.swift /Users/admin/builder/spi-builder-workspace/Sources/System/Util.swift /Users/admin/builder/spi-builder-workspace/Sources/System/UtilConsumers.swift -supplementary-output-file-map /Users/admin/builder/spi-builder-workspace/.derivedData/Build/Intermediates.noindex/swift-system.build/Debug-watchos/SystemPackage.build/Objects-normal/arm64_32/supplementaryOutputs-1 -target arm64_32-apple-watchos5.0 -enable-objc-interop -sdk /Applications/Xcode-16.1.0.app/Contents/Developer/Platforms/WatchOS.platform/Developer/SDKs/WatchOS11.1.sdk -I /Users/admin/builder/spi-builder-workspace/.derivedData/Build/Products/Debug-watchos -I /Applications/Xcode-16.1.0.app/Contents/Developer/Platforms/WatchOS.platform/Developer/usr/lib -F /Users/admin/builder/spi-builder-workspace/.derivedData/Build/Products/Debug-watchos/PackageFrameworks -F /Users/admin/builder/spi-builder-workspace/.derivedData/Build/Products/Debug-watchos -F /Applications/Xcode-16.1.0.app/Contents/Developer/Platforms/WatchOS.platform/Developer/Library/Frameworks -F /Applications/Xcode-16.1.0.app/Contents/Developer/Platforms/WatchOS.platform/Developer/SDKs/WatchOS11.1.sdk/Developer/Library/Frameworks -no-color-diagnostics -enable-testing -g -debug-info-format\=dwarf -dwarf-version\=4 -module-cache-path /Users/admin/builder/spi-builder-workspace/.derivedData/ModuleCache.noindex -profile-generate -profile-coverage-mapping -swift-version 5 -enforce-exclusivity\=checked -stats-output-dir /Users/admin/builder/spi-builder-workspace/.swiftpm/xcode/.stats -Onone -D SWIFT_PACKAGE -D DEBUG -D SYSTEM_PACKAGE -D ENABLE_MOCKING -serialize-debugging-options -const-gather-protocols-file /Users/admin/builder/spi-builder-workspace/.derivedData/Build/Intermediates.noindex/swift-system.build/Debug-watchos/SystemPackage.build/Objects-normal/arm64_32/SystemPackage_const_extract_protocols.json -enable-experimental-feature DebugDescriptionMacro -enable-experimental-feature OpaqueTypeErasure -enable-upcoming-feature StrictConcurrency -enable-upcoming-feature DisableOutwardActorInference -enable-upcoming-feature GlobalActorIsolatedTypesUsability -enable-upcoming-feature InferSendableFromCaptures -strict-concurrency\=complete -empty-abi-descriptor -plugin-path /Applications/Xcode-16.1.0.app/Contents/Developer/Toolchains/XcodeDefault.xctoolchain/usr/lib/swift/host/plugins/testing -validate-clang-modules-once -clang-build-session-file /Users/admin/builder/spi-builder-workspace/.derivedData/ModuleCache.noindex/Session.modulevalidation -Xcc -working-directory -Xcc /Users/admin/builder/spi-builder-workspace/.swiftpm/xcode -resource-dir /Applications/Xcode-16.1.0.app/Contents/Developer/Toolchains/XcodeDefault.xctoolchain/usr/lib/swift -enable-anonymous-context-mangled-names -file-compilation-dir /Users/admin/builder/spi-builder-workspace/.swiftpm/xcode -Xcc -D_LIBCPP_HARDENING_MODE\=_LIBCPP_HARDENING_MODE_DEBUG -Xcc -ivfsstatcache -Xcc /Users/admin/builder/spi-builder-workspace/.derivedData/SDKStatCaches.noindex/watchos11.1-22R574-7b9df0bda16bb4641b33636c68f04660.sdkstatcache -Xcc -I/Users/admin/builder/spi-builder-workspace/.derivedData/Build/Intermediates.noindex/swift-system.build/Debug-watchos/SystemPackage.build/swift-overrides.hmap -Xcc -I/Users/admin/builder/spi-builder-workspace/Sources/CSystem/include -Xcc -I/Users/admin/builder/spi-builder-workspace/.derivedData/Build/Products/Debug-watchos/include -Xcc -I/Users/admin/builder/spi-builder-workspace/.derivedData/Build/Intermediates.noindex/swift-system.build/Debug-watchos/SystemPackage.build/DerivedSources-normal/arm64_32 -Xcc -I/Users/admin/builder/spi-builder-workspace/.derivedData/Build/Intermediates.noindex/swift-system.build/Debug-watchos/SystemPackage.build/DerivedSources/arm64_32 -Xcc -I/Users/admin/builder/spi-builder-workspace/.derivedData/Build/Intermediates.noindex/swift-system.build/Debug-watchos/SystemPackage.build/DerivedSources -Xcc -DSWIFT_PACKAGE -Xcc -DDEBUG\=1 -Xcc -D_CRT_SECURE_NO_WARNINGS -module-name SystemPackage -frontend-parseable-output -disable-clang-spi -target-sdk-version 11.1 -target-sdk-name watchos11.1 -external-plugin-path /Applications/Xcode-16.1.0.app/Contents/Developer/Platforms/WatchOS.platform/Developer/usr/lib/swift/host/plugins\#/Applications/Xcode-16.1.0.app/Contents/Developer/Platforms/WatchOS.platform/Developer/usr/bin/swift-plugin-server -external-plugin-path /Applications/Xcode-16.1.0.app/Contents/Developer/Platforms/WatchOS.platform/Developer/usr/local/lib/swift/host/plugins\#/Applications/Xcode-16.1.0.app/Contents/Developer/Platforms/WatchOS.platform/Developer/usr/bin/swift-plugin-server -plugin-path /Applications/Xcode-16.1.0.app/Contents/Developer/Toolchains/XcodeDefault.xctoolchain/usr/lib/swift/host/plugins -plugin-path /Applications/Xcode-16.1.0.app/Contents/Developer/Toolchains/XcodeDefault.xctoolchain/usr/local/lib/swift/host/plugins -o /Users/admin/builder/spi-builder-workspace/.derivedData/Build/Intermediates.noindex/swift-system.build/Debug-watchos/SystemPackage.build/Objects-normal/arm64_32/AsyncFileOperations.o -o /Users/admin/builder/spi-builder-workspace/.derivedData/Build/Intermediates.noindex/swift-system.build/Debug-watchos/SystemPackage.build/Objects-normal/arm64_32/Errno.o -o /Users/admin/builder/spi-builder-workspace/.derivedData/Build/Intermediates.noindex/swift-system.build/Debug-watchos/SystemPackage.build/Objects-normal/arm64_32/FileChange.o -o /Users/admin/builder/spi-builder-workspace/.derivedData/Build/Intermediates.noindex/swift-system.build/Debug-watchos/SystemPackage.build/Objects-normal/arm64_32/FileDescriptor.o -o /Users/admin/builder/spi-builder-workspace/.derivedData/Build/Intermediates.noindex/swift-system.build/Debug-watchos/SystemPackage.build/Objects-normal/arm64_32/FileDescriptorSet.o -o /Users/admin/builder/spi-builder-workspace/.derivedData/Build/Intermediates.noindex/swift-system.build/Debug-watchos/SystemPackage.build/Objects-normal/arm64_32/FileEvent.o -o /Users/admin/builder/spi-builder-workspace/.derivedData/Build/Intermediates.noindex/swift-system.build/Debug-watchos/SystemPackage.build/Objects-normal/arm64_32/FileHelpers.o -index-unit-output-path /swift-system.build/Debug-watchos/SystemPackage.build/Objects-normal/arm64_32/AsyncFileOperations.o -index-unit-output-path /swift-system.build/Debug-watchos/SystemPackage.build/Objects-normal/arm64_32/Errno.o -index-unit-output-path /swift-system.build/Debug-watchos/SystemPackage.build/Objects-normal/arm64_32/FileChange.o -index-unit-output-path /swift-system.build/Debug-watchos/SystemPackage.build/Objects-normal/arm64_32/FileDescriptor.o -index-unit-output-path /swift-system.build/Debug-watchos/SystemPackage.build/Objects-normal/arm64_32/FileDescriptorSet.o -index-unit-output-path /swift-system.build/Debug-watchos/SystemPackage.build/Objects-normal/arm64_32/FileEvent.o -index-unit-output-path /swift-system.build/Debug-watchos/SystemPackage.build/Objects-normal/arm64_32/FileHelpers.o -index-store-path /Users/admin/builder/spi-builder-workspace/.derivedData/Index.noindex/DataStore -index-system-modules
SwiftCompile normal arm64_32 /Users/admin/builder/spi-builder-workspace/Sources/System/FileDescriptorSet.swift (in target 'SystemPackage' from project 'swift-system')
cd /Users/admin/builder/spi-builder-workspace/.swiftpm/xcode
/Applications/Xcode-16.1.0.app/Contents/Developer/Toolchains/XcodeDefault.xctoolchain/usr/bin/swift-frontend -c -primary-file /Users/admin/builder/spi-builder-workspace/Sources/System/AsyncFileOperations.swift -primary-file /Users/admin/builder/spi-builder-workspace/Sources/System/Errno.swift -primary-file /Users/admin/builder/spi-builder-workspace/Sources/System/FileChange.swift -primary-file /Users/admin/builder/spi-builder-workspace/Sources/System/FileDescriptor.swift -primary-file /Users/admin/builder/spi-builder-workspace/Sources/System/FileDescriptorSet.swift -primary-file /Users/admin/builder/spi-builder-workspace/Sources/System/FileEvent.swift -primary-file /Users/admin/builder/spi-builder-workspace/Sources/System/FileHelpers.swift /Users/admin/builder/spi-builder-workspace/Sources/System/FileOperations.swift /Users/admin/builder/spi-builder-workspace/Sources/System/FilePath/FilePath.swift /Users/admin/builder/spi-builder-workspace/Sources/System/FilePath/FilePathComponentView.swift /Users/admin/builder/spi-builder-workspace/Sources/System/FilePath/FilePathComponents.swift /Users/admin/builder/spi-builder-workspace/Sources/System/FilePath/FilePathParsing.swift /Users/admin/builder/spi-builder-workspace/Sources/System/FilePath/FilePathString.swift /Users/admin/builder/spi-builder-workspace/Sources/System/FilePath/FilePathSyntax.swift /Users/admin/builder/spi-builder-workspace/Sources/System/FilePath/FilePathWindows.swift /Users/admin/builder/spi-builder-workspace/Sources/System/FilePermissions.swift /Users/admin/builder/spi-builder-workspace/Sources/System/InputOutput/IOControl.swift /Users/admin/builder/spi-builder-workspace/Sources/System/InputOutput/IODirection.swift /Users/admin/builder/spi-builder-workspace/Sources/System/InputOutput/IOOperations.swift /Users/admin/builder/spi-builder-workspace/Sources/System/InputOutput/IOType.swift /Users/admin/builder/spi-builder-workspace/Sources/System/InputOutput/TerminalIO.swift /Users/admin/builder/spi-builder-workspace/Sources/System/Internals/CInternetAddress.swift /Users/admin/builder/spi-builder-workspace/Sources/System/Internals/CInterop.swift /Users/admin/builder/spi-builder-workspace/Sources/System/Internals/CSocketAddress.swift /Users/admin/builder/spi-builder-workspace/Sources/System/Internals/Compatibility.swift /Users/admin/builder/spi-builder-workspace/Sources/System/Internals/Constants.swift /Users/admin/builder/spi-builder-workspace/Sources/System/Internals/Exports.swift /Users/admin/builder/spi-builder-workspace/Sources/System/Internals/IOCTL.swift /Users/admin/builder/spi-builder-workspace/Sources/System/Internals/Mocking.swift /Users/admin/builder/spi-builder-workspace/Sources/System/Internals/NetworkOrder.swift /Users/admin/builder/spi-builder-workspace/Sources/System/Internals/Syscalls.swift /Users/admin/builder/spi-builder-workspace/Sources/System/Internals/WindowsSyscallAdapters.swift /Users/admin/builder/spi-builder-workspace/Sources/System/InternetProtocol.swift /Users/admin/builder/spi-builder-workspace/Sources/System/PlatformString.swift /Users/admin/builder/spi-builder-workspace/Sources/System/ProcessID.swift /Users/admin/builder/spi-builder-workspace/Sources/System/Signal/Signal.swift /Users/admin/builder/spi-builder-workspace/Sources/System/Signal/SignalAction.swift /Users/admin/builder/spi-builder-workspace/Sources/System/Signal/SignalHandler.swift /Users/admin/builder/spi-builder-workspace/Sources/System/Signal/SignalInformation.swift /Users/admin/builder/spi-builder-workspace/Sources/System/Signal/SignalSet.swift /Users/admin/builder/spi-builder-workspace/Sources/System/Socket/AsyncSocketOperations.swift /Users/admin/builder/spi-builder-workspace/Sources/System/Socket/MessageFlags.swift /Users/admin/builder/spi-builder-workspace/Sources/System/Socket/Poll.swift /Users/admin/builder/spi-builder-workspace/Sources/System/Socket/SocketAddress.swift /Users/admin/builder/spi-builder-workspace/Sources/System/Socket/SocketAddressFamily.swift /Users/admin/builder/spi-builder-workspace/Sources/System/Socket/SocketFlags.swift /Users/admin/builder/spi-builder-workspace/Sources/System/Socket/SocketOperations.swift /Users/admin/builder/spi-builder-workspace/Sources/System/Socket/SocketOption.swift /Users/admin/builder/spi-builder-workspace/Sources/System/Socket/SocketOptionID.swift /Users/admin/builder/spi-builder-workspace/Sources/System/Socket/SocketOptionLevel.swift /Users/admin/builder/spi-builder-workspace/Sources/System/Socket/SocketProtocol.swift /Users/admin/builder/spi-builder-workspace/Sources/System/Socket/SocketType.swift /Users/admin/builder/spi-builder-workspace/Sources/System/SystemInfo.swift /Users/admin/builder/spi-builder-workspace/Sources/System/SystemString.swift /Users/admin/builder/spi-builder-workspace/Sources/System/Time/Clock.swift /Users/admin/builder/spi-builder-workspace/Sources/System/Time/Microseconds.swift /Users/admin/builder/spi-builder-workspace/Sources/System/Time/Nanoseconds.swift /Users/admin/builder/spi-builder-workspace/Sources/System/Time/ProcessorTime.swift /Users/admin/builder/spi-builder-workspace/Sources/System/Time/Time.swift /Users/admin/builder/spi-builder-workspace/Sources/System/Time/TimeComponents.swift /Users/admin/builder/spi-builder-workspace/Sources/System/Time/TimeInterval.swift /Users/admin/builder/spi-builder-workspace/Sources/System/Time/TimeIntervalMicroseconds.swift /Users/admin/builder/spi-builder-workspace/Sources/System/Time/TimeIntervalNanoseconds.swift /Users/admin/builder/spi-builder-workspace/Sources/System/UserID.swift /Users/admin/builder/spi-builder-workspace/Sources/System/Util.swift /Users/admin/builder/spi-builder-workspace/Sources/System/UtilConsumers.swift -supplementary-output-file-map /Users/admin/builder/spi-builder-workspace/.derivedData/Build/Intermediates.noindex/swift-system.build/Debug-watchos/SystemPackage.build/Objects-normal/arm64_32/supplementaryOutputs-1 -target arm64_32-apple-watchos5.0 -enable-objc-interop -sdk /Applications/Xcode-16.1.0.app/Contents/Developer/Platforms/WatchOS.platform/Developer/SDKs/WatchOS11.1.sdk -I /Users/admin/builder/spi-builder-workspace/.derivedData/Build/Products/Debug-watchos -I /Applications/Xcode-16.1.0.app/Contents/Developer/Platforms/WatchOS.platform/Developer/usr/lib -F /Users/admin/builder/spi-builder-workspace/.derivedData/Build/Products/Debug-watchos/PackageFrameworks -F /Users/admin/builder/spi-builder-workspace/.derivedData/Build/Products/Debug-watchos -F /Applications/Xcode-16.1.0.app/Contents/Developer/Platforms/WatchOS.platform/Developer/Library/Frameworks -F /Applications/Xcode-16.1.0.app/Contents/Developer/Platforms/WatchOS.platform/Developer/SDKs/WatchOS11.1.sdk/Developer/Library/Frameworks -no-color-diagnostics -enable-testing -g -debug-info-format\=dwarf -dwarf-version\=4 -module-cache-path /Users/admin/builder/spi-builder-workspace/.derivedData/ModuleCache.noindex -profile-generate -profile-coverage-mapping -swift-version 5 -enforce-exclusivity\=checked -stats-output-dir /Users/admin/builder/spi-builder-workspace/.swiftpm/xcode/.stats -Onone -D SWIFT_PACKAGE -D DEBUG -D SYSTEM_PACKAGE -D ENABLE_MOCKING -serialize-debugging-options -const-gather-protocols-file /Users/admin/builder/spi-builder-workspace/.derivedData/Build/Intermediates.noindex/swift-system.build/Debug-watchos/SystemPackage.build/Objects-normal/arm64_32/SystemPackage_const_extract_protocols.json -enable-experimental-feature DebugDescriptionMacro -enable-experimental-feature OpaqueTypeErasure -enable-upcoming-feature StrictConcurrency -enable-upcoming-feature DisableOutwardActorInference -enable-upcoming-feature GlobalActorIsolatedTypesUsability -enable-upcoming-feature InferSendableFromCaptures -strict-concurrency\=complete -empty-abi-descriptor -plugin-path /Applications/Xcode-16.1.0.app/Contents/Developer/Toolchains/XcodeDefault.xctoolchain/usr/lib/swift/host/plugins/testing -validate-clang-modules-once -clang-build-session-file /Users/admin/builder/spi-builder-workspace/.derivedData/ModuleCache.noindex/Session.modulevalidation -Xcc -working-directory -Xcc /Users/admin/builder/spi-builder-workspace/.swiftpm/xcode -resource-dir /Applications/Xcode-16.1.0.app/Contents/Developer/Toolchains/XcodeDefault.xctoolchain/usr/lib/swift -enable-anonymous-context-mangled-names -file-compilation-dir /Users/admin/builder/spi-builder-workspace/.swiftpm/xcode -Xcc -D_LIBCPP_HARDENING_MODE\=_LIBCPP_HARDENING_MODE_DEBUG -Xcc -ivfsstatcache -Xcc /Users/admin/builder/spi-builder-workspace/.derivedData/SDKStatCaches.noindex/watchos11.1-22R574-7b9df0bda16bb4641b33636c68f04660.sdkstatcache -Xcc -I/Users/admin/builder/spi-builder-workspace/.derivedData/Build/Intermediates.noindex/swift-system.build/Debug-watchos/SystemPackage.build/swift-overrides.hmap -Xcc -I/Users/admin/builder/spi-builder-workspace/Sources/CSystem/include -Xcc -I/Users/admin/builder/spi-builder-workspace/.derivedData/Build/Products/Debug-watchos/include -Xcc -I/Users/admin/builder/spi-builder-workspace/.derivedData/Build/Intermediates.noindex/swift-system.build/Debug-watchos/SystemPackage.build/DerivedSources-normal/arm64_32 -Xcc -I/Users/admin/builder/spi-builder-workspace/.derivedData/Build/Intermediates.noindex/swift-system.build/Debug-watchos/SystemPackage.build/DerivedSources/arm64_32 -Xcc -I/Users/admin/builder/spi-builder-workspace/.derivedData/Build/Intermediates.noindex/swift-system.build/Debug-watchos/SystemPackage.build/DerivedSources -Xcc -DSWIFT_PACKAGE -Xcc -DDEBUG\=1 -Xcc -D_CRT_SECURE_NO_WARNINGS -module-name SystemPackage -frontend-parseable-output -disable-clang-spi -target-sdk-version 11.1 -target-sdk-name watchos11.1 -external-plugin-path /Applications/Xcode-16.1.0.app/Contents/Developer/Platforms/WatchOS.platform/Developer/usr/lib/swift/host/plugins\#/Applications/Xcode-16.1.0.app/Contents/Developer/Platforms/WatchOS.platform/Developer/usr/bin/swift-plugin-server -external-plugin-path /Applications/Xcode-16.1.0.app/Contents/Developer/Platforms/WatchOS.platform/Developer/usr/local/lib/swift/host/plugins\#/Applications/Xcode-16.1.0.app/Contents/Developer/Platforms/WatchOS.platform/Developer/usr/bin/swift-plugin-server -plugin-path /Applications/Xcode-16.1.0.app/Contents/Developer/Toolchains/XcodeDefault.xctoolchain/usr/lib/swift/host/plugins -plugin-path /Applications/Xcode-16.1.0.app/Contents/Developer/Toolchains/XcodeDefault.xctoolchain/usr/local/lib/swift/host/plugins -o /Users/admin/builder/spi-builder-workspace/.derivedData/Build/Intermediates.noindex/swift-system.build/Debug-watchos/SystemPackage.build/Objects-normal/arm64_32/AsyncFileOperations.o -o /Users/admin/builder/spi-builder-workspace/.derivedData/Build/Intermediates.noindex/swift-system.build/Debug-watchos/SystemPackage.build/Objects-normal/arm64_32/Errno.o -o /Users/admin/builder/spi-builder-workspace/.derivedData/Build/Intermediates.noindex/swift-system.build/Debug-watchos/SystemPackage.build/Objects-normal/arm64_32/FileChange.o -o /Users/admin/builder/spi-builder-workspace/.derivedData/Build/Intermediates.noindex/swift-system.build/Debug-watchos/SystemPackage.build/Objects-normal/arm64_32/FileDescriptor.o -o /Users/admin/builder/spi-builder-workspace/.derivedData/Build/Intermediates.noindex/swift-system.build/Debug-watchos/SystemPackage.build/Objects-normal/arm64_32/FileDescriptorSet.o -o /Users/admin/builder/spi-builder-workspace/.derivedData/Build/Intermediates.noindex/swift-system.build/Debug-watchos/SystemPackage.build/Objects-normal/arm64_32/FileEvent.o -o /Users/admin/builder/spi-builder-workspace/.derivedData/Build/Intermediates.noindex/swift-system.build/Debug-watchos/SystemPackage.build/Objects-normal/arm64_32/FileHelpers.o -index-unit-output-path /swift-system.build/Debug-watchos/SystemPackage.build/Objects-normal/arm64_32/AsyncFileOperations.o -index-unit-output-path /swift-system.build/Debug-watchos/SystemPackage.build/Objects-normal/arm64_32/Errno.o -index-unit-output-path /swift-system.build/Debug-watchos/SystemPackage.build/Objects-normal/arm64_32/FileChange.o -index-unit-output-path /swift-system.build/Debug-watchos/SystemPackage.build/Objects-normal/arm64_32/FileDescriptor.o -index-unit-output-path /swift-system.build/Debug-watchos/SystemPackage.build/Objects-normal/arm64_32/FileDescriptorSet.o -index-unit-output-path /swift-system.build/Debug-watchos/SystemPackage.build/Objects-normal/arm64_32/FileEvent.o -index-unit-output-path /swift-system.build/Debug-watchos/SystemPackage.build/Objects-normal/arm64_32/FileHelpers.o -index-store-path /Users/admin/builder/spi-builder-workspace/.derivedData/Index.noindex/DataStore -index-system-modules
SwiftCompile normal arm64_32 /Users/admin/builder/spi-builder-workspace/Sources/System/FileEvent.swift (in target 'SystemPackage' from project 'swift-system')
cd /Users/admin/builder/spi-builder-workspace/.swiftpm/xcode
/Applications/Xcode-16.1.0.app/Contents/Developer/Toolchains/XcodeDefault.xctoolchain/usr/bin/swift-frontend -c -primary-file /Users/admin/builder/spi-builder-workspace/Sources/System/AsyncFileOperations.swift -primary-file /Users/admin/builder/spi-builder-workspace/Sources/System/Errno.swift -primary-file /Users/admin/builder/spi-builder-workspace/Sources/System/FileChange.swift -primary-file /Users/admin/builder/spi-builder-workspace/Sources/System/FileDescriptor.swift -primary-file /Users/admin/builder/spi-builder-workspace/Sources/System/FileDescriptorSet.swift -primary-file /Users/admin/builder/spi-builder-workspace/Sources/System/FileEvent.swift -primary-file /Users/admin/builder/spi-builder-workspace/Sources/System/FileHelpers.swift /Users/admin/builder/spi-builder-workspace/Sources/System/FileOperations.swift /Users/admin/builder/spi-builder-workspace/Sources/System/FilePath/FilePath.swift /Users/admin/builder/spi-builder-workspace/Sources/System/FilePath/FilePathComponentView.swift /Users/admin/builder/spi-builder-workspace/Sources/System/FilePath/FilePathComponents.swift /Users/admin/builder/spi-builder-workspace/Sources/System/FilePath/FilePathParsing.swift /Users/admin/builder/spi-builder-workspace/Sources/System/FilePath/FilePathString.swift /Users/admin/builder/spi-builder-workspace/Sources/System/FilePath/FilePathSyntax.swift /Users/admin/builder/spi-builder-workspace/Sources/System/FilePath/FilePathWindows.swift /Users/admin/builder/spi-builder-workspace/Sources/System/FilePermissions.swift /Users/admin/builder/spi-builder-workspace/Sources/System/InputOutput/IOControl.swift /Users/admin/builder/spi-builder-workspace/Sources/System/InputOutput/IODirection.swift /Users/admin/builder/spi-builder-workspace/Sources/System/InputOutput/IOOperations.swift /Users/admin/builder/spi-builder-workspace/Sources/System/InputOutput/IOType.swift /Users/admin/builder/spi-builder-workspace/Sources/System/InputOutput/TerminalIO.swift /Users/admin/builder/spi-builder-workspace/Sources/System/Internals/CInternetAddress.swift /Users/admin/builder/spi-builder-workspace/Sources/System/Internals/CInterop.swift /Users/admin/builder/spi-builder-workspace/Sources/System/Internals/CSocketAddress.swift /Users/admin/builder/spi-builder-workspace/Sources/System/Internals/Compatibility.swift /Users/admin/builder/spi-builder-workspace/Sources/System/Internals/Constants.swift /Users/admin/builder/spi-builder-workspace/Sources/System/Internals/Exports.swift /Users/admin/builder/spi-builder-workspace/Sources/System/Internals/IOCTL.swift /Users/admin/builder/spi-builder-workspace/Sources/System/Internals/Mocking.swift /Users/admin/builder/spi-builder-workspace/Sources/System/Internals/NetworkOrder.swift /Users/admin/builder/spi-builder-workspace/Sources/System/Internals/Syscalls.swift /Users/admin/builder/spi-builder-workspace/Sources/System/Internals/WindowsSyscallAdapters.swift /Users/admin/builder/spi-builder-workspace/Sources/System/InternetProtocol.swift /Users/admin/builder/spi-builder-workspace/Sources/System/PlatformString.swift /Users/admin/builder/spi-builder-workspace/Sources/System/ProcessID.swift /Users/admin/builder/spi-builder-workspace/Sources/System/Signal/Signal.swift /Users/admin/builder/spi-builder-workspace/Sources/System/Signal/SignalAction.swift /Users/admin/builder/spi-builder-workspace/Sources/System/Signal/SignalHandler.swift /Users/admin/builder/spi-builder-workspace/Sources/System/Signal/SignalInformation.swift /Users/admin/builder/spi-builder-workspace/Sources/System/Signal/SignalSet.swift /Users/admin/builder/spi-builder-workspace/Sources/System/Socket/AsyncSocketOperations.swift /Users/admin/builder/spi-builder-workspace/Sources/System/Socket/MessageFlags.swift /Users/admin/builder/spi-builder-workspace/Sources/System/Socket/Poll.swift /Users/admin/builder/spi-builder-workspace/Sources/System/Socket/SocketAddress.swift /Users/admin/builder/spi-builder-workspace/Sources/System/Socket/SocketAddressFamily.swift /Users/admin/builder/spi-builder-workspace/Sources/System/Socket/SocketFlags.swift /Users/admin/builder/spi-builder-workspace/Sources/System/Socket/SocketOperations.swift /Users/admin/builder/spi-builder-workspace/Sources/System/Socket/SocketOption.swift /Users/admin/builder/spi-builder-workspace/Sources/System/Socket/SocketOptionID.swift /Users/admin/builder/spi-builder-workspace/Sources/System/Socket/SocketOptionLevel.swift /Users/admin/builder/spi-builder-workspace/Sources/System/Socket/SocketProtocol.swift /Users/admin/builder/spi-builder-workspace/Sources/System/Socket/SocketType.swift /Users/admin/builder/spi-builder-workspace/Sources/System/SystemInfo.swift /Users/admin/builder/spi-builder-workspace/Sources/System/SystemString.swift /Users/admin/builder/spi-builder-workspace/Sources/System/Time/Clock.swift /Users/admin/builder/spi-builder-workspace/Sources/System/Time/Microseconds.swift /Users/admin/builder/spi-builder-workspace/Sources/System/Time/Nanoseconds.swift /Users/admin/builder/spi-builder-workspace/Sources/System/Time/ProcessorTime.swift /Users/admin/builder/spi-builder-workspace/Sources/System/Time/Time.swift /Users/admin/builder/spi-builder-workspace/Sources/System/Time/TimeComponents.swift /Users/admin/builder/spi-builder-workspace/Sources/System/Time/TimeInterval.swift /Users/admin/builder/spi-builder-workspace/Sources/System/Time/TimeIntervalMicroseconds.swift /Users/admin/builder/spi-builder-workspace/Sources/System/Time/TimeIntervalNanoseconds.swift /Users/admin/builder/spi-builder-workspace/Sources/System/UserID.swift /Users/admin/builder/spi-builder-workspace/Sources/System/Util.swift /Users/admin/builder/spi-builder-workspace/Sources/System/UtilConsumers.swift -supplementary-output-file-map /Users/admin/builder/spi-builder-workspace/.derivedData/Build/Intermediates.noindex/swift-system.build/Debug-watchos/SystemPackage.build/Objects-normal/arm64_32/supplementaryOutputs-1 -target arm64_32-apple-watchos5.0 -enable-objc-interop -sdk /Applications/Xcode-16.1.0.app/Contents/Developer/Platforms/WatchOS.platform/Developer/SDKs/WatchOS11.1.sdk -I /Users/admin/builder/spi-builder-workspace/.derivedData/Build/Products/Debug-watchos -I /Applications/Xcode-16.1.0.app/Contents/Developer/Platforms/WatchOS.platform/Developer/usr/lib -F /Users/admin/builder/spi-builder-workspace/.derivedData/Build/Products/Debug-watchos/PackageFrameworks -F /Users/admin/builder/spi-builder-workspace/.derivedData/Build/Products/Debug-watchos -F /Applications/Xcode-16.1.0.app/Contents/Developer/Platforms/WatchOS.platform/Developer/Library/Frameworks -F /Applications/Xcode-16.1.0.app/Contents/Developer/Platforms/WatchOS.platform/Developer/SDKs/WatchOS11.1.sdk/Developer/Library/Frameworks -no-color-diagnostics -enable-testing -g -debug-info-format\=dwarf -dwarf-version\=4 -module-cache-path /Users/admin/builder/spi-builder-workspace/.derivedData/ModuleCache.noindex -profile-generate -profile-coverage-mapping -swift-version 5 -enforce-exclusivity\=checked -stats-output-dir /Users/admin/builder/spi-builder-workspace/.swiftpm/xcode/.stats -Onone -D SWIFT_PACKAGE -D DEBUG -D SYSTEM_PACKAGE -D ENABLE_MOCKING -serialize-debugging-options -const-gather-protocols-file /Users/admin/builder/spi-builder-workspace/.derivedData/Build/Intermediates.noindex/swift-system.build/Debug-watchos/SystemPackage.build/Objects-normal/arm64_32/SystemPackage_const_extract_protocols.json -enable-experimental-feature DebugDescriptionMacro -enable-experimental-feature OpaqueTypeErasure -enable-upcoming-feature StrictConcurrency -enable-upcoming-feature DisableOutwardActorInference -enable-upcoming-feature GlobalActorIsolatedTypesUsability -enable-upcoming-feature InferSendableFromCaptures -strict-concurrency\=complete -empty-abi-descriptor -plugin-path /Applications/Xcode-16.1.0.app/Contents/Developer/Toolchains/XcodeDefault.xctoolchain/usr/lib/swift/host/plugins/testing -validate-clang-modules-once -clang-build-session-file /Users/admin/builder/spi-builder-workspace/.derivedData/ModuleCache.noindex/Session.modulevalidation -Xcc -working-directory -Xcc /Users/admin/builder/spi-builder-workspace/.swiftpm/xcode -resource-dir /Applications/Xcode-16.1.0.app/Contents/Developer/Toolchains/XcodeDefault.xctoolchain/usr/lib/swift -enable-anonymous-context-mangled-names -file-compilation-dir /Users/admin/builder/spi-builder-workspace/.swiftpm/xcode -Xcc -D_LIBCPP_HARDENING_MODE\=_LIBCPP_HARDENING_MODE_DEBUG -Xcc -ivfsstatcache -Xcc /Users/admin/builder/spi-builder-workspace/.derivedData/SDKStatCaches.noindex/watchos11.1-22R574-7b9df0bda16bb4641b33636c68f04660.sdkstatcache -Xcc -I/Users/admin/builder/spi-builder-workspace/.derivedData/Build/Intermediates.noindex/swift-system.build/Debug-watchos/SystemPackage.build/swift-overrides.hmap -Xcc -I/Users/admin/builder/spi-builder-workspace/Sources/CSystem/include -Xcc -I/Users/admin/builder/spi-builder-workspace/.derivedData/Build/Products/Debug-watchos/include -Xcc -I/Users/admin/builder/spi-builder-workspace/.derivedData/Build/Intermediates.noindex/swift-system.build/Debug-watchos/SystemPackage.build/DerivedSources-normal/arm64_32 -Xcc -I/Users/admin/builder/spi-builder-workspace/.derivedData/Build/Intermediates.noindex/swift-system.build/Debug-watchos/SystemPackage.build/DerivedSources/arm64_32 -Xcc -I/Users/admin/builder/spi-builder-workspace/.derivedData/Build/Intermediates.noindex/swift-system.build/Debug-watchos/SystemPackage.build/DerivedSources -Xcc -DSWIFT_PACKAGE -Xcc -DDEBUG\=1 -Xcc -D_CRT_SECURE_NO_WARNINGS -module-name SystemPackage -frontend-parseable-output -disable-clang-spi -target-sdk-version 11.1 -target-sdk-name watchos11.1 -external-plugin-path /Applications/Xcode-16.1.0.app/Contents/Developer/Platforms/WatchOS.platform/Developer/usr/lib/swift/host/plugins\#/Applications/Xcode-16.1.0.app/Contents/Developer/Platforms/WatchOS.platform/Developer/usr/bin/swift-plugin-server -external-plugin-path /Applications/Xcode-16.1.0.app/Contents/Developer/Platforms/WatchOS.platform/Developer/usr/local/lib/swift/host/plugins\#/Applications/Xcode-16.1.0.app/Contents/Developer/Platforms/WatchOS.platform/Developer/usr/bin/swift-plugin-server -plugin-path /Applications/Xcode-16.1.0.app/Contents/Developer/Toolchains/XcodeDefault.xctoolchain/usr/lib/swift/host/plugins -plugin-path /Applications/Xcode-16.1.0.app/Contents/Developer/Toolchains/XcodeDefault.xctoolchain/usr/local/lib/swift/host/plugins -o /Users/admin/builder/spi-builder-workspace/.derivedData/Build/Intermediates.noindex/swift-system.build/Debug-watchos/SystemPackage.build/Objects-normal/arm64_32/AsyncFileOperations.o -o /Users/admin/builder/spi-builder-workspace/.derivedData/Build/Intermediates.noindex/swift-system.build/Debug-watchos/SystemPackage.build/Objects-normal/arm64_32/Errno.o -o /Users/admin/builder/spi-builder-workspace/.derivedData/Build/Intermediates.noindex/swift-system.build/Debug-watchos/SystemPackage.build/Objects-normal/arm64_32/FileChange.o -o /Users/admin/builder/spi-builder-workspace/.derivedData/Build/Intermediates.noindex/swift-system.build/Debug-watchos/SystemPackage.build/Objects-normal/arm64_32/FileDescriptor.o -o /Users/admin/builder/spi-builder-workspace/.derivedData/Build/Intermediates.noindex/swift-system.build/Debug-watchos/SystemPackage.build/Objects-normal/arm64_32/FileDescriptorSet.o -o /Users/admin/builder/spi-builder-workspace/.derivedData/Build/Intermediates.noindex/swift-system.build/Debug-watchos/SystemPackage.build/Objects-normal/arm64_32/FileEvent.o -o /Users/admin/builder/spi-builder-workspace/.derivedData/Build/Intermediates.noindex/swift-system.build/Debug-watchos/SystemPackage.build/Objects-normal/arm64_32/FileHelpers.o -index-unit-output-path /swift-system.build/Debug-watchos/SystemPackage.build/Objects-normal/arm64_32/AsyncFileOperations.o -index-unit-output-path /swift-system.build/Debug-watchos/SystemPackage.build/Objects-normal/arm64_32/Errno.o -index-unit-output-path /swift-system.build/Debug-watchos/SystemPackage.build/Objects-normal/arm64_32/FileChange.o -index-unit-output-path /swift-system.build/Debug-watchos/SystemPackage.build/Objects-normal/arm64_32/FileDescriptor.o -index-unit-output-path /swift-system.build/Debug-watchos/SystemPackage.build/Objects-normal/arm64_32/FileDescriptorSet.o -index-unit-output-path /swift-system.build/Debug-watchos/SystemPackage.build/Objects-normal/arm64_32/FileEvent.o -index-unit-output-path /swift-system.build/Debug-watchos/SystemPackage.build/Objects-normal/arm64_32/FileHelpers.o -index-store-path /Users/admin/builder/spi-builder-workspace/.derivedData/Index.noindex/DataStore -index-system-modules
SwiftCompile normal arm64_32 /Users/admin/builder/spi-builder-workspace/Sources/System/FileHelpers.swift (in target 'SystemPackage' from project 'swift-system')
cd /Users/admin/builder/spi-builder-workspace/.swiftpm/xcode
/Applications/Xcode-16.1.0.app/Contents/Developer/Toolchains/XcodeDefault.xctoolchain/usr/bin/swift-frontend -c -primary-file /Users/admin/builder/spi-builder-workspace/Sources/System/AsyncFileOperations.swift -primary-file /Users/admin/builder/spi-builder-workspace/Sources/System/Errno.swift -primary-file /Users/admin/builder/spi-builder-workspace/Sources/System/FileChange.swift -primary-file /Users/admin/builder/spi-builder-workspace/Sources/System/FileDescriptor.swift -primary-file /Users/admin/builder/spi-builder-workspace/Sources/System/FileDescriptorSet.swift -primary-file /Users/admin/builder/spi-builder-workspace/Sources/System/FileEvent.swift -primary-file /Users/admin/builder/spi-builder-workspace/Sources/System/FileHelpers.swift /Users/admin/builder/spi-builder-workspace/Sources/System/FileOperations.swift /Users/admin/builder/spi-builder-workspace/Sources/System/FilePath/FilePath.swift /Users/admin/builder/spi-builder-workspace/Sources/System/FilePath/FilePathComponentView.swift /Users/admin/builder/spi-builder-workspace/Sources/System/FilePath/FilePathComponents.swift /Users/admin/builder/spi-builder-workspace/Sources/System/FilePath/FilePathParsing.swift /Users/admin/builder/spi-builder-workspace/Sources/System/FilePath/FilePathString.swift /Users/admin/builder/spi-builder-workspace/Sources/System/FilePath/FilePathSyntax.swift /Users/admin/builder/spi-builder-workspace/Sources/System/FilePath/FilePathWindows.swift /Users/admin/builder/spi-builder-workspace/Sources/System/FilePermissions.swift /Users/admin/builder/spi-builder-workspace/Sources/System/InputOutput/IOControl.swift /Users/admin/builder/spi-builder-workspace/Sources/System/InputOutput/IODirection.swift /Users/admin/builder/spi-builder-workspace/Sources/System/InputOutput/IOOperations.swift /Users/admin/builder/spi-builder-workspace/Sources/System/InputOutput/IOType.swift /Users/admin/builder/spi-builder-workspace/Sources/System/InputOutput/TerminalIO.swift /Users/admin/builder/spi-builder-workspace/Sources/System/Internals/CInternetAddress.swift /Users/admin/builder/spi-builder-workspace/Sources/System/Internals/CInterop.swift /Users/admin/builder/spi-builder-workspace/Sources/System/Internals/CSocketAddress.swift /Users/admin/builder/spi-builder-workspace/Sources/System/Internals/Compatibility.swift /Users/admin/builder/spi-builder-workspace/Sources/System/Internals/Constants.swift /Users/admin/builder/spi-builder-workspace/Sources/System/Internals/Exports.swift /Users/admin/builder/spi-builder-workspace/Sources/System/Internals/IOCTL.swift /Users/admin/builder/spi-builder-workspace/Sources/System/Internals/Mocking.swift /Users/admin/builder/spi-builder-workspace/Sources/System/Internals/NetworkOrder.swift /Users/admin/builder/spi-builder-workspace/Sources/System/Internals/Syscalls.swift /Users/admin/builder/spi-builder-workspace/Sources/System/Internals/WindowsSyscallAdapters.swift /Users/admin/builder/spi-builder-workspace/Sources/System/InternetProtocol.swift /Users/admin/builder/spi-builder-workspace/Sources/System/PlatformString.swift /Users/admin/builder/spi-builder-workspace/Sources/System/ProcessID.swift /Users/admin/builder/spi-builder-workspace/Sources/System/Signal/Signal.swift /Users/admin/builder/spi-builder-workspace/Sources/System/Signal/SignalAction.swift /Users/admin/builder/spi-builder-workspace/Sources/System/Signal/SignalHandler.swift /Users/admin/builder/spi-builder-workspace/Sources/System/Signal/SignalInformation.swift /Users/admin/builder/spi-builder-workspace/Sources/System/Signal/SignalSet.swift /Users/admin/builder/spi-builder-workspace/Sources/System/Socket/AsyncSocketOperations.swift /Users/admin/builder/spi-builder-workspace/Sources/System/Socket/MessageFlags.swift /Users/admin/builder/spi-builder-workspace/Sources/System/Socket/Poll.swift /Users/admin/builder/spi-builder-workspace/Sources/System/Socket/SocketAddress.swift /Users/admin/builder/spi-builder-workspace/Sources/System/Socket/SocketAddressFamily.swift /Users/admin/builder/spi-builder-workspace/Sources/System/Socket/SocketFlags.swift /Users/admin/builder/spi-builder-workspace/Sources/System/Socket/SocketOperations.swift /Users/admin/builder/spi-builder-workspace/Sources/System/Socket/SocketOption.swift /Users/admin/builder/spi-builder-workspace/Sources/System/Socket/SocketOptionID.swift /Users/admin/builder/spi-builder-workspace/Sources/System/Socket/SocketOptionLevel.swift /Users/admin/builder/spi-builder-workspace/Sources/System/Socket/SocketProtocol.swift /Users/admin/builder/spi-builder-workspace/Sources/System/Socket/SocketType.swift /Users/admin/builder/spi-builder-workspace/Sources/System/SystemInfo.swift /Users/admin/builder/spi-builder-workspace/Sources/System/SystemString.swift /Users/admin/builder/spi-builder-workspace/Sources/System/Time/Clock.swift /Users/admin/builder/spi-builder-workspace/Sources/System/Time/Microseconds.swift /Users/admin/builder/spi-builder-workspace/Sources/System/Time/Nanoseconds.swift /Users/admin/builder/spi-builder-workspace/Sources/System/Time/ProcessorTime.swift /Users/admin/builder/spi-builder-workspace/Sources/System/Time/Time.swift /Users/admin/builder/spi-builder-workspace/Sources/System/Time/TimeComponents.swift /Users/admin/builder/spi-builder-workspace/Sources/System/Time/TimeInterval.swift /Users/admin/builder/spi-builder-workspace/Sources/System/Time/TimeIntervalMicroseconds.swift /Users/admin/builder/spi-builder-workspace/Sources/System/Time/TimeIntervalNanoseconds.swift /Users/admin/builder/spi-builder-workspace/Sources/System/UserID.swift /Users/admin/builder/spi-builder-workspace/Sources/System/Util.swift /Users/admin/builder/spi-builder-workspace/Sources/System/UtilConsumers.swift -supplementary-output-file-map /Users/admin/builder/spi-builder-workspace/.derivedData/Build/Intermediates.noindex/swift-system.build/Debug-watchos/SystemPackage.build/Objects-normal/arm64_32/supplementaryOutputs-1 -target arm64_32-apple-watchos5.0 -enable-objc-interop -sdk /Applications/Xcode-16.1.0.app/Contents/Developer/Platforms/WatchOS.platform/Developer/SDKs/WatchOS11.1.sdk -I /Users/admin/builder/spi-builder-workspace/.derivedData/Build/Products/Debug-watchos -I /Applications/Xcode-16.1.0.app/Contents/Developer/Platforms/WatchOS.platform/Developer/usr/lib -F /Users/admin/builder/spi-builder-workspace/.derivedData/Build/Products/Debug-watchos/PackageFrameworks -F /Users/admin/builder/spi-builder-workspace/.derivedData/Build/Products/Debug-watchos -F /Applications/Xcode-16.1.0.app/Contents/Developer/Platforms/WatchOS.platform/Developer/Library/Frameworks -F /Applications/Xcode-16.1.0.app/Contents/Developer/Platforms/WatchOS.platform/Developer/SDKs/WatchOS11.1.sdk/Developer/Library/Frameworks -no-color-diagnostics -enable-testing -g -debug-info-format\=dwarf -dwarf-version\=4 -module-cache-path /Users/admin/builder/spi-builder-workspace/.derivedData/ModuleCache.noindex -profile-generate -profile-coverage-mapping -swift-version 5 -enforce-exclusivity\=checked -stats-output-dir /Users/admin/builder/spi-builder-workspace/.swiftpm/xcode/.stats -Onone -D SWIFT_PACKAGE -D DEBUG -D SYSTEM_PACKAGE -D ENABLE_MOCKING -serialize-debugging-options -const-gather-protocols-file /Users/admin/builder/spi-builder-workspace/.derivedData/Build/Intermediates.noindex/swift-system.build/Debug-watchos/SystemPackage.build/Objects-normal/arm64_32/SystemPackage_const_extract_protocols.json -enable-experimental-feature DebugDescriptionMacro -enable-experimental-feature OpaqueTypeErasure -enable-upcoming-feature StrictConcurrency -enable-upcoming-feature DisableOutwardActorInference -enable-upcoming-feature GlobalActorIsolatedTypesUsability -enable-upcoming-feature InferSendableFromCaptures -strict-concurrency\=complete -empty-abi-descriptor -plugin-path /Applications/Xcode-16.1.0.app/Contents/Developer/Toolchains/XcodeDefault.xctoolchain/usr/lib/swift/host/plugins/testing -validate-clang-modules-once -clang-build-session-file /Users/admin/builder/spi-builder-workspace/.derivedData/ModuleCache.noindex/Session.modulevalidation -Xcc -working-directory -Xcc /Users/admin/builder/spi-builder-workspace/.swiftpm/xcode -resource-dir /Applications/Xcode-16.1.0.app/Contents/Developer/Toolchains/XcodeDefault.xctoolchain/usr/lib/swift -enable-anonymous-context-mangled-names -file-compilation-dir /Users/admin/builder/spi-builder-workspace/.swiftpm/xcode -Xcc -D_LIBCPP_HARDENING_MODE\=_LIBCPP_HARDENING_MODE_DEBUG -Xcc -ivfsstatcache -Xcc /Users/admin/builder/spi-builder-workspace/.derivedData/SDKStatCaches.noindex/watchos11.1-22R574-7b9df0bda16bb4641b33636c68f04660.sdkstatcache -Xcc -I/Users/admin/builder/spi-builder-workspace/.derivedData/Build/Intermediates.noindex/swift-system.build/Debug-watchos/SystemPackage.build/swift-overrides.hmap -Xcc -I/Users/admin/builder/spi-builder-workspace/Sources/CSystem/include -Xcc -I/Users/admin/builder/spi-builder-workspace/.derivedData/Build/Products/Debug-watchos/include -Xcc -I/Users/admin/builder/spi-builder-workspace/.derivedData/Build/Intermediates.noindex/swift-system.build/Debug-watchos/SystemPackage.build/DerivedSources-normal/arm64_32 -Xcc -I/Users/admin/builder/spi-builder-workspace/.derivedData/Build/Intermediates.noindex/swift-system.build/Debug-watchos/SystemPackage.build/DerivedSources/arm64_32 -Xcc -I/Users/admin/builder/spi-builder-workspace/.derivedData/Build/Intermediates.noindex/swift-system.build/Debug-watchos/SystemPackage.build/DerivedSources -Xcc -DSWIFT_PACKAGE -Xcc -DDEBUG\=1 -Xcc -D_CRT_SECURE_NO_WARNINGS -module-name SystemPackage -frontend-parseable-output -disable-clang-spi -target-sdk-version 11.1 -target-sdk-name watchos11.1 -external-plugin-path /Applications/Xcode-16.1.0.app/Contents/Developer/Platforms/WatchOS.platform/Developer/usr/lib/swift/host/plugins\#/Applications/Xcode-16.1.0.app/Contents/Developer/Platforms/WatchOS.platform/Developer/usr/bin/swift-plugin-server -external-plugin-path /Applications/Xcode-16.1.0.app/Contents/Developer/Platforms/WatchOS.platform/Developer/usr/local/lib/swift/host/plugins\#/Applications/Xcode-16.1.0.app/Contents/Developer/Platforms/WatchOS.platform/Developer/usr/bin/swift-plugin-server -plugin-path /Applications/Xcode-16.1.0.app/Contents/Developer/Toolchains/XcodeDefault.xctoolchain/usr/lib/swift/host/plugins -plugin-path /Applications/Xcode-16.1.0.app/Contents/Developer/Toolchains/XcodeDefault.xctoolchain/usr/local/lib/swift/host/plugins -o /Users/admin/builder/spi-builder-workspace/.derivedData/Build/Intermediates.noindex/swift-system.build/Debug-watchos/SystemPackage.build/Objects-normal/arm64_32/AsyncFileOperations.o -o /Users/admin/builder/spi-builder-workspace/.derivedData/Build/Intermediates.noindex/swift-system.build/Debug-watchos/SystemPackage.build/Objects-normal/arm64_32/Errno.o -o /Users/admin/builder/spi-builder-workspace/.derivedData/Build/Intermediates.noindex/swift-system.build/Debug-watchos/SystemPackage.build/Objects-normal/arm64_32/FileChange.o -o /Users/admin/builder/spi-builder-workspace/.derivedData/Build/Intermediates.noindex/swift-system.build/Debug-watchos/SystemPackage.build/Objects-normal/arm64_32/FileDescriptor.o -o /Users/admin/builder/spi-builder-workspace/.derivedData/Build/Intermediates.noindex/swift-system.build/Debug-watchos/SystemPackage.build/Objects-normal/arm64_32/FileDescriptorSet.o -o /Users/admin/builder/spi-builder-workspace/.derivedData/Build/Intermediates.noindex/swift-system.build/Debug-watchos/SystemPackage.build/Objects-normal/arm64_32/FileEvent.o -o /Users/admin/builder/spi-builder-workspace/.derivedData/Build/Intermediates.noindex/swift-system.build/Debug-watchos/SystemPackage.build/Objects-normal/arm64_32/FileHelpers.o -index-unit-output-path /swift-system.build/Debug-watchos/SystemPackage.build/Objects-normal/arm64_32/AsyncFileOperations.o -index-unit-output-path /swift-system.build/Debug-watchos/SystemPackage.build/Objects-normal/arm64_32/Errno.o -index-unit-output-path /swift-system.build/Debug-watchos/SystemPackage.build/Objects-normal/arm64_32/FileChange.o -index-unit-output-path /swift-system.build/Debug-watchos/SystemPackage.build/Objects-normal/arm64_32/FileDescriptor.o -index-unit-output-path /swift-system.build/Debug-watchos/SystemPackage.build/Objects-normal/arm64_32/FileDescriptorSet.o -index-unit-output-path /swift-system.build/Debug-watchos/SystemPackage.build/Objects-normal/arm64_32/FileEvent.o -index-unit-output-path /swift-system.build/Debug-watchos/SystemPackage.build/Objects-normal/arm64_32/FileHelpers.o -index-store-path /Users/admin/builder/spi-builder-workspace/.derivedData/Index.noindex/DataStore -index-system-modules
SwiftEmitModule normal armv7k Emitting\ module\ for\ SystemPackage (in target 'SystemPackage' from project 'swift-system')
cd /Users/admin/builder/spi-builder-workspace/.swiftpm/xcode
builtin-swiftTaskExecution -- /Applications/Xcode-16.1.0.app/Contents/Developer/Toolchains/XcodeDefault.xctoolchain/usr/bin/swift-frontend -frontend -emit-module -experimental-skip-non-inlinable-function-bodies-without-types /Users/admin/builder/spi-builder-workspace/Sources/System/AsyncFileOperations.swift /Users/admin/builder/spi-builder-workspace/Sources/System/Errno.swift /Users/admin/builder/spi-builder-workspace/Sources/System/FileChange.swift /Users/admin/builder/spi-builder-workspace/Sources/System/FileDescriptor.swift /Users/admin/builder/spi-builder-workspace/Sources/System/FileDescriptorSet.swift /Users/admin/builder/spi-builder-workspace/Sources/System/FileEvent.swift /Users/admin/builder/spi-builder-workspace/Sources/System/FileHelpers.swift /Users/admin/builder/spi-builder-workspace/Sources/System/FileOperations.swift /Users/admin/builder/spi-builder-workspace/Sources/System/FilePath/FilePath.swift /Users/admin/builder/spi-builder-workspace/Sources/System/FilePath/FilePathComponentView.swift /Users/admin/builder/spi-builder-workspace/Sources/System/FilePath/FilePathComponents.swift /Users/admin/builder/spi-builder-workspace/Sources/System/FilePath/FilePathParsing.swift /Users/admin/builder/spi-builder-workspace/Sources/System/FilePath/FilePathString.swift /Users/admin/builder/spi-builder-workspace/Sources/System/FilePath/FilePathSyntax.swift /Users/admin/builder/spi-builder-workspace/Sources/System/FilePath/FilePathWindows.swift /Users/admin/builder/spi-builder-workspace/Sources/System/FilePermissions.swift /Users/admin/builder/spi-builder-workspace/Sources/System/InputOutput/IOControl.swift /Users/admin/builder/spi-builder-workspace/Sources/System/InputOutput/IODirection.swift /Users/admin/builder/spi-builder-workspace/Sources/System/InputOutput/IOOperations.swift /Users/admin/builder/spi-builder-workspace/Sources/System/InputOutput/IOType.swift /Users/admin/builder/spi-builder-workspace/Sources/System/InputOutput/TerminalIO.swift /Users/admin/builder/spi-builder-workspace/Sources/System/Internals/CInternetAddress.swift /Users/admin/builder/spi-builder-workspace/Sources/System/Internals/CInterop.swift /Users/admin/builder/spi-builder-workspace/Sources/System/Internals/CSocketAddress.swift /Users/admin/builder/spi-builder-workspace/Sources/System/Internals/Compatibility.swift /Users/admin/builder/spi-builder-workspace/Sources/System/Internals/Constants.swift /Users/admin/builder/spi-builder-workspace/Sources/System/Internals/Exports.swift /Users/admin/builder/spi-builder-workspace/Sources/System/Internals/IOCTL.swift /Users/admin/builder/spi-builder-workspace/Sources/System/Internals/Mocking.swift /Users/admin/builder/spi-builder-workspace/Sources/System/Internals/NetworkOrder.swift /Users/admin/builder/spi-builder-workspace/Sources/System/Internals/Syscalls.swift /Users/admin/builder/spi-builder-workspace/Sources/System/Internals/WindowsSyscallAdapters.swift /Users/admin/builder/spi-builder-workspace/Sources/System/InternetProtocol.swift /Users/admin/builder/spi-builder-workspace/Sources/System/PlatformString.swift /Users/admin/builder/spi-builder-workspace/Sources/System/ProcessID.swift /Users/admin/builder/spi-builder-workspace/Sources/System/Signal/Signal.swift /Users/admin/builder/spi-builder-workspace/Sources/System/Signal/SignalAction.swift /Users/admin/builder/spi-builder-workspace/Sources/System/Signal/SignalHandler.swift /Users/admin/builder/spi-builder-workspace/Sources/System/Signal/SignalInformation.swift /Users/admin/builder/spi-builder-workspace/Sources/System/Signal/SignalSet.swift /Users/admin/builder/spi-builder-workspace/Sources/System/Socket/AsyncSocketOperations.swift /Users/admin/builder/spi-builder-workspace/Sources/System/Socket/MessageFlags.swift /Users/admin/builder/spi-builder-workspace/Sources/System/Socket/Poll.swift /Users/admin/builder/spi-builder-workspace/Sources/System/Socket/SocketAddress.swift /Users/admin/builder/spi-builder-workspace/Sources/System/Socket/SocketAddressFamily.swift /Users/admin/builder/spi-builder-workspace/Sources/System/Socket/SocketFlags.swift /Users/admin/builder/spi-builder-workspace/Sources/System/Socket/SocketOperations.swift /Users/admin/builder/spi-builder-workspace/Sources/System/Socket/SocketOption.swift /Users/admin/builder/spi-builder-workspace/Sources/System/Socket/SocketOptionID.swift /Users/admin/builder/spi-builder-workspace/Sources/System/Socket/SocketOptionLevel.swift /Users/admin/builder/spi-builder-workspace/Sources/System/Socket/SocketProtocol.swift /Users/admin/builder/spi-builder-workspace/Sources/System/Socket/SocketType.swift /Users/admin/builder/spi-builder-workspace/Sources/System/SystemInfo.swift /Users/admin/builder/spi-builder-workspace/Sources/System/SystemString.swift /Users/admin/builder/spi-builder-workspace/Sources/System/Time/Clock.swift /Users/admin/builder/spi-builder-workspace/Sources/System/Time/Microseconds.swift /Users/admin/builder/spi-builder-workspace/Sources/System/Time/Nanoseconds.swift /Users/admin/builder/spi-builder-workspace/Sources/System/Time/ProcessorTime.swift /Users/admin/builder/spi-builder-workspace/Sources/System/Time/Time.swift /Users/admin/builder/spi-builder-workspace/Sources/System/Time/TimeComponents.swift /Users/admin/builder/spi-builder-workspace/Sources/System/Time/TimeInterval.swift /Users/admin/builder/spi-builder-workspace/Sources/System/Time/TimeIntervalMicroseconds.swift /Users/admin/builder/spi-builder-workspace/Sources/System/Time/TimeIntervalNanoseconds.swift /Users/admin/builder/spi-builder-workspace/Sources/System/UserID.swift /Users/admin/builder/spi-builder-workspace/Sources/System/Util.swift /Users/admin/builder/spi-builder-workspace/Sources/System/UtilConsumers.swift -target armv7k-apple-watchos5.0 -enable-objc-interop -sdk /Applications/Xcode-16.1.0.app/Contents/Developer/Platforms/WatchOS.platform/Developer/SDKs/WatchOS11.1.sdk -I /Users/admin/builder/spi-builder-workspace/.derivedData/Build/Products/Debug-watchos -I /Applications/Xcode-16.1.0.app/Contents/Developer/Platforms/WatchOS.platform/Developer/usr/lib -F /Users/admin/builder/spi-builder-workspace/.derivedData/Build/Products/Debug-watchos/PackageFrameworks -F /Users/admin/builder/spi-builder-workspace/.derivedData/Build/Products/Debug-watchos -F /Applications/Xcode-16.1.0.app/Contents/Developer/Platforms/WatchOS.platform/Developer/Library/Frameworks -F /Applications/Xcode-16.1.0.app/Contents/Developer/Platforms/WatchOS.platform/Developer/SDKs/WatchOS11.1.sdk/Developer/Library/Frameworks -no-color-diagnostics -enable-testing -g -debug-info-format\=dwarf -dwarf-version\=4 -module-cache-path /Users/admin/builder/spi-builder-workspace/.derivedData/ModuleCache.noindex -profile-generate -profile-coverage-mapping -swift-version 5 -enforce-exclusivity\=checked -stats-output-dir /Users/admin/builder/spi-builder-workspace/.swiftpm/xcode/.stats -Onone -D SWIFT_PACKAGE -D DEBUG -D SYSTEM_PACKAGE -D ENABLE_MOCKING -serialize-debugging-options -const-gather-protocols-file /Users/admin/builder/spi-builder-workspace/.derivedData/Build/Intermediates.noindex/swift-system.build/Debug-watchos/SystemPackage.build/Objects-normal/armv7k/SystemPackage_const_extract_protocols.json -enable-experimental-feature DebugDescriptionMacro -enable-experimental-feature OpaqueTypeErasure -enable-upcoming-feature StrictConcurrency -enable-upcoming-feature DisableOutwardActorInference -enable-upcoming-feature GlobalActorIsolatedTypesUsability -enable-upcoming-feature InferSendableFromCaptures -strict-concurrency\=complete -empty-abi-descriptor -plugin-path /Applications/Xcode-16.1.0.app/Contents/Developer/Toolchains/XcodeDefault.xctoolchain/usr/lib/swift/host/plugins/testing -validate-clang-modules-once -clang-build-session-file /Users/admin/builder/spi-builder-workspace/.derivedData/ModuleCache.noindex/Session.modulevalidation -Xcc -working-directory -Xcc /Users/admin/builder/spi-builder-workspace/.swiftpm/xcode -resource-dir /Applications/Xcode-16.1.0.app/Contents/Developer/Toolchains/XcodeDefault.xctoolchain/usr/lib/swift -enable-anonymous-context-mangled-names -file-compilation-dir /Users/admin/builder/spi-builder-workspace/.swiftpm/xcode -Xcc -D_LIBCPP_HARDENING_MODE\=_LIBCPP_HARDENING_MODE_DEBUG -Xcc -ivfsstatcache -Xcc /Users/admin/builder/spi-builder-workspace/.derivedData/SDKStatCaches.noindex/watchos11.1-22R574-7b9df0bda16bb4641b33636c68f04660.sdkstatcache -Xcc -I/Users/admin/builder/spi-builder-workspace/.derivedData/Build/Intermediates.noindex/swift-system.build/Debug-watchos/SystemPackage.build/swift-overrides.hmap -Xcc -I/Users/admin/builder/spi-builder-workspace/Sources/CSystem/include -Xcc -I/Users/admin/builder/spi-builder-workspace/.derivedData/Build/Products/Debug-watchos/include -Xcc -I/Users/admin/builder/spi-builder-workspace/.derivedData/Build/Intermediates.noindex/swift-system.build/Debug-watchos/SystemPackage.build/DerivedSources-normal/armv7k -Xcc -I/Users/admin/builder/spi-builder-workspace/.derivedData/Build/Intermediates.noindex/swift-system.build/Debug-watchos/SystemPackage.build/DerivedSources/armv7k -Xcc -I/Users/admin/builder/spi-builder-workspace/.derivedData/Build/Intermediates.noindex/swift-system.build/Debug-watchos/SystemPackage.build/DerivedSources -Xcc -DSWIFT_PACKAGE -Xcc -DDEBUG\=1 -Xcc -D_CRT_SECURE_NO_WARNINGS -module-name SystemPackage -frontend-parseable-output -disable-clang-spi -target-sdk-version 11.1 -target-sdk-name watchos11.1 -external-plugin-path /Applications/Xcode-16.1.0.app/Contents/Developer/Platforms/WatchOS.platform/Developer/usr/lib/swift/host/plugins\#/Applications/Xcode-16.1.0.app/Contents/Developer/Platforms/WatchOS.platform/Developer/usr/bin/swift-plugin-server -external-plugin-path /Applications/Xcode-16.1.0.app/Contents/Developer/Platforms/WatchOS.platform/Developer/usr/local/lib/swift/host/plugins\#/Applications/Xcode-16.1.0.app/Contents/Developer/Platforms/WatchOS.platform/Developer/usr/bin/swift-plugin-server -plugin-path /Applications/Xcode-16.1.0.app/Contents/Developer/Toolchains/XcodeDefault.xctoolchain/usr/lib/swift/host/plugins -plugin-path /Applications/Xcode-16.1.0.app/Contents/Developer/Toolchains/XcodeDefault.xctoolchain/usr/local/lib/swift/host/plugins -emit-module-doc-path /Users/admin/builder/spi-builder-workspace/.derivedData/Build/Intermediates.noindex/swift-system.build/Debug-watchos/SystemPackage.build/Objects-normal/armv7k/SystemPackage.swiftdoc -emit-module-source-info-path /Users/admin/builder/spi-builder-workspace/.derivedData/Build/Intermediates.noindex/swift-system.build/Debug-watchos/SystemPackage.build/Objects-normal/armv7k/SystemPackage.swiftsourceinfo -emit-objc-header-path /Users/admin/builder/spi-builder-workspace/.derivedData/Build/Intermediates.noindex/swift-system.build/Debug-watchos/SystemPackage.build/Objects-normal/armv7k/SystemPackage-Swift.h -serialize-diagnostics-path /Users/admin/builder/spi-builder-workspace/.derivedData/Build/Intermediates.noindex/swift-system.build/Debug-watchos/SystemPackage.build/Objects-normal/armv7k/SystemPackage-master-emit-module.dia -emit-dependencies-path /Users/admin/builder/spi-builder-workspace/.derivedData/Build/Intermediates.noindex/swift-system.build/Debug-watchos/SystemPackage.build/Objects-normal/armv7k/SystemPackage-master-emit-module.d -o /Users/admin/builder/spi-builder-workspace/.derivedData/Build/Intermediates.noindex/swift-system.build/Debug-watchos/SystemPackage.build/Objects-normal/armv7k/SystemPackage.swiftmodule -emit-abi-descriptor-path /Users/admin/builder/spi-builder-workspace/.derivedData/Build/Intermediates.noindex/swift-system.build/Debug-watchos/SystemPackage.build/Objects-normal/armv7k/SystemPackage.abi.json
EmitSwiftModule normal armv7k (in target 'SystemPackage' from project 'swift-system')
cd /Users/admin/builder/spi-builder-workspace/.swiftpm/xcode
/Applications/Xcode-16.1.0.app/Contents/Developer/Toolchains/XcodeDefault.xctoolchain/usr/bin/swift-frontend -emit-module -experimental-skip-non-inlinable-function-bodies-without-types /Users/admin/builder/spi-builder-workspace/Sources/System/AsyncFileOperations.swift /Users/admin/builder/spi-builder-workspace/Sources/System/Errno.swift /Users/admin/builder/spi-builder-workspace/Sources/System/FileChange.swift /Users/admin/builder/spi-builder-workspace/Sources/System/FileDescriptor.swift /Users/admin/builder/spi-builder-workspace/Sources/System/FileDescriptorSet.swift /Users/admin/builder/spi-builder-workspace/Sources/System/FileEvent.swift /Users/admin/builder/spi-builder-workspace/Sources/System/FileHelpers.swift /Users/admin/builder/spi-builder-workspace/Sources/System/FileOperations.swift /Users/admin/builder/spi-builder-workspace/Sources/System/FilePath/FilePath.swift /Users/admin/builder/spi-builder-workspace/Sources/System/FilePath/FilePathComponentView.swift /Users/admin/builder/spi-builder-workspace/Sources/System/FilePath/FilePathComponents.swift /Users/admin/builder/spi-builder-workspace/Sources/System/FilePath/FilePathParsing.swift /Users/admin/builder/spi-builder-workspace/Sources/System/FilePath/FilePathString.swift /Users/admin/builder/spi-builder-workspace/Sources/System/FilePath/FilePathSyntax.swift /Users/admin/builder/spi-builder-workspace/Sources/System/FilePath/FilePathWindows.swift /Users/admin/builder/spi-builder-workspace/Sources/System/FilePermissions.swift /Users/admin/builder/spi-builder-workspace/Sources/System/InputOutput/IOControl.swift /Users/admin/builder/spi-builder-workspace/Sources/System/InputOutput/IODirection.swift /Users/admin/builder/spi-builder-workspace/Sources/System/InputOutput/IOOperations.swift /Users/admin/builder/spi-builder-workspace/Sources/System/InputOutput/IOType.swift /Users/admin/builder/spi-builder-workspace/Sources/System/InputOutput/TerminalIO.swift /Users/admin/builder/spi-builder-workspace/Sources/System/Internals/CInternetAddress.swift /Users/admin/builder/spi-builder-workspace/Sources/System/Internals/CInterop.swift /Users/admin/builder/spi-builder-workspace/Sources/System/Internals/CSocketAddress.swift /Users/admin/builder/spi-builder-workspace/Sources/System/Internals/Compatibility.swift /Users/admin/builder/spi-builder-workspace/Sources/System/Internals/Constants.swift /Users/admin/builder/spi-builder-workspace/Sources/System/Internals/Exports.swift /Users/admin/builder/spi-builder-workspace/Sources/System/Internals/IOCTL.swift /Users/admin/builder/spi-builder-workspace/Sources/System/Internals/Mocking.swift /Users/admin/builder/spi-builder-workspace/Sources/System/Internals/NetworkOrder.swift /Users/admin/builder/spi-builder-workspace/Sources/System/Internals/Syscalls.swift /Users/admin/builder/spi-builder-workspace/Sources/System/Internals/WindowsSyscallAdapters.swift /Users/admin/builder/spi-builder-workspace/Sources/System/InternetProtocol.swift /Users/admin/builder/spi-builder-workspace/Sources/System/PlatformString.swift /Users/admin/builder/spi-builder-workspace/Sources/System/ProcessID.swift /Users/admin/builder/spi-builder-workspace/Sources/System/Signal/Signal.swift /Users/admin/builder/spi-builder-workspace/Sources/System/Signal/SignalAction.swift /Users/admin/builder/spi-builder-workspace/Sources/System/Signal/SignalHandler.swift /Users/admin/builder/spi-builder-workspace/Sources/System/Signal/SignalInformation.swift /Users/admin/builder/spi-builder-workspace/Sources/System/Signal/SignalSet.swift /Users/admin/builder/spi-builder-workspace/Sources/System/Socket/AsyncSocketOperations.swift /Users/admin/builder/spi-builder-workspace/Sources/System/Socket/MessageFlags.swift /Users/admin/builder/spi-builder-workspace/Sources/System/Socket/Poll.swift /Users/admin/builder/spi-builder-workspace/Sources/System/Socket/SocketAddress.swift /Users/admin/builder/spi-builder-workspace/Sources/System/Socket/SocketAddressFamily.swift /Users/admin/builder/spi-builder-workspace/Sources/System/Socket/SocketFlags.swift /Users/admin/builder/spi-builder-workspace/Sources/System/Socket/SocketOperations.swift /Users/admin/builder/spi-builder-workspace/Sources/System/Socket/SocketOption.swift /Users/admin/builder/spi-builder-workspace/Sources/System/Socket/SocketOptionID.swift /Users/admin/builder/spi-builder-workspace/Sources/System/Socket/SocketOptionLevel.swift /Users/admin/builder/spi-builder-workspace/Sources/System/Socket/SocketProtocol.swift /Users/admin/builder/spi-builder-workspace/Sources/System/Socket/SocketType.swift /Users/admin/builder/spi-builder-workspace/Sources/System/SystemInfo.swift /Users/admin/builder/spi-builder-workspace/Sources/System/SystemString.swift /Users/admin/builder/spi-builder-workspace/Sources/System/Time/Clock.swift /Users/admin/builder/spi-builder-workspace/Sources/System/Time/Microseconds.swift /Users/admin/builder/spi-builder-workspace/Sources/System/Time/Nanoseconds.swift /Users/admin/builder/spi-builder-workspace/Sources/System/Time/ProcessorTime.swift /Users/admin/builder/spi-builder-workspace/Sources/System/Time/Time.swift /Users/admin/builder/spi-builder-workspace/Sources/System/Time/TimeComponents.swift /Users/admin/builder/spi-builder-workspace/Sources/System/Time/TimeInterval.swift /Users/admin/builder/spi-builder-workspace/Sources/System/Time/TimeIntervalMicroseconds.swift /Users/admin/builder/spi-builder-workspace/Sources/System/Time/TimeIntervalNanoseconds.swift /Users/admin/builder/spi-builder-workspace/Sources/System/UserID.swift /Users/admin/builder/spi-builder-workspace/Sources/System/Util.swift /Users/admin/builder/spi-builder-workspace/Sources/System/UtilConsumers.swift -target armv7k-apple-watchos5.0 -enable-objc-interop -sdk /Applications/Xcode-16.1.0.app/Contents/Developer/Platforms/WatchOS.platform/Developer/SDKs/WatchOS11.1.sdk -I /Users/admin/builder/spi-builder-workspace/.derivedData/Build/Products/Debug-watchos -I /Applications/Xcode-16.1.0.app/Contents/Developer/Platforms/WatchOS.platform/Developer/usr/lib -F /Users/admin/builder/spi-builder-workspace/.derivedData/Build/Products/Debug-watchos/PackageFrameworks -F /Users/admin/builder/spi-builder-workspace/.derivedData/Build/Products/Debug-watchos -F /Applications/Xcode-16.1.0.app/Contents/Developer/Platforms/WatchOS.platform/Developer/Library/Frameworks -F /Applications/Xcode-16.1.0.app/Contents/Developer/Platforms/WatchOS.platform/Developer/SDKs/WatchOS11.1.sdk/Developer/Library/Frameworks -no-color-diagnostics -enable-testing -g -debug-info-format\=dwarf -dwarf-version\=4 -module-cache-path /Users/admin/builder/spi-builder-workspace/.derivedData/ModuleCache.noindex -profile-generate -profile-coverage-mapping -swift-version 5 -enforce-exclusivity\=checked -stats-output-dir /Users/admin/builder/spi-builder-workspace/.swiftpm/xcode/.stats -Onone -D SWIFT_PACKAGE -D DEBUG -D SYSTEM_PACKAGE -D ENABLE_MOCKING -serialize-debugging-options -const-gather-protocols-file /Users/admin/builder/spi-builder-workspace/.derivedData/Build/Intermediates.noindex/swift-system.build/Debug-watchos/SystemPackage.build/Objects-normal/armv7k/SystemPackage_const_extract_protocols.json -enable-experimental-feature DebugDescriptionMacro -enable-experimental-feature OpaqueTypeErasure -enable-upcoming-feature StrictConcurrency -enable-upcoming-feature DisableOutwardActorInference -enable-upcoming-feature GlobalActorIsolatedTypesUsability -enable-upcoming-feature InferSendableFromCaptures -strict-concurrency\=complete -empty-abi-descriptor -plugin-path /Applications/Xcode-16.1.0.app/Contents/Developer/Toolchains/XcodeDefault.xctoolchain/usr/lib/swift/host/plugins/testing -validate-clang-modules-once -clang-build-session-file /Users/admin/builder/spi-builder-workspace/.derivedData/ModuleCache.noindex/Session.modulevalidation -Xcc -working-directory -Xcc /Users/admin/builder/spi-builder-workspace/.swiftpm/xcode -resource-dir /Applications/Xcode-16.1.0.app/Contents/Developer/Toolchains/XcodeDefault.xctoolchain/usr/lib/swift -enable-anonymous-context-mangled-names -file-compilation-dir /Users/admin/builder/spi-builder-workspace/.swiftpm/xcode -Xcc -D_LIBCPP_HARDENING_MODE\=_LIBCPP_HARDENING_MODE_DEBUG -Xcc -ivfsstatcache -Xcc /Users/admin/builder/spi-builder-workspace/.derivedData/SDKStatCaches.noindex/watchos11.1-22R574-7b9df0bda16bb4641b33636c68f04660.sdkstatcache -Xcc -I/Users/admin/builder/spi-builder-workspace/.derivedData/Build/Intermediates.noindex/swift-system.build/Debug-watchos/SystemPackage.build/swift-overrides.hmap -Xcc -I/Users/admin/builder/spi-builder-workspace/Sources/CSystem/include -Xcc -I/Users/admin/builder/spi-builder-workspace/.derivedData/Build/Products/Debug-watchos/include -Xcc -I/Users/admin/builder/spi-builder-workspace/.derivedData/Build/Intermediates.noindex/swift-system.build/Debug-watchos/SystemPackage.build/DerivedSources-normal/armv7k -Xcc -I/Users/admin/builder/spi-builder-workspace/.derivedData/Build/Intermediates.noindex/swift-system.build/Debug-watchos/SystemPackage.build/DerivedSources/armv7k -Xcc -I/Users/admin/builder/spi-builder-workspace/.derivedData/Build/Intermediates.noindex/swift-system.build/Debug-watchos/SystemPackage.build/DerivedSources -Xcc -DSWIFT_PACKAGE -Xcc -DDEBUG\=1 -Xcc -D_CRT_SECURE_NO_WARNINGS -module-name SystemPackage -frontend-parseable-output -disable-clang-spi -target-sdk-version 11.1 -target-sdk-name watchos11.1 -external-plugin-path /Applications/Xcode-16.1.0.app/Contents/Developer/Platforms/WatchOS.platform/Developer/usr/lib/swift/host/plugins\#/Applications/Xcode-16.1.0.app/Contents/Developer/Platforms/WatchOS.platform/Developer/usr/bin/swift-plugin-server -external-plugin-path /Applications/Xcode-16.1.0.app/Contents/Developer/Platforms/WatchOS.platform/Developer/usr/local/lib/swift/host/plugins\#/Applications/Xcode-16.1.0.app/Contents/Developer/Platforms/WatchOS.platform/Developer/usr/bin/swift-plugin-server -plugin-path /Applications/Xcode-16.1.0.app/Contents/Developer/Toolchains/XcodeDefault.xctoolchain/usr/lib/swift/host/plugins -plugin-path /Applications/Xcode-16.1.0.app/Contents/Developer/Toolchains/XcodeDefault.xctoolchain/usr/local/lib/swift/host/plugins -emit-module-doc-path /Users/admin/builder/spi-builder-workspace/.derivedData/Build/Intermediates.noindex/swift-system.build/Debug-watchos/SystemPackage.build/Objects-normal/armv7k/SystemPackage.swiftdoc -emit-module-source-info-path /Users/admin/builder/spi-builder-workspace/.derivedData/Build/Intermediates.noindex/swift-system.build/Debug-watchos/SystemPackage.build/Objects-normal/armv7k/SystemPackage.swiftsourceinfo -emit-objc-header-path /Users/admin/builder/spi-builder-workspace/.derivedData/Build/Intermediates.noindex/swift-system.build/Debug-watchos/SystemPackage.build/Objects-normal/armv7k/SystemPackage-Swift.h -serialize-diagnostics-path /Users/admin/builder/spi-builder-workspace/.derivedData/Build/Intermediates.noindex/swift-system.build/Debug-watchos/SystemPackage.build/Objects-normal/armv7k/SystemPackage-master-emit-module.dia -emit-dependencies-path /Users/admin/builder/spi-builder-workspace/.derivedData/Build/Intermediates.noindex/swift-system.build/Debug-watchos/SystemPackage.build/Objects-normal/armv7k/SystemPackage-master-emit-module.d -o /Users/admin/builder/spi-builder-workspace/.derivedData/Build/Intermediates.noindex/swift-system.build/Debug-watchos/SystemPackage.build/Objects-normal/armv7k/SystemPackage.swiftmodule -emit-abi-descriptor-path /Users/admin/builder/spi-builder-workspace/.derivedData/Build/Intermediates.noindex/swift-system.build/Debug-watchos/SystemPackage.build/Objects-normal/armv7k/SystemPackage.abi.json
/Users/admin/builder/spi-builder-workspace/Sources/System/FileDescriptorSet.swift:26:32: warning: initializer 'init()' cannot be used in an '@_alwaysEmitIntoClient' function because '_sys_select' was not imported by this file; this is an error in the Swift 6 language mode
self.init(CInterop.FileDescriptorSet())
^
/Users/admin/builder/spi-builder-workspace/Sources/System/FileDescriptorSet.swift:26:32: note: The missing import of module '_sys_select' will be added implicitly
self.init(CInterop.FileDescriptorSet())
^
/Users/admin/builder/spi-builder-workspace/Sources/System/Internals/CInterop.swift:127:38: error: cannot find type 'proc_taskinfo' in scope
public typealias ProcessTaskInfo = proc_taskinfo
^~~~~~~~~~~~~
/Users/admin/builder/spi-builder-workspace/Sources/System/Signal/SignalAction.swift:32:32: warning: initializer 'init(__sigaction_u:sa_mask:sa_flags:)' cannot be used in an '@_alwaysEmitIntoClient' function because '_signal' was not imported by this file; this is an error in the Swift 6 language mode
self.init(CInterop.SignalAction(
^
/Users/admin/builder/spi-builder-workspace/Sources/System/Signal/SignalAction.swift:32:32: note: The missing import of module '_signal' will be added implicitly
self.init(CInterop.SignalAction(
^
/Users/admin/builder/spi-builder-workspace/Sources/System/Signal/SignalAction.swift:33:33: warning: initializer 'init(__sa_handler:)' cannot be used in an '@_alwaysEmitIntoClient' function because '_signal' was not imported by this file; this is an error in the Swift 6 language mode
__sigaction_u: .init(__sa_handler: handler.rawValue),
^
/Users/admin/builder/spi-builder-workspace/Sources/System/Signal/SignalAction.swift:33:33: note: The missing import of module '_signal' will be added implicitly
__sigaction_u: .init(__sa_handler: handler.rawValue),
^
/Users/admin/builder/spi-builder-workspace/Sources/System/Signal/SignalAction.swift:56:32: warning: initializer 'init(__sigaction_u:sa_mask:sa_flags:)' cannot be used in an '@_alwaysEmitIntoClient' function because '_signal' was not imported by this file; this is an error in the Swift 6 language mode
self.init(CInterop.SignalAction(
^
/Users/admin/builder/spi-builder-workspace/Sources/System/Signal/SignalAction.swift:56:32: note: The missing import of module '_signal' will be added implicitly
self.init(CInterop.SignalAction(
^
/Users/admin/builder/spi-builder-workspace/Sources/System/Signal/SignalAction.swift:57:33: warning: initializer 'init(__sa_sigaction:)' cannot be used in an '@_alwaysEmitIntoClient' function because '_signal' was not imported by this file; this is an error in the Swift 6 language mode
__sigaction_u: .init(__sa_sigaction: body),
^
/Users/admin/builder/spi-builder-workspace/Sources/System/Signal/SignalAction.swift:57:33: note: The missing import of module '_signal' will be added implicitly
__sigaction_u: .init(__sa_sigaction: body),
^
/Users/admin/builder/spi-builder-workspace/Sources/System/Signal/SignalAction.swift:73:32: warning: initializer 'init()' cannot be used in an '@_alwaysEmitIntoClient' function because '_signal' was not imported by this file; this is an error in the Swift 6 language mode
self.init(CInterop.SignalAction())
^
/Users/admin/builder/spi-builder-workspace/Sources/System/Signal/SignalAction.swift:73:32: note: The missing import of module '_signal' will be added implicitly
self.init(CInterop.SignalAction())
^
/Users/admin/builder/spi-builder-workspace/Sources/System/Signal/SignalAction.swift:82:38: warning: property 'sa_flags' cannot be used in an '@_alwaysEmitIntoClient' function because '_signal' was not imported by this file; this is an error in the Swift 6 language mode
return .init(rawValue: bytes.sa_flags)
^
/Users/admin/builder/spi-builder-workspace/Sources/System/Signal/SignalAction.swift:82:38: note: The missing import of module '_signal' will be added implicitly
return .init(rawValue: bytes.sa_flags)
^
/Users/admin/builder/spi-builder-workspace/Sources/System/Signal/SignalAction.swift:87:33: warning: property 'sa_mask' cannot be used in an '@_alwaysEmitIntoClient' function because '_signal' was not imported by this file; this is an error in the Swift 6 language mode
return Signal.Set(bytes.sa_mask)
^
/Users/admin/builder/spi-builder-workspace/Sources/System/Signal/SignalAction.swift:87:33: note: The missing import of module '_signal' will be added implicitly
return Signal.Set(bytes.sa_mask)
^
/Users/admin/builder/spi-builder-workspace/Sources/System/Time/Clock.swift:16:50: warning: cannot use type alias 'RawValue' here; '_time' was not imported by this file
public typealias RawValue = CInterop.ClockID.RawValue
^
_time.clockid_t:5:22: note: type declared here
public typealias RawValue = UInt32
^
SwiftEmitModule normal arm64 Emitting\ module\ for\ SystemPackage (in target 'SystemPackage' from project 'swift-system')
cd /Users/admin/builder/spi-builder-workspace/.swiftpm/xcode
builtin-swiftTaskExecution -- /Applications/Xcode-16.1.0.app/Contents/Developer/Toolchains/XcodeDefault.xctoolchain/usr/bin/swift-frontend -frontend -emit-module -experimental-skip-non-inlinable-function-bodies-without-types /Users/admin/builder/spi-builder-workspace/Sources/System/AsyncFileOperations.swift /Users/admin/builder/spi-builder-workspace/Sources/System/Errno.swift /Users/admin/builder/spi-builder-workspace/Sources/System/FileChange.swift /Users/admin/builder/spi-builder-workspace/Sources/System/FileDescriptor.swift /Users/admin/builder/spi-builder-workspace/Sources/System/FileDescriptorSet.swift /Users/admin/builder/spi-builder-workspace/Sources/System/FileEvent.swift /Users/admin/builder/spi-builder-workspace/Sources/System/FileHelpers.swift /Users/admin/builder/spi-builder-workspace/Sources/System/FileOperations.swift /Users/admin/builder/spi-builder-workspace/Sources/System/FilePath/FilePath.swift /Users/admin/builder/spi-builder-workspace/Sources/System/FilePath/FilePathComponentView.swift /Users/admin/builder/spi-builder-workspace/Sources/System/FilePath/FilePathComponents.swift /Users/admin/builder/spi-builder-workspace/Sources/System/FilePath/FilePathParsing.swift /Users/admin/builder/spi-builder-workspace/Sources/System/FilePath/FilePathString.swift /Users/admin/builder/spi-builder-workspace/Sources/System/FilePath/FilePathSyntax.swift /Users/admin/builder/spi-builder-workspace/Sources/System/FilePath/FilePathWindows.swift /Users/admin/builder/spi-builder-workspace/Sources/System/FilePermissions.swift /Users/admin/builder/spi-builder-workspace/Sources/System/InputOutput/IOControl.swift /Users/admin/builder/spi-builder-workspace/Sources/System/InputOutput/IODirection.swift /Users/admin/builder/spi-builder-workspace/Sources/System/InputOutput/IOOperations.swift /Users/admin/builder/spi-builder-workspace/Sources/System/InputOutput/IOType.swift /Users/admin/builder/spi-builder-workspace/Sources/System/InputOutput/TerminalIO.swift /Users/admin/builder/spi-builder-workspace/Sources/System/Internals/CInternetAddress.swift /Users/admin/builder/spi-builder-workspace/Sources/System/Internals/CInterop.swift /Users/admin/builder/spi-builder-workspace/Sources/System/Internals/CSocketAddress.swift /Users/admin/builder/spi-builder-workspace/Sources/System/Internals/Compatibility.swift /Users/admin/builder/spi-builder-workspace/Sources/System/Internals/Constants.swift /Users/admin/builder/spi-builder-workspace/Sources/System/Internals/Exports.swift /Users/admin/builder/spi-builder-workspace/Sources/System/Internals/IOCTL.swift /Users/admin/builder/spi-builder-workspace/Sources/System/Internals/Mocking.swift /Users/admin/builder/spi-builder-workspace/Sources/System/Internals/NetworkOrder.swift /Users/admin/builder/spi-builder-workspace/Sources/System/Internals/Syscalls.swift /Users/admin/builder/spi-builder-workspace/Sources/System/Internals/WindowsSyscallAdapters.swift /Users/admin/builder/spi-builder-workspace/Sources/System/InternetProtocol.swift /Users/admin/builder/spi-builder-workspace/Sources/System/PlatformString.swift /Users/admin/builder/spi-builder-workspace/Sources/System/ProcessID.swift /Users/admin/builder/spi-builder-workspace/Sources/System/Signal/Signal.swift /Users/admin/builder/spi-builder-workspace/Sources/System/Signal/SignalAction.swift /Users/admin/builder/spi-builder-workspace/Sources/System/Signal/SignalHandler.swift /Users/admin/builder/spi-builder-workspace/Sources/System/Signal/SignalInformation.swift /Users/admin/builder/spi-builder-workspace/Sources/System/Signal/SignalSet.swift /Users/admin/builder/spi-builder-workspace/Sources/System/Socket/AsyncSocketOperations.swift /Users/admin/builder/spi-builder-workspace/Sources/System/Socket/MessageFlags.swift /Users/admin/builder/spi-builder-workspace/Sources/System/Socket/Poll.swift /Users/admin/builder/spi-builder-workspace/Sources/System/Socket/SocketAddress.swift /Users/admin/builder/spi-builder-workspace/Sources/System/Socket/SocketAddressFamily.swift /Users/admin/builder/spi-builder-workspace/Sources/System/Socket/SocketFlags.swift /Users/admin/builder/spi-builder-workspace/Sources/System/Socket/SocketOperations.swift /Users/admin/builder/spi-builder-workspace/Sources/System/Socket/SocketOption.swift /Users/admin/builder/spi-builder-workspace/Sources/System/Socket/SocketOptionID.swift /Users/admin/builder/spi-builder-workspace/Sources/System/Socket/SocketOptionLevel.swift /Users/admin/builder/spi-builder-workspace/Sources/System/Socket/SocketProtocol.swift /Users/admin/builder/spi-builder-workspace/Sources/System/Socket/SocketType.swift /Users/admin/builder/spi-builder-workspace/Sources/System/SystemInfo.swift /Users/admin/builder/spi-builder-workspace/Sources/System/SystemString.swift /Users/admin/builder/spi-builder-workspace/Sources/System/Time/Clock.swift /Users/admin/builder/spi-builder-workspace/Sources/System/Time/Microseconds.swift /Users/admin/builder/spi-builder-workspace/Sources/System/Time/Nanoseconds.swift /Users/admin/builder/spi-builder-workspace/Sources/System/Time/ProcessorTime.swift /Users/admin/builder/spi-builder-workspace/Sources/System/Time/Time.swift /Users/admin/builder/spi-builder-workspace/Sources/System/Time/TimeComponents.swift /Users/admin/builder/spi-builder-workspace/Sources/System/Time/TimeInterval.swift /Users/admin/builder/spi-builder-workspace/Sources/System/Time/TimeIntervalMicroseconds.swift /Users/admin/builder/spi-builder-workspace/Sources/System/Time/TimeIntervalNanoseconds.swift /Users/admin/builder/spi-builder-workspace/Sources/System/UserID.swift /Users/admin/builder/spi-builder-workspace/Sources/System/Util.swift /Users/admin/builder/spi-builder-workspace/Sources/System/UtilConsumers.swift -target arm64-apple-watchos5.0 -Xllvm -aarch64-use-tbi -enable-objc-interop -sdk /Applications/Xcode-16.1.0.app/Contents/Developer/Platforms/WatchOS.platform/Developer/SDKs/WatchOS11.1.sdk -I /Users/admin/builder/spi-builder-workspace/.derivedData/Build/Products/Debug-watchos -I /Applications/Xcode-16.1.0.app/Contents/Developer/Platforms/WatchOS.platform/Developer/usr/lib -F /Users/admin/builder/spi-builder-workspace/.derivedData/Build/Products/Debug-watchos/PackageFrameworks -F /Users/admin/builder/spi-builder-workspace/.derivedData/Build/Products/Debug-watchos -F /Applications/Xcode-16.1.0.app/Contents/Developer/Platforms/WatchOS.platform/Developer/Library/Frameworks -F /Applications/Xcode-16.1.0.app/Contents/Developer/Platforms/WatchOS.platform/Developer/SDKs/WatchOS11.1.sdk/Developer/Library/Frameworks -no-color-diagnostics -enable-testing -g -debug-info-format\=dwarf -dwarf-version\=4 -module-cache-path /Users/admin/builder/spi-builder-workspace/.derivedData/ModuleCache.noindex -profile-generate -profile-coverage-mapping -swift-version 5 -enforce-exclusivity\=checked -stats-output-dir /Users/admin/builder/spi-builder-workspace/.swiftpm/xcode/.stats -Onone -D SWIFT_PACKAGE -D DEBUG -D SYSTEM_PACKAGE -D ENABLE_MOCKING -serialize-debugging-options -const-gather-protocols-file /Users/admin/builder/spi-builder-workspace/.derivedData/Build/Intermediates.noindex/swift-system.build/Debug-watchos/SystemPackage.build/Objects-normal/arm64/SystemPackage_const_extract_protocols.json -enable-experimental-feature DebugDescriptionMacro -enable-experimental-feature OpaqueTypeErasure -enable-upcoming-feature StrictConcurrency -enable-upcoming-feature DisableOutwardActorInference -enable-upcoming-feature GlobalActorIsolatedTypesUsability -enable-upcoming-feature InferSendableFromCaptures -strict-concurrency\=complete -empty-abi-descriptor -plugin-path /Applications/Xcode-16.1.0.app/Contents/Developer/Toolchains/XcodeDefault.xctoolchain/usr/lib/swift/host/plugins/testing -validate-clang-modules-once -clang-build-session-file /Users/admin/builder/spi-builder-workspace/.derivedData/ModuleCache.noindex/Session.modulevalidation -Xcc -working-directory -Xcc /Users/admin/builder/spi-builder-workspace/.swiftpm/xcode -resource-dir /Applications/Xcode-16.1.0.app/Contents/Developer/Toolchains/XcodeDefault.xctoolchain/usr/lib/swift -enable-anonymous-context-mangled-names -file-compilation-dir /Users/admin/builder/spi-builder-workspace/.swiftpm/xcode -Xcc -D_LIBCPP_HARDENING_MODE\=_LIBCPP_HARDENING_MODE_DEBUG -Xcc -ivfsstatcache -Xcc /Users/admin/builder/spi-builder-workspace/.derivedData/SDKStatCaches.noindex/watchos11.1-22R574-7b9df0bda16bb4641b33636c68f04660.sdkstatcache -Xcc -I/Users/admin/builder/spi-builder-workspace/.derivedData/Build/Intermediates.noindex/swift-system.build/Debug-watchos/SystemPackage.build/swift-overrides.hmap -Xcc -I/Users/admin/builder/spi-builder-workspace/Sources/CSystem/include -Xcc -I/Users/admin/builder/spi-builder-workspace/.derivedData/Build/Products/Debug-watchos/include -Xcc -I/Users/admin/builder/spi-builder-workspace/.derivedData/Build/Intermediates.noindex/swift-system.build/Debug-watchos/SystemPackage.build/DerivedSources-normal/arm64 -Xcc -I/Users/admin/builder/spi-builder-workspace/.derivedData/Build/Intermediates.noindex/swift-system.build/Debug-watchos/SystemPackage.build/DerivedSources/arm64 -Xcc -I/Users/admin/builder/spi-builder-workspace/.derivedData/Build/Intermediates.noindex/swift-system.build/Debug-watchos/SystemPackage.build/DerivedSources -Xcc -DSWIFT_PACKAGE -Xcc -DDEBUG\=1 -Xcc -D_CRT_SECURE_NO_WARNINGS -module-name SystemPackage -frontend-parseable-output -disable-clang-spi -target-sdk-version 11.1 -target-sdk-name watchos11.1 -external-plugin-path /Applications/Xcode-16.1.0.app/Contents/Developer/Platforms/WatchOS.platform/Developer/usr/lib/swift/host/plugins\#/Applications/Xcode-16.1.0.app/Contents/Developer/Platforms/WatchOS.platform/Developer/usr/bin/swift-plugin-server -external-plugin-path /Applications/Xcode-16.1.0.app/Contents/Developer/Platforms/WatchOS.platform/Developer/usr/local/lib/swift/host/plugins\#/Applications/Xcode-16.1.0.app/Contents/Developer/Platforms/WatchOS.platform/Developer/usr/bin/swift-plugin-server -plugin-path /Applications/Xcode-16.1.0.app/Contents/Developer/Toolchains/XcodeDefault.xctoolchain/usr/lib/swift/host/plugins -plugin-path /Applications/Xcode-16.1.0.app/Contents/Developer/Toolchains/XcodeDefault.xctoolchain/usr/local/lib/swift/host/plugins -emit-module-doc-path /Users/admin/builder/spi-builder-workspace/.derivedData/Build/Intermediates.noindex/swift-system.build/Debug-watchos/SystemPackage.build/Objects-normal/arm64/SystemPackage.swiftdoc -emit-module-source-info-path /Users/admin/builder/spi-builder-workspace/.derivedData/Build/Intermediates.noindex/swift-system.build/Debug-watchos/SystemPackage.build/Objects-normal/arm64/SystemPackage.swiftsourceinfo -emit-objc-header-path /Users/admin/builder/spi-builder-workspace/.derivedData/Build/Intermediates.noindex/swift-system.build/Debug-watchos/SystemPackage.build/Objects-normal/arm64/SystemPackage-Swift.h -serialize-diagnostics-path /Users/admin/builder/spi-builder-workspace/.derivedData/Build/Intermediates.noindex/swift-system.build/Debug-watchos/SystemPackage.build/Objects-normal/arm64/SystemPackage-master-emit-module.dia -emit-dependencies-path /Users/admin/builder/spi-builder-workspace/.derivedData/Build/Intermediates.noindex/swift-system.build/Debug-watchos/SystemPackage.build/Objects-normal/arm64/SystemPackage-master-emit-module.d -o /Users/admin/builder/spi-builder-workspace/.derivedData/Build/Intermediates.noindex/swift-system.build/Debug-watchos/SystemPackage.build/Objects-normal/arm64/SystemPackage.swiftmodule -emit-abi-descriptor-path /Users/admin/builder/spi-builder-workspace/.derivedData/Build/Intermediates.noindex/swift-system.build/Debug-watchos/SystemPackage.build/Objects-normal/arm64/SystemPackage.abi.json
Command SwiftEmitModule failed with a nonzero exit code
** BUILD FAILED **
The following build commands failed:
SwiftEmitModule normal armv7k Emitting\ module\ for\ SystemPackage (in target 'SystemPackage' from project 'swift-system')
EmitSwiftModule normal armv7k (in target 'SystemPackage' from project 'swift-system')
SwiftEmitModule normal arm64 Emitting\ module\ for\ SystemPackage (in target 'SystemPackage' from project 'swift-system')
Building workspace spi-builder-workspace with scheme swift-system
(4 failures)
BUILD FAILURE 6.0 watchOS