The Swift Package Index logo.Swift Package Index

Track the adoption of Swift 6 strict concurrency checks for data race safety. How many packages are Ready for Swift 6?

Build Information

Failed to build CommandLineToolkit, reference 2.0.0 (1a91fd), with Swift 5.10 for visionOS using Xcode 15.4 on 23 Oct 2024 18:43:39 UTC.

Build Command

env DEVELOPER_DIR=/Applications/Xcode-15.4.0.app xcrun xcodebuild -IDEClonedSourcePackagesDirPathOverride=$PWD/.dependencies -skipMacroValidation -skipPackagePluginValidation -derivedDataPath $PWD/.derivedData build -scheme CommandLineToolkit-Package -destination generic/platform=xrOS

Build Log

        ➜ Explicit dependency on target 'CLTExtensions' in project 'CommandLineToolkit'
        ➜ Explicit dependency on target 'CLTTypes' in project 'CommandLineToolkit'
    Target 'Kibana' in project 'CommandLineToolkit'
        ➜ Explicit dependency on target 'CLTExtensions' in project 'CommandLineToolkit'
        ➜ Explicit dependency on target 'CLTTypes' in project 'CommandLineToolkit'
        ➜ Explicit dependency on target 'DI' in project 'CommandLineToolkit'
        ➜ Explicit dependency on target 'DateProvider' in project 'CommandLineToolkit'
        ➜ Explicit dependency on target 'Types' in project 'CommandLineToolkit'
        ➜ Explicit dependency on target 'SocketModels' in project 'CommandLineToolkit'
    Target 'SocketModels' in project 'CommandLineToolkit'
        ➜ Explicit dependency on target 'Types' in project 'CommandLineToolkit'
    Target 'CLTTypes' in project 'CommandLineToolkit'
        ➜ Explicit dependency on target 'CLTExtensions' in project 'CommandLineToolkit'
    Target 'FileSystem' in project 'CommandLineToolkit'
        ➜ Explicit dependency on target 'CLTExtensions' in project 'CommandLineToolkit'
        ➜ Explicit dependency on target 'DI' in project 'CommandLineToolkit'
        ➜ Explicit dependency on target 'PathLib' in project 'CommandLineToolkit'
        ➜ Explicit dependency on target 'Types' in project 'CommandLineToolkit'
        ➜ Explicit dependency on target 'Glob' in project 'Glob'
    Target 'Glob' in project 'Glob'
        ➜ Explicit dependency on target 'Glob' in project 'Glob'
    Target 'Glob' in project 'Glob' (no dependencies)
    Target 'PathLib' in project 'CommandLineToolkit' (no dependencies)
    Target 'DateProvider' in project 'CommandLineToolkit'
        ➜ Explicit dependency on target 'DI' in project 'CommandLineToolkit'
    Target 'DI' in project 'CommandLineToolkit' (no dependencies)
    Target 'CLTLoggingModels' in project 'CommandLineToolkit' (no dependencies)
    Target 'CLTExtensions' in project 'CommandLineToolkit'
        ➜ Explicit dependency on target 'CLTExtensions' in project 'CommandLineToolkit'
    Target 'CLTExtensions' in project 'CommandLineToolkit' (no dependencies)
    Target 'CLTCollections' in project 'CommandLineToolkit'
        ➜ Explicit dependency on target 'CLTCollections' in project 'CommandLineToolkit'
        ➜ Explicit dependency on target 'Types' in project 'CommandLineToolkit'
    Target 'CLTCollections' in project 'CommandLineToolkit'
        ➜ Explicit dependency on target 'Types' in project 'CommandLineToolkit'
    Target 'Types' in project 'CommandLineToolkit' (no dependencies)
    Target 'AtomicModels' in project 'CommandLineToolkit'
        ➜ Explicit dependency on target 'AtomicModels' in project 'CommandLineToolkit'
    Target 'AtomicModels' in project 'CommandLineToolkit' (no dependencies)
GatherProvisioningInputs
CreateBuildDescription
ClangStatCache /Applications/Xcode-15.4.0.app/Contents/Developer/Toolchains/XcodeDefault.xctoolchain/usr/bin/clang-stat-cache /Applications/Xcode-15.4.0.app/Contents/Developer/Platforms/XROS.platform/Developer/SDKs/XROS1.2.sdk /Users/admin/builder/spi-builder-workspace/.derivedData/SDKStatCaches.noindex/xros1.2-21O5565d-70e6a4b4e6ce75e0f2056db95c07d51a.sdkstatcache
    cd /Users/admin/builder/spi-builder-workspace/.swiftpm/xcode
    /Applications/Xcode-15.4.0.app/Contents/Developer/Toolchains/XcodeDefault.xctoolchain/usr/bin/clang-stat-cache /Applications/Xcode-15.4.0.app/Contents/Developer/Platforms/XROS.platform/Developer/SDKs/XROS1.2.sdk -o /Users/admin/builder/spi-builder-workspace/.derivedData/SDKStatCaches.noindex/xros1.2-21O5565d-70e6a4b4e6ce75e0f2056db95c07d51a.sdkstatcache
SwiftDriver Yams normal arm64 com.apple.xcode.tools.swift.compiler (in target 'Yams' from project 'Yams')
    cd /Users/admin/builder/spi-builder-workspace/.dependencies/checkouts/Yams
    builtin-SwiftDriver -- /Applications/Xcode-15.4.0.app/Contents/Developer/Toolchains/XcodeDefault.xctoolchain/usr/bin/swiftc -module-name Yams -Onone -enforce-exclusivity\=checked @/Users/admin/builder/spi-builder-workspace/.derivedData/Build/Intermediates.noindex/Yams.build/Debug-xros/Yams.build/Objects-normal/arm64/Yams.SwiftFileList -DSWIFT_PACKAGE -DDEBUG -DXcode -sdk /Applications/Xcode-15.4.0.app/Contents/Developer/Platforms/XROS.platform/Developer/SDKs/XROS1.2.sdk -target arm64-apple-xros1.0 -g -module-cache-path /Users/admin/builder/spi-builder-workspace/.derivedData/ModuleCache.noindex -Xfrontend -serialize-debugging-options -profile-coverage-mapping -profile-generate -enable-testing -suppress-warnings -index-store-path /Users/admin/builder/spi-builder-workspace/.derivedData/Index.noindex/DataStore -swift-version 5 -I /Users/admin/builder/spi-builder-workspace/.derivedData/Build/Products/Debug-xros -I /Applications/Xcode-15.4.0.app/Contents/Developer/Platforms/XROS.platform/Developer/usr/lib -F /Users/admin/builder/spi-builder-workspace/.derivedData/Build/Products/Debug-xros/PackageFrameworks -F /Users/admin/builder/spi-builder-workspace/.derivedData/Build/Products/Debug-xros -F /Applications/Xcode-15.4.0.app/Contents/Developer/Platforms/XROS.platform/Developer/Library/Frameworks -F /Applications/Xcode-15.4.0.app/Contents/Developer/Platforms/XROS.platform/Developer/SDKs/XROS1.2.sdk/Developer/Library/Frameworks -c -j10 -enable-batch-mode -incremental -Xcc -ivfsstatcache -Xcc /Users/admin/builder/spi-builder-workspace/.derivedData/SDKStatCaches.noindex/xros1.2-21O5565d-70e6a4b4e6ce75e0f2056db95c07d51a.sdkstatcache -output-file-map /Users/admin/builder/spi-builder-workspace/.derivedData/Build/Intermediates.noindex/Yams.build/Debug-xros/Yams.build/Objects-normal/arm64/Yams-OutputFileMap.json -use-frontend-parseable-output -save-temps -no-color-diagnostics -serialize-diagnostics -emit-dependencies -emit-module -emit-module-path /Users/admin/builder/spi-builder-workspace/.derivedData/Build/Intermediates.noindex/Yams.build/Debug-xros/Yams.build/Objects-normal/arm64/Yams.swiftmodule -validate-clang-modules-once -clang-build-session-file /Users/admin/builder/spi-builder-workspace/.derivedData/ModuleCache.noindex/Session.modulevalidation -Xcc -I/Users/admin/builder/spi-builder-workspace/.derivedData/Build/Intermediates.noindex/Yams.build/Debug-xros/Yams.build/swift-overrides.hmap -emit-const-values -Xfrontend -const-gather-protocols-file -Xfrontend /Users/admin/builder/spi-builder-workspace/.derivedData/Build/Intermediates.noindex/Yams.build/Debug-xros/Yams.build/Objects-normal/arm64/Yams_const_extract_protocols.json -Xcc -I/Users/admin/builder/spi-builder-workspace/.dependencies/checkouts/Yams/Sources/CYaml/include -Xcc -I/Users/admin/builder/spi-builder-workspace/.derivedData/Build/Products/Debug-xros/include -Xcc -I/Users/admin/builder/spi-builder-workspace/.derivedData/Build/Intermediates.noindex/Yams.build/Debug-xros/Yams.build/DerivedSources-normal/arm64 -Xcc -I/Users/admin/builder/spi-builder-workspace/.derivedData/Build/Intermediates.noindex/Yams.build/Debug-xros/Yams.build/DerivedSources/arm64 -Xcc -I/Users/admin/builder/spi-builder-workspace/.derivedData/Build/Intermediates.noindex/Yams.build/Debug-xros/Yams.build/DerivedSources -Xcc -DSWIFT_PACKAGE -Xcc -DDEBUG\=1 -emit-objc-header -emit-objc-header-path /Users/admin/builder/spi-builder-workspace/.derivedData/Build/Intermediates.noindex/Yams.build/Debug-xros/Yams.build/Objects-normal/arm64/Yams-Swift.h -working-directory /Users/admin/builder/spi-builder-workspace/.dependencies/checkouts/Yams -experimental-emit-module-separately -disable-cmo
SwiftDriver Waitable normal arm64 com.apple.xcode.tools.swift.compiler (in target 'Waitable' from project 'CommandLineToolkit')
    cd /Users/admin/builder/spi-builder-workspace
    builtin-SwiftDriver -- /Applications/Xcode-15.4.0.app/Contents/Developer/Toolchains/XcodeDefault.xctoolchain/usr/bin/swiftc -module-name Waitable -Onone -enforce-exclusivity\=checked @/Users/admin/builder/spi-builder-workspace/.derivedData/Build/Intermediates.noindex/CommandLineToolkit.build/Debug-xros/Waitable.build/Objects-normal/arm64/Waitable.SwiftFileList -DSWIFT_PACKAGE -DDEBUG -DXcode -sdk /Applications/Xcode-15.4.0.app/Contents/Developer/Platforms/XROS.platform/Developer/SDKs/XROS1.2.sdk -target arm64-apple-xros1.0 -g -module-cache-path /Users/admin/builder/spi-builder-workspace/.derivedData/ModuleCache.noindex -Xfrontend -serialize-debugging-options -profile-coverage-mapping -profile-generate -enable-testing -index-store-path /Users/admin/builder/spi-builder-workspace/.derivedData/Index.noindex/DataStore -swift-version 5 -I /Users/admin/builder/spi-builder-workspace/.derivedData/Build/Products/Debug-xros -I /Applications/Xcode-15.4.0.app/Contents/Developer/Platforms/XROS.platform/Developer/usr/lib -F /Users/admin/builder/spi-builder-workspace/.derivedData/Build/Products/Debug-xros -F /Applications/Xcode-15.4.0.app/Contents/Developer/Platforms/XROS.platform/Developer/Library/Frameworks -F /Applications/Xcode-15.4.0.app/Contents/Developer/Platforms/XROS.platform/Developer/SDKs/XROS1.2.sdk/Developer/Library/Frameworks -parse-as-library -c -j10 -enable-batch-mode -incremental -Xcc -ivfsstatcache -Xcc /Users/admin/builder/spi-builder-workspace/.derivedData/SDKStatCaches.noindex/xros1.2-21O5565d-70e6a4b4e6ce75e0f2056db95c07d51a.sdkstatcache -output-file-map /Users/admin/builder/spi-builder-workspace/.derivedData/Build/Intermediates.noindex/CommandLineToolkit.build/Debug-xros/Waitable.build/Objects-normal/arm64/Waitable-OutputFileMap.json -use-frontend-parseable-output -save-temps -no-color-diagnostics -serialize-diagnostics -emit-dependencies -emit-module -emit-module-path /Users/admin/builder/spi-builder-workspace/.derivedData/Build/Intermediates.noindex/CommandLineToolkit.build/Debug-xros/Waitable.build/Objects-normal/arm64/Waitable.swiftmodule -validate-clang-modules-once -clang-build-session-file /Users/admin/builder/spi-builder-workspace/.derivedData/ModuleCache.noindex/Session.modulevalidation -Xfrontend -package-name -Xfrontend spi_builder_workspace -Xcc -I/Users/admin/builder/spi-builder-workspace/.derivedData/Build/Intermediates.noindex/CommandLineToolkit.build/Debug-xros/Waitable.build/swift-overrides.hmap -emit-const-values -Xfrontend -const-gather-protocols-file -Xfrontend /Users/admin/builder/spi-builder-workspace/.derivedData/Build/Intermediates.noindex/CommandLineToolkit.build/Debug-xros/Waitable.build/Objects-normal/arm64/Waitable_const_extract_protocols.json -Xcc -I/Users/admin/builder/spi-builder-workspace/.derivedData/Build/Products/Debug-xros/include -Xcc -I/Users/admin/builder/spi-builder-workspace/.derivedData/Build/Intermediates.noindex/CommandLineToolkit.build/Debug-xros/Waitable.build/DerivedSources-normal/arm64 -Xcc -I/Users/admin/builder/spi-builder-workspace/.derivedData/Build/Intermediates.noindex/CommandLineToolkit.build/Debug-xros/Waitable.build/DerivedSources/arm64 -Xcc -I/Users/admin/builder/spi-builder-workspace/.derivedData/Build/Intermediates.noindex/CommandLineToolkit.build/Debug-xros/Waitable.build/DerivedSources -Xcc -DSWIFT_PACKAGE -Xcc -DDEBUG\=1 -emit-objc-header -emit-objc-header-path /Users/admin/builder/spi-builder-workspace/.derivedData/Build/Intermediates.noindex/CommandLineToolkit.build/Debug-xros/Waitable.build/Objects-normal/arm64/Waitable-Swift.h -working-directory /Users/admin/builder/spi-builder-workspace -experimental-emit-module-separately -disable-cmo
SwiftDriver URLSessionTestHelpers normal arm64 com.apple.xcode.tools.swift.compiler (in target 'URLSessionTestHelpers' from project 'CommandLineToolkit')
    cd /Users/admin/builder/spi-builder-workspace
    builtin-SwiftDriver -- /Applications/Xcode-15.4.0.app/Contents/Developer/Toolchains/XcodeDefault.xctoolchain/usr/bin/swiftc -module-name URLSessionTestHelpers -Onone -enforce-exclusivity\=checked @/Users/admin/builder/spi-builder-workspace/.derivedData/Build/Intermediates.noindex/CommandLineToolkit.build/Debug-xros/URLSessionTestHelpers.build/Objects-normal/arm64/URLSessionTestHelpers.SwiftFileList -DSWIFT_PACKAGE -DDEBUG -DXcode -sdk /Applications/Xcode-15.4.0.app/Contents/Developer/Platforms/XROS.platform/Developer/SDKs/XROS1.2.sdk -target arm64-apple-xros1.0 -g -module-cache-path /Users/admin/builder/spi-builder-workspace/.derivedData/ModuleCache.noindex -Xfrontend -serialize-debugging-options -profile-coverage-mapping -profile-generate -enable-testing -index-store-path /Users/admin/builder/spi-builder-workspace/.derivedData/Index.noindex/DataStore -swift-version 5 -I /Users/admin/builder/spi-builder-workspace/.derivedData/Build/Products/Debug-xros -I /Applications/Xcode-15.4.0.app/Contents/Developer/Platforms/XROS.platform/Developer/usr/lib -F /Users/admin/builder/spi-builder-workspace/.derivedData/Build/Products/Debug-xros -F /Applications/Xcode-15.4.0.app/Contents/Developer/Platforms/XROS.platform/Developer/Library/Frameworks -F /Applications/Xcode-15.4.0.app/Contents/Developer/Platforms/XROS.platform/Developer/SDKs/XROS1.2.sdk/Developer/Library/Frameworks -parse-as-library -c -j10 -enable-batch-mode -incremental -Xcc -ivfsstatcache -Xcc /Users/admin/builder/spi-builder-workspace/.derivedData/SDKStatCaches.noindex/xros1.2-21O5565d-70e6a4b4e6ce75e0f2056db95c07d51a.sdkstatcache -output-file-map /Users/admin/builder/spi-builder-workspace/.derivedData/Build/Intermediates.noindex/CommandLineToolkit.build/Debug-xros/URLSessionTestHelpers.build/Objects-normal/arm64/URLSessionTestHelpers-OutputFileMap.json -use-frontend-parseable-output -save-temps -no-color-diagnostics -serialize-diagnostics -emit-dependencies -emit-module -emit-module-path /Users/admin/builder/spi-builder-workspace/.derivedData/Build/Intermediates.noindex/CommandLineToolkit.build/Debug-xros/URLSessionTestHelpers.build/Objects-normal/arm64/URLSessionTestHelpers.swiftmodule -validate-clang-modules-once -clang-build-session-file /Users/admin/builder/spi-builder-workspace/.derivedData/ModuleCache.noindex/Session.modulevalidation -Xfrontend -package-name -Xfrontend spi_builder_workspace -Xcc -I/Users/admin/builder/spi-builder-workspace/.derivedData/Build/Intermediates.noindex/CommandLineToolkit.build/Debug-xros/URLSessionTestHelpers.build/swift-overrides.hmap -emit-const-values -Xfrontend -const-gather-protocols-file -Xfrontend /Users/admin/builder/spi-builder-workspace/.derivedData/Build/Intermediates.noindex/CommandLineToolkit.build/Debug-xros/URLSessionTestHelpers.build/Objects-normal/arm64/URLSessionTestHelpers_const_extract_protocols.json -Xcc -I/Users/admin/builder/spi-builder-workspace/.derivedData/Build/Products/Debug-xros/include -Xcc -I/Users/admin/builder/spi-builder-workspace/.derivedData/Build/Intermediates.noindex/CommandLineToolkit.build/Debug-xros/URLSessionTestHelpers.build/DerivedSources-normal/arm64 -Xcc -I/Users/admin/builder/spi-builder-workspace/.derivedData/Build/Intermediates.noindex/CommandLineToolkit.build/Debug-xros/URLSessionTestHelpers.build/DerivedSources/arm64 -Xcc -I/Users/admin/builder/spi-builder-workspace/.derivedData/Build/Intermediates.noindex/CommandLineToolkit.build/Debug-xros/URLSessionTestHelpers.build/DerivedSources -Xcc -DSWIFT_PACKAGE -Xcc -DDEBUG\=1 -emit-objc-header -emit-objc-header-path /Users/admin/builder/spi-builder-workspace/.derivedData/Build/Intermediates.noindex/CommandLineToolkit.build/Debug-xros/URLSessionTestHelpers.build/Objects-normal/arm64/URLSessionTestHelpers-Swift.h -working-directory /Users/admin/builder/spi-builder-workspace -experimental-emit-module-separately -disable-cmo
SwiftDriver Types normal arm64 com.apple.xcode.tools.swift.compiler (in target 'Types' from project 'CommandLineToolkit')
    cd /Users/admin/builder/spi-builder-workspace
    builtin-SwiftDriver -- /Applications/Xcode-15.4.0.app/Contents/Developer/Toolchains/XcodeDefault.xctoolchain/usr/bin/swiftc -module-name Types -Onone -enforce-exclusivity\=checked @/Users/admin/builder/spi-builder-workspace/.derivedData/Build/Intermediates.noindex/CommandLineToolkit.build/Debug-xros/Types.build/Objects-normal/arm64/Types.SwiftFileList -DSWIFT_PACKAGE -DDEBUG -DXcode -sdk /Applications/Xcode-15.4.0.app/Contents/Developer/Platforms/XROS.platform/Developer/SDKs/XROS1.2.sdk -target arm64-apple-xros1.0 -g -module-cache-path /Users/admin/builder/spi-builder-workspace/.derivedData/ModuleCache.noindex -Xfrontend -serialize-debugging-options -profile-coverage-mapping -profile-generate -enable-testing -index-store-path /Users/admin/builder/spi-builder-workspace/.derivedData/Index.noindex/DataStore -swift-version 5 -I /Users/admin/builder/spi-builder-workspace/.derivedData/Build/Products/Debug-xros -I /Applications/Xcode-15.4.0.app/Contents/Developer/Platforms/XROS.platform/Developer/usr/lib -F /Users/admin/builder/spi-builder-workspace/.derivedData/Build/Products/Debug-xros -F /Applications/Xcode-15.4.0.app/Contents/Developer/Platforms/XROS.platform/Developer/Library/Frameworks -F /Applications/Xcode-15.4.0.app/Contents/Developer/Platforms/XROS.platform/Developer/SDKs/XROS1.2.sdk/Developer/Library/Frameworks -c -j10 -enable-batch-mode -incremental -Xcc -ivfsstatcache -Xcc /Users/admin/builder/spi-builder-workspace/.derivedData/SDKStatCaches.noindex/xros1.2-21O5565d-70e6a4b4e6ce75e0f2056db95c07d51a.sdkstatcache -output-file-map /Users/admin/builder/spi-builder-workspace/.derivedData/Build/Intermediates.noindex/CommandLineToolkit.build/Debug-xros/Types.build/Objects-normal/arm64/Types-OutputFileMap.json -use-frontend-parseable-output -save-temps -no-color-diagnostics -serialize-diagnostics -emit-dependencies -emit-module -emit-module-path /Users/admin/builder/spi-builder-workspace/.derivedData/Build/Intermediates.noindex/CommandLineToolkit.build/Debug-xros/Types.build/Objects-normal/arm64/Types.swiftmodule -validate-clang-modules-once -clang-build-session-file /Users/admin/builder/spi-builder-workspace/.derivedData/ModuleCache.noindex/Session.modulevalidation -Xfrontend -package-name -Xfrontend spi_builder_workspace -Xcc -I/Users/admin/builder/spi-builder-workspace/.derivedData/Build/Intermediates.noindex/CommandLineToolkit.build/Debug-xros/Types.build/swift-overrides.hmap -emit-const-values -Xfrontend -const-gather-protocols-file -Xfrontend /Users/admin/builder/spi-builder-workspace/.derivedData/Build/Intermediates.noindex/CommandLineToolkit.build/Debug-xros/Types.build/Objects-normal/arm64/Types_const_extract_protocols.json -Xcc -I/Users/admin/builder/spi-builder-workspace/.derivedData/Build/Products/Debug-xros/include -Xcc -I/Users/admin/builder/spi-builder-workspace/.derivedData/Build/Intermediates.noindex/CommandLineToolkit.build/Debug-xros/Types.build/DerivedSources-normal/arm64 -Xcc -I/Users/admin/builder/spi-builder-workspace/.derivedData/Build/Intermediates.noindex/CommandLineToolkit.build/Debug-xros/Types.build/DerivedSources/arm64 -Xcc -I/Users/admin/builder/spi-builder-workspace/.derivedData/Build/Intermediates.noindex/CommandLineToolkit.build/Debug-xros/Types.build/DerivedSources -Xcc -DSWIFT_PACKAGE -Xcc -DDEBUG\=1 -emit-objc-header -emit-objc-header-path /Users/admin/builder/spi-builder-workspace/.derivedData/Build/Intermediates.noindex/CommandLineToolkit.build/Debug-xros/Types.build/Objects-normal/arm64/Types-Swift.h -working-directory /Users/admin/builder/spi-builder-workspace -experimental-emit-module-separately -disable-cmo
SwiftDriver Timer normal arm64 com.apple.xcode.tools.swift.compiler (in target 'Timer' from project 'CommandLineToolkit')
    cd /Users/admin/builder/spi-builder-workspace
    builtin-SwiftDriver -- /Applications/Xcode-15.4.0.app/Contents/Developer/Toolchains/XcodeDefault.xctoolchain/usr/bin/swiftc -module-name Timer -Onone -enforce-exclusivity\=checked @/Users/admin/builder/spi-builder-workspace/.derivedData/Build/Intermediates.noindex/CommandLineToolkit.build/Debug-xros/Timer.build/Objects-normal/arm64/Timer.SwiftFileList -DSWIFT_PACKAGE -DDEBUG -DXcode -sdk /Applications/Xcode-15.4.0.app/Contents/Developer/Platforms/XROS.platform/Developer/SDKs/XROS1.2.sdk -target arm64-apple-xros1.0 -g -module-cache-path /Users/admin/builder/spi-builder-workspace/.derivedData/ModuleCache.noindex -Xfrontend -serialize-debugging-options -profile-coverage-mapping -profile-generate -enable-testing -index-store-path /Users/admin/builder/spi-builder-workspace/.derivedData/Index.noindex/DataStore -swift-version 5 -I /Users/admin/builder/spi-builder-workspace/.derivedData/Build/Products/Debug-xros -I /Applications/Xcode-15.4.0.app/Contents/Developer/Platforms/XROS.platform/Developer/usr/lib -F /Users/admin/builder/spi-builder-workspace/.derivedData/Build/Products/Debug-xros -F /Applications/Xcode-15.4.0.app/Contents/Developer/Platforms/XROS.platform/Developer/Library/Frameworks -F /Applications/Xcode-15.4.0.app/Contents/Developer/Platforms/XROS.platform/Developer/SDKs/XROS1.2.sdk/Developer/Library/Frameworks -parse-as-library -c -j10 -enable-batch-mode -incremental -Xcc -ivfsstatcache -Xcc /Users/admin/builder/spi-builder-workspace/.derivedData/SDKStatCaches.noindex/xros1.2-21O5565d-70e6a4b4e6ce75e0f2056db95c07d51a.sdkstatcache -output-file-map /Users/admin/builder/spi-builder-workspace/.derivedData/Build/Intermediates.noindex/CommandLineToolkit.build/Debug-xros/Timer.build/Objects-normal/arm64/Timer-OutputFileMap.json -use-frontend-parseable-output -save-temps -no-color-diagnostics -serialize-diagnostics -emit-dependencies -emit-module -emit-module-path /Users/admin/builder/spi-builder-workspace/.derivedData/Build/Intermediates.noindex/CommandLineToolkit.build/Debug-xros/Timer.build/Objects-normal/arm64/Timer.swiftmodule -validate-clang-modules-once -clang-build-session-file /Users/admin/builder/spi-builder-workspace/.derivedData/ModuleCache.noindex/Session.modulevalidation -Xfrontend -package-name -Xfrontend spi_builder_workspace -Xcc -I/Users/admin/builder/spi-builder-workspace/.derivedData/Build/Intermediates.noindex/CommandLineToolkit.build/Debug-xros/Timer.build/swift-overrides.hmap -emit-const-values -Xfrontend -const-gather-protocols-file -Xfrontend /Users/admin/builder/spi-builder-workspace/.derivedData/Build/Intermediates.noindex/CommandLineToolkit.build/Debug-xros/Timer.build/Objects-normal/arm64/Timer_const_extract_protocols.json -Xcc -I/Users/admin/builder/spi-builder-workspace/.derivedData/Build/Products/Debug-xros/include -Xcc -I/Users/admin/builder/spi-builder-workspace/.derivedData/Build/Intermediates.noindex/CommandLineToolkit.build/Debug-xros/Timer.build/DerivedSources-normal/arm64 -Xcc -I/Users/admin/builder/spi-builder-workspace/.derivedData/Build/Intermediates.noindex/CommandLineToolkit.build/Debug-xros/Timer.build/DerivedSources/arm64 -Xcc -I/Users/admin/builder/spi-builder-workspace/.derivedData/Build/Intermediates.noindex/CommandLineToolkit.build/Debug-xros/Timer.build/DerivedSources -Xcc -DSWIFT_PACKAGE -Xcc -DDEBUG\=1 -emit-objc-header -emit-objc-header-path /Users/admin/builder/spi-builder-workspace/.derivedData/Build/Intermediates.noindex/CommandLineToolkit.build/Debug-xros/Timer.build/Objects-normal/arm64/Timer-Swift.h -working-directory /Users/admin/builder/spi-builder-workspace -experimental-emit-module-separately -disable-cmo
SwiftDriver Socket normal arm64 com.apple.xcode.tools.swift.compiler (in target 'Socket' from project 'Socket')
    cd /Users/admin/builder/spi-builder-workspace/.dependencies/checkouts/BlueSocket
    builtin-SwiftDriver -- /Applications/Xcode-15.4.0.app/Contents/Developer/Toolchains/XcodeDefault.xctoolchain/usr/bin/swiftc -module-name Socket -Onone -enforce-exclusivity\=checked @/Users/admin/builder/spi-builder-workspace/.derivedData/Build/Intermediates.noindex/Socket.build/Debug-xros/Socket.build/Objects-normal/arm64/Socket.SwiftFileList -DSWIFT_PACKAGE -DDEBUG -DXcode -sdk /Applications/Xcode-15.4.0.app/Contents/Developer/Platforms/XROS.platform/Developer/SDKs/XROS1.2.sdk -target arm64-apple-xros1.0 -g -module-cache-path /Users/admin/builder/spi-builder-workspace/.derivedData/ModuleCache.noindex -Xfrontend -serialize-debugging-options -profile-coverage-mapping -profile-generate -enable-testing -suppress-warnings -index-store-path /Users/admin/builder/spi-builder-workspace/.derivedData/Index.noindex/DataStore -swift-version 5 -I /Users/admin/builder/spi-builder-workspace/.derivedData/Build/Products/Debug-xros -I /Applications/Xcode-15.4.0.app/Contents/Developer/Platforms/XROS.platform/Developer/usr/lib -F /Users/admin/builder/spi-builder-workspace/.derivedData/Build/Products/Debug-xros -F /Applications/Xcode-15.4.0.app/Contents/Developer/Platforms/XROS.platform/Developer/Library/Frameworks -F /Applications/Xcode-15.4.0.app/Contents/Developer/Platforms/XROS.platform/Developer/SDKs/XROS1.2.sdk/Developer/Library/Frameworks -c -j10 -enable-batch-mode -incremental -Xcc -ivfsstatcache -Xcc /Users/admin/builder/spi-builder-workspace/.derivedData/SDKStatCaches.noindex/xros1.2-21O5565d-70e6a4b4e6ce75e0f2056db95c07d51a.sdkstatcache -output-file-map /Users/admin/builder/spi-builder-workspace/.derivedData/Build/Intermediates.noindex/Socket.build/Debug-xros/Socket.build/Objects-normal/arm64/Socket-OutputFileMap.json -use-frontend-parseable-output -save-temps -no-color-diagnostics -serialize-diagnostics -emit-dependencies -emit-module -emit-module-path /Users/admin/builder/spi-builder-workspace/.derivedData/Build/Intermediates.noindex/Socket.build/Debug-xros/Socket.build/Objects-normal/arm64/Socket.swiftmodule -validate-clang-modules-once -clang-build-session-file /Users/admin/builder/spi-builder-workspace/.derivedData/ModuleCache.noindex/Session.modulevalidation -Xcc -I/Users/admin/builder/spi-builder-workspace/.derivedData/Build/Intermediates.noindex/Socket.build/Debug-xros/Socket.build/swift-overrides.hmap -emit-const-values -Xfrontend -const-gather-protocols-file -Xfrontend /Users/admin/builder/spi-builder-workspace/.derivedData/Build/Intermediates.noindex/Socket.build/Debug-xros/Socket.build/Objects-normal/arm64/Socket_const_extract_protocols.json -Xcc -I/Users/admin/builder/spi-builder-workspace/.derivedData/Build/Products/Debug-xros/include -Xcc -I/Users/admin/builder/spi-builder-workspace/.derivedData/Build/Intermediates.noindex/Socket.build/Debug-xros/Socket.build/DerivedSources-normal/arm64 -Xcc -I/Users/admin/builder/spi-builder-workspace/.derivedData/Build/Intermediates.noindex/Socket.build/Debug-xros/Socket.build/DerivedSources/arm64 -Xcc -I/Users/admin/builder/spi-builder-workspace/.derivedData/Build/Intermediates.noindex/Socket.build/Debug-xros/Socket.build/DerivedSources -Xcc -DSWIFT_PACKAGE -Xcc -DDEBUG\=1 -emit-objc-header -emit-objc-header-path /Users/admin/builder/spi-builder-workspace/.derivedData/Build/Intermediates.noindex/Socket.build/Debug-xros/Socket.build/Objects-normal/arm64/Socket-Swift.h -working-directory /Users/admin/builder/spi-builder-workspace/.dependencies/checkouts/BlueSocket -experimental-emit-module-separately -disable-cmo
SwiftDriver Signals normal arm64 com.apple.xcode.tools.swift.compiler (in target 'Signals' from project 'Signals')
    cd /Users/admin/builder/spi-builder-workspace/.dependencies/checkouts/BlueSignals
    builtin-SwiftDriver -- /Applications/Xcode-15.4.0.app/Contents/Developer/Toolchains/XcodeDefault.xctoolchain/usr/bin/swiftc -module-name Signals -Onone -enforce-exclusivity\=checked @/Users/admin/builder/spi-builder-workspace/.derivedData/Build/Intermediates.noindex/Signals.build/Debug-xros/Signals.build/Objects-normal/arm64/Signals.SwiftFileList -DSWIFT_PACKAGE -DDEBUG -DXcode -sdk /Applications/Xcode-15.4.0.app/Contents/Developer/Platforms/XROS.platform/Developer/SDKs/XROS1.2.sdk -target arm64-apple-xros1.0 -g -module-cache-path /Users/admin/builder/spi-builder-workspace/.derivedData/ModuleCache.noindex -Xfrontend -serialize-debugging-options -profile-coverage-mapping -profile-generate -enable-testing -suppress-warnings -index-store-path /Users/admin/builder/spi-builder-workspace/.derivedData/Index.noindex/DataStore -swift-version 5 -I /Users/admin/builder/spi-builder-workspace/.derivedData/Build/Products/Debug-xros -I /Applications/Xcode-15.4.0.app/Contents/Developer/Platforms/XROS.platform/Developer/usr/lib -F /Users/admin/builder/spi-builder-workspace/.derivedData/Build/Products/Debug-xros -F /Applications/Xcode-15.4.0.app/Contents/Developer/Platforms/XROS.platform/Developer/Library/Frameworks -F /Applications/Xcode-15.4.0.app/Contents/Developer/Platforms/XROS.platform/Developer/SDKs/XROS1.2.sdk/Developer/Library/Frameworks -parse-as-library -c -j10 -enable-batch-mode -incremental -Xcc -ivfsstatcache -Xcc /Users/admin/builder/spi-builder-workspace/.derivedData/SDKStatCaches.noindex/xros1.2-21O5565d-70e6a4b4e6ce75e0f2056db95c07d51a.sdkstatcache -output-file-map /Users/admin/builder/spi-builder-workspace/.derivedData/Build/Intermediates.noindex/Signals.build/Debug-xros/Signals.build/Objects-normal/arm64/Signals-OutputFileMap.json -use-frontend-parseable-output -save-temps -no-color-diagnostics -serialize-diagnostics -emit-dependencies -emit-module -emit-module-path /Users/admin/builder/spi-builder-workspace/.derivedData/Build/Intermediates.noindex/Signals.build/Debug-xros/Signals.build/Objects-normal/arm64/Signals.swiftmodule -validate-clang-modules-once -clang-build-session-file /Users/admin/builder/spi-builder-workspace/.derivedData/ModuleCache.noindex/Session.modulevalidation -Xcc -I/Users/admin/builder/spi-builder-workspace/.derivedData/Build/Intermediates.noindex/Signals.build/Debug-xros/Signals.build/swift-overrides.hmap -emit-const-values -Xfrontend -const-gather-protocols-file -Xfrontend /Users/admin/builder/spi-builder-workspace/.derivedData/Build/Intermediates.noindex/Signals.build/Debug-xros/Signals.build/Objects-normal/arm64/Signals_const_extract_protocols.json -Xcc -I/Users/admin/builder/spi-builder-workspace/.derivedData/Build/Products/Debug-xros/include -Xcc -I/Users/admin/builder/spi-builder-workspace/.derivedData/Build/Intermediates.noindex/Signals.build/Debug-xros/Signals.build/DerivedSources-normal/arm64 -Xcc -I/Users/admin/builder/spi-builder-workspace/.derivedData/Build/Intermediates.noindex/Signals.build/Debug-xros/Signals.build/DerivedSources/arm64 -Xcc -I/Users/admin/builder/spi-builder-workspace/.derivedData/Build/Intermediates.noindex/Signals.build/Debug-xros/Signals.build/DerivedSources -Xcc -DSWIFT_PACKAGE -Xcc -DDEBUG\=1 -emit-objc-header -emit-objc-header-path /Users/admin/builder/spi-builder-workspace/.derivedData/Build/Intermediates.noindex/Signals.build/Debug-xros/Signals.build/Objects-normal/arm64/Signals-Swift.h -working-directory /Users/admin/builder/spi-builder-workspace/.dependencies/checkouts/BlueSignals -experimental-emit-module-separately -disable-cmo
SwiftDriver PathLib normal arm64 com.apple.xcode.tools.swift.compiler (in target 'PathLib' from project 'CommandLineToolkit')
    cd /Users/admin/builder/spi-builder-workspace
    builtin-SwiftDriver -- /Applications/Xcode-15.4.0.app/Contents/Developer/Toolchains/XcodeDefault.xctoolchain/usr/bin/swiftc -module-name PathLib -Onone -enforce-exclusivity\=checked @/Users/admin/builder/spi-builder-workspace/.derivedData/Build/Intermediates.noindex/CommandLineToolkit.build/Debug-xros/PathLib.build/Objects-normal/arm64/PathLib.SwiftFileList -DSWIFT_PACKAGE -DDEBUG -DXcode -sdk /Applications/Xcode-15.4.0.app/Contents/Developer/Platforms/XROS.platform/Developer/SDKs/XROS1.2.sdk -target arm64-apple-xros1.0 -g -module-cache-path /Users/admin/builder/spi-builder-workspace/.derivedData/ModuleCache.noindex -Xfrontend -serialize-debugging-options -profile-coverage-mapping -profile-generate -enable-testing -index-store-path /Users/admin/builder/spi-builder-workspace/.derivedData/Index.noindex/DataStore -swift-version 5 -I /Users/admin/builder/spi-builder-workspace/.derivedData/Build/Products/Debug-xros -I /Applications/Xcode-15.4.0.app/Contents/Developer/Platforms/XROS.platform/Developer/usr/lib -F /Users/admin/builder/spi-builder-workspace/.derivedData/Build/Products/Debug-xros -F /Applications/Xcode-15.4.0.app/Contents/Developer/Platforms/XROS.platform/Developer/Library/Frameworks -F /Applications/Xcode-15.4.0.app/Contents/Developer/Platforms/XROS.platform/Developer/SDKs/XROS1.2.sdk/Developer/Library/Frameworks -c -j10 -enable-batch-mode -incremental -Xcc -ivfsstatcache -Xcc /Users/admin/builder/spi-builder-workspace/.derivedData/SDKStatCaches.noindex/xros1.2-21O5565d-70e6a4b4e6ce75e0f2056db95c07d51a.sdkstatcache -output-file-map /Users/admin/builder/spi-builder-workspace/.derivedData/Build/Intermediates.noindex/CommandLineToolkit.build/Debug-xros/PathLib.build/Objects-normal/arm64/PathLib-OutputFileMap.json -use-frontend-parseable-output -save-temps -no-color-diagnostics -serialize-diagnostics -emit-dependencies -emit-module -emit-module-path /Users/admin/builder/spi-builder-workspace/.derivedData/Build/Intermediates.noindex/CommandLineToolkit.build/Debug-xros/PathLib.build/Objects-normal/arm64/PathLib.swiftmodule -validate-clang-modules-once -clang-build-session-file /Users/admin/builder/spi-builder-workspace/.derivedData/ModuleCache.noindex/Session.modulevalidation -Xfrontend -package-name -Xfrontend spi_builder_workspace -Xcc -I/Users/admin/builder/spi-builder-workspace/.derivedData/Build/Intermediates.noindex/CommandLineToolkit.build/Debug-xros/PathLib.build/swift-overrides.hmap -emit-const-values -Xfrontend -const-gather-protocols-file -Xfrontend /Users/admin/builder/spi-builder-workspace/.derivedData/Build/Intermediates.noindex/CommandLineToolkit.build/Debug-xros/PathLib.build/Objects-normal/arm64/PathLib_const_extract_protocols.json -Xcc -I/Users/admin/builder/spi-builder-workspace/.derivedData/Build/Products/Debug-xros/include -Xcc -I/Users/admin/builder/spi-builder-workspace/.derivedData/Build/Intermediates.noindex/CommandLineToolkit.build/Debug-xros/PathLib.build/DerivedSources-normal/arm64 -Xcc -I/Users/admin/builder/spi-builder-workspace/.derivedData/Build/Intermediates.noindex/CommandLineToolkit.build/Debug-xros/PathLib.build/DerivedSources/arm64 -Xcc -I/Users/admin/builder/spi-builder-workspace/.derivedData/Build/Intermediates.noindex/CommandLineToolkit.build/Debug-xros/PathLib.build/DerivedSources -Xcc -DSWIFT_PACKAGE -Xcc -DDEBUG\=1 -emit-objc-header -emit-objc-header-path /Users/admin/builder/spi-builder-workspace/.derivedData/Build/Intermediates.noindex/CommandLineToolkit.build/Debug-xros/PathLib.build/Objects-normal/arm64/PathLib-Swift.h -working-directory /Users/admin/builder/spi-builder-workspace -experimental-emit-module-separately -disable-cmo
SwiftDriver MetricsUtils normal arm64 com.apple.xcode.tools.swift.compiler (in target 'MetricsUtils' from project 'CommandLineToolkit')
    cd /Users/admin/builder/spi-builder-workspace
    builtin-SwiftDriver -- /Applications/Xcode-15.4.0.app/Contents/Developer/Toolchains/XcodeDefault.xctoolchain/usr/bin/swiftc -module-name MetricsUtils -Onone -enforce-exclusivity\=checked @/Users/admin/builder/spi-builder-workspace/.derivedData/Build/Intermediates.noindex/CommandLineToolkit.build/Debug-xros/MetricsUtils.build/Objects-normal/arm64/MetricsUtils.SwiftFileList -DSWIFT_PACKAGE -DDEBUG -DXcode -sdk /Applications/Xcode-15.4.0.app/Contents/Developer/Platforms/XROS.platform/Developer/SDKs/XROS1.2.sdk -target arm64-apple-xros1.0 -g -module-cache-path /Users/admin/builder/spi-builder-workspace/.derivedData/ModuleCache.noindex -Xfrontend -serialize-debugging-options -profile-coverage-mapping -profile-generate -enable-testing -index-store-path /Users/admin/builder/spi-builder-workspace/.derivedData/Index.noindex/DataStore -swift-version 5 -I /Users/admin/builder/spi-builder-workspace/.derivedData/Build/Products/Debug-xros -I /Applications/Xcode-15.4.0.app/Contents/Developer/Platforms/XROS.platform/Developer/usr/lib -F /Users/admin/builder/spi-builder-workspace/.derivedData/Build/Products/Debug-xros -F /Applications/Xcode-15.4.0.app/Contents/Developer/Platforms/XROS.platform/Developer/Library/Frameworks -F /Applications/Xcode-15.4.0.app/Contents/Developer/Platforms/XROS.platform/Developer/SDKs/XROS1.2.sdk/Developer/Library/Frameworks -parse-as-library -c -j10 -enable-batch-mode -incremental -Xcc -ivfsstatcache -Xcc /Users/admin/builder/spi-builder-workspace/.derivedData/SDKStatCaches.noindex/xros1.2-21O5565d-70e6a4b4e6ce75e0f2056db95c07d51a.sdkstatcache -output-file-map /Users/admin/builder/spi-builder-workspace/.derivedData/Build/Intermediates.noindex/CommandLineToolkit.build/Debug-xros/MetricsUtils.build/Objects-normal/arm64/MetricsUtils-OutputFileMap.json -use-frontend-parseable-output -save-temps -no-color-diagnostics -serialize-diagnostics -emit-dependencies -emit-module -emit-module-path /Users/admin/builder/spi-builder-workspace/.derivedData/Build/Intermediates.noindex/CommandLineToolkit.build/Debug-xros/MetricsUtils.build/Objects-normal/arm64/MetricsUtils.swiftmodule -validate-clang-modules-once -clang-build-session-file /Users/admin/builder/spi-builder-workspace/.derivedData/ModuleCache.noindex/Session.modulevalidation -Xfrontend -package-name -Xfrontend spi_builder_workspace -Xcc -I/Users/admin/builder/spi-builder-workspace/.derivedData/Build/Intermediates.noindex/CommandLineToolkit.build/Debug-xros/MetricsUtils.build/swift-overrides.hmap -emit-const-values -Xfrontend -const-gather-protocols-file -Xfrontend /Users/admin/builder/spi-builder-workspace/.derivedData/Build/Intermediates.noindex/CommandLineToolkit.build/Debug-xros/MetricsUtils.build/Objects-normal/arm64/MetricsUtils_const_extract_protocols.json -Xcc -I/Users/admin/builder/spi-builder-workspace/.derivedData/Build/Products/Debug-xros/include -Xcc -I/Users/admin/builder/spi-builder-workspace/.derivedData/Build/Intermediates.noindex/CommandLineToolkit.build/Debug-xros/MetricsUtils.build/DerivedSources-normal/arm64 -Xcc -I/Users/admin/builder/spi-builder-workspace/.derivedData/Build/Intermediates.noindex/CommandLineToolkit.build/Debug-xros/MetricsUtils.build/DerivedSources/arm64 -Xcc -I/Users/admin/builder/spi-builder-workspace/.derivedData/Build/Intermediates.noindex/CommandLineToolkit.build/Debug-xros/MetricsUtils.build/DerivedSources -Xcc -DSWIFT_PACKAGE -Xcc -DDEBUG\=1 -emit-objc-header -emit-objc-header-path /Users/admin/builder/spi-builder-workspace/.derivedData/Build/Intermediates.noindex/CommandLineToolkit.build/Debug-xros/MetricsUtils.build/Objects-normal/arm64/MetricsUtils-Swift.h -working-directory /Users/admin/builder/spi-builder-workspace -experimental-emit-module-separately -disable-cmo
SwiftDriver Logging normal arm64 com.apple.xcode.tools.swift.compiler (in target 'Logging' from project 'swift-log')
    cd /Users/admin/builder/spi-builder-workspace/.dependencies/checkouts/swift-log
    builtin-SwiftDriver -- /Applications/Xcode-15.4.0.app/Contents/Developer/Toolchains/XcodeDefault.xctoolchain/usr/bin/swiftc -module-name Logging -Onone -enforce-exclusivity\=checked @/Users/admin/builder/spi-builder-workspace/.derivedData/Build/Intermediates.noindex/swift-log.build/Debug-xros/Logging.build/Objects-normal/arm64/Logging.SwiftFileList -DSWIFT_PACKAGE -DDEBUG -DXcode -sdk /Applications/Xcode-15.4.0.app/Contents/Developer/Platforms/XROS.platform/Developer/SDKs/XROS1.2.sdk -target arm64-apple-xros1.0 -g -module-cache-path /Users/admin/builder/spi-builder-workspace/.derivedData/ModuleCache.noindex -Xfrontend -serialize-debugging-options -profile-coverage-mapping -profile-generate -enable-testing -suppress-warnings -index-store-path /Users/admin/builder/spi-builder-workspace/.derivedData/Index.noindex/DataStore -swift-version 5 -I /Users/admin/builder/spi-builder-workspace/.derivedData/Build/Products/Debug-xros -I /Applications/Xcode-15.4.0.app/Contents/Developer/Platforms/XROS.platform/Developer/usr/lib -F /Users/admin/builder/spi-builder-workspace/.derivedData/Build/Products/Debug-xros -F /Applications/Xcode-15.4.0.app/Contents/Developer/Platforms/XROS.platform/Developer/Library/Frameworks -F /Applications/Xcode-15.4.0.app/Contents/Developer/Platforms/XROS.platform/Developer/SDKs/XROS1.2.sdk/Developer/Library/Frameworks -c -j10 -enable-batch-mode -incremental -Xcc -ivfsstatcache -Xcc /Users/admin/builder/spi-builder-workspace/.derivedData/SDKStatCaches.noindex/xros1.2-21O5565d-70e6a4b4e6ce75e0f2056db95c07d51a.sdkstatcache -output-file-map /Users/admin/builder/spi-builder-workspace/.derivedData/Build/Intermediates.noindex/swift-log.build/Debug-xros/Logging.build/Objects-normal/arm64/Logging-OutputFileMap.json -use-frontend-parseable-output -save-temps -no-color-diagnostics -serialize-diagnostics -emit-dependencies -emit-module -emit-module-path /Users/admin/builder/spi-builder-workspace/.derivedData/Build/Intermediates.noindex/swift-log.build/Debug-xros/Logging.build/Objects-normal/arm64/Logging.swiftmodule -validate-clang-modules-once -clang-build-session-file /Users/admin/builder/spi-builder-workspace/.derivedData/ModuleCache.noindex/Session.modulevalidation -Xcc -I/Users/admin/builder/spi-builder-workspace/.derivedData/Build/Intermediates.noindex/swift-log.build/Debug-xros/Logging.build/swift-overrides.hmap -emit-const-values -Xfrontend -const-gather-protocols-file -Xfrontend /Users/admin/builder/spi-builder-workspace/.derivedData/Build/Intermediates.noindex/swift-log.build/Debug-xros/Logging.build/Objects-normal/arm64/Logging_const_extract_protocols.json -Xcc -I/Users/admin/builder/spi-builder-workspace/.derivedData/Build/Products/Debug-xros/include -Xcc -I/Users/admin/builder/spi-builder-workspace/.derivedData/Build/Intermediates.noindex/swift-log.build/Debug-xros/Logging.build/DerivedSources-normal/arm64 -Xcc -I/Users/admin/builder/spi-builder-workspace/.derivedData/Build/Intermediates.noindex/swift-log.build/Debug-xros/Logging.build/DerivedSources/arm64 -Xcc -I/Users/admin/builder/spi-builder-workspace/.derivedData/Build/Intermediates.noindex/swift-log.build/Debug-xros/Logging.build/DerivedSources -Xcc -DSWIFT_PACKAGE -Xcc -DDEBUG\=1 -emit-objc-header -emit-objc-header-path /Users/admin/builder/spi-builder-workspace/.derivedData/Build/Intermediates.noindex/swift-log.build/Debug-xros/Logging.build/Objects-normal/arm64/Logging-Swift.h -working-directory /Users/admin/builder/spi-builder-workspace/.dependencies/checkouts/swift-log -experimental-emit-module-separately -disable-cmo
SwiftDriver LaunchdUtils normal arm64 com.apple.xcode.tools.swift.compiler (in target 'LaunchdUtils' from project 'CommandLineToolkit')
    cd /Users/admin/builder/spi-builder-workspace
    builtin-SwiftDriver -- /Applications/Xcode-15.4.0.app/Contents/Developer/Toolchains/XcodeDefault.xctoolchain/usr/bin/swiftc -module-name LaunchdUtils -Onone -enforce-exclusivity\=checked @/Users/admin/builder/spi-builder-workspace/.derivedData/Build/Intermediates.noindex/CommandLineToolkit.build/Debug-xros/LaunchdUtils.build/Objects-normal/arm64/LaunchdUtils.SwiftFileList -DSWIFT_PACKAGE -DDEBUG -DXcode -sdk /Applications/Xcode-15.4.0.app/Contents/Developer/Platforms/XROS.platform/Developer/SDKs/XROS1.2.sdk -target arm64-apple-xros1.0 -g -module-cache-path /Users/admin/builder/spi-builder-workspace/.derivedData/ModuleCache.noindex -Xfrontend -serialize-debugging-options -profile-coverage-mapping -profile-generate -enable-testing -index-store-path /Users/admin/builder/spi-builder-workspace/.derivedData/Index.noindex/DataStore -swift-version 5 -I /Users/admin/builder/spi-builder-workspace/.derivedData/Build/Products/Debug-xros -I /Applications/Xcode-15.4.0.app/Contents/Developer/Platforms/XROS.platform/Developer/usr/lib -F /Users/admin/builder/spi-builder-workspace/.derivedData/Build/Products/Debug-xros -F /Applications/Xcode-15.4.0.app/Contents/Developer/Platforms/XROS.platform/Developer/Library/Frameworks -F /Applications/Xcode-15.4.0.app/Contents/Developer/Platforms/XROS.platform/Developer/SDKs/XROS1.2.sdk/Developer/Library/Frameworks -c -j10 -enable-batch-mode -incremental -Xcc -ivfsstatcache -Xcc /Users/admin/builder/spi-builder-workspace/.derivedData/SDKStatCaches.noindex/xros1.2-21O5565d-70e6a4b4e6ce75e0f2056db95c07d51a.sdkstatcache -output-file-map /Users/admin/builder/spi-builder-workspace/.derivedData/Build/Intermediates.noindex/CommandLineToolkit.build/Debug-xros/LaunchdUtils.build/Objects-normal/arm64/LaunchdUtils-OutputFileMap.json -use-frontend-parseable-output -save-temps -no-color-diagnostics -serialize-diagnostics -emit-dependencies -emit-module -emit-module-path /Users/admin/builder/spi-builder-workspace/.derivedData/Build/Intermediates.noindex/CommandLineToolkit.build/Debug-xros/LaunchdUtils.build/Objects-normal/arm64/LaunchdUtils.swiftmodule -validate-clang-modules-once -clang-build-session-file /Users/admin/builder/spi-builder-workspace/.derivedData/ModuleCache.noindex/Session.modulevalidation -Xfrontend -package-name -Xfrontend spi_builder_workspace -Xcc -I/Users/admin/builder/spi-builder-workspace/.derivedData/Build/Intermediates.noindex/CommandLineToolkit.build/Debug-xros/LaunchdUtils.build/swift-overrides.hmap -emit-const-values -Xfrontend -const-gather-protocols-file -Xfrontend /Users/admin/builder/spi-builder-workspace/.derivedData/Build/Intermediates.noindex/CommandLineToolkit.build/Debug-xros/LaunchdUtils.build/Objects-normal/arm64/LaunchdUtils_const_extract_protocols.json -Xcc -I/Users/admin/builder/spi-builder-workspace/.derivedData/Build/Products/Debug-xros/include -Xcc -I/Users/admin/builder/spi-builder-workspace/.derivedData/Build/Intermediates.noindex/CommandLineToolkit.build/Debug-xros/LaunchdUtils.build/DerivedSources-normal/arm64 -Xcc -I/Users/admin/builder/spi-builder-workspace/.derivedData/Build/Intermediates.noindex/CommandLineToolkit.build/Debug-xros/LaunchdUtils.build/DerivedSources/arm64 -Xcc -I/Users/admin/builder/spi-builder-workspace/.derivedData/Build/Intermediates.noindex/CommandLineToolkit.build/Debug-xros/LaunchdUtils.build/DerivedSources -Xcc -DSWIFT_PACKAGE -Xcc -DDEBUG\=1 -emit-objc-header -emit-objc-header-path /Users/admin/builder/spi-builder-workspace/.derivedData/Build/Intermediates.noindex/CommandLineToolkit.build/Debug-xros/LaunchdUtils.build/Objects-normal/arm64/LaunchdUtils-Swift.h -working-directory /Users/admin/builder/spi-builder-workspace -experimental-emit-module-separately -disable-cmo
SwiftDriver Glob normal arm64 com.apple.xcode.tools.swift.compiler (in target 'Glob' from project 'Glob')
    cd /Users/admin/builder/spi-builder-workspace/.dependencies/checkouts/Glob
    builtin-SwiftDriver -- /Applications/Xcode-15.4.0.app/Contents/Developer/Toolchains/XcodeDefault.xctoolchain/usr/bin/swiftc -module-name Glob -Onone -enforce-exclusivity\=checked @/Users/admin/builder/spi-builder-workspace/.derivedData/Build/Intermediates.noindex/Glob.build/Debug-xros/Glob.build/Objects-normal/arm64/Glob.SwiftFileList -DSWIFT_PACKAGE -DDEBUG -DXcode -sdk /Applications/Xcode-15.4.0.app/Contents/Developer/Platforms/XROS.platform/Developer/SDKs/XROS1.2.sdk -target arm64-apple-xros1.0 -g -module-cache-path /Users/admin/builder/spi-builder-workspace/.derivedData/ModuleCache.noindex -Xfrontend -serialize-debugging-options -profile-coverage-mapping -profile-generate -enable-testing -suppress-warnings -index-store-path /Users/admin/builder/spi-builder-workspace/.derivedData/Index.noindex/DataStore -swift-version 5 -I /Users/admin/builder/spi-builder-workspace/.derivedData/Build/Products/Debug-xros -I /Applications/Xcode-15.4.0.app/Contents/Developer/Platforms/XROS.platform/Developer/usr/lib -F /Users/admin/builder/spi-builder-workspace/.derivedData/Build/Products/Debug-xros -F /Applications/Xcode-15.4.0.app/Contents/Developer/Platforms/XROS.platform/Developer/Library/Frameworks -F /Applications/Xcode-15.4.0.app/Contents/Developer/Platforms/XROS.platform/Developer/SDKs/XROS1.2.sdk/Developer/Library/Frameworks -parse-as-library -c -j10 -enable-batch-mode -incremental -Xcc -ivfsstatcache -Xcc /Users/admin/builder/spi-builder-workspace/.derivedData/SDKStatCaches.noindex/xros1.2-21O5565d-70e6a4b4e6ce75e0f2056db95c07d51a.sdkstatcache -output-file-map /Users/admin/builder/spi-builder-workspace/.derivedData/Build/Intermediates.noindex/Glob.build/Debug-xros/Glob.build/Objects-normal/arm64/Glob-OutputFileMap.json -use-frontend-parseable-output -save-temps -no-color-diagnostics -serialize-diagnostics -emit-dependencies -emit-module -emit-module-path /Users/admin/builder/spi-builder-workspace/.derivedData/Build/Intermediates.noindex/Glob.build/Debug-xros/Glob.build/Objects-normal/arm64/Glob.swiftmodule -validate-clang-modules-once -clang-build-session-file /Users/admin/builder/spi-builder-workspace/.derivedData/ModuleCache.noindex/Session.modulevalidation -Xcc -I/Users/admin/builder/spi-builder-workspace/.derivedData/Build/Intermediates.noindex/Glob.build/Debug-xros/Glob.build/swift-overrides.hmap -emit-const-values -Xfrontend -const-gather-protocols-file -Xfrontend /Users/admin/builder/spi-builder-workspace/.derivedData/Build/Intermediates.noindex/Glob.build/Debug-xros/Glob.build/Objects-normal/arm64/Glob_const_extract_protocols.json -Xcc -I/Users/admin/builder/spi-builder-workspace/.derivedData/Build/Products/Debug-xros/include -Xcc -I/Users/admin/builder/spi-builder-workspace/.derivedData/Build/Intermediates.noindex/Glob.build/Debug-xros/Glob.build/DerivedSources-normal/arm64 -Xcc -I/Users/admin/builder/spi-builder-workspace/.derivedData/Build/Intermediates.noindex/Glob.build/Debug-xros/Glob.build/DerivedSources/arm64 -Xcc -I/Users/admin/builder/spi-builder-workspace/.derivedData/Build/Intermediates.noindex/Glob.build/Debug-xros/Glob.build/DerivedSources -Xcc -DSWIFT_PACKAGE -Xcc -DDEBUG\=1 -emit-objc-header -emit-objc-header-path /Users/admin/builder/spi-builder-workspace/.derivedData/Build/Intermediates.noindex/Glob.build/Debug-xros/Glob.build/Objects-normal/arm64/Glob-Swift.h -working-directory /Users/admin/builder/spi-builder-workspace/.dependencies/checkouts/Glob -experimental-emit-module-separately -disable-cmo
SwiftDriver DI normal arm64 com.apple.xcode.tools.swift.compiler (in target 'DI' from project 'CommandLineToolkit')
    cd /Users/admin/builder/spi-builder-workspace
    builtin-SwiftDriver -- /Applications/Xcode-15.4.0.app/Contents/Developer/Toolchains/XcodeDefault.xctoolchain/usr/bin/swiftc -module-name DI -Onone -enforce-exclusivity\=checked @/Users/admin/builder/spi-builder-workspace/.derivedData/Build/Intermediates.noindex/CommandLineToolkit.build/Debug-xros/DI.build/Objects-normal/arm64/DI.SwiftFileList -DSWIFT_PACKAGE -DDEBUG -DXcode -sdk /Applications/Xcode-15.4.0.app/Contents/Developer/Platforms/XROS.platform/Developer/SDKs/XROS1.2.sdk -target arm64-apple-xros1.0 -g -module-cache-path /Users/admin/builder/spi-builder-workspace/.derivedData/ModuleCache.noindex -Xfrontend -serialize-debugging-options -profile-coverage-mapping -profile-generate -enable-testing -index-store-path /Users/admin/builder/spi-builder-workspace/.derivedData/Index.noindex/DataStore -swift-version 5 -I /Users/admin/builder/spi-builder-workspace/.derivedData/Build/Products/Debug-xros -I /Applications/Xcode-15.4.0.app/Contents/Developer/Platforms/XROS.platform/Developer/usr/lib -F /Users/admin/builder/spi-builder-workspace/.derivedData/Build/Products/Debug-xros -F /Applications/Xcode-15.4.0.app/Contents/Developer/Platforms/XROS.platform/Developer/Library/Frameworks -F /Applications/Xcode-15.4.0.app/Contents/Developer/Platforms/XROS.platform/Developer/SDKs/XROS1.2.sdk/Developer/Library/Frameworks -c -j10 -enable-batch-mode -incremental -Xcc -ivfsstatcache -Xcc /Users/admin/builder/spi-builder-workspace/.derivedData/SDKStatCaches.noindex/xros1.2-21O5565d-70e6a4b4e6ce75e0f2056db95c07d51a.sdkstatcache -output-file-map /Users/admin/builder/spi-builder-workspace/.derivedData/Build/Intermediates.noindex/CommandLineToolkit.build/Debug-xros/DI.build/Objects-normal/arm64/DI-OutputFileMap.json -use-frontend-parseable-output -save-temps -no-color-diagnostics -serialize-diagnostics -emit-dependencies -emit-module -emit-module-path /Users/admin/builder/spi-builder-workspace/.derivedData/Build/Intermediates.noindex/CommandLineToolkit.build/Debug-xros/DI.build/Objects-normal/arm64/DI.swiftmodule -validate-clang-modules-once -clang-build-session-file /Users/admin/builder/spi-builder-workspace/.derivedData/ModuleCache.noindex/Session.modulevalidation -Xfrontend -package-name -Xfrontend spi_builder_workspace -Xcc -I/Users/admin/builder/spi-builder-workspace/.derivedData/Build/Intermediates.noindex/CommandLineToolkit.build/Debug-xros/DI.build/swift-overrides.hmap -emit-const-values -Xfrontend -const-gather-protocols-file -Xfrontend /Users/admin/builder/spi-builder-workspace/.derivedData/Build/Intermediates.noindex/CommandLineToolkit.build/Debug-xros/DI.build/Objects-normal/arm64/DI_const_extract_protocols.json -Xcc -I/Users/admin/builder/spi-builder-workspace/.derivedData/Build/Products/Debug-xros/include -Xcc -I/Users/admin/builder/spi-builder-workspace/.derivedData/Build/Intermediates.noindex/CommandLineToolkit.build/Debug-xros/DI.build/DerivedSources-normal/arm64 -Xcc -I/Users/admin/builder/spi-builder-workspace/.derivedData/Build/Intermediates.noindex/CommandLineToolkit.build/Debug-xros/DI.build/DerivedSources/arm64 -Xcc -I/Users/admin/builder/spi-builder-workspace/.derivedData/Build/Intermediates.noindex/CommandLineToolkit.build/Debug-xros/DI.build/DerivedSources -Xcc -DSWIFT_PACKAGE -Xcc -DDEBUG\=1 -emit-objc-header -emit-objc-header-path /Users/admin/builder/spi-builder-workspace/.derivedData/Build/Intermediates.noindex/CommandLineToolkit.build/Debug-xros/DI.build/Objects-normal/arm64/DI-Swift.h -working-directory /Users/admin/builder/spi-builder-workspace -experimental-emit-module-separately -disable-cmo
SwiftDriver CLTLoggingModels normal arm64 com.apple.xcode.tools.swift.compiler (in target 'CLTLoggingModels' from project 'CommandLineToolkit')
    cd /Users/admin/builder/spi-builder-workspace
    builtin-SwiftDriver -- /Applications/Xcode-15.4.0.app/Contents/Developer/Toolchains/XcodeDefault.xctoolchain/usr/bin/swiftc -module-name CLTLoggingModels -Onone -enforce-exclusivity\=checked @/Users/admin/builder/spi-builder-workspace/.derivedData/Build/Intermediates.noindex/CommandLineToolkit.build/Debug-xros/CLTLoggingModels.build/Objects-normal/arm64/CLTLoggingModels.SwiftFileList -DSWIFT_PACKAGE -DDEBUG -DXcode -sdk /Applications/Xcode-15.4.0.app/Contents/Developer/Platforms/XROS.platform/Developer/SDKs/XROS1.2.sdk -target arm64-apple-xros1.0 -g -module-cache-path /Users/admin/builder/spi-builder-workspace/.derivedData/ModuleCache.noindex -Xfrontend -serialize-debugging-options -profile-coverage-mapping -profile-generate -enable-testing -index-store-path /Users/admin/builder/spi-builder-workspace/.derivedData/Index.noindex/DataStore -swift-version 5 -I /Users/admin/builder/spi-builder-workspace/.derivedData/Build/Products/Debug-xros -I /Applications/Xcode-15.4.0.app/Contents/Developer/Platforms/XROS.platform/Developer/usr/lib -F /Users/admin/builder/spi-builder-workspace/.derivedData/Build/Products/Debug-xros -F /Applications/Xcode-15.4.0.app/Contents/Developer/Platforms/XROS.platform/Developer/Library/Frameworks -F /Applications/Xcode-15.4.0.app/Contents/Developer/Platforms/XROS.platform/Developer/SDKs/XROS1.2.sdk/Developer/Library/Frameworks -c -j10 -enable-batch-mode -incremental -Xcc -ivfsstatcache -Xcc /Users/admin/builder/spi-builder-workspace/.derivedData/SDKStatCaches.noindex/xros1.2-21O5565d-70e6a4b4e6ce75e0f2056db95c07d51a.sdkstatcache -output-file-map /Users/admin/builder/spi-builder-workspace/.derivedData/Build/Intermediates.noindex/CommandLineToolkit.build/Debug-xros/CLTLoggingModels.build/Objects-normal/arm64/CLTLoggingModels-OutputFileMap.json -use-frontend-parseable-output -save-temps -no-color-diagnostics -serialize-diagnostics -emit-dependencies -emit-module -emit-module-path /Users/admin/builder/spi-builder-workspace/.derivedData/Build/Intermediates.noindex/CommandLineToolkit.build/Debug-xros/CLTLoggingModels.build/Objects-normal/arm64/CLTLoggingModels.swiftmodule -validate-clang-modules-once -clang-build-session-file /Users/admin/builder/spi-builder-workspace/.derivedData/ModuleCache.noindex/Session.modulevalidation -Xfrontend -package-name -Xfrontend spi_builder_workspace -Xcc -I/Users/admin/builder/spi-builder-workspace/.derivedData/Build/Intermediates.noindex/CommandLineToolkit.build/Debug-xros/CLTLoggingModels.build/swift-overrides.hmap -emit-const-values -Xfrontend -const-gather-protocols-file -Xfrontend /Users/admin/builder/spi-builder-workspace/.derivedData/Build/Intermediates.noindex/CommandLineToolkit.build/Debug-xros/CLTLoggingModels.build/Objects-normal/arm64/CLTLoggingModels_const_extract_protocols.json -Xcc -I/Users/admin/builder/spi-builder-workspace/.derivedData/Build/Products/Debug-xros/include -Xcc -I/Users/admin/builder/spi-builder-workspace/.derivedData/Build/Intermediates.noindex/CommandLineToolkit.build/Debug-xros/CLTLoggingModels.build/DerivedSources-normal/arm64 -Xcc -I/Users/admin/builder/spi-builder-workspace/.derivedData/Build/Intermediates.noindex/CommandLineToolkit.build/Debug-xros/CLTLoggingModels.build/DerivedSources/arm64 -Xcc -I/Users/admin/builder/spi-builder-workspace/.derivedData/Build/Intermediates.noindex/CommandLineToolkit.build/Debug-xros/CLTLoggingModels.build/DerivedSources -Xcc -DSWIFT_PACKAGE -Xcc -DDEBUG\=1 -emit-objc-header -emit-objc-header-path /Users/admin/builder/spi-builder-workspace/.derivedData/Build/Intermediates.noindex/CommandLineToolkit.build/Debug-xros/CLTLoggingModels.build/Objects-normal/arm64/CLTLoggingModels-Swift.h -working-directory /Users/admin/builder/spi-builder-workspace -experimental-emit-module-separately -disable-cmo
SwiftDriver CLTExtensions normal arm64 com.apple.xcode.tools.swift.compiler (in target 'CLTExtensions' from project 'CommandLineToolkit')
    cd /Users/admin/builder/spi-builder-workspace
    builtin-SwiftDriver -- /Applications/Xcode-15.4.0.app/Contents/Developer/Toolchains/XcodeDefault.xctoolchain/usr/bin/swiftc -module-name CLTExtensions -Onone -enforce-exclusivity\=checked @/Users/admin/builder/spi-builder-workspace/.derivedData/Build/Intermediates.noindex/CommandLineToolkit.build/Debug-xros/CLTExtensions.build/Objects-normal/arm64/CLTExtensions.SwiftFileList -DSWIFT_PACKAGE -DDEBUG -DXcode -sdk /Applications/Xcode-15.4.0.app/Contents/Developer/Platforms/XROS.platform/Developer/SDKs/XROS1.2.sdk -target arm64-apple-xros1.0 -g -module-cache-path /Users/admin/builder/spi-builder-workspace/.derivedData/ModuleCache.noindex -Xfrontend -serialize-debugging-options -profile-coverage-mapping -profile-generate -enable-testing -index-store-path /Users/admin/builder/spi-builder-workspace/.derivedData/Index.noindex/DataStore -swift-version 5 -I /Users/admin/builder/spi-builder-workspace/.derivedData/Build/Products/Debug-xros -I /Applications/Xcode-15.4.0.app/Contents/Developer/Platforms/XROS.platform/Developer/usr/lib -F /Users/admin/builder/spi-builder-workspace/.derivedData/Build/Products/Debug-xros -F /Applications/Xcode-15.4.0.app/Contents/Developer/Platforms/XROS.platform/Developer/Library/Frameworks -F /Applications/Xcode-15.4.0.app/Contents/Developer/Platforms/XROS.platform/Developer/SDKs/XROS1.2.sdk/Developer/Library/Frameworks -c -j10 -enable-batch-mode -incremental -Xcc -ivfsstatcache -Xcc /Users/admin/builder/spi-builder-workspace/.derivedData/SDKStatCaches.noindex/xros1.2-21O5565d-70e6a4b4e6ce75e0f2056db95c07d51a.sdkstatcache -output-file-map /Users/admin/builder/spi-builder-workspace/.derivedData/Build/Intermediates.noindex/CommandLineToolkit.build/Debug-xros/CLTExtensions.build/Objects-normal/arm64/CLTExtensions-OutputFileMap.json -use-frontend-parseable-output -save-temps -no-color-diagnostics -serialize-diagnostics -emit-dependencies -emit-module -emit-module-path /Users/admin/builder/spi-builder-workspace/.derivedData/Build/Intermediates.noindex/CommandLineToolkit.build/Debug-xros/CLTExtensions.build/Objects-normal/arm64/CLTExtensions.swiftmodule -validate-clang-modules-once -clang-build-session-file /Users/admin/builder/spi-builder-workspace/.derivedData/ModuleCache.noindex/Session.modulevalidation -Xfrontend -package-name -Xfrontend spi_builder_workspace -Xcc -I/Users/admin/builder/spi-builder-workspace/.derivedData/Build/Intermediates.noindex/CommandLineToolkit.build/Debug-xros/CLTExtensions.build/swift-overrides.hmap -emit-const-values -Xfrontend -const-gather-protocols-file -Xfrontend /Users/admin/builder/spi-builder-workspace/.derivedData/Build/Intermediates.noindex/CommandLineToolkit.build/Debug-xros/CLTExtensions.build/Objects-normal/arm64/CLTExtensions_const_extract_protocols.json -Xcc -I/Users/admin/builder/spi-builder-workspace/.derivedData/Build/Products/Debug-xros/include -Xcc -I/Users/admin/builder/spi-builder-workspace/.derivedData/Build/Intermediates.noindex/CommandLineToolkit.build/Debug-xros/CLTExtensions.build/DerivedSources-normal/arm64 -Xcc -I/Users/admin/builder/spi-builder-workspace/.derivedData/Build/Intermediates.noindex/CommandLineToolkit.build/Debug-xros/CLTExtensions.build/DerivedSources/arm64 -Xcc -I/Users/admin/builder/spi-builder-workspace/.derivedData/Build/Intermediates.noindex/CommandLineToolkit.build/Debug-xros/CLTExtensions.build/DerivedSources -Xcc -DSWIFT_PACKAGE -Xcc -DDEBUG\=1 -emit-objc-header -emit-objc-header-path /Users/admin/builder/spi-builder-workspace/.derivedData/Build/Intermediates.noindex/CommandLineToolkit.build/Debug-xros/CLTExtensions.build/Objects-normal/arm64/CLTExtensions-Swift.h -working-directory /Users/admin/builder/spi-builder-workspace -experimental-emit-module-separately -disable-cmo
SwiftDriver AtomicModels normal arm64 com.apple.xcode.tools.swift.compiler (in target 'AtomicModels' from project 'CommandLineToolkit')
    cd /Users/admin/builder/spi-builder-workspace
    builtin-SwiftDriver -- /Applications/Xcode-15.4.0.app/Contents/Developer/Toolchains/XcodeDefault.xctoolchain/usr/bin/swiftc -module-name AtomicModels -Onone -enforce-exclusivity\=checked @/Users/admin/builder/spi-builder-workspace/.derivedData/Build/Intermediates.noindex/CommandLineToolkit.build/Debug-xros/AtomicModels.build/Objects-normal/arm64/AtomicModels.SwiftFileList -DSWIFT_PACKAGE -DDEBUG -DXcode -sdk /Applications/Xcode-15.4.0.app/Contents/Developer/Platforms/XROS.platform/Developer/SDKs/XROS1.2.sdk -target arm64-apple-xros1.0 -g -module-cache-path /Users/admin/builder/spi-builder-workspace/.derivedData/ModuleCache.noindex -Xfrontend -serialize-debugging-options -profile-coverage-mapping -profile-generate -enable-testing -index-store-path /Users/admin/builder/spi-builder-workspace/.derivedData/Index.noindex/DataStore -swift-version 5 -I /Users/admin/builder/spi-builder-workspace/.derivedData/Build/Products/Debug-xros -I /Applications/Xcode-15.4.0.app/Contents/Developer/Platforms/XROS.platform/Developer/usr/lib -F /Users/admin/builder/spi-builder-workspace/.derivedData/Build/Products/Debug-xros -F /Applications/Xcode-15.4.0.app/Contents/Developer/Platforms/XROS.platform/Developer/Library/Frameworks -F /Applications/Xcode-15.4.0.app/Contents/Developer/Platforms/XROS.platform/Developer/SDKs/XROS1.2.sdk/Developer/Library/Frameworks -parse-as-library -c -j10 -enable-batch-mode -incremental -Xcc -ivfsstatcache -Xcc /Users/admin/builder/spi-builder-workspace/.derivedData/SDKStatCaches.noindex/xros1.2-21O5565d-70e6a4b4e6ce75e0f2056db95c07d51a.sdkstatcache -output-file-map /Users/admin/builder/spi-builder-workspace/.derivedData/Build/Intermediates.noindex/CommandLineToolkit.build/Debug-xros/AtomicModels.build/Objects-normal/arm64/AtomicModels-OutputFileMap.json -use-frontend-parseable-output -save-temps -no-color-diagnostics -serialize-diagnostics -emit-dependencies -emit-module -emit-module-path /Users/admin/builder/spi-builder-workspace/.derivedData/Build/Intermediates.noindex/CommandLineToolkit.build/Debug-xros/AtomicModels.build/Objects-normal/arm64/AtomicModels.swiftmodule -validate-clang-modules-once -clang-build-session-file /Users/admin/builder/spi-builder-workspace/.derivedData/ModuleCache.noindex/Session.modulevalidation -Xfrontend -package-name -Xfrontend spi_builder_workspace -Xcc -I/Users/admin/builder/spi-builder-workspace/.derivedData/Build/Intermediates.noindex/CommandLineToolkit.build/Debug-xros/AtomicModels.build/swift-overrides.hmap -emit-const-values -Xfrontend -const-gather-protocols-file -Xfrontend /Users/admin/builder/spi-builder-workspace/.derivedData/Build/Intermediates.noindex/CommandLineToolkit.build/Debug-xros/AtomicModels.build/Objects-normal/arm64/AtomicModels_const_extract_protocols.json -Xcc -I/Users/admin/builder/spi-builder-workspace/.derivedData/Build/Products/Debug-xros/include -Xcc -I/Users/admin/builder/spi-builder-workspace/.derivedData/Build/Intermediates.noindex/CommandLineToolkit.build/Debug-xros/AtomicModels.build/DerivedSources-normal/arm64 -Xcc -I/Users/admin/builder/spi-builder-workspace/.derivedData/Build/Intermediates.noindex/CommandLineToolkit.build/Debug-xros/AtomicModels.build/DerivedSources/arm64 -Xcc -I/Users/admin/builder/spi-builder-workspace/.derivedData/Build/Intermediates.noindex/CommandLineToolkit.build/Debug-xros/AtomicModels.build/DerivedSources -Xcc -DSWIFT_PACKAGE -Xcc -DDEBUG\=1 -emit-objc-header -emit-objc-header-path /Users/admin/builder/spi-builder-workspace/.derivedData/Build/Intermediates.noindex/CommandLineToolkit.build/Debug-xros/AtomicModels.build/Objects-normal/arm64/AtomicModels-Swift.h -working-directory /Users/admin/builder/spi-builder-workspace -experimental-emit-module-separately -disable-cmo
SwiftEmitModule normal arm64 Emitting\ module\ for\ Waitable (in target 'Waitable' from project 'CommandLineToolkit')
    cd /Users/admin/builder/spi-builder-workspace
    builtin-swiftTaskExecution -- /Applications/Xcode-15.4.0.app/Contents/Developer/Toolchains/XcodeDefault.xctoolchain/usr/bin/swift-frontend -frontend -emit-module -experimental-skip-non-inlinable-function-bodies-without-types /Users/admin/builder/spi-builder-workspace/Sources/Waitable/Waitable.swift -target arm64-apple-xros1.0 -Xllvm -aarch64-use-tbi -enable-objc-interop -stack-check -sdk /Applications/Xcode-15.4.0.app/Contents/Developer/Platforms/XROS.platform/Developer/SDKs/XROS1.2.sdk -I /Users/admin/builder/spi-builder-workspace/.derivedData/Build/Products/Debug-xros -I /Applications/Xcode-15.4.0.app/Contents/Developer/Platforms/XROS.platform/Developer/usr/lib -F /Users/admin/builder/spi-builder-workspace/.derivedData/Build/Products/Debug-xros -F /Applications/Xcode-15.4.0.app/Contents/Developer/Platforms/XROS.platform/Developer/Library/Frameworks -F /Applications/Xcode-15.4.0.app/Contents/Developer/Platforms/XROS.platform/Developer/SDKs/XROS1.2.sdk/Developer/Library/Frameworks -no-color-diagnostics -enable-testing -g -module-cache-path /Users/admin/builder/spi-builder-workspace/.derivedData/ModuleCache.noindex -profile-generate -profile-coverage-mapping -swift-version 5 -enforce-exclusivity\=checked -Onone -D SWIFT_PACKAGE -D DEBUG -D Xcode -serialize-debugging-options -package-name spi_builder_workspace -const-gather-protocols-file /Users/admin/builder/spi-builder-workspace/.derivedData/Build/Intermediates.noindex/CommandLineToolkit.build/Debug-xros/Waitable.build/Objects-normal/arm64/Waitable_const_extract_protocols.json -empty-abi-descriptor -validate-clang-modules-once -clang-build-session-file /Users/admin/builder/spi-builder-workspace/.derivedData/ModuleCache.noindex/Session.modulevalidation -Xcc -working-directory -Xcc /Users/admin/builder/spi-builder-workspace -resource-dir /Applications/Xcode-15.4.0.app/Contents/Developer/Toolchains/XcodeDefault.xctoolchain/usr/lib/swift -enable-anonymous-context-mangled-names -Xcc -ivfsstatcache -Xcc /Users/admin/builder/spi-builder-workspace/.derivedData/SDKStatCaches.noindex/xros1.2-21O5565d-70e6a4b4e6ce75e0f2056db95c07d51a.sdkstatcache -Xcc -I/Users/admin/builder/spi-builder-workspace/.derivedData/Build/Intermediates.noindex/CommandLineToolkit.build/Debug-xros/Waitable.build/swift-overrides.hmap -Xcc -I/Users/admin/builder/spi-builder-workspace/.derivedData/Build/Products/Debug-xros/include -Xcc -I/Users/admin/builder/spi-builder-workspace/.derivedData/Build/Intermediates.noindex/CommandLineToolkit.build/Debug-xros/Waitable.build/DerivedSources-normal/arm64 -Xcc -I/Users/admin/builder/spi-builder-workspace/.derivedData/Build/Intermediates.noindex/CommandLineToolkit.build/Debug-xros/Waitable.build/DerivedSources/arm64 -Xcc -I/Users/admin/builder/spi-builder-workspace/.derivedData/Build/Intermediates.noindex/CommandLineToolkit.build/Debug-xros/Waitable.build/DerivedSources -Xcc -DSWIFT_PACKAGE -Xcc -DDEBUG\=1 -module-name Waitable -disable-clang-spi -target-sdk-version 1.2 -target-sdk-name xros1.2 -external-plugin-path /Applications/Xcode-15.4.0.app/Contents/Developer/Platforms/XROS.platform/Developer/SDKs/XROS1.2.sdk/usr/lib/swift/host/plugins\#/Applications/Xcode-15.4.0.app/Contents/Developer/Platforms/XROS.platform/Developer/SDKs/XROS1.2.sdk/usr/bin/swift-plugin-server -external-plugin-path /Applications/Xcode-15.4.0.app/Contents/Developer/Platforms/XROS.platform/Developer/SDKs/XROS1.2.sdk/usr/local/lib/swift/host/plugins\#/Applications/Xcode-15.4.0.app/Contents/Developer/Platforms/XROS.platform/Developer/SDKs/XROS1.2.sdk/usr/bin/swift-plugin-server -external-plugin-path /Applications/Xcode-15.4.0.app/Contents/Developer/Platforms/XROS.platform/Developer/usr/lib/swift/host/plugins\#/Applications/Xcode-15.4.0.app/Contents/Developer/Platforms/XROS.platform/Developer/usr/bin/swift-plugin-server -external-plugin-path /Applications/Xcode-15.4.0.app/Contents/Developer/Platforms/XROS.platform/Developer/usr/local/lib/swift/host/plugins\#/Applications/Xcode-15.4.0.app/Contents/Developer/Platforms/XROS.platform/Developer/usr/bin/swift-plugin-server -plugin-path /Applications/Xcode-15.4.0.app/Contents/Developer/Toolchains/XcodeDefault.xctoolchain/usr/lib/swift/host/plugins -plugin-path /Applications/Xcode-15.4.0.app/Contents/Developer/Toolchains/XcodeDefault.xctoolchain/usr/local/lib/swift/host/plugins -emit-module-doc-path /Users/admin/builder/spi-builder-workspace/.derivedData/Build/Intermediates.noindex/CommandLineToolkit.build/Debug-xros/Waitable.build/Objects-normal/arm64/Waitable.swiftdoc -emit-module-source-info-path /Users/admin/builder/spi-builder-workspace/.derivedData/Build/Intermediates.noindex/CommandLineToolkit.build/Debug-xros/Waitable.build/Objects-normal/arm64/Waitable.swiftsourceinfo -emit-objc-header-path /Users/admin/builder/spi-builder-workspace/.derivedData/Build/Intermediates.noindex/CommandLineToolkit.build/Debug-xros/Waitable.build/Objects-normal/arm64/Waitable-Swift.h -serialize-diagnostics-path /Users/admin/builder/spi-builder-workspace/.derivedData/Build/Intermediates.noindex/CommandLineToolkit.build/Debug-xros/Waitable.build/Objects-normal/arm64/Waitable-master-emit-module.dia -emit-dependencies-path /Users/admin/builder/spi-builder-workspace/.derivedData/Build/Intermediates.noindex/CommandLineToolkit.build/Debug-xros/Waitable.build/Objects-normal/arm64/Waitable-master-emit-module.d -parse-as-library -o /Users/admin/builder/spi-builder-workspace/.derivedData/Build/Intermediates.noindex/CommandLineToolkit.build/Debug-xros/Waitable.build/Objects-normal/arm64/Waitable.swiftmodule -emit-abi-descriptor-path /Users/admin/builder/spi-builder-workspace/.derivedData/Build/Intermediates.noindex/CommandLineToolkit.build/Debug-xros/Waitable.build/Objects-normal/arm64/Waitable.abi.json
SwiftEmitModule normal arm64 Emitting\ module\ for\ URLSessionTestHelpers (in target 'URLSessionTestHelpers' from project 'CommandLineToolkit')
    cd /Users/admin/builder/spi-builder-workspace
    builtin-swiftTaskExecution -- /Applications/Xcode-15.4.0.app/Contents/Developer/Toolchains/XcodeDefault.xctoolchain/usr/bin/swift-frontend -frontend -emit-module -experimental-skip-non-inlinable-function-bodies-without-types /Users/admin/builder/spi-builder-workspace/Tests/URLSessionTestHelpers/FakeURLSession.swift -target arm64-apple-xros1.0 -Xllvm -aarch64-use-tbi -enable-objc-interop -stack-check -sdk /Applications/Xcode-15.4.0.app/Contents/Developer/Platforms/XROS.platform/Developer/SDKs/XROS1.2.sdk -I /Users/admin/builder/spi-builder-workspace/.derivedData/Build/Products/Debug-xros -I /Applications/Xcode-15.4.0.app/Contents/Developer/Platforms/XROS.platform/Developer/usr/lib -F /Users/admin/builder/spi-builder-workspace/.derivedData/Build/Products/Debug-xros -F /Applications/Xcode-15.4.0.app/Contents/Developer/Platforms/XROS.platform/Developer/Library/Frameworks -F /Applications/Xcode-15.4.0.app/Contents/Developer/Platforms/XROS.platform/Developer/SDKs/XROS1.2.sdk/Developer/Library/Frameworks -no-color-diagnostics -enable-testing -g -module-cache-path /Users/admin/builder/spi-builder-workspace/.derivedData/ModuleCache.noindex -profile-generate -profile-coverage-mapping -swift-version 5 -enforce-exclusivity\=checked -Onone -D SWIFT_PACKAGE -D DEBUG -D Xcode -serialize-debugging-options -package-name spi_builder_workspace -const-gather-protocols-file /Users/admin/builder/spi-builder-workspace/.derivedData/Build/Intermediates.noindex/CommandLineToolkit.build/Debug-xros/URLSessionTestHelpers.build/Objects-normal/arm64/URLSessionTestHelpers_const_extract_protocols.json -empty-abi-descriptor -validate-clang-modules-once -clang-build-session-file /Users/admin/builder/spi-builder-workspace/.derivedData/ModuleCache.noindex/Session.modulevalidation -Xcc -working-directory -Xcc /Users/admin/builder/spi-builder-workspace -resource-dir /Applications/Xcode-15.4.0.app/Contents/Developer/Toolchains/XcodeDefault.xctoolchain/usr/lib/swift -enable-anonymous-context-mangled-names -Xcc -ivfsstatcache -Xcc /Users/admin/builder/spi-builder-workspace/.derivedData/SDKStatCaches.noindex/xros1.2-21O5565d-70e6a4b4e6ce75e0f2056db95c07d51a.sdkstatcache -Xcc -I/Users/admin/builder/spi-builder-workspace/.derivedData/Build/Intermediates.noindex/CommandLineToolkit.build/Debug-xros/URLSessionTestHelpers.build/swift-overrides.hmap -Xcc -I/Users/admin/builder/spi-builder-workspace/.derivedData/Build/Products/Debug-xros/include -Xcc -I/Users/admin/builder/spi-builder-workspace/.derivedData/Build/Intermediates.noindex/CommandLineToolkit.build/Debug-xros/URLSessionTestHelpers.build/DerivedSources-normal/arm64 -Xcc -I/Users/admin/builder/spi-builder-workspace/.derivedData/Build/Intermediates.noindex/CommandLineToolkit.build/Debug-xros/URLSessionTestHelpers.build/DerivedSources/arm64 -Xcc -I/Users/admin/builder/spi-builder-workspace/.derivedData/Build/Intermediates.noindex/CommandLineToolkit.build/Debug-xros/URLSessionTestHelpers.build/DerivedSources -Xcc -DSWIFT_PACKAGE -Xcc -DDEBUG\=1 -module-name URLSessionTestHelpers -disable-clang-spi -target-sdk-version 1.2 -target-sdk-name xros1.2 -external-plugin-path /Applications/Xcode-15.4.0.app/Contents/Developer/Platforms/XROS.platform/Developer/SDKs/XROS1.2.sdk/usr/lib/swift/host/plugins\#/Applications/Xcode-15.4.0.app/Contents/Developer/Platforms/XROS.platform/Developer/SDKs/XROS1.2.sdk/usr/bin/swift-plugin-server -external-plugin-path /Applications/Xcode-15.4.0.app/Contents/Developer/Platforms/XROS.platform/Developer/SDKs/XROS1.2.sdk/usr/local/lib/swift/host/plugins\#/Applications/Xcode-15.4.0.app/Contents/Developer/Platforms/XROS.platform/Developer/SDKs/XROS1.2.sdk/usr/bin/swift-plugin-server -external-plugin-path /Applications/Xcode-15.4.0.app/Contents/Developer/Platforms/XROS.platform/Developer/usr/lib/swift/host/plugins\#/Applications/Xcode-15.4.0.app/Contents/Developer/Platforms/XROS.platform/Developer/usr/bin/swift-plugin-server -external-plugin-path /Applications/Xcode-15.4.0.app/Contents/Developer/Platforms/XROS.platform/Developer/usr/local/lib/swift/host/plugins\#/Applications/Xcode-15.4.0.app/Contents/Developer/Platforms/XROS.platform/Developer/usr/bin/swift-plugin-server -plugin-path /Applications/Xcode-15.4.0.app/Contents/Developer/Toolchains/XcodeDefault.xctoolchain/usr/lib/swift/host/plugins -plugin-path /Applications/Xcode-15.4.0.app/Contents/Developer/Toolchains/XcodeDefault.xctoolchain/usr/local/lib/swift/host/plugins -emit-module-doc-path /Users/admin/builder/spi-builder-workspace/.derivedData/Build/Intermediates.noindex/CommandLineToolkit.build/Debug-xros/URLSessionTestHelpers.build/Objects-normal/arm64/URLSessionTestHelpers.swiftdoc -emit-module-source-info-path /Users/admin/builder/spi-builder-workspace/.derivedData/Build/Intermediates.noindex/CommandLineToolkit.build/Debug-xros/URLSessionTestHelpers.build/Objects-normal/arm64/URLSessionTestHelpers.swiftsourceinfo -emit-objc-header-path /Users/admin/builder/spi-builder-workspace/.derivedData/Build/Intermediates.noindex/CommandLineToolkit.build/Debug-xros/URLSessionTestHelpers.build/Objects-normal/arm64/URLSessionTestHelpers-Swift.h -serialize-diagnostics-path /Users/admin/builder/spi-builder-workspace/.derivedData/Build/Intermediates.noindex/CommandLineToolkit.build/Debug-xros/URLSessionTestHelpers.build/Objects-normal/arm64/URLSessionTestHelpers-master-emit-module.dia -emit-dependencies-path /Users/admin/builder/spi-builder-workspace/.derivedData/Build/Intermediates.noindex/CommandLineToolkit.build/Debug-xros/URLSessionTestHelpers.build/Objects-normal/arm64/URLSessionTestHelpers-master-emit-module.d -parse-as-library -o /Users/admin/builder/spi-builder-workspace/.derivedData/Build/Intermediates.noindex/CommandLineToolkit.build/Debug-xros/URLSessionTestHelpers.build/Objects-normal/arm64/URLSessionTestHelpers.swiftmodule -emit-abi-descriptor-path /Users/admin/builder/spi-builder-workspace/.derivedData/Build/Intermediates.noindex/CommandLineToolkit.build/Debug-xros/URLSessionTestHelpers.build/Objects-normal/arm64/URLSessionTestHelpers.abi.json
SwiftEmitModule normal arm64 Emitting\ module\ for\ Timer (in target 'Timer' from project 'CommandLineToolkit')
    cd /Users/admin/builder/spi-builder-workspace
    builtin-swiftTaskExecution -- /Applications/Xcode-15.4.0.app/Contents/Developer/Toolchains/XcodeDefault.xctoolchain/usr/bin/swift-frontend -frontend -emit-module -experimental-skip-non-inlinable-function-bodies-without-types /Users/admin/builder/spi-builder-workspace/Sources/Timer/DispatchBasedTimer.swift -target arm64-apple-xros1.0 -Xllvm -aarch64-use-tbi -enable-objc-interop -stack-check -sdk /Applications/Xcode-15.4.0.app/Contents/Developer/Platforms/XROS.platform/Developer/SDKs/XROS1.2.sdk -I /Users/admin/builder/spi-builder-workspace/.derivedData/Build/Products/Debug-xros -I /Applications/Xcode-15.4.0.app/Contents/Developer/Platforms/XROS.platform/Developer/usr/lib -F /Users/admin/builder/spi-builder-workspace/.derivedData/Build/Products/Debug-xros -F /Applications/Xcode-15.4.0.app/Contents/Developer/Platforms/XROS.platform/Developer/Library/Frameworks -F /Applications/Xcode-15.4.0.app/Contents/Developer/Platforms/XROS.platform/Developer/SDKs/XROS1.2.sdk/Developer/Library/Frameworks -no-color-diagnostics -enable-testing -g -module-cache-path /Users/admin/builder/spi-builder-workspace/.derivedData/ModuleCache.noindex -profile-generate -profile-coverage-mapping -swift-version 5 -enforce-exclusivity\=checked -Onone -D SWIFT_PACKAGE -D DEBUG -D Xcode -serialize-debugging-options -package-name spi_builder_workspace -const-gather-protocols-file /Users/admin/builder/spi-builder-workspace/.derivedData/Build/Intermediates.noindex/CommandLineToolkit.build/Debug-xros/Timer.build/Objects-normal/arm64/Timer_const_extract_protocols.json -empty-abi-descriptor -validate-clang-modules-once -clang-build-session-file /Users/admin/builder/spi-builder-workspace/.derivedData/ModuleCache.noindex/Session.modulevalidation -Xcc -working-directory -Xcc /Users/admin/builder/spi-builder-workspace -resource-dir /Applications/Xcode-15.4.0.app/Contents/Developer/Toolchains/XcodeDefault.xctoolchain/usr/lib/swift -enable-anonymous-context-mangled-names -Xcc -ivfsstatcache -Xcc /Users/admin/builder/spi-builder-workspace/.derivedData/SDKStatCaches.noindex/xros1.2-21O5565d-70e6a4b4e6ce75e0f2056db95c07d51a.sdkstatcache -Xcc -I/Users/admin/builder/spi-builder-workspace/.derivedData/Build/Intermediates.noindex/CommandLineToolkit.build/Debug-xros/Timer.build/swift-overrides.hmap -Xcc -I/Users/admin/builder/spi-builder-workspace/.derivedData/Build/Products/Debug-xros/include -Xcc -I/Users/admin/builder/spi-builder-workspace/.derivedData/Build/Intermediates.noindex/CommandLineToolkit.build/Debug-xros/Timer.build/DerivedSources-normal/arm64 -Xcc -I/Users/admin/builder/spi-builder-workspace/.derivedData/Build/Intermediates.noindex/CommandLineToolkit.build/Debug-xros/Timer.build/DerivedSources/arm64 -Xcc -I/Users/admin/builder/spi-builder-workspace/.derivedData/Build/Intermediates.noindex/CommandLineToolkit.build/Debug-xros/Timer.build/DerivedSources -Xcc -DSWIFT_PACKAGE -Xcc -DDEBUG\=1 -module-name Timer -disable-clang-spi -target-sdk-version 1.2 -target-sdk-name xros1.2 -external-plugin-path /Applications/Xcode-15.4.0.app/Contents/Developer/Platforms/XROS.platform/Developer/SDKs/XROS1.2.sdk/usr/lib/swift/host/plugins\#/Applications/Xcode-15.4.0.app/Contents/Developer/Platforms/XROS.platform/Developer/SDKs/XROS1.2.sdk/usr/bin/swift-plugin-server -external-plugin-path /Applications/Xcode-15.4.0.app/Contents/Developer/Platforms/XROS.platform/Developer/SDKs/XROS1.2.sdk/usr/local/lib/swift/host/plugins\#/Applications/Xcode-15.4.0.app/Contents/Developer/Platforms/XROS.platform/Developer/SDKs/XROS1.2.sdk/usr/bin/swift-plugin-server -external-plugin-path /Applications/Xcode-15.4.0.app/Contents/Developer/Platforms/XROS.platform/Developer/usr/lib/swift/host/plugins\#/Applications/Xcode-15.4.0.app/Contents/Developer/Platforms/XROS.platform/Developer/usr/bin/swift-plugin-server -external-plugin-path /Applications/Xcode-15.4.0.app/Contents/Developer/Platforms/XROS.platform/Developer/usr/local/lib/swift/host/plugins\#/Applications/Xcode-15.4.0.app/Contents/Developer/Platforms/XROS.platform/Developer/usr/bin/swift-plugin-server -plugin-path /Applications/Xcode-15.4.0.app/Contents/Developer/Toolchains/XcodeDefault.xctoolchain/usr/lib/swift/host/plugins -plugin-path /Applications/Xcode-15.4.0.app/Contents/Developer/Toolchains/XcodeDefault.xctoolchain/usr/local/lib/swift/host/plugins -emit-module-doc-path /Users/admin/builder/spi-builder-workspace/.derivedData/Build/Intermediates.noindex/CommandLineToolkit.build/Debug-xros/Timer.build/Objects-normal/arm64/Timer.swiftdoc -emit-module-source-info-path /Users/admin/builder/spi-builder-workspace/.derivedData/Build/Intermediates.noindex/CommandLineToolkit.build/Debug-xros/Timer.build/Objects-normal/arm64/Timer.swiftsourceinfo -emit-objc-header-path /Users/admin/builder/spi-builder-workspace/.derivedData/Build/Intermediates.noindex/CommandLineToolkit.build/Debug-xros/Timer.build/Objects-normal/arm64/Timer-Swift.h -serialize-diagnostics-path /Users/admin/builder/spi-builder-workspace/.derivedData/Build/Intermediates.noindex/CommandLineToolkit.build/Debug-xros/Timer.build/Objects-normal/arm64/Timer-master-emit-module.dia -emit-dependencies-path /Users/admin/builder/spi-builder-workspace/.derivedData/Build/Intermediates.noindex/CommandLineToolkit.build/Debug-xros/Timer.build/Objects-normal/arm64/Timer-master-emit-module.d -parse-as-library -o /Users/admin/builder/spi-builder-workspace/.derivedData/Build/Intermediates.noindex/CommandLineToolkit.build/Debug-xros/Timer.build/Objects-normal/arm64/Timer.swiftmodule -emit-abi-descriptor-path /Users/admin/builder/spi-builder-workspace/.derivedData/Build/Intermediates.noindex/CommandLineToolkit.build/Debug-xros/Timer.build/Objects-normal/arm64/Timer.abi.json
SwiftEmitModule normal arm64 Emitting\ module\ for\ Socket (in target 'Socket' from project 'Socket')
    cd /Users/admin/builder/spi-builder-workspace/.dependencies/checkouts/BlueSocket
    builtin-swiftTaskExecution -- /Applications/Xcode-15.4.0.app/Contents/Developer/Toolchains/XcodeDefault.xctoolchain/usr/bin/swift-frontend -frontend -emit-module -experimental-skip-non-inlinable-function-bodies-without-types /Users/admin/builder/spi-builder-workspace/.dependencies/checkouts/BlueSocket/Sources/Socket/Socket.swift /Users/admin/builder/spi-builder-workspace/.dependencies/checkouts/BlueSocket/Sources/Socket/SocketProtocols.swift /Users/admin/builder/spi-builder-workspace/.dependencies/checkouts/BlueSocket/Sources/Socket/SocketUtils.swift -target arm64-apple-xros1.0 -Xllvm -aarch64-use-tbi -enable-objc-interop -stack-check -sdk /Applications/Xcode-15.4.0.app/Contents/Developer/Platforms/XROS.platform/Developer/SDKs/XROS1.2.sdk -I /Users/admin/builder/spi-builder-workspace/.derivedData/Build/Products/Debug-xros -I /Applications/Xcode-15.4.0.app/Contents/Developer/Platforms/XROS.platform/Developer/usr/lib -F /Users/admin/builder/spi-builder-workspace/.derivedData/Build/Products/Debug-xros -F /Applications/Xcode-15.4.0.app/Contents/Developer/Platforms/XROS.platform/Developer/Library/Frameworks -F /Applications/Xcode-15.4.0.app/Contents/Developer/Platforms/XROS.platform/Developer/SDKs/XROS1.2.sdk/Developer/Library/Frameworks -no-color-diagnostics -enable-testing -g -module-cache-path /Users/admin/builder/spi-builder-workspace/.derivedData/ModuleCache.noindex -suppress-warnings -profile-generate -profile-coverage-mapping -swift-version 5 -enforce-exclusivity\=checked -Onone -D SWIFT_PACKAGE -D DEBUG -D Xcode -serialize-debugging-options -const-gather-protocols-file /Users/admin/builder/spi-builder-workspace/.derivedData/Build/Intermediates.noindex/Socket.build/Debug-xros/Socket.build/Objects-normal/arm64/Socket_const_extract_protocols.json -empty-abi-descriptor -validate-clang-modules-once -clang-build-session-file /Users/admin/builder/spi-builder-workspace/.derivedData/ModuleCache.noindex/Session.modulevalidation -Xcc -working-directory -Xcc /Users/admin/builder/spi-builder-workspace/.dependencies/checkouts/BlueSocket -resource-dir /Applications/Xcode-15.4.0.app/Contents/Developer/Toolchains/XcodeDefault.xctoolchain/usr/lib/swift -enable-anonymous-context-mangled-names -Xcc -ivfsstatcache -Xcc /Users/admin/builder/spi-builder-workspace/.derivedData/SDKStatCaches.noindex/xros1.2-21O5565d-70e6a4b4e6ce75e0f2056db95c07d51a.sdkstatcache -Xcc -I/Users/admin/builder/spi-builder-workspace/.derivedData/Build/Intermediates.noindex/Socket.build/Debug-xros/Socket.build/swift-overrides.hmap -Xcc -I/Users/admin/builder/spi-builder-workspace/.derivedData/Build/Products/Debug-xros/include -Xcc -I/Users/admin/builder/spi-builder-workspace/.derivedData/Build/Intermediates.noindex/Socket.build/Debug-xros/Socket.build/DerivedSources-normal/arm64 -Xcc -I/Users/admin/builder/spi-builder-workspace/.derivedData/Build/Intermediates.noindex/Socket.build/Debug-xros/Socket.build/DerivedSources/arm64 -Xcc -I/Users/admin/builder/spi-builder-workspace/.derivedData/Build/Intermediates.noindex/Socket.build/Debug-xros/Socket.build/DerivedSources -Xcc -DSWIFT_PACKAGE -Xcc -DDEBUG\=1 -module-name Socket -disable-clang-spi -target-sdk-version 1.2 -target-sdk-name xros1.2 -external-plugin-path /Applications/Xcode-15.4.0.app/Contents/Developer/Platforms/XROS.platform/Developer/SDKs/XROS1.2.sdk/usr/lib/swift/host/plugins\#/Applications/Xcode-15.4.0.app/Contents/Developer/Platforms/XROS.platform/Developer/SDKs/XROS1.2.sdk/usr/bin/swift-plugin-server -external-plugin-path /Applications/Xcode-15.4.0.app/Contents/Developer/Platforms/XROS.platform/Developer/SDKs/XROS1.2.sdk/usr/local/lib/swift/host/plugins\#/Applications/Xcode-15.4.0.app/Contents/Developer/Platforms/XROS.platform/Developer/SDKs/XROS1.2.sdk/usr/bin/swift-plugin-server -external-plugin-path /Applications/Xcode-15.4.0.app/Contents/Developer/Platforms/XROS.platform/Developer/usr/lib/swift/host/plugins\#/Applications/Xcode-15.4.0.app/Contents/Developer/Platforms/XROS.platform/Developer/usr/bin/swift-plugin-server -external-plugin-path /Applications/Xcode-15.4.0.app/Contents/Developer/Platforms/XROS.platform/Developer/usr/local/lib/swift/host/plugins\#/Applications/Xcode-15.4.0.app/Contents/Developer/Platforms/XROS.platform/Developer/usr/bin/swift-plugin-server -plugin-path /Applications/Xcode-15.4.0.app/Contents/Developer/Toolchains/XcodeDefault.xctoolchain/usr/lib/swift/host/plugins -plugin-path /Applications/Xcode-15.4.0.app/Contents/Developer/Toolchains/XcodeDefault.xctoolchain/usr/local/lib/swift/host/plugins -emit-module-doc-path /Users/admin/builder/spi-builder-workspace/.derivedData/Build/Intermediates.noindex/Socket.build/Debug-xros/Socket.build/Objects-normal/arm64/Socket.swiftdoc -emit-module-source-info-path /Users/admin/builder/spi-builder-workspace/.derivedData/Build/Intermediates.noindex/Socket.build/Debug-xros/Socket.build/Objects-normal/arm64/Socket.swiftsourceinfo -emit-objc-header-path /Users/admin/builder/spi-builder-workspace/.derivedData/Build/Intermediates.noindex/Socket.build/Debug-xros/Socket.build/Objects-normal/arm64/Socket-Swift.h -serialize-diagnostics-path /Users/admin/builder/spi-builder-workspace/.derivedData/Build/Intermediates.noindex/Socket.build/Debug-xros/Socket.build/Objects-normal/arm64/Socket-master-emit-module.dia -emit-dependencies-path /Users/admin/builder/spi-builder-workspace/.derivedData/Build/Intermediates.noindex/Socket.build/Debug-xros/Socket.build/Objects-normal/arm64/Socket-master-emit-module.d -o /Users/admin/builder/spi-builder-workspace/.derivedData/Build/Intermediates.noindex/Socket.build/Debug-xros/Socket.build/Objects-normal/arm64/Socket.swiftmodule -emit-abi-descriptor-path /Users/admin/builder/spi-builder-workspace/.derivedData/Build/Intermediates.noindex/Socket.build/Debug-xros/Socket.build/Objects-normal/arm64/Socket.abi.json
SwiftEmitModule normal arm64 Emitting\ module\ for\ Signals (in target 'Signals' from project 'Signals')
    cd /Users/admin/builder/spi-builder-workspace/.dependencies/checkouts/BlueSignals
    builtin-swiftTaskExecution -- /Applications/Xcode-15.4.0.app/Contents/Developer/Toolchains/XcodeDefault.xctoolchain/usr/bin/swift-frontend -frontend -emit-module -experimental-skip-non-inlinable-function-bodies-without-types /Users/admin/builder/spi-builder-workspace/.dependencies/checkouts/BlueSignals/Sources/Signals/Signals.swift -target arm64-apple-xros1.0 -Xllvm -aarch64-use-tbi -enable-objc-interop -stack-check -sdk /Applications/Xcode-15.4.0.app/Contents/Developer/Platforms/XROS.platform/Developer/SDKs/XROS1.2.sdk -I /Users/admin/builder/spi-builder-workspace/.derivedData/Build/Products/Debug-xros -I /Applications/Xcode-15.4.0.app/Contents/Developer/Platforms/XROS.platform/Developer/usr/lib -F /Users/admin/builder/spi-builder-workspace/.derivedData/Build/Products/Debug-xros -F /Applications/Xcode-15.4.0.app/Contents/Developer/Platforms/XROS.platform/Developer/Library/Frameworks -F /Applications/Xcode-15.4.0.app/Contents/Developer/Platforms/XROS.platform/Developer/SDKs/XROS1.2.sdk/Developer/Library/Frameworks -no-color-diagnostics -enable-testing -g -module-cache-path /Users/admin/builder/spi-builder-workspace/.derivedData/ModuleCache.noindex -suppress-warnings -profile-generate -profile-coverage-mapping -swift-version 5 -enforce-exclusivity\=checked -Onone -D SWIFT_PACKAGE -D DEBUG -D Xcode -serialize-debugging-options -const-gather-protocols-file /Users/admin/builder/spi-builder-workspace/.derivedData/Build/Intermediates.noindex/Signals.build/Debug-xros/Signals.build/Objects-normal/arm64/Signals_const_extract_protocols.json -empty-abi-descriptor -validate-clang-modules-once -clang-build-session-file /Users/admin/builder/spi-builder-workspace/.derivedData/ModuleCache.noindex/Session.modulevalidation -Xcc -working-directory -Xcc /Users/admin/builder/spi-builder-workspace/.dependencies/checkouts/BlueSignals -resource-dir /Applications/Xcode-15.4.0.app/Contents/Developer/Toolchains/XcodeDefault.xctoolchain/usr/lib/swift -enable-anonymous-context-mangled-names -Xcc -ivfsstatcache -Xcc /Users/admin/builder/spi-builder-workspace/.derivedData/SDKStatCaches.noindex/xros1.2-21O5565d-70e6a4b4e6ce75e0f2056db95c07d51a.sdkstatcache -Xcc -I/Users/admin/builder/spi-builder-workspace/.derivedData/Build/Intermediates.noindex/Signals.build/Debug-xros/Signals.build/swift-overrides.hmap -Xcc -I/Users/admin/builder/spi-builder-workspace/.derivedData/Build/Products/Debug-xros/include -Xcc -I/Users/admin/builder/spi-builder-workspace/.derivedData/Build/Intermediates.noindex/Signals.build/Debug-xros/Signals.build/DerivedSources-normal/arm64 -Xcc -I/Users/admin/builder/spi-builder-workspace/.derivedData/Build/Intermediates.noindex/Signals.build/Debug-xros/Signals.build/DerivedSources/arm64 -Xcc -I/Users/admin/builder/spi-builder-workspace/.derivedData/Build/Intermediates.noindex/Signals.build/Debug-xros/Signals.build/DerivedSources -Xcc -DSWIFT_PACKAGE -Xcc -DDEBUG\=1 -module-name Signals -disable-clang-spi -target-sdk-version 1.2 -target-sdk-name xros1.2 -external-plugin-path /Applications/Xcode-15.4.0.app/Contents/Developer/Platforms/XROS.platform/Developer/SDKs/XROS1.2.sdk/usr/lib/swift/host/plugins\#/Applications/Xcode-15.4.0.app/Contents/Developer/Platforms/XROS.platform/Developer/SDKs/XROS1.2.sdk/usr/bin/swift-plugin-server -external-plugin-path /Applications/Xcode-15.4.0.app/Contents/Developer/Platforms/XROS.platform/Developer/SDKs/XROS1.2.sdk/usr/local/lib/swift/host/plugins\#/Applications/Xcode-15.4.0.app/Contents/Developer/Platforms/XROS.platform/Developer/SDKs/XROS1.2.sdk/usr/bin/swift-plugin-server -external-plugin-path /Applications/Xcode-15.4.0.app/Contents/Developer/Platforms/XROS.platform/Developer/usr/lib/swift/host/plugins\#/Applications/Xcode-15.4.0.app/Contents/Developer/Platforms/XROS.platform/Developer/usr/bin/swift-plugin-server -external-plugin-path /Applications/Xcode-15.4.0.app/Contents/Developer/Platforms/XROS.platform/Developer/usr/local/lib/swift/host/plugins\#/Applications/Xcode-15.4.0.app/Contents/Developer/Platforms/XROS.platform/Developer/usr/bin/swift-plugin-server -plugin-path /Applications/Xcode-15.4.0.app/Contents/Developer/Toolchains/XcodeDefault.xctoolchain/usr/lib/swift/host/plugins -plugin-path /Applications/Xcode-15.4.0.app/Contents/Developer/Toolchains/XcodeDefault.xctoolchain/usr/local/lib/swift/host/plugins -emit-module-doc-path /Users/admin/builder/spi-builder-workspace/.derivedData/Build/Intermediates.noindex/Signals.build/Debug-xros/Signals.build/Objects-normal/arm64/Signals.swiftdoc -emit-module-source-info-path /Users/admin/builder/spi-builder-workspace/.derivedData/Build/Intermediates.noindex/Signals.build/Debug-xros/Signals.build/Objects-normal/arm64/Signals.swiftsourceinfo -emit-objc-header-path /Users/admin/builder/spi-builder-workspace/.derivedData/Build/Intermediates.noindex/Signals.build/Debug-xros/Signals.build/Objects-normal/arm64/Signals-Swift.h -serialize-diagnostics-path /Users/admin/builder/spi-builder-workspace/.derivedData/Build/Intermediates.noindex/Signals.build/Debug-xros/Signals.build/Objects-normal/arm64/Signals-master-emit-module.dia -emit-dependencies-path /Users/admin/builder/spi-builder-workspace/.derivedData/Build/Intermediates.noindex/Signals.build/Debug-xros/Signals.build/Objects-normal/arm64/Signals-master-emit-module.d -parse-as-library -o /Users/admin/builder/spi-builder-workspace/.derivedData/Build/Intermediates.noindex/Signals.build/Debug-xros/Signals.build/Objects-normal/arm64/Signals.swiftmodule -emit-abi-descriptor-path /Users/admin/builder/spi-builder-workspace/.derivedData/Build/Intermediates.noindex/Signals.build/Debug-xros/Signals.build/Objects-normal/arm64/Signals.abi.json
SwiftEmitModule normal arm64 Emitting\ module\ for\ PathLib (in target 'PathLib' from project 'CommandLineToolkit')
    cd /Users/admin/builder/spi-builder-workspace
    builtin-swiftTaskExecution -- /Applications/Xcode-15.4.0.app/Contents/Developer/Toolchains/XcodeDefault.xctoolchain/usr/bin/swift-frontend -frontend -emit-module -experimental-skip-non-inlinable-function-bodies-without-types /Users/admin/builder/spi-builder-workspace/Sources/PathLib/AbsolutePath.swift /Users/admin/builder/spi-builder-workspace/Sources/PathLib/FileManager+Extensions.swift /Users/admin/builder/spi-builder-workspace/Sources/PathLib/Path+CommonOperations.swift /Users/admin/builder/spi-builder-workspace/Sources/PathLib/Path.swift /Users/admin/builder/spi-builder-workspace/Sources/PathLib/RelativePath.swift /Users/admin/builder/spi-builder-workspace/Sources/PathLib/String+ShellEscaping.swift /Users/admin/builder/spi-builder-workspace/Sources/PathLib/StringPathParsing.swift -target arm64-apple-xros1.0 -Xllvm -aarch64-use-tbi -enable-objc-interop -stack-check -sdk /Applications/Xcode-15.4.0.app/Contents/Developer/Platforms/XROS.platform/Developer/SDKs/XROS1.2.sdk -I /Users/admin/builder/spi-builder-workspace/.derivedData/Build/Products/Debug-xros -I /Applications/Xcode-15.4.0.app/Contents/Developer/Platforms/XROS.platform/Developer/usr/lib -F /Users/admin/builder/spi-builder-workspace/.derivedData/Build/Products/Debug-xros -F /Applications/Xcode-15.4.0.app/Contents/Developer/Platforms/XROS.platform/Developer/Library/Frameworks -F /Applications/Xcode-15.4.0.app/Contents/Developer/Platforms/XROS.platform/Developer/SDKs/XROS1.2.sdk/Developer/Library/Frameworks -no-color-diagnostics -enable-testing -g -module-cache-path /Users/admin/builder/spi-builder-workspace/.derivedData/ModuleCache.noindex -profile-generate -profile-coverage-mapping -swift-version 5 -enforce-exclusivity\=checked -Onone -D SWIFT_PACKAGE -D DEBUG -D Xcode -serialize-debugging-options -package-name spi_builder_workspace -const-gather-protocols-file /Users/admin/builder/spi-builder-workspace/.derivedData/Build/Intermediates.noindex/CommandLineToolkit.build/Debug-xros/PathLib.build/Objects-normal/arm64/PathLib_const_extract_protocols.json -empty-abi-descriptor -validate-clang-modules-once -clang-build-session-file /Users/admin/builder/spi-builder-workspace/.derivedData/ModuleCache.noindex/Session.modulevalidation -Xcc -working-directory -Xcc /Users/admin/builder/spi-builder-workspace -resource-dir /Applications/Xcode-15.4.0.app/Contents/Developer/Toolchains/XcodeDefault.xctoolchain/usr/lib/swift -enable-anonymous-context-mangled-names -Xcc -ivfsstatcache -Xcc /Users/admin/builder/spi-builder-workspace/.derivedData/SDKStatCaches.noindex/xros1.2-21O5565d-70e6a4b4e6ce75e0f2056db95c07d51a.sdkstatcache -Xcc -I/Users/admin/builder/spi-builder-workspace/.derivedData/Build/Intermediates.noindex/CommandLineToolkit.build/Debug-xros/PathLib.build/swift-overrides.hmap -Xcc -I/Users/admin/builder/spi-builder-workspace/.derivedData/Build/Products/Debug-xros/include -Xcc -I/Users/admin/builder/spi-builder-workspace/.derivedData/Build/Intermediates.noindex/CommandLineToolkit.build/Debug-xros/PathLib.build/DerivedSources-normal/arm64 -Xcc -I/Users/admin/builder/spi-builder-workspace/.derivedData/Build/Intermediates.noindex/CommandLineToolkit.build/Debug-xros/PathLib.build/DerivedSources/arm64 -Xcc -I/Users/admin/builder/spi-builder-workspace/.derivedData/Build/Intermediates.noindex/CommandLineToolkit.build/Debug-xros/PathLib.build/DerivedSources -Xcc -DSWIFT_PACKAGE -Xcc -DDEBUG\=1 -module-name PathLib -disable-clang-spi -target-sdk-version 1.2 -target-sdk-name xros1.2 -external-plugin-path /Applications/Xcode-15.4.0.app/Contents/Developer/Platforms/XROS.platform/Developer/SDKs/XROS1.2.sdk/usr/lib/swift/host/plugins\#/Applications/Xcode-15.4.0.app/Contents/Developer/Platforms/XROS.platform/Developer/SDKs/XROS1.2.sdk/usr/bin/swift-plugin-server -external-plugin-path /Applications/Xcode-15.4.0.app/Contents/Developer/Platforms/XROS.platform/Developer/SDKs/XROS1.2.sdk/usr/local/lib/swift/host/plugins\#/Applications/Xcode-15.4.0.app/Contents/Developer/Platforms/XROS.platform/Developer/SDKs/XROS1.2.sdk/usr/bin/swift-plugin-server -external-plugin-path /Applications/Xcode-15.4.0.app/Contents/Developer/Platforms/XROS.platform/Developer/usr/lib/swift/host/plugins\#/Applications/Xcode-15.4.0.app/Contents/Developer/Platforms/XROS.platform/Developer/usr/bin/swift-plugin-server -external-plugin-path /Applications/Xcode-15.4.0.app/Contents/Developer/Platforms/XROS.platform/Developer/usr/local/lib/swift/host/plugins\#/Applications/Xcode-15.4.0.app/Contents/Developer/Platforms/XROS.platform/Developer/usr/bin/swift-plugin-server -plugin-path /Applications/Xcode-15.4.0.app/Contents/Developer/Toolchains/XcodeDefault.xctoolchain/usr/lib/swift/host/plugins -plugin-path /Applications/Xcode-15.4.0.app/Contents/Developer/Toolchains/XcodeDefault.xctoolchain/usr/local/lib/swift/host/plugins -emit-module-doc-path /Users/admin/builder/spi-builder-workspace/.derivedData/Build/Intermediates.noindex/CommandLineToolkit.build/Debug-xros/PathLib.build/Objects-normal/arm64/PathLib.swiftdoc -emit-module-source-info-path /Users/admin/builder/spi-builder-workspace/.derivedData/Build/Intermediates.noindex/CommandLineToolkit.build/Debug-xros/PathLib.build/Objects-normal/arm64/PathLib.swiftsourceinfo -emit-objc-header-path /Users/admin/builder/spi-builder-workspace/.derivedData/Build/Intermediates.noindex/CommandLineToolkit.build/Debug-xros/PathLib.build/Objects-normal/arm64/PathLib-Swift.h -serialize-diagnostics-path /Users/admin/builder/spi-builder-workspace/.derivedData/Build/Intermediates.noindex/CommandLineToolkit.build/Debug-xros/PathLib.build/Objects-normal/arm64/PathLib-master-emit-module.dia -emit-dependencies-path /Users/admin/builder/spi-builder-workspace/.derivedData/Build/Intermediates.noindex/CommandLineToolkit.build/Debug-xros/PathLib.build/Objects-normal/arm64/PathLib-master-emit-module.d -o /Users/admin/builder/spi-builder-workspace/.derivedData/Build/Intermediates.noindex/CommandLineToolkit.build/Debug-xros/PathLib.build/Objects-normal/arm64/PathLib.swiftmodule -emit-abi-descriptor-path /Users/admin/builder/spi-builder-workspace/.derivedData/Build/Intermediates.noindex/CommandLineToolkit.build/Debug-xros/PathLib.build/Objects-normal/arm64/PathLib.abi.json
SwiftEmitModule normal arm64 Emitting\ module\ for\ MetricsUtils (in target 'MetricsUtils' from project 'CommandLineToolkit')
    cd /Users/admin/builder/spi-builder-workspace
    builtin-swiftTaskExecution -- /Applications/Xcode-15.4.0.app/Contents/Developer/Toolchains/XcodeDefault.xctoolchain/usr/bin/swift-frontend -frontend -emit-module -experimental-skip-non-inlinable-function-bodies-without-types /Users/admin/builder/spi-builder-workspace/Sources/MetricsUtils/String+MetricComponent.swift -target arm64-apple-xros1.0 -Xllvm -aarch64-use-tbi -enable-objc-interop -stack-check -sdk /Applications/Xcode-15.4.0.app/Contents/Developer/Platforms/XROS.platform/Developer/SDKs/XROS1.2.sdk -I /Users/admin/builder/spi-builder-workspace/.derivedData/Build/Products/Debug-xros -I /Applications/Xcode-15.4.0.app/Contents/Developer/Platforms/XROS.platform/Developer/usr/lib -F /Users/admin/builder/spi-builder-workspace/.derivedData/Build/Products/Debug-xros -F /Applications/Xcode-15.4.0.app/Contents/Developer/Platforms/XROS.platform/Developer/Library/Frameworks -F /Applications/Xcode-15.4.0.app/Contents/Developer/Platforms/XROS.platform/Developer/SDKs/XROS1.2.sdk/Developer/Library/Frameworks -no-color-diagnostics -enable-testing -g -module-cache-path /Users/admin/builder/spi-builder-workspace/.derivedData/ModuleCache.noindex -profile-generate -profile-coverage-mapping -swift-version 5 -enforce-exclusivity\=checked -Onone -D SWIFT_PACKAGE -D DEBUG -D Xcode -serialize-debugging-options -package-name spi_builder_workspace -const-gather-protocols-file /Users/admin/builder/spi-builder-workspace/.derivedData/Build/Intermediates.noindex/CommandLineToolkit.build/Debug-xros/MetricsUtils.build/Objects-normal/arm64/MetricsUtils_const_extract_protocols.json -empty-abi-descriptor -validate-clang-modules-once -clang-build-session-file /Users/admin/builder/spi-builder-workspace/.derivedData/ModuleCache.noindex/Session.modulevalidation -Xcc -working-directory -Xcc /Users/admin/builder/spi-builder-workspace -resource-dir /Applications/Xcode-15.4.0.app/Contents/Developer/Toolchains/XcodeDefault.xctoolchain/usr/lib/swift -enable-anonymous-context-mangled-names -Xcc -ivfsstatcache -Xcc /Users/admin/builder/spi-builder-workspace/.derivedData/SDKStatCaches.noindex/xros1.2-21O5565d-70e6a4b4e6ce75e0f2056db95c07d51a.sdkstatcache -Xcc -I/Users/admin/builder/spi-builder-workspace/.derivedData/Build/Intermediates.noindex/CommandLineToolkit.build/Debug-xros/MetricsUtils.build/swift-overrides.hmap -Xcc -I/Users/admin/builder/spi-builder-workspace/.derivedData/Build/Products/Debug-xros/include -Xcc -I/Users/admin/builder/spi-builder-workspace/.derivedData/Build/Intermediates.noindex/CommandLineToolkit.build/Debug-xros/MetricsUtils.build/DerivedSources-normal/arm64 -Xcc -I/Users/admin/builder/spi-builder-workspace/.derivedData/Build/Intermediates.noindex/CommandLineToolkit.build/Debug-xros/MetricsUtils.build/DerivedSources/arm64 -Xcc -I/Users/admin/builder/spi-builder-workspace/.derivedData/Build/Intermediates.noindex/CommandLineToolkit.build/Debug-xros/MetricsUtils.build/DerivedSources -Xcc -DSWIFT_PACKAGE -Xcc -DDEBUG\=1 -module-name MetricsUtils -disable-clang-spi -target-sdk-version 1.2 -target-sdk-name xros1.2 -external-plugin-path /Applications/Xcode-15.4.0.app/Contents/Developer/Platforms/XROS.platform/Developer/SDKs/XROS1.2.sdk/usr/lib/swift/host/plugins\#/Applications/Xcode-15.4.0.app/Contents/Developer/Platforms/XROS.platform/Developer/SDKs/XROS1.2.sdk/usr/bin/swift-plugin-server -external-plugin-path /Applications/Xcode-15.4.0.app/Contents/Developer/Platforms/XROS.platform/Developer/SDKs/XROS1.2.sdk/usr/local/lib/swift/host/plugins\#/Applications/Xcode-15.4.0.app/Contents/Developer/Platforms/XROS.platform/Developer/SDKs/XROS1.2.sdk/usr/bin/swift-plugin-server -external-plugin-path /Applications/Xcode-15.4.0.app/Contents/Developer/Platforms/XROS.platform/Developer/usr/lib/swift/host/plugins\#/Applications/Xcode-15.4.0.app/Contents/Developer/Platforms/XROS.platform/Developer/usr/bin/swift-plugin-server -external-plugin-path /Applications/Xcode-15.4.0.app/Contents/Developer/Platforms/XROS.platform/Developer/usr/local/lib/swift/host/plugins\#/Applications/Xcode-15.4.0.app/Contents/Developer/Platforms/XROS.platform/Developer/usr/bin/swift-plugin-server -plugin-path /Applications/Xcode-15.4.0.app/Contents/Developer/Toolchains/XcodeDefault.xctoolchain/usr/lib/swift/host/plugins -plugin-path /Applications/Xcode-15.4.0.app/Contents/Developer/Toolchains/XcodeDefault.xctoolchain/usr/local/lib/swift/host/plugins -emit-module-doc-path /Users/admin/builder/spi-builder-workspace/.derivedData/Build/Intermediates.noindex/CommandLineToolkit.build/Debug-xros/MetricsUtils.build/Objects-normal/arm64/MetricsUtils.swiftdoc -emit-module-source-info-path /Users/admin/builder/spi-builder-workspace/.derivedData/Build/Intermediates.noindex/CommandLineToolkit.build/Debug-xros/MetricsUtils.build/Objects-normal/arm64/MetricsUtils.swiftsourceinfo -emit-objc-header-path /Users/admin/builder/spi-builder-workspace/.derivedData/Build/Intermediates.noindex/CommandLineToolkit.build/Debug-xros/MetricsUtils.build/Objects-normal/arm64/MetricsUtils-Swift.h -serialize-diagnostics-path /Users/admin/builder/spi-builder-workspace/.derivedData/Build/Intermediates.noindex/CommandLineToolkit.build/Debug-xros/MetricsUtils.build/Objects-normal/arm64/MetricsUtils-master-emit-module.dia -emit-dependencies-path /Users/admin/builder/spi-builder-workspace/.derivedData/Build/Intermediates.noindex/CommandLineToolkit.build/Debug-xros/MetricsUtils.build/Objects-normal/arm64/MetricsUtils-master-emit-module.d -parse-as-library -o /Users/admin/builder/spi-builder-workspace/.derivedData/Build/Intermediates.noindex/CommandLineToolkit.build/Debug-xros/MetricsUtils.build/Objects-normal/arm64/MetricsUtils.swiftmodule -emit-abi-descriptor-path /Users/admin/builder/spi-builder-workspace/.derivedData/Build/Intermediates.noindex/CommandLineToolkit.build/Debug-xros/MetricsUtils.build/Objects-normal/arm64/MetricsUtils.abi.json
SwiftEmitModule normal arm64 Emitting\ module\ for\ Logging (in target 'Logging' from project 'swift-log')
    cd /Users/admin/builder/spi-builder-workspace/.dependencies/checkouts/swift-log
    builtin-swiftTaskExecution -- /Applications/Xcode-15.4.0.app/Contents/Developer/Toolchains/XcodeDefault.xctoolchain/usr/bin/swift-frontend -frontend -emit-module -experimental-skip-non-inlinable-function-bodies-without-types /Users/admin/builder/spi-builder-workspace/.dependencies/checkouts/swift-log/Sources/Logging/Locks.swift /Users/admin/builder/spi-builder-workspace/.dependencies/checkouts/swift-log/Sources/Logging/LogHandler.swift /Users/admin/builder/spi-builder-workspace/.dependencies/checkouts/swift-log/Sources/Logging/Logging.swift /Users/admin/builder/spi-builder-workspace/.dependencies/checkouts/swift-log/Sources/Logging/MetadataProvider.swift -target arm64-apple-xros1.0 -Xllvm -aarch64-use-tbi -enable-objc-interop -stack-check -sdk /Applications/Xcode-15.4.0.app/Contents/Developer/Platforms/XROS.platform/Developer/SDKs/XROS1.2.sdk -I /Users/admin/builder/spi-builder-workspace/.derivedData/Build/Products/Debug-xros -I /Applications/Xcode-15.4.0.app/Contents/Developer/Platforms/XROS.platform/Developer/usr/lib -F /Users/admin/builder/spi-builder-workspace/.derivedData/Build/Products/Debug-xros -F /Applications/Xcode-15.4.0.app/Contents/Developer/Platforms/XROS.platform/Developer/Library/Frameworks -F /Applications/Xcode-15.4.0.app/Contents/Developer/Platforms/XROS.platform/Developer/SDKs/XROS1.2.sdk/Developer/Library/Frameworks -no-color-diagnostics -enable-testing -g -module-cache-path /Users/admin/builder/spi-builder-workspace/.derivedData/ModuleCache.noindex -suppress-warnings -profile-generate -profile-coverage-mapping -swift-version 5 -enforce-exclusivity\=checked -Onone -D SWIFT_PACKAGE -D DEBUG -D Xcode -serialize-debugging-options -const-gather-protocols-file /Users/admin/builder/spi-builder-workspace/.derivedData/Build/Intermediates.noindex/swift-log.build/Debug-xros/Logging.build/Objects-normal/arm64/Logging_const_extract_protocols.json -empty-abi-descriptor -validate-clang-modules-once -clang-build-session-file /Users/admin/builder/spi-builder-workspace/.derivedData/ModuleCache.noindex/Session.modulevalidation -Xcc -working-directory -Xcc /Users/admin/builder/spi-builder-workspace/.dependencies/checkouts/swift-log -resource-dir /Applications/Xcode-15.4.0.app/Contents/Developer/Toolchains/XcodeDefault.xctoolchain/usr/lib/swift -enable-anonymous-context-mangled-names -Xcc -ivfsstatcache -Xcc /Users/admin/builder/spi-builder-workspace/.derivedData/SDKStatCaches.noindex/xros1.2-21O5565d-70e6a4b4e6ce75e0f2056db95c07d51a.sdkstatcache -Xcc -I/Users/admin/builder/spi-builder-workspace/.derivedData/Build/Intermediates.noindex/swift-log.build/Debug-xros/Logging.build/swift-overrides.hmap -Xcc -I/Users/admin/builder/spi-builder-workspace/.derivedData/Build/Products/Debug-xros/include -Xcc -I/Users/admin/builder/spi-builder-workspace/.derivedData/Build/Intermediates.noindex/swift-log.build/Debug-xros/Logging.build/DerivedSources-normal/arm64 -Xcc -I/Users/admin/builder/spi-builder-workspace/.derivedData/Build/Intermediates.noindex/swift-log.build/Debug-xros/Logging.build/DerivedSources/arm64 -Xcc -I/Users/admin/builder/spi-builder-workspace/.derivedData/Build/Intermediates.noindex/swift-log.build/Debug-xros/Logging.build/DerivedSources -Xcc -DSWIFT_PACKAGE -Xcc -DDEBUG\=1 -module-name Logging -disable-clang-spi -target-sdk-version 1.2 -target-sdk-name xros1.2 -external-plugin-path /Applications/Xcode-15.4.0.app/Contents/Developer/Platforms/XROS.platform/Developer/SDKs/XROS1.2.sdk/usr/lib/swift/host/plugins\#/Applications/Xcode-15.4.0.app/Contents/Developer/Platforms/XROS.platform/Developer/SDKs/XROS1.2.sdk/usr/bin/swift-plugin-server -external-plugin-path /Applications/Xcode-15.4.0.app/Contents/Developer/Platforms/XROS.platform/Developer/SDKs/XROS1.2.sdk/usr/local/lib/swift/host/plugins\#/Applications/Xcode-15.4.0.app/Contents/Developer/Platforms/XROS.platform/Developer/SDKs/XROS1.2.sdk/usr/bin/swift-plugin-server -external-plugin-path /Applications/Xcode-15.4.0.app/Contents/Developer/Platforms/XROS.platform/Developer/usr/lib/swift/host/plugins\#/Applications/Xcode-15.4.0.app/Contents/Developer/Platforms/XROS.platform/Developer/usr/bin/swift-plugin-server -external-plugin-path /Applications/Xcode-15.4.0.app/Contents/Developer/Platforms/XROS.platform/Developer/usr/local/lib/swift/host/plugins\#/Applications/Xcode-15.4.0.app/Contents/Developer/Platforms/XROS.platform/Developer/usr/bin/swift-plugin-server -plugin-path /Applications/Xcode-15.4.0.app/Contents/Developer/Toolchains/XcodeDefault.xctoolchain/usr/lib/swift/host/plugins -plugin-path /Applications/Xcode-15.4.0.app/Contents/Developer/Toolchains/XcodeDefault.xctoolchain/usr/local/lib/swift/host/plugins -emit-module-doc-path /Users/admin/builder/spi-builder-workspace/.derivedData/Build/Intermediates.noindex/swift-log.build/Debug-xros/Logging.build/Objects-normal/arm64/Logging.swiftdoc -emit-module-source-info-path /Users/admin/builder/spi-builder-workspace/.derivedData/Build/Intermediates.noindex/swift-log.build/Debug-xros/Logging.build/Objects-normal/arm64/Logging.swiftsourceinfo -emit-objc-header-path /Users/admin/builder/spi-builder-workspace/.derivedData/Build/Intermediates.noindex/swift-log.build/Debug-xros/Logging.build/Objects-normal/arm64/Logging-Swift.h -serialize-diagnostics-path /Users/admin/builder/spi-builder-workspace/.derivedData/Build/Intermediates.noindex/swift-log.build/Debug-xros/Logging.build/Objects-normal/arm64/Logging-master-emit-module.dia -emit-dependencies-path /Users/admin/builder/spi-builder-workspace/.derivedData/Build/Intermediates.noindex/swift-log.build/Debug-xros/Logging.build/Objects-normal/arm64/Logging-master-emit-module.d -o /Users/admin/builder/spi-builder-workspace/.derivedData/Build/Intermediates.noindex/swift-log.build/Debug-xros/Logging.build/Objects-normal/arm64/Logging.swiftmodule -emit-abi-descriptor-path /Users/admin/builder/spi-builder-workspace/.derivedData/Build/Intermediates.noindex/swift-log.build/Debug-xros/Logging.build/Objects-normal/arm64/Logging.abi.json
/Users/admin/builder/spi-builder-workspace/.dependencies/checkouts/swift-log/Sources/Logging/Logging.swift:24:8: error: Unsupported runtime
#error("Unsupported runtime")
       ^~~~~~~~~~~~~~~~~~~~~
/Users/admin/builder/spi-builder-workspace/.dependencies/checkouts/swift-log/Sources/Logging/Logging.swift:1183:56: error: cannot find type 'FILE' in scope
internal typealias CFilePointer = UnsafeMutablePointer<FILE>
                                                       ^~~~
/Users/admin/builder/spi-builder-workspace/.dependencies/checkouts/swift-log/Sources/Logging/Logging.swift:1234:58: error: cannot find 'systemStderr' in scope
    internal static let stderr = StdioOutputStream(file: systemStderr, flushMode: .always)
                                                         ^~~~~~~~~~~~
/Users/admin/builder/spi-builder-workspace/.dependencies/checkouts/swift-log/Sources/Logging/Logging.swift:1234:84: error: cannot infer contextual base in reference to member 'always'
    internal static let stderr = StdioOutputStream(file: systemStderr, flushMode: .always)
                                                                                  ~^~~~~~
/Users/admin/builder/spi-builder-workspace/.dependencies/checkouts/swift-log/Sources/Logging/Logging.swift:1235:58: error: cannot find 'systemStdout' in scope
    internal static let stdout = StdioOutputStream(file: systemStdout, flushMode: .always)
                                                         ^~~~~~~~~~~~
/Users/admin/builder/spi-builder-workspace/.dependencies/checkouts/swift-log/Sources/Logging/Logging.swift:1235:84: error: cannot infer contextual base in reference to member 'always'
    internal static let stdout = StdioOutputStream(file: systemStdout, flushMode: .always)
                                                                                  ~^~~~~~
/Users/admin/builder/spi-builder-workspace/.dependencies/checkouts/swift-log/Sources/Logging/Logging.swift:1258:8: error: Unsupported runtime
#error("Unsupported runtime")
       ^~~~~~~~~~~~~~~~~~~~~
/Users/admin/builder/spi-builder-workspace/.dependencies/checkouts/swift-log/Sources/Logging/MetadataProvider.swift:24:8: error: Unsupported runtime
#error("Unsupported runtime")
       ^~~~~~~~~~~~~~~~~~~~~
SwiftEmitModule normal arm64 Emitting\ module\ for\ Yams (in target 'Yams' from project 'Yams')
    cd /Users/admin/builder/spi-builder-workspace/.dependencies/checkouts/Yams
    builtin-swiftTaskExecution -- /Applications/Xcode-15.4.0.app/Contents/Developer/Toolchains/XcodeDefault.xctoolchain/usr/bin/swift-frontend -frontend -emit-module -experimental-skip-non-inlinable-function-bodies-without-types /Users/admin/builder/spi-builder-workspace/.dependencies/checkouts/Yams/Sources/Yams/Constructor.swift /Users/admin/builder/spi-builder-workspace/.dependencies/checkouts/Yams/Sources/Yams/Decoder.swift /Users/admin/builder/spi-builder-workspace/.dependencies/checkouts/Yams/Sources/Yams/Emitter.swift /Users/admin/builder/spi-builder-workspace/.dependencies/checkouts/Yams/Sources/Yams/Encoder.swift /Users/admin/builder/spi-builder-workspace/.dependencies/checkouts/Yams/Sources/Yams/Mark.swift /Users/admin/builder/spi-builder-workspace/.dependencies/checkouts/Yams/Sources/Yams/Node.Mapping.swift /Users/admin/builder/spi-builder-workspace/.dependencies/checkouts/Yams/Sources/Yams/Node.Scalar.swift /Users/admin/builder/spi-builder-workspace/.dependencies/checkouts/Yams/Sources/Yams/Node.Sequence.swift /Users/admin/builder/spi-builder-workspace/.dependencies/checkouts/Yams/Sources/Yams/Node.swift /Users/admin/builder/spi-builder-workspace/.dependencies/checkouts/Yams/Sources/Yams/Parser.swift /Users/admin/builder/spi-builder-workspace/.dependencies/checkouts/Yams/Sources/Yams/Representer.swift /Users/admin/builder/spi-builder-workspace/.dependencies/checkouts/Yams/Sources/Yams/Resolver.swift /Users/admin/builder/spi-builder-workspace/.dependencies/checkouts/Yams/Sources/Yams/String+Yams.swift /Users/admin/builder/spi-builder-workspace/.dependencies/checkouts/Yams/Sources/Yams/Tag.swift /Users/admin/builder/spi-builder-workspace/.dependencies/checkouts/Yams/Sources/Yams/YamlError.swift -target arm64-apple-xros1.0 -Xllvm -aarch64-use-tbi -enable-objc-interop -stack-check -sdk /Applications/Xcode-15.4.0.app/Contents/Developer/Platforms/XROS.platform/Developer/SDKs/XROS1.2.sdk -I /Users/admin/builder/spi-builder-workspace/.derivedData/Build/Products/Debug-xros -I /Applications/Xcode-15.4.0.app/Contents/Developer/Platforms/XROS.platform/Developer/usr/lib -F /Users/admin/builder/spi-builder-workspace/.derivedData/Build/Products/Debug-xros/PackageFrameworks -F /Users/admin/builder/spi-builder-workspace/.derivedData/Build/Products/Debug-xros -F /Applications/Xcode-15.4.0.app/Contents/Developer/Platforms/XROS.platform/Developer/Library/Frameworks -F /Applications/Xcode-15.4.0.app/Contents/Developer/Platforms/XROS.platform/Developer/SDKs/XROS1.2.sdk/Developer/Library/Frameworks -no-color-diagnostics -enable-testing -g -module-cache-path /Users/admin/builder/spi-builder-workspace/.derivedData/ModuleCache.noindex -suppress-warnings -profile-generate -profile-coverage-mapping -swift-version 5 -enforce-exclusivity\=checked -Onone -D SWIFT_PACKAGE -D DEBUG -D Xcode -serialize-debugging-options -const-gather-protocols-file /Users/admin/builder/spi-builder-workspace/.derivedData/Build/Intermediates.noindex/Yams.build/Debug-xros/Yams.build/Objects-normal/arm64/Yams_const_extract_protocols.json -empty-abi-descriptor -validate-clang-modules-once -clang-build-session-file /Users/admin/builder/spi-builder-workspace/.derivedData/ModuleCache.noindex/Session.modulevalidation -Xcc -working-directory -Xcc /Users/admin/builder/spi-builder-workspace/.dependencies/checkouts/Yams -resource-dir /Applications/Xcode-15.4.0.app/Contents/Developer/Toolchains/XcodeDefault.xctoolchain/usr/lib/swift -enable-anonymous-context-mangled-names -Xcc -ivfsstatcache -Xcc /Users/admin/builder/spi-builder-workspace/.derivedData/SDKStatCaches.noindex/xros1.2-21O5565d-70e6a4b4e6ce75e0f2056db95c07d51a.sdkstatcache -Xcc -I/Users/admin/builder/spi-builder-workspace/.derivedData/Build/Intermediates.noindex/Yams.build/Debug-xros/Yams.build/swift-overrides.hmap -Xcc -I/Users/admin/builder/spi-builder-workspace/.dependencies/checkouts/Yams/Sources/CYaml/include -Xcc -I/Users/admin/builder/spi-builder-workspace/.derivedData/Build/Products/Debug-xros/include -Xcc -I/Users/admin/builder/spi-builder-workspace/.derivedData/Build/Intermediates.noindex/Yams.build/Debug-xros/Yams.build/DerivedSources-normal/arm64 -Xcc -I/Users/admin/builder/spi-builder-workspace/.derivedData/Build/Intermediates.noindex/Yams.build/Debug-xros/Yams.build/DerivedSources/arm64 -Xcc -I/Users/admin/builder/spi-builder-workspace/.derivedData/Build/Intermediates.noindex/Yams.build/Debug-xros/Yams.build/DerivedSources -Xcc -DSWIFT_PACKAGE -Xcc -DDEBUG\=1 -module-name Yams -disable-clang-spi -target-sdk-version 1.2 -target-sdk-name xros1.2 -external-plugin-path /Applications/Xcode-15.4.0.app/Contents/Developer/Platforms/XROS.platform/Developer/SDKs/XROS1.2.sdk/usr/lib/swift/host/plugins\#/Applications/Xcode-15.4.0.app/Contents/Developer/Platforms/XROS.platform/Developer/SDKs/XROS1.2.sdk/usr/bin/swift-plugin-server -external-plugin-path /Applications/Xcode-15.4.0.app/Contents/Developer/Platforms/XROS.platform/Developer/SDKs/XROS1.2.sdk/usr/local/lib/swift/host/plugins\#/Applications/Xcode-15.4.0.app/Contents/Developer/Platforms/XROS.platform/Developer/SDKs/XROS1.2.sdk/usr/bin/swift-plugin-server -external-plugin-path /Applications/Xcode-15.4.0.app/Contents/Developer/Platforms/XROS.platform/Developer/usr/lib/swift/host/plugins\#/Applications/Xcode-15.4.0.app/Contents/Developer/Platforms/XROS.platform/Developer/usr/bin/swift-plugin-server -external-plugin-path /Applications/Xcode-15.4.0.app/Contents/Developer/Platforms/XROS.platform/Developer/usr/local/lib/swift/host/plugins\#/Applications/Xcode-15.4.0.app/Contents/Developer/Platforms/XROS.platform/Developer/usr/bin/swift-plugin-server -plugin-path /Applications/Xcode-15.4.0.app/Contents/Developer/Toolchains/XcodeDefault.xctoolchain/usr/lib/swift/host/plugins -plugin-path /Applications/Xcode-15.4.0.app/Contents/Developer/Toolchains/XcodeDefault.xctoolchain/usr/local/lib/swift/host/plugins -emit-module-doc-path /Users/admin/builder/spi-builder-workspace/.derivedData/Build/Intermediates.noindex/Yams.build/Debug-xros/Yams.build/Objects-normal/arm64/Yams.swiftdoc -emit-module-source-info-path /Users/admin/builder/spi-builder-workspace/.derivedData/Build/Intermediates.noindex/Yams.build/Debug-xros/Yams.build/Objects-normal/arm64/Yams.swiftsourceinfo -emit-objc-header-path /Users/admin/builder/spi-builder-workspace/.derivedData/Build/Intermediates.noindex/Yams.build/Debug-xros/Yams.build/Objects-normal/arm64/Yams-Swift.h -serialize-diagnostics-path /Users/admin/builder/spi-builder-workspace/.derivedData/Build/Intermediates.noindex/Yams.build/Debug-xros/Yams.build/Objects-normal/arm64/Yams-master-emit-module.dia -emit-dependencies-path /Users/admin/builder/spi-builder-workspace/.derivedData/Build/Intermediates.noindex/Yams.build/Debug-xros/Yams.build/Objects-normal/arm64/Yams-master-emit-module.d -o /Users/admin/builder/spi-builder-workspace/.derivedData/Build/Intermediates.noindex/Yams.build/Debug-xros/Yams.build/Objects-normal/arm64/Yams.swiftmodule -emit-abi-descriptor-path /Users/admin/builder/spi-builder-workspace/.derivedData/Build/Intermediates.noindex/Yams.build/Debug-xros/Yams.build/Objects-normal/arm64/Yams.abi.json
/Users/admin/builder/spi-builder-workspace/.dependencies/checkouts/Yams/Sources/Yams/Representer.swift:19:8: error: no such module 'Glibc'
import Glibc
       ^
SwiftEmitModule normal arm64 Emitting\ module\ for\ Types (in target 'Types' from project 'CommandLineToolkit')
    cd /Users/admin/builder/spi-builder-workspace
    builtin-swiftTaskExecution -- /Applications/Xcode-15.4.0.app/Contents/Developer/Toolchains/XcodeDefault.xctoolchain/usr/bin/swift-frontend -frontend -emit-module -experimental-skip-non-inlinable-function-bodies-without-types /Users/admin/builder/spi-builder-workspace/Sources/Types/CompoundError.swift /Users/admin/builder/spi-builder-workspace/Sources/Types/CustomOrDefault.swift /Users/admin/builder/spi-builder-workspace/Sources/Types/Either.swift /Users/admin/builder/spi-builder-workspace/Sources/Types/MapWithCollection.swift /Users/admin/builder/spi-builder-workspace/Sources/Types/MutableBox.swift /Users/admin/builder/spi-builder-workspace/Sources/Types/NewIntType.swift /Users/admin/builder/spi-builder-workspace/Sources/Types/NewStringType.swift /Users/admin/builder/spi-builder-workspace/Sources/Types/ThrowingProperty/GettableThrowingProperty.swift /Users/admin/builder/spi-builder-workspace/Sources/Types/ThrowingProperty/GettableThrowingPropertyOf.swift /Users/admin/builder/spi-builder-workspace/Sources/Types/ThrowingProperty/SettableThrowingProperty.swift /Users/admin/builder/spi-builder-workspace/Sources/Types/ThrowingProperty/SettableThrowingPropertyOf.swift /Users/admin/builder/spi-builder-workspace/Sources/Types/ThrowingProperty/ThrowingProperty.swift /Users/admin/builder/spi-builder-workspace/Sources/Types/ThrowingProperty/ThrowingPropertyOf.swift -target arm64-apple-xros1.0 -Xllvm -aarch64-use-tbi -enable-objc-interop -stack-check -sdk /Applications/Xcode-15.4.0.app/Contents/Developer/Platforms/XROS.platform/Developer/SDKs/XROS1.2.sdk -I /Users/admin/builder/spi-builder-workspace/.derivedData/Build/Products/Debug-xros -I /Applications/Xcode-15.4.0.app/Contents/Developer/Platforms/XROS.platform/Developer/usr/lib -F /Users/admin/builder/spi-builder-workspace/.derivedData/Build/Products/Debug-xros -F /Applications/Xcode-15.4.0.app/Contents/Developer/Platforms/XROS.platform/Developer/Library/Frameworks -F /Applications/Xcode-15.4.0.app/Contents/Developer/Platforms/XROS.platform/Developer/SDKs/XROS1.2.sdk/Developer/Library/Frameworks -no-color-diagnostics -enable-testing -g -module-cache-path /Users/admin/builder/spi-builder-workspace/.derivedData/ModuleCache.noindex -profile-generate -profile-coverage-mapping -swift-version 5 -enforce-exclusivity\=checked -Onone -D SWIFT_PACKAGE -D DEBUG -D Xcode -serialize-debugging-options -package-name spi_builder_workspace -const-gather-protocols-file /Users/admin/builder/spi-builder-workspace/.derivedData/Build/Intermediates.noindex/CommandLineToolkit.build/Debug-xros/Types.build/Objects-normal/arm64/Types_const_extract_protocols.json -empty-abi-descriptor -validate-clang-modules-once -clang-build-session-file /Users/admin/builder/spi-builder-workspace/.derivedData/ModuleCache.noindex/Session.modulevalidation -Xcc -working-directory -Xcc /Users/admin/builder/spi-builder-workspace -resource-dir /Applications/Xcode-15.4.0.app/Contents/Developer/Toolchains/XcodeDefault.xctoolchain/usr/lib/swift -enable-anonymous-context-mangled-names -Xcc -ivfsstatcache -Xcc /Users/admin/builder/spi-builder-workspace/.derivedData/SDKStatCaches.noindex/xros1.2-21O5565d-70e6a4b4e6ce75e0f2056db95c07d51a.sdkstatcache -Xcc -I/Users/admin/builder/spi-builder-workspace/.derivedData/Build/Intermediates.noindex/CommandLineToolkit.build/Debug-xros/Types.build/swift-overrides.hmap -Xcc -I/Users/admin/builder/spi-builder-workspace/.derivedData/Build/Products/Debug-xros/include -Xcc -I/Users/admin/builder/spi-builder-workspace/.derivedData/Build/Intermediates.noindex/CommandLineToolkit.build/Debug-xros/Types.build/DerivedSources-normal/arm64 -Xcc -I/Users/admin/builder/spi-builder-workspace/.derivedData/Build/Intermediates.noindex/CommandLineToolkit.build/Debug-xros/Types.build/DerivedSources/arm64 -Xcc -I/Users/admin/builder/spi-builder-workspace/.derivedData/Build/Intermediates.noindex/CommandLineToolkit.build/Debug-xros/Types.build/DerivedSources -Xcc -DSWIFT_PACKAGE -Xcc -DDEBUG\=1 -module-name Types -disable-clang-spi -target-sdk-version 1.2 -target-sdk-name xros1.2 -external-plugin-path /Applications/Xcode-15.4.0.app/Contents/Developer/Platforms/XROS.platform/Developer/SDKs/XROS1.2.sdk/usr/lib/swift/host/plugins\#/Applications/Xcode-15.4.0.app/Contents/Developer/Platforms/XROS.platform/Developer/SDKs/XROS1.2.sdk/usr/bin/swift-plugin-server -external-plugin-path /Applications/Xcode-15.4.0.app/Contents/Developer/Platforms/XROS.platform/Developer/SDKs/XROS1.2.sdk/usr/local/lib/swift/host/plugins\#/Applications/Xcode-15.4.0.app/Contents/Developer/Platforms/XROS.platform/Developer/SDKs/XROS1.2.sdk/usr/bin/swift-plugin-server -external-plugin-path /Applications/Xcode-15.4.0.app/Contents/Developer/Platforms/XROS.platform/Developer/usr/lib/swift/host/plugins\#/Applications/Xcode-15.4.0.app/Contents/Developer/Platforms/XROS.platform/Developer/usr/bin/swift-plugin-server -external-plugin-path /Applications/Xcode-15.4.0.app/Contents/Developer/Platforms/XROS.platform/Developer/usr/local/lib/swift/host/plugins\#/Applications/Xcode-15.4.0.app/Contents/Developer/Platforms/XROS.platform/Developer/usr/bin/swift-plugin-server -plugin-path /Applications/Xcode-15.4.0.app/Contents/Developer/Toolchains/XcodeDefault.xctoolchain/usr/lib/swift/host/plugins -plugin-path /Applications/Xcode-15.4.0.app/Contents/Developer/Toolchains/XcodeDefault.xctoolchain/usr/local/lib/swift/host/plugins -emit-module-doc-path /Users/admin/builder/spi-builder-workspace/.derivedData/Build/Intermediates.noindex/CommandLineToolkit.build/Debug-xros/Types.build/Objects-normal/arm64/Types.swiftdoc -emit-module-source-info-path /Users/admin/builder/spi-builder-workspace/.derivedData/Build/Intermediates.noindex/CommandLineToolkit.build/Debug-xros/Types.build/Objects-normal/arm64/Types.swiftsourceinfo -emit-objc-header-path /Users/admin/builder/spi-builder-workspace/.derivedData/Build/Intermediates.noindex/CommandLineToolkit.build/Debug-xros/Types.build/Objects-normal/arm64/Types-Swift.h -serialize-diagnostics-path /Users/admin/builder/spi-builder-workspace/.derivedData/Build/Intermediates.noindex/CommandLineToolkit.build/Debug-xros/Types.build/Objects-normal/arm64/Types-master-emit-module.dia -emit-dependencies-path /Users/admin/builder/spi-builder-workspace/.derivedData/Build/Intermediates.noindex/CommandLineToolkit.build/Debug-xros/Types.build/Objects-normal/arm64/Types-master-emit-module.d -o /Users/admin/builder/spi-builder-workspace/.derivedData/Build/Intermediates.noindex/CommandLineToolkit.build/Debug-xros/Types.build/Objects-normal/arm64/Types.swiftmodule -emit-abi-descriptor-path /Users/admin/builder/spi-builder-workspace/.derivedData/Build/Intermediates.noindex/CommandLineToolkit.build/Debug-xros/Types.build/Objects-normal/arm64/Types.abi.json
SwiftEmitModule normal arm64 Emitting\ module\ for\ LaunchdUtils (in target 'LaunchdUtils' from project 'CommandLineToolkit')
    cd /Users/admin/builder/spi-builder-workspace
    builtin-swiftTaskExecution -- /Applications/Xcode-15.4.0.app/Contents/Developer/Toolchains/XcodeDefault.xctoolchain/usr/bin/swift-frontend -frontend -emit-module -experimental-skip-non-inlinable-function-bodies-without-types /Users/admin/builder/spi-builder-workspace/Sources/LaunchdUtils/LaunchdJob.swift /Users/admin/builder/spi-builder-workspace/Sources/LaunchdUtils/LaunchdPlist.swift /Users/admin/builder/spi-builder-workspace/Sources/LaunchdUtils/LaunchdSocket.swift /Users/admin/builder/spi-builder-workspace/Sources/LaunchdUtils/LaunchdSocketActivation.swift /Users/admin/builder/spi-builder-workspace/Sources/LaunchdUtils/LaunchdSocketActivationError.swift -target arm64-apple-xros1.0 -Xllvm -aarch64-use-tbi -enable-objc-interop -stack-check -sdk /Applications/Xcode-15.4.0.app/Contents/Developer/Platforms/XROS.platform/Developer/SDKs/XROS1.2.sdk -I /Users/admin/builder/spi-builder-workspace/.derivedData/Build/Products/Debug-xros -I /Applications/Xcode-15.4.0.app/Contents/Developer/Platforms/XROS.platform/Developer/usr/lib -F /Users/admin/builder/spi-builder-workspace/.derivedData/Build/Products/Debug-xros -F /Applications/Xcode-15.4.0.app/Contents/Developer/Platforms/XROS.platform/Developer/Library/Frameworks -F /Applications/Xcode-15.4.0.app/Contents/Developer/Platforms/XROS.platform/Developer/SDKs/XROS1.2.sdk/Developer/Library/Frameworks -no-color-diagnostics -enable-testing -g -module-cache-path /Users/admin/builder/spi-builder-workspace/.derivedData/ModuleCache.noindex -profile-generate -profile-coverage-mapping -swift-version 5 -enforce-exclusivity\=checked -Onone -D SWIFT_PACKAGE -D DEBUG -D Xcode -serialize-debugging-options -package-name spi_builder_workspace -const-gather-protocols-file /Users/admin/builder/spi-builder-workspace/.derivedData/Build/Intermediates.noindex/CommandLineToolkit.build/Debug-xros/LaunchdUtils.build/Objects-normal/arm64/LaunchdUtils_const_extract_protocols.json -empty-abi-descriptor -validate-clang-modules-once -clang-build-session-file /Users/admin/builder/spi-builder-workspace/.derivedData/ModuleCache.noindex/Session.modulevalidation -Xcc -working-directory -Xcc /Users/admin/builder/spi-builder-workspace -resource-dir /Applications/Xcode-15.4.0.app/Contents/Developer/Toolchains/XcodeDefault.xctoolchain/usr/lib/swift -enable-anonymous-context-mangled-names -Xcc -ivfsstatcache -Xcc /Users/admin/builder/spi-builder-workspace/.derivedData/SDKStatCaches.noindex/xros1.2-21O5565d-70e6a4b4e6ce75e0f2056db95c07d51a.sdkstatcache -Xcc -I/Users/admin/builder/spi-builder-workspace/.derivedData/Build/Intermediates.noindex/CommandLineToolkit.build/Debug-xros/LaunchdUtils.build/swift-overrides.hmap -Xcc -I/Users/admin/builder/spi-builder-workspace/.derivedData/Build/Products/Debug-xros/include -Xcc -I/Users/admin/builder/spi-builder-workspace/.derivedData/Build/Intermediates.noindex/CommandLineToolkit.build/Debug-xros/LaunchdUtils.build/DerivedSources-normal/arm64 -Xcc -I/Users/admin/builder/spi-builder-workspace/.derivedData/Build/Intermediates.noindex/CommandLineToolkit.build/Debug-xros/LaunchdUtils.build/DerivedSources/arm64 -Xcc -I/Users/admin/builder/spi-builder-workspace/.derivedData/Build/Intermediates.noindex/CommandLineToolkit.build/Debug-xros/LaunchdUtils.build/DerivedSources -Xcc -DSWIFT_PACKAGE -Xcc -DDEBUG\=1 -module-name LaunchdUtils -disable-clang-spi -target-sdk-version 1.2 -target-sdk-name xros1.2 -external-plugin-path /Applications/Xcode-15.4.0.app/Contents/Developer/Platforms/XROS.platform/Developer/SDKs/XROS1.2.sdk/usr/lib/swift/host/plugins\#/Applications/Xcode-15.4.0.app/Contents/Developer/Platforms/XROS.platform/Developer/SDKs/XROS1.2.sdk/usr/bin/swift-plugin-server -external-plugin-path /Applications/Xcode-15.4.0.app/Contents/Developer/Platforms/XROS.platform/Developer/SDKs/XROS1.2.sdk/usr/local/lib/swift/host/plugins\#/Applications/Xcode-15.4.0.app/Contents/Developer/Platforms/XROS.platform/Developer/SDKs/XROS1.2.sdk/usr/bin/swift-plugin-server -external-plugin-path /Applications/Xcode-15.4.0.app/Contents/Developer/Platforms/XROS.platform/Developer/usr/lib/swift/host/plugins\#/Applications/Xcode-15.4.0.app/Contents/Developer/Platforms/XROS.platform/Developer/usr/bin/swift-plugin-server -external-plugin-path /Applications/Xcode-15.4.0.app/Contents/Developer/Platforms/XROS.platform/Developer/usr/local/lib/swift/host/plugins\#/Applications/Xcode-15.4.0.app/Contents/Developer/Platforms/XROS.platform/Developer/usr/bin/swift-plugin-server -plugin-path /Applications/Xcode-15.4.0.app/Contents/Developer/Toolchains/XcodeDefault.xctoolchain/usr/lib/swift/host/plugins -plugin-path /Applications/Xcode-15.4.0.app/Contents/Developer/Toolchains/XcodeDefault.xctoolchain/usr/local/lib/swift/host/plugins -emit-module-doc-path /Users/admin/builder/spi-builder-workspace/.derivedData/Build/Intermediates.noindex/CommandLineToolkit.build/Debug-xros/LaunchdUtils.build/Objects-normal/arm64/LaunchdUtils.swiftdoc -emit-module-source-info-path /Users/admin/builder/spi-builder-workspace/.derivedData/Build/Intermediates.noindex/CommandLineToolkit.build/Debug-xros/LaunchdUtils.build/Objects-normal/arm64/LaunchdUtils.swiftsourceinfo -emit-objc-header-path /Users/admin/builder/spi-builder-workspace/.derivedData/Build/Intermediates.noindex/CommandLineToolkit.build/Debug-xros/LaunchdUtils.build/Objects-normal/arm64/LaunchdUtils-Swift.h -serialize-diagnostics-path /Users/admin/builder/spi-builder-workspace/.derivedData/Build/Intermediates.noindex/CommandLineToolkit.build/Debug-xros/LaunchdUtils.build/Objects-normal/arm64/LaunchdUtils-master-emit-module.dia -emit-dependencies-path /Users/admin/builder/spi-builder-workspace/.derivedData/Build/Intermediates.noindex/CommandLineToolkit.build/Debug-xros/LaunchdUtils.build/Objects-normal/arm64/LaunchdUtils-master-emit-module.d -o /Users/admin/builder/spi-builder-workspace/.derivedData/Build/Intermediates.noindex/CommandLineToolkit.build/Debug-xros/LaunchdUtils.build/Objects-normal/arm64/LaunchdUtils.swiftmodule -emit-abi-descriptor-path /Users/admin/builder/spi-builder-workspace/.derivedData/Build/Intermediates.noindex/CommandLineToolkit.build/Debug-xros/LaunchdUtils.build/Objects-normal/arm64/LaunchdUtils.abi.json
SwiftDriverJobDiscovery normal arm64 Emitting module for Waitable (in target 'Waitable' from project 'CommandLineToolkit')
SwiftDriverJobDiscovery normal arm64 Emitting module for Timer (in target 'Timer' from project 'CommandLineToolkit')
SwiftDriver\ Compilation\ Requirements Waitable normal arm64 com.apple.xcode.tools.swift.compiler (in target 'Waitable' from project 'CommandLineToolkit')
    cd /Users/admin/builder/spi-builder-workspace
    builtin-Swift-Compilation-Requirements -- /Applications/Xcode-15.4.0.app/Contents/Developer/Toolchains/XcodeDefault.xctoolchain/usr/bin/swiftc -module-name Waitable -Onone -enforce-exclusivity\=checked @/Users/admin/builder/spi-builder-workspace/.derivedData/Build/Intermediates.noindex/CommandLineToolkit.build/Debug-xros/Waitable.build/Objects-normal/arm64/Waitable.SwiftFileList -DSWIFT_PACKAGE -DDEBUG -DXcode -sdk /Applications/Xcode-15.4.0.app/Contents/Developer/Platforms/XROS.platform/Developer/SDKs/XROS1.2.sdk -target arm64-apple-xros1.0 -g -module-cache-path /Users/admin/builder/spi-builder-workspace/.derivedData/ModuleCache.noindex -Xfrontend -serialize-debugging-options -profile-coverage-mapping -profile-generate -enable-testing -index-store-path /Users/admin/builder/spi-builder-workspace/.derivedData/Index.noindex/DataStore -swift-version 5 -I /Users/admin/builder/spi-builder-workspace/.derivedData/Build/Products/Debug-xros -I /Applications/Xcode-15.4.0.app/Contents/Developer/Platforms/XROS.platform/Developer/usr/lib -F /Users/admin/builder/spi-builder-workspace/.derivedData/Build/Products/Debug-xros -F /Applications/Xcode-15.4.0.app/Contents/Developer/Platforms/XROS.platform/Developer/Library/Frameworks -F /Applications/Xcode-15.4.0.app/Contents/Developer/Platforms/XROS.platform/Developer/SDKs/XROS1.2.sdk/Developer/Library/Frameworks -parse-as-library -c -j10 -enable-batch-mode -incremental -Xcc -ivfsstatcache -Xcc /Users/admin/builder/spi-builder-workspace/.derivedData/SDKStatCaches.noindex/xros1.2-21O5565d-70e6a4b4e6ce75e0f2056db95c07d51a.sdkstatcache -output-file-map /Users/admin/builder/spi-builder-workspace/.derivedData/Build/Intermediates.noindex/CommandLineToolkit.build/Debug-xros/Waitable.build/Objects-normal/arm64/Waitable-OutputFileMap.json -use-frontend-parseable-output -save-temps -no-color-diagnostics -serialize-diagnostics -emit-dependencies -emit-module -emit-module-path /Users/admin/builder/spi-builder-workspace/.derivedData/Build/Intermediates.noindex/CommandLineToolkit.build/Debug-xros/Waitable.build/Objects-normal/arm64/Waitable.swiftmodule -validate-clang-modules-once -clang-build-session-file /Users/admin/builder/spi-builder-workspace/.derivedData/ModuleCache.noindex/Session.modulevalidation -Xfrontend -package-name -Xfrontend spi_builder_workspace -Xcc -I/Users/admin/builder/spi-builder-workspace/.derivedData/Build/Intermediates.noindex/CommandLineToolkit.build/Debug-xros/Waitable.build/swift-overrides.hmap -emit-const-values -Xfrontend -const-gather-protocols-file -Xfrontend /Users/admin/builder/spi-builder-workspace/.derivedData/Build/Intermediates.noindex/CommandLineToolkit.build/Debug-xros/Waitable.build/Objects-normal/arm64/Waitable_const_extract_protocols.json -Xcc -I/Users/admin/builder/spi-builder-workspace/.derivedData/Build/Products/Debug-xros/include -Xcc -I/Users/admin/builder/spi-builder-workspace/.derivedData/Build/Intermediates.noindex/CommandLineToolkit.build/Debug-xros/Waitable.build/DerivedSources-normal/arm64 -Xcc -I/Users/admin/builder/spi-builder-workspace/.derivedData/Build/Intermediates.noindex/CommandLineToolkit.build/Debug-xros/Waitable.build/DerivedSources/arm64 -Xcc -I/Users/admin/builder/spi-builder-workspace/.derivedData/Build/Intermediates.noindex/CommandLineToolkit.build/Debug-xros/Waitable.build/DerivedSources -Xcc -DSWIFT_PACKAGE -Xcc -DDEBUG\=1 -emit-objc-header -emit-objc-header-path /Users/admin/builder/spi-builder-workspace/.derivedData/Build/Intermediates.noindex/CommandLineToolkit.build/Debug-xros/Waitable.build/Objects-normal/arm64/Waitable-Swift.h -working-directory /Users/admin/builder/spi-builder-workspace -experimental-emit-module-separately -disable-cmo
SwiftDriver\ Compilation\ Requirements Timer normal arm64 com.apple.xcode.tools.swift.compiler (in target 'Timer' from project 'CommandLineToolkit')
    cd /Users/admin/builder/spi-builder-workspace
    builtin-Swift-Compilation-Requirements -- /Applications/Xcode-15.4.0.app/Contents/Developer/Toolchains/XcodeDefault.xctoolchain/usr/bin/swiftc -module-name Timer -Onone -enforce-exclusivity\=checked @/Users/admin/builder/spi-builder-workspace/.derivedData/Build/Intermediates.noindex/CommandLineToolkit.build/Debug-xros/Timer.build/Objects-normal/arm64/Timer.SwiftFileList -DSWIFT_PACKAGE -DDEBUG -DXcode -sdk /Applications/Xcode-15.4.0.app/Contents/Developer/Platforms/XROS.platform/Developer/SDKs/XROS1.2.sdk -target arm64-apple-xros1.0 -g -module-cache-path /Users/admin/builder/spi-builder-workspace/.derivedData/ModuleCache.noindex -Xfrontend -serialize-debugging-options -profile-coverage-mapping -profile-generate -enable-testing -index-store-path /Users/admin/builder/spi-builder-workspace/.derivedData/Index.noindex/DataStore -swift-version 5 -I /Users/admin/builder/spi-builder-workspace/.derivedData/Build/Products/Debug-xros -I /Applications/Xcode-15.4.0.app/Contents/Developer/Platforms/XROS.platform/Developer/usr/lib -F /Users/admin/builder/spi-builder-workspace/.derivedData/Build/Products/Debug-xros -F /Applications/Xcode-15.4.0.app/Contents/Developer/Platforms/XROS.platform/Developer/Library/Frameworks -F /Applications/Xcode-15.4.0.app/Contents/Developer/Platforms/XROS.platform/Developer/SDKs/XROS1.2.sdk/Developer/Library/Frameworks -parse-as-library -c -j10 -enable-batch-mode -incremental -Xcc -ivfsstatcache -Xcc /Users/admin/builder/spi-builder-workspace/.derivedData/SDKStatCaches.noindex/xros1.2-21O5565d-70e6a4b4e6ce75e0f2056db95c07d51a.sdkstatcache -output-file-map /Users/admin/builder/spi-builder-workspace/.derivedData/Build/Intermediates.noindex/CommandLineToolkit.build/Debug-xros/Timer.build/Objects-normal/arm64/Timer-OutputFileMap.json -use-frontend-parseable-output -save-temps -no-color-diagnostics -serialize-diagnostics -emit-dependencies -emit-module -emit-module-path /Users/admin/builder/spi-builder-workspace/.derivedData/Build/Intermediates.noindex/CommandLineToolkit.build/Debug-xros/Timer.build/Objects-normal/arm64/Timer.swiftmodule -validate-clang-modules-once -clang-build-session-file /Users/admin/builder/spi-builder-workspace/.derivedData/ModuleCache.noindex/Session.modulevalidation -Xfrontend -package-name -Xfrontend spi_builder_workspace -Xcc -I/Users/admin/builder/spi-builder-workspace/.derivedData/Build/Intermediates.noindex/CommandLineToolkit.build/Debug-xros/Timer.build/swift-overrides.hmap -emit-const-values -Xfrontend -const-gather-protocols-file -Xfrontend /Users/admin/builder/spi-builder-workspace/.derivedData/Build/Intermediates.noindex/CommandLineToolkit.build/Debug-xros/Timer.build/Objects-normal/arm64/Timer_const_extract_protocols.json -Xcc -I/Users/admin/builder/spi-builder-workspace/.derivedData/Build/Products/Debug-xros/include -Xcc -I/Users/admin/builder/spi-builder-workspace/.derivedData/Build/Intermediates.noindex/CommandLineToolkit.build/Debug-xros/Timer.build/DerivedSources-normal/arm64 -Xcc -I/Users/admin/builder/spi-builder-workspace/.derivedData/Build/Intermediates.noindex/CommandLineToolkit.build/Debug-xros/Timer.build/DerivedSources/arm64 -Xcc -I/Users/admin/builder/spi-builder-workspace/.derivedData/Build/Intermediates.noindex/CommandLineToolkit.build/Debug-xros/Timer.build/DerivedSources -Xcc -DSWIFT_PACKAGE -Xcc -DDEBUG\=1 -emit-objc-header -emit-objc-header-path /Users/admin/builder/spi-builder-workspace/.derivedData/Build/Intermediates.noindex/CommandLineToolkit.build/Debug-xros/Timer.build/Objects-normal/arm64/Timer-Swift.h -working-directory /Users/admin/builder/spi-builder-workspace -experimental-emit-module-separately -disable-cmo
SwiftDriverJobDiscovery normal arm64 Emitting module for URLSessionTestHelpers (in target 'URLSessionTestHelpers' from project 'CommandLineToolkit')
SwiftMergeGeneratedHeaders /Users/admin/builder/spi-builder-workspace/.derivedData/Build/Intermediates.noindex/GeneratedModuleMaps-xros/Waitable-Swift.h /Users/admin/builder/spi-builder-workspace/.derivedData/Build/Intermediates.noindex/CommandLineToolkit.build/Debug-xros/Waitable.build/Objects-normal/arm64/Waitable-Swift.h (in target 'Waitable' from project 'CommandLineToolkit')
    cd /Users/admin/builder/spi-builder-workspace
    builtin-swiftHeaderTool -arch arm64 /Users/admin/builder/spi-builder-workspace/.derivedData/Build/Intermediates.noindex/CommandLineToolkit.build/Debug-xros/Waitable.build/Objects-normal/arm64/Waitable-Swift.h -o /Users/admin/builder/spi-builder-workspace/.derivedData/Build/Intermediates.noindex/GeneratedModuleMaps-xros/Waitable-Swift.h
Copy /Users/admin/builder/spi-builder-workspace/.derivedData/Build/Products/Debug-xros/Waitable.swiftmodule/arm64-apple-xros.swiftmodule /Users/admin/builder/spi-builder-workspace/.derivedData/Build/Intermediates.noindex/CommandLineToolkit.build/Debug-xros/Waitable.build/Objects-normal/arm64/Waitable.swiftmodule (in target 'Waitable' from project 'CommandLineToolkit')
    cd /Users/admin/builder/spi-builder-workspace
    builtin-copy -exclude .DS_Store -exclude CVS -exclude .svn -exclude .git -exclude .hg -resolve-src-symlinks -rename /Users/admin/builder/spi-builder-workspace/.derivedData/Build/Intermediates.noindex/CommandLineToolkit.build/Debug-xros/Waitable.build/Objects-normal/arm64/Waitable.swiftmodule /Users/admin/builder/spi-builder-workspace/.derivedData/Build/Products/Debug-xros/Waitable.swiftmodule/arm64-apple-xros.swiftmodule
Copy /Users/admin/builder/spi-builder-workspace/.derivedData/Build/Products/Debug-xros/Waitable.swiftmodule/arm64-apple-xros.swiftdoc /Users/admin/builder/spi-builder-workspace/.derivedData/Build/Intermediates.noindex/CommandLineToolkit.build/Debug-xros/Waitable.build/Objects-normal/arm64/Waitable.swiftdoc (in target 'Waitable' from project 'CommandLineToolkit')
    cd /Users/admin/builder/spi-builder-workspace
    builtin-copy -exclude .DS_Store -exclude CVS -exclude .svn -exclude .git -exclude .hg -resolve-src-symlinks -rename /Users/admin/builder/spi-builder-workspace/.derivedData/Build/Intermediates.noindex/CommandLineToolkit.build/Debug-xros/Waitable.build/Objects-normal/arm64/Waitable.swiftdoc /Users/admin/builder/spi-builder-workspace/.derivedData/Build/Products/Debug-xros/Waitable.swiftmodule/arm64-apple-xros.swiftdoc
Copy /Users/admin/builder/spi-builder-workspace/.derivedData/Build/Products/Debug-xros/Waitable.swiftmodule/arm64-apple-xros.abi.json /Users/admin/builder/spi-builder-workspace/.derivedData/Build/Intermediates.noindex/CommandLineToolkit.build/Debug-xros/Waitable.build/Objects-normal/arm64/Waitable.abi.json (in target 'Waitable' from project 'CommandLineToolkit')
    cd /Users/admin/builder/spi-builder-workspace
    builtin-copy -exclude .DS_Store -exclude CVS -exclude .svn -exclude .git -exclude .hg -resolve-src-symlinks -rename /Users/admin/builder/spi-builder-workspace/.derivedData/Build/Intermediates.noindex/CommandLineToolkit.build/Debug-xros/Waitable.build/Objects-normal/arm64/Waitable.abi.json /Users/admin/builder/spi-builder-workspace/.derivedData/Build/Products/Debug-xros/Waitable.swiftmodule/arm64-apple-xros.abi.json
Copy /Users/admin/builder/spi-builder-workspace/.derivedData/Build/Products/Debug-xros/Waitable.swiftmodule/Project/arm64-apple-xros.swiftsourceinfo /Users/admin/builder/spi-builder-workspace/.derivedData/Build/Intermediates.noindex/CommandLineToolkit.build/Debug-xros/Waitable.build/Objects-normal/arm64/Waitable.swiftsourceinfo (in target 'Waitable' from project 'CommandLineToolkit')
    cd /Users/admin/builder/spi-builder-workspace
    builtin-copy -exclude .DS_Store -exclude CVS -exclude .svn -exclude .git -exclude .hg -resolve-src-symlinks -rename /Users/admin/builder/spi-builder-workspace/.derivedData/Build/Intermediates.noindex/CommandLineToolkit.build/Debug-xros/Waitable.build/Objects-normal/arm64/Waitable.swiftsourceinfo /Users/admin/builder/spi-builder-workspace/.derivedData/Build/Products/Debug-xros/Waitable.swiftmodule/Project/arm64-apple-xros.swiftsourceinfo
SwiftDriver\ Compilation\ Requirements URLSessionTestHelpers normal arm64 com.apple.xcode.tools.swift.compiler (in target 'URLSessionTestHelpers' from project 'CommandLineToolkit')
    cd /Users/admin/builder/spi-builder-workspace
    builtin-Swift-Compilation-Requirements -- /Applications/Xcode-15.4.0.app/Contents/Developer/Toolchains/XcodeDefault.xctoolchain/usr/bin/swiftc -module-name URLSessionTestHelpers -Onone -enforce-exclusivity\=checked @/Users/admin/builder/spi-builder-workspace/.derivedData/Build/Intermediates.noindex/CommandLineToolkit.build/Debug-xros/URLSessionTestHelpers.build/Objects-normal/arm64/URLSessionTestHelpers.SwiftFileList -DSWIFT_PACKAGE -DDEBUG -DXcode -sdk /Applications/Xcode-15.4.0.app/Contents/Developer/Platforms/XROS.platform/Developer/SDKs/XROS1.2.sdk -target arm64-apple-xros1.0 -g -module-cache-path /Users/admin/builder/spi-builder-workspace/.derivedData/ModuleCache.noindex -Xfrontend -serialize-debugging-options -profile-coverage-mapping -profile-generate -enable-testing -index-store-path /Users/admin/builder/spi-builder-workspace/.derivedData/Index.noindex/DataStore -swift-version 5 -I /Users/admin/builder/spi-builder-workspace/.derivedData/Build/Products/Debug-xros -I /Applications/Xcode-15.4.0.app/Contents/Developer/Platforms/XROS.platform/Developer/usr/lib -F /Users/admin/builder/spi-builder-workspace/.derivedData/Build/Products/Debug-xros -F /Applications/Xcode-15.4.0.app/Contents/Developer/Platforms/XROS.platform/Developer/Library/Frameworks -F /Applications/Xcode-15.4.0.app/Contents/Developer/Platforms/XROS.platform/Developer/SDKs/XROS1.2.sdk/Developer/Library/Frameworks -parse-as-library -c -j10 -enable-batch-mode -incremental -Xcc -ivfsstatcache -Xcc /Users/admin/builder/spi-builder-workspace/.derivedData/SDKStatCaches.noindex/xros1.2-21O5565d-70e6a4b4e6ce75e0f2056db95c07d51a.sdkstatcache -output-file-map /Users/admin/builder/spi-builder-workspace/.derivedData/Build/Intermediates.noindex/CommandLineToolkit.build/Debug-xros/URLSessionTestHelpers.build/Objects-normal/arm64/URLSessionTestHelpers-OutputFileMap.json -use-frontend-parseable-output -save-temps -no-color-diagnostics -serialize-diagnostics -emit-dependencies -emit-module -emit-module-path /Users/admin/builder/spi-builder-workspace/.derivedData/Build/Intermediates.noindex/CommandLineToolkit.build/Debug-xros/URLSessionTestHelpers.build/Objects-normal/arm64/URLSessionTestHelpers.swiftmodule -validate-clang-modules-once -clang-build-session-file /Users/admin/builder/spi-builder-workspace/.derivedData/ModuleCache.noindex/Session.modulevalidation -Xfrontend -package-name -Xfrontend spi_builder_workspace -Xcc -I/Users/admin/builder/spi-builder-workspace/.derivedData/Build/Intermediates.noindex/CommandLineToolkit.build/Debug-xros/URLSessionTestHelpers.build/swift-overrides.hmap -emit-const-values -Xfrontend -const-gather-protocols-file -Xfrontend /Users/admin/builder/spi-builder-workspace/.derivedData/Build/Intermediates.noindex/CommandLineToolkit.build/Debug-xros/URLSessionTestHelpers.build/Objects-normal/arm64/URLSessionTestHelpers_const_extract_protocols.json -Xcc -I/Users/admin/builder/spi-builder-workspace/.derivedData/Build/Products/Debug-xros/include -Xcc -I/Users/admin/builder/spi-builder-workspace/.derivedData/Build/Intermediates.noindex/CommandLineToolkit.build/Debug-xros/URLSessionTestHelpers.build/DerivedSources-normal/arm64 -Xcc -I/Users/admin/builder/spi-builder-workspace/.derivedData/Build/Intermediates.noindex/CommandLineToolkit.build/Debug-xros/URLSessionTestHelpers.build/DerivedSources/arm64 -Xcc -I/Users/admin/builder/spi-builder-workspace/.derivedData/Build/Intermediates.noindex/CommandLineToolkit.build/Debug-xros/URLSessionTestHelpers.build/DerivedSources -Xcc -DSWIFT_PACKAGE -Xcc -DDEBUG\=1 -emit-objc-header -emit-objc-header-path /Users/admin/builder/spi-builder-workspace/.derivedData/Build/Intermediates.noindex/CommandLineToolkit.build/Debug-xros/URLSessionTestHelpers.build/Objects-normal/arm64/URLSessionTestHelpers-Swift.h -working-directory /Users/admin/builder/spi-builder-workspace -experimental-emit-module-separately -disable-cmo
SwiftMergeGeneratedHeaders /Users/admin/builder/spi-builder-workspace/.derivedData/Build/Intermediates.noindex/GeneratedModuleMaps-xros/Timer-Swift.h /Users/admin/builder/spi-builder-workspace/.derivedData/Build/Intermediates.noindex/CommandLineToolkit.build/Debug-xros/Timer.build/Objects-normal/arm64/Timer-Swift.h (in target 'Timer' from project 'CommandLineToolkit')
    cd /Users/admin/builder/spi-builder-workspace
    builtin-swiftHeaderTool -arch arm64 /Users/admin/builder/spi-builder-workspace/.derivedData/Build/Intermediates.noindex/CommandLineToolkit.build/Debug-xros/Timer.build/Objects-normal/arm64/Timer-Swift.h -o /Users/admin/builder/spi-builder-workspace/.derivedData/Build/Intermediates.noindex/GeneratedModuleMaps-xros/Timer-Swift.h
Copy /Users/admin/builder/spi-builder-workspace/.derivedData/Build/Products/Debug-xros/Timer.swiftmodule/arm64-apple-xros.swiftmodule /Users/admin/builder/spi-builder-workspace/.derivedData/Build/Intermediates.noindex/CommandLineToolkit.build/Debug-xros/Timer.build/Objects-normal/arm64/Timer.swiftmodule (in target 'Timer' from project 'CommandLineToolkit')
    cd /Users/admin/builder/spi-builder-workspace
    builtin-copy -exclude .DS_Store -exclude CVS -exclude .svn -exclude .git -exclude .hg -resolve-src-symlinks -rename /Users/admin/builder/spi-builder-workspace/.derivedData/Build/Intermediates.noindex/CommandLineToolkit.build/Debug-xros/Timer.build/Objects-normal/arm64/Timer.swiftmodule /Users/admin/builder/spi-builder-workspace/.derivedData/Build/Products/Debug-xros/Timer.swiftmodule/arm64-apple-xros.swiftmodule
Copy /Users/admin/builder/spi-builder-workspace/.derivedData/Build/Products/Debug-xros/Timer.swiftmodule/arm64-apple-xros.swiftdoc /Users/admin/builder/spi-builder-workspace/.derivedData/Build/Intermediates.noindex/CommandLineToolkit.build/Debug-xros/Timer.build/Objects-normal/arm64/Timer.swiftdoc (in target 'Timer' from project 'CommandLineToolkit')
    cd /Users/admin/builder/spi-builder-workspace
    builtin-copy -exclude .DS_Store -exclude CVS -exclude .svn -exclude .git -exclude .hg -resolve-src-symlinks -rename /Users/admin/builder/spi-builder-workspace/.derivedData/Build/Intermediates.noindex/CommandLineToolkit.build/Debug-xros/Timer.build/Objects-normal/arm64/Timer.swiftdoc /Users/admin/builder/spi-builder-workspace/.derivedData/Build/Products/Debug-xros/Timer.swiftmodule/arm64-apple-xros.swiftdoc
SwiftDriverJobDiscovery normal arm64 Emitting module for MetricsUtils (in target 'MetricsUtils' from project 'CommandLineToolkit')
SwiftMergeGeneratedHeaders /Users/admin/builder/spi-builder-workspace/.derivedData/Build/Intermediates.noindex/GeneratedModuleMaps-xros/URLSessionTestHelpers-Swift.h /Users/admin/builder/spi-builder-workspace/.derivedData/Build/Intermediates.noindex/CommandLineToolkit.build/Debug-xros/URLSessionTestHelpers.build/Objects-normal/arm64/URLSessionTestHelpers-Swift.h (in target 'URLSessionTestHelpers' from project 'CommandLineToolkit')
    cd /Users/admin/builder/spi-builder-workspace
    builtin-swiftHeaderTool -arch arm64 /Users/admin/builder/spi-builder-workspace/.derivedData/Build/Intermediates.noindex/CommandLineToolkit.build/Debug-xros/URLSessionTestHelpers.build/Objects-normal/arm64/URLSessionTestHelpers-Swift.h -o /Users/admin/builder/spi-builder-workspace/.derivedData/Build/Intermediates.noindex/GeneratedModuleMaps-xros/URLSessionTestHelpers-Swift.h
Copy /Users/admin/builder/spi-builder-workspace/.derivedData/Build/Products/Debug-xros/URLSessionTestHelpers.swiftmodule/arm64-apple-xros.swiftmodule /Users/admin/builder/spi-builder-workspace/.derivedData/Build/Intermediates.noindex/CommandLineToolkit.build/Debug-xros/URLSessionTestHelpers.build/Objects-normal/arm64/URLSessionTestHelpers.swiftmodule (in target 'URLSessionTestHelpers' from project 'CommandLineToolkit')
    cd /Users/admin/builder/spi-builder-workspace
    builtin-copy -exclude .DS_Store -exclude CVS -exclude .svn -exclude .git -exclude .hg -resolve-src-symlinks -rename /Users/admin/builder/spi-builder-workspace/.derivedData/Build/Intermediates.noindex/CommandLineToolkit.build/Debug-xros/URLSessionTestHelpers.build/Objects-normal/arm64/URLSessionTestHelpers.swiftmodule /Users/admin/builder/spi-builder-workspace/.derivedData/Build/Products/Debug-xros/URLSessionTestHelpers.swiftmodule/arm64-apple-xros.swiftmodule
Copy /Users/admin/builder/spi-builder-workspace/.derivedData/Build/Products/Debug-xros/URLSessionTestHelpers.swiftmodule/arm64-apple-xros.swiftdoc /Users/admin/builder/spi-builder-workspace/.derivedData/Build/Intermediates.noindex/CommandLineToolkit.build/Debug-xros/URLSessionTestHelpers.build/Objects-normal/arm64/URLSessionTestHelpers.swiftdoc (in target 'URLSessionTestHelpers' from project 'CommandLineToolkit')
    cd /Users/admin/builder/spi-builder-workspace
    builtin-copy -exclude .DS_Store -exclude CVS -exclude .svn -exclude .git -exclude .hg -resolve-src-symlinks -rename /Users/admin/builder/spi-builder-workspace/.derivedData/Build/Intermediates.noindex/CommandLineToolkit.build/Debug-xros/URLSessionTestHelpers.build/Objects-normal/arm64/URLSessionTestHelpers.swiftdoc /Users/admin/builder/spi-builder-workspace/.derivedData/Build/Products/Debug-xros/URLSessionTestHelpers.swiftmodule/arm64-apple-xros.swiftdoc
Copy /Users/admin/builder/spi-builder-workspace/.derivedData/Build/Products/Debug-xros/URLSessionTestHelpers.swiftmodule/arm64-apple-xros.abi.json /Users/admin/builder/spi-builder-workspace/.derivedData/Build/Intermediates.noindex/CommandLineToolkit.build/Debug-xros/URLSessionTestHelpers.build/Objects-normal/arm64/URLSessionTestHelpers.abi.json (in target 'URLSessionTestHelpers' from project 'CommandLineToolkit')
    cd /Users/admin/builder/spi-builder-workspace
    builtin-copy -exclude .DS_Store -exclude CVS -exclude .svn -exclude .git -exclude .hg -resolve-src-symlinks -rename /Users/admin/builder/spi-builder-workspace/.derivedData/Build/Intermediates.noindex/CommandLineToolkit.build/Debug-xros/URLSessionTestHelpers.build/Objects-normal/arm64/URLSessionTestHelpers.abi.json /Users/admin/builder/spi-builder-workspace/.derivedData/Build/Products/Debug-xros/URLSessionTestHelpers.swiftmodule/arm64-apple-xros.abi.json
Copy /Users/admin/builder/spi-builder-workspace/.derivedData/Build/Products/Debug-xros/URLSessionTestHelpers.swiftmodule/Project/arm64-apple-xros.swiftsourceinfo /Users/admin/builder/spi-builder-workspace/.derivedData/Build/Intermediates.noindex/CommandLineToolkit.build/Debug-xros/URLSessionTestHelpers.build/Objects-normal/arm64/URLSessionTestHelpers.swiftsourceinfo (in target 'URLSessionTestHelpers' from project 'CommandLineToolkit')
    cd /Users/admin/builder/spi-builder-workspace
    builtin-copy -exclude .DS_Store -exclude CVS -exclude .svn -exclude .git -exclude .hg -resolve-src-symlinks -rename /Users/admin/builder/spi-builder-workspace/.derivedData/Build/Intermediates.noindex/CommandLineToolkit.build/Debug-xros/URLSessionTestHelpers.build/Objects-normal/arm64/URLSessionTestHelpers.swiftsourceinfo /Users/admin/builder/spi-builder-workspace/.derivedData/Build/Products/Debug-xros/URLSessionTestHelpers.swiftmodule/Project/arm64-apple-xros.swiftsourceinfo
Copy /Users/admin/builder/spi-builder-workspace/.derivedData/Build/Products/Debug-xros/Timer.swiftmodule/arm64-apple-xros.abi.json /Users/admin/builder/spi-builder-workspace/.derivedData/Build/Intermediates.noindex/CommandLineToolkit.build/Debug-xros/Timer.build/Objects-normal/arm64/Timer.abi.json (in target 'Timer' from project 'CommandLineToolkit')
    cd /Users/admin/builder/spi-builder-workspace
    builtin-copy -exclude .DS_Store -exclude CVS -exclude .svn -exclude .git -exclude .hg -resolve-src-symlinks -rename /Users/admin/builder/spi-builder-workspace/.derivedData/Build/Intermediates.noindex/CommandLineToolkit.build/Debug-xros/Timer.build/Objects-normal/arm64/Timer.abi.json /Users/admin/builder/spi-builder-workspace/.derivedData/Build/Products/Debug-xros/Timer.swiftmodule/arm64-apple-xros.abi.json
Copy /Users/admin/builder/spi-builder-workspace/.derivedData/Build/Products/Debug-xros/Timer.swiftmodule/Project/arm64-apple-xros.swiftsourceinfo /Users/admin/builder/spi-builder-workspace/.derivedData/Build/Intermediates.noindex/CommandLineToolkit.build/Debug-xros/Timer.build/Objects-normal/arm64/Timer.swiftsourceinfo (in target 'Timer' from project 'CommandLineToolkit')
    cd /Users/admin/builder/spi-builder-workspace
    builtin-copy -exclude .DS_Store -exclude CVS -exclude .svn -exclude .git -exclude .hg -resolve-src-symlinks -rename /Users/admin/builder/spi-builder-workspace/.derivedData/Build/Intermediates.noindex/CommandLineToolkit.build/Debug-xros/Timer.build/Objects-normal/arm64/Timer.swiftsourceinfo /Users/admin/builder/spi-builder-workspace/.derivedData/Build/Products/Debug-xros/Timer.swiftmodule/Project/arm64-apple-xros.swiftsourceinfo
SwiftDriverJobDiscovery normal arm64 Emitting module for Signals (in target 'Signals' from project 'Signals')
SwiftDriver\ Compilation\ Requirements MetricsUtils normal arm64 com.apple.xcode.tools.swift.compiler (in target 'MetricsUtils' from project 'CommandLineToolkit')
    cd /Users/admin/builder/spi-builder-workspace
    builtin-Swift-Compilation-Requirements -- /Applications/Xcode-15.4.0.app/Contents/Developer/Toolchains/XcodeDefault.xctoolchain/usr/bin/swiftc -module-name MetricsUtils -Onone -enforce-exclusivity\=checked @/Users/admin/builder/spi-builder-workspace/.derivedData/Build/Intermediates.noindex/CommandLineToolkit.build/Debug-xros/MetricsUtils.build/Objects-normal/arm64/MetricsUtils.SwiftFileList -DSWIFT_PACKAGE -DDEBUG -DXcode -sdk /Applications/Xcode-15.4.0.app/Contents/Developer/Platforms/XROS.platform/Developer/SDKs/XROS1.2.sdk -target arm64-apple-xros1.0 -g -module-cache-path /Users/admin/builder/spi-builder-workspace/.derivedData/ModuleCache.noindex -Xfrontend -serialize-debugging-options -profile-coverage-mapping -profile-generate -enable-testing -index-store-path /Users/admin/builder/spi-builder-workspace/.derivedData/Index.noindex/DataStore -swift-version 5 -I /Users/admin/builder/spi-builder-workspace/.derivedData/Build/Products/Debug-xros -I /Applications/Xcode-15.4.0.app/Contents/Developer/Platforms/XROS.platform/Developer/usr/lib -F /Users/admin/builder/spi-builder-workspace/.derivedData/Build/Products/Debug-xros -F /Applications/Xcode-15.4.0.app/Contents/Developer/Platforms/XROS.platform/Developer/Library/Frameworks -F /Applications/Xcode-15.4.0.app/Contents/Developer/Platforms/XROS.platform/Developer/SDKs/XROS1.2.sdk/Developer/Library/Frameworks -parse-as-library -c -j10 -enable-batch-mode -incremental -Xcc -ivfsstatcache -Xcc /Users/admin/builder/spi-builder-workspace/.derivedData/SDKStatCaches.noindex/xros1.2-21O5565d-70e6a4b4e6ce75e0f2056db95c07d51a.sdkstatcache -output-file-map /Users/admin/builder/spi-builder-workspace/.derivedData/Build/Intermediates.noindex/CommandLineToolkit.build/Debug-xros/MetricsUtils.build/Objects-normal/arm64/MetricsUtils-OutputFileMap.json -use-frontend-parseable-output -save-temps -no-color-diagnostics -serialize-diagnostics -emit-dependencies -emit-module -emit-module-path /Users/admin/builder/spi-builder-workspace/.derivedData/Build/Intermediates.noindex/CommandLineToolkit.build/Debug-xros/MetricsUtils.build/Objects-normal/arm64/MetricsUtils.swiftmodule -validate-clang-modules-once -clang-build-session-file /Users/admin/builder/spi-builder-workspace/.derivedData/ModuleCache.noindex/Session.modulevalidation -Xfrontend -package-name -Xfrontend spi_builder_workspace -Xcc -I/Users/admin/builder/spi-builder-workspace/.derivedData/Build/Intermediates.noindex/CommandLineToolkit.build/Debug-xros/MetricsUtils.build/swift-overrides.hmap -emit-const-values -Xfrontend -const-gather-protocols-file -Xfrontend /Users/admin/builder/spi-builder-workspace/.derivedData/Build/Intermediates.noindex/CommandLineToolkit.build/Debug-xros/MetricsUtils.build/Objects-normal/arm64/MetricsUtils_const_extract_protocols.json -Xcc -I/Users/admin/builder/spi-builder-workspace/.derivedData/Build/Products/Debug-xros/include -Xcc -I/Users/admin/builder/spi-builder-workspace/.derivedData/Build/Intermediates.noindex/CommandLineToolkit.build/Debug-xros/MetricsUtils.build/DerivedSources-normal/arm64 -Xcc -I/Users/admin/builder/spi-builder-workspace/.derivedData/Build/Intermediates.noindex/CommandLineToolkit.build/Debug-xros/MetricsUtils.build/DerivedSources/arm64 -Xcc -I/Users/admin/builder/spi-builder-workspace/.derivedData/Build/Intermediates.noindex/CommandLineToolkit.build/Debug-xros/MetricsUtils.build/DerivedSources -Xcc -DSWIFT_PACKAGE -Xcc -DDEBUG\=1 -emit-objc-header -emit-objc-header-path /Users/admin/builder/spi-builder-workspace/.derivedData/Build/Intermediates.noindex/CommandLineToolkit.build/Debug-xros/MetricsUtils.build/Objects-normal/arm64/MetricsUtils-Swift.h -working-directory /Users/admin/builder/spi-builder-workspace -experimental-emit-module-separately -disable-cmo
SwiftEmitModule normal arm64 Emitting\ module\ for\ Glob (in target 'Glob' from project 'Glob')
    cd /Users/admin/builder/spi-builder-workspace/.dependencies/checkouts/Glob
    builtin-swiftTaskExecution -- /Applications/Xcode-15.4.0.app/Contents/Developer/Toolchains/XcodeDefault.xctoolchain/usr/bin/swift-frontend -frontend -emit-module -experimental-skip-non-inlinable-function-bodies-without-types /Users/admin/builder/spi-builder-workspace/.dependencies/checkouts/Glob/Sources/Glob/Glob.swift -target arm64-apple-xros1.0 -Xllvm -aarch64-use-tbi -enable-objc-interop -stack-check -sdk /Applications/Xcode-15.4.0.app/Contents/Developer/Platforms/XROS.platform/Developer/SDKs/XROS1.2.sdk -I /Users/admin/builder/spi-builder-workspace/.derivedData/Build/Products/Debug-xros -I /Applications/Xcode-15.4.0.app/Contents/Developer/Platforms/XROS.platform/Developer/usr/lib -F /Users/admin/builder/spi-builder-workspace/.derivedData/Build/Products/Debug-xros -F /Applications/Xcode-15.4.0.app/Contents/Developer/Platforms/XROS.platform/Developer/Library/Frameworks -F /Applications/Xcode-15.4.0.app/Contents/Developer/Platforms/XROS.platform/Developer/SDKs/XROS1.2.sdk/Developer/Library/Frameworks -no-color-diagnostics -enable-testing -g -module-cache-path /Users/admin/builder/spi-builder-workspace/.derivedData/ModuleCache.noindex -suppress-warnings -profile-generate -profile-coverage-mapping -swift-version 5 -enforce-exclusivity\=checked -Onone -D SWIFT_PACKAGE -D DEBUG -D Xcode -serialize-debugging-options -const-gather-protocols-file /Users/admin/builder/spi-builder-workspace/.derivedData/Build/Intermediates.noindex/Glob.build/Debug-xros/Glob.build/Objects-normal/arm64/Glob_const_extract_protocols.json -empty-abi-descriptor -validate-clang-modules-once -clang-build-session-file /Users/admin/builder/spi-builder-workspace/.derivedData/ModuleCache.noindex/Session.modulevalidation -Xcc -working-directory -Xcc /Users/admin/builder/spi-builder-workspace/.dependencies/checkouts/Glob -resource-dir /Applications/Xcode-15.4.0.app/Contents/Developer/Toolchains/XcodeDefault.xctoolchain/usr/lib/swift -enable-anonymous-context-mangled-names -Xcc -ivfsstatcache -Xcc /Users/admin/builder/spi-builder-workspace/.derivedData/SDKStatCaches.noindex/xros1.2-21O5565d-70e6a4b4e6ce75e0f2056db95c07d51a.sdkstatcache -Xcc -I/Users/admin/builder/spi-builder-workspace/.derivedData/Build/Intermediates.noindex/Glob.build/Debug-xros/Glob.build/swift-overrides.hmap -Xcc -I/Users/admin/builder/spi-builder-workspace/.derivedData/Build/Products/Debug-xros/include -Xcc -I/Users/admin/builder/spi-builder-workspace/.derivedData/Build/Intermediates.noindex/Glob.build/Debug-xros/Glob.build/DerivedSources-normal/arm64 -Xcc -I/Users/admin/builder/spi-builder-workspace/.derivedData/Build/Intermediates.noindex/Glob.build/Debug-xros/Glob.build/DerivedSources/arm64 -Xcc -I/Users/admin/builder/spi-builder-workspace/.derivedData/Build/Intermediates.noindex/Glob.build/Debug-xros/Glob.build/DerivedSources -Xcc -DSWIFT_PACKAGE -Xcc -DDEBUG\=1 -module-name Glob -disable-clang-spi -target-sdk-version 1.2 -target-sdk-name xros1.2 -external-plugin-path /Applications/Xcode-15.4.0.app/Contents/Developer/Platforms/XROS.platform/Developer/SDKs/XROS1.2.sdk/usr/lib/swift/host/plugins\#/Applications/Xcode-15.4.0.app/Contents/Developer/Platforms/XROS.platform/Developer/SDKs/XROS1.2.sdk/usr/bin/swift-plugin-server -external-plugin-path /Applications/Xcode-15.4.0.app/Contents/Developer/Platforms/XROS.platform/Developer/SDKs/XROS1.2.sdk/usr/local/lib/swift/host/plugins\#/Applications/Xcode-15.4.0.app/Contents/Developer/Platforms/XROS.platform/Developer/SDKs/XROS1.2.sdk/usr/bin/swift-plugin-server -external-plugin-path /Applications/Xcode-15.4.0.app/Contents/Developer/Platforms/XROS.platform/Developer/usr/lib/swift/host/plugins\#/Applications/Xcode-15.4.0.app/Contents/Developer/Platforms/XROS.platform/Developer/usr/bin/swift-plugin-server -external-plugin-path /Applications/Xcode-15.4.0.app/Contents/Developer/Platforms/XROS.platform/Developer/usr/local/lib/swift/host/plugins\#/Applications/Xcode-15.4.0.app/Contents/Developer/Platforms/XROS.platform/Developer/usr/bin/swift-plugin-server -plugin-path /Applications/Xcode-15.4.0.app/Contents/Developer/Toolchains/XcodeDefault.xctoolchain/usr/lib/swift/host/plugins -plugin-path /Applications/Xcode-15.4.0.app/Contents/Developer/Toolchains/XcodeDefault.xctoolchain/usr/local/lib/swift/host/plugins -emit-module-doc-path /Users/admin/builder/spi-builder-workspace/.derivedData/Build/Intermediates.noindex/Glob.build/Debug-xros/Glob.build/Objects-normal/arm64/Glob.swiftdoc -emit-module-source-info-path /Users/admin/builder/spi-builder-workspace/.derivedData/Build/Intermediates.noindex/Glob.build/Debug-xros/Glob.build/Objects-normal/arm64/Glob.swiftsourceinfo -emit-objc-header-path /Users/admin/builder/spi-builder-workspace/.derivedData/Build/Intermediates.noindex/Glob.build/Debug-xros/Glob.build/Objects-normal/arm64/Glob-Swift.h -serialize-diagnostics-path /Users/admin/builder/spi-builder-workspace/.derivedData/Build/Intermediates.noindex/Glob.build/Debug-xros/Glob.build/Objects-normal/arm64/Glob-master-emit-module.dia -emit-dependencies-path /Users/admin/builder/spi-builder-workspace/.derivedData/Build/Intermediates.noindex/Glob.build/Debug-xros/Glob.build/Objects-normal/arm64/Glob-master-emit-module.d -parse-as-library -o /Users/admin/builder/spi-builder-workspace/.derivedData/Build/Intermediates.noindex/Glob.build/Debug-xros/Glob.build/Objects-normal/arm64/Glob.swiftmodule -emit-abi-descriptor-path /Users/admin/builder/spi-builder-workspace/.derivedData/Build/Intermediates.noindex/Glob.build/Debug-xros/Glob.build/Objects-normal/arm64/Glob.abi.json
SwiftEmitModule normal arm64 Emitting\ module\ for\ DI (in target 'DI' from project 'CommandLineToolkit')
    cd /Users/admin/builder/spi-builder-workspace
    builtin-swiftTaskExecution -- /Applications/Xcode-15.4.0.app/Contents/Developer/Toolchains/XcodeDefault.xctoolchain/usr/bin/swift-frontend -frontend -emit-module -experimental-skip-non-inlinable-function-bodies-without-types /Users/admin/builder/spi-builder-workspace/Sources/DI/DependencyCollectionRegisterer/CompoundDependencyCollectionRegisterer.swift /Users/admin/builder/spi-builder-workspace/Sources/DI/DependencyCollectionRegisterer/DependencyCollectionRegisterer.swift /Users/admin/builder/spi-builder-workspace/Sources/DI/DependencyInjection/DelegatingDependencyInjection.swift /Users/admin/builder/spi-builder-workspace/Sources/DI/DependencyInjection/DependencyInjection.swift /Users/admin/builder/spi-builder-workspace/Sources/DI/DependencyInjectionFactory/DependencyInjectionFactory.swift /Users/admin/builder/spi-builder-workspace/Sources/DI/DependencyRegisterer/DependencyRegisterer+RegisterMultiple.swift /Users/admin/builder/spi-builder-workspace/Sources/DI/DependencyRegisterer/DependencyRegisterer.swift /Users/admin/builder/spi-builder-workspace/Sources/DI/DependencyRegisterer/MultipleDependenciesRegistrationContinuation.swift /Users/admin/builder/spi-builder-workspace/Sources/DI/DependencyResolver/CompoundDependencyResolver.swift /Users/admin/builder/spi-builder-workspace/Sources/DI/DependencyResolver/DependencyResolver.swift /Users/admin/builder/spi-builder-workspace/Sources/DI/DependencyResolver/WeakDependencyResolver.swift /Users/admin/builder/spi-builder-workspace/Sources/DI/Facade/DIContext.swift /Users/admin/builder/spi-builder-workspace/Sources/DI/Facade/InitializableWithNoArguments.swift /Users/admin/builder/spi-builder-workspace/Sources/DI/HashableType/HashableType.swift /Users/admin/builder/spi-builder-workspace/Sources/DI/Implementation/DependencyInjection/DependencyInjectionFactoryImpl.swift /Users/admin/builder/spi-builder-workspace/Sources/DI/Implementation/DependencyInjection/DependencyInjectionImpl.swift /Users/admin/builder/spi-builder-workspace/Sources/DI/Implementation/DependencyInjection/RegisteredDependency.swift /Users/admin/builder/spi-builder-workspace/Sources/DI/Models/DiError.swift /Users/admin/builder/spi-builder-workspace/Sources/DI/Models/Scope.swift /Users/admin/builder/spi-builder-workspace/Sources/DI/Modular/AllModularDependenciesDependencyCollectionRegisterer.swift /Users/admin/builder/spi-builder-workspace/Sources/DI/Modular/ModuleDependencies.swift -target arm64-apple-xros1.0 -Xllvm -aarch64-use-tbi -enable-objc-interop -stack-check -sdk /Applications/Xcode-15.4.0.app/Contents/Developer/Platforms/XROS.platform/Developer/SDKs/XROS1.2.sdk -I /Users/admin/builder/spi-builder-workspace/.derivedData/Build/Products/Debug-xros -I /Applications/Xcode-15.4.0.app/Contents/Developer/Platforms/XROS.platform/Developer/usr/lib -F /Users/admin/builder/spi-builder-workspace/.derivedData/Build/Products/Debug-xros -F /Applications/Xcode-15.4.0.app/Contents/Developer/Platforms/XROS.platform/Developer/Library/Frameworks -F /Applications/Xcode-15.4.0.app/Contents/Developer/Platforms/XROS.platform/Developer/SDKs/XROS1.2.sdk/Developer/Library/Frameworks -no-color-diagnostics -enable-testing -g -module-cache-path /Users/admin/builder/spi-builder-workspace/.derivedData/ModuleCache.noindex -profile-generate -profile-coverage-mapping -swift-version 5 -enforce-exclusivity\=checked -Onone -D SWIFT_PACKAGE -D DEBUG -D Xcode -serialize-debugging-options -package-name spi_builder_workspace -const-gather-protocols-file /Users/admin/builder/spi-builder-workspace/.derivedData/Build/Intermediates.noindex/CommandLineToolkit.build/Debug-xros/DI.build/Objects-normal/arm64/DI_const_extract_protocols.json -empty-abi-descriptor -validate-clang-modules-once -clang-build-session-file /Users/admin/builder/spi-builder-workspace/.derivedData/ModuleCache.noindex/Session.modulevalidation -Xcc -working-directory -Xcc /Users/admin/builder/spi-builder-workspace -resource-dir /Applications/Xcode-15.4.0.app/Contents/Developer/Toolchains/XcodeDefault.xctoolchain/usr/lib/swift -enable-anonymous-context-mangled-names -Xcc -ivfsstatcache -Xcc /Users/admin/builder/spi-builder-workspace/.derivedData/SDKStatCaches.noindex/xros1.2-21O5565d-70e6a4b4e6ce75e0f2056db95c07d51a.sdkstatcache -Xcc -I/Users/admin/builder/spi-builder-workspace/.derivedData/Build/Intermediates.noindex/CommandLineToolkit.build/Debug-xros/DI.build/swift-overrides.hmap -Xcc -I/Users/admin/builder/spi-builder-workspace/.derivedData/Build/Products/Debug-xros/include -Xcc -I/Users/admin/builder/spi-builder-workspace/.derivedData/Build/Intermediates.noindex/CommandLineToolkit.build/Debug-xros/DI.build/DerivedSources-normal/arm64 -Xcc -I/Users/admin/builder/spi-builder-workspace/.derivedData/Build/Intermediates.noindex/CommandLineToolkit.build/Debug-xros/DI.build/DerivedSources/arm64 -Xcc -I/Users/admin/builder/spi-builder-workspace/.derivedData/Build/Intermediates.noindex/CommandLineToolkit.build/Debug-xros/DI.build/DerivedSources -Xcc -DSWIFT_PACKAGE -Xcc -DDEBUG\=1 -module-name DI -disable-clang-spi -target-sdk-version 1.2 -target-sdk-name xros1.2 -external-plugin-path /Applications/Xcode-15.4.0.app/Contents/Developer/Platforms/XROS.platform/Developer/SDKs/XROS1.2.sdk/usr/lib/swift/host/plugins\#/Applications/Xcode-15.4.0.app/Contents/Developer/Platforms/XROS.platform/Developer/SDKs/XROS1.2.sdk/usr/bin/swift-plugin-server -external-plugin-path /Applications/Xcode-15.4.0.app/Contents/Developer/Platforms/XROS.platform/Developer/SDKs/XROS1.2.sdk/usr/local/lib/swift/host/plugins\#/Applications/Xcode-15.4.0.app/Contents/Developer/Platforms/XROS.platform/Developer/SDKs/XROS1.2.sdk/usr/bin/swift-plugin-server -external-plugin-path /Applications/Xcode-15.4.0.app/Contents/Developer/Platforms/XROS.platform/Developer/usr/lib/swift/host/plugins\#/Applications/Xcode-15.4.0.app/Contents/Developer/Platforms/XROS.platform/Developer/usr/bin/swift-plugin-server -external-plugin-path /Applications/Xcode-15.4.0.app/Contents/Developer/Platforms/XROS.platform/Developer/usr/local/lib/swift/host/plugins\#/Applications/Xcode-15.4.0.app/Contents/Developer/Platforms/XROS.platform/Developer/usr/bin/swift-plugin-server -plugin-path /Applications/Xcode-15.4.0.app/Contents/Developer/Toolchains/XcodeDefault.xctoolchain/usr/lib/swift/host/plugins -plugin-path /Applications/Xcode-15.4.0.app/Contents/Developer/Toolchains/XcodeDefault.xctoolchain/usr/local/lib/swift/host/plugins -emit-module-doc-path /Users/admin/builder/spi-builder-workspace/.derivedData/Build/Intermediates.noindex/CommandLineToolkit.build/Debug-xros/DI.build/Objects-normal/arm64/DI.swiftdoc -emit-module-source-info-path /Users/admin/builder/spi-builder-workspace/.derivedData/Build/Intermediates.noindex/CommandLineToolkit.build/Debug-xros/DI.build/Objects-normal/arm64/DI.swiftsourceinfo -emit-objc-header-path /Users/admin/builder/spi-builder-workspace/.derivedData/Build/Intermediates.noindex/CommandLineToolkit.build/Debug-xros/DI.build/Objects-normal/arm64/DI-Swift.h -serialize-diagnostics-path /Users/admin/builder/spi-builder-workspace/.derivedData/Build/Intermediates.noindex/CommandLineToolkit.build/Debug-xros/DI.build/Objects-normal/arm64/DI-master-emit-module.dia -emit-dependencies-path /Users/admin/builder/spi-builder-workspace/.derivedData/Build/Intermediates.noindex/CommandLineToolkit.build/Debug-xros/DI.build/Objects-normal/arm64/DI-master-emit-module.d -o /Users/admin/builder/spi-builder-workspace/.derivedData/Build/Intermediates.noindex/CommandLineToolkit.build/Debug-xros/DI.build/Objects-normal/arm64/DI.swiftmodule -emit-abi-descriptor-path /Users/admin/builder/spi-builder-workspace/.derivedData/Build/Intermediates.noindex/CommandLineToolkit.build/Debug-xros/DI.build/Objects-normal/arm64/DI.abi.json
SwiftDriver\ Compilation\ Requirements Signals normal arm64 com.apple.xcode.tools.swift.compiler (in target 'Signals' from project 'Signals')
    cd /Users/admin/builder/spi-builder-workspace/.dependencies/checkouts/BlueSignals
    builtin-Swift-Compilation-Requirements -- /Applications/Xcode-15.4.0.app/Contents/Developer/Toolchains/XcodeDefault.xctoolchain/usr/bin/swiftc -module-name Signals -Onone -enforce-exclusivity\=checked @/Users/admin/builder/spi-builder-workspace/.derivedData/Build/Intermediates.noindex/Signals.build/Debug-xros/Signals.build/Objects-normal/arm64/Signals.SwiftFileList -DSWIFT_PACKAGE -DDEBUG -DXcode -sdk /Applications/Xcode-15.4.0.app/Contents/Developer/Platforms/XROS.platform/Developer/SDKs/XROS1.2.sdk -target arm64-apple-xros1.0 -g -module-cache-path /Users/admin/builder/spi-builder-workspace/.derivedData/ModuleCache.noindex -Xfrontend -serialize-debugging-options -profile-coverage-mapping -profile-generate -enable-testing -suppress-warnings -index-store-path /Users/admin/builder/spi-builder-workspace/.derivedData/Index.noindex/DataStore -swift-version 5 -I /Users/admin/builder/spi-builder-workspace/.derivedData/Build/Products/Debug-xros -I /Applications/Xcode-15.4.0.app/Contents/Developer/Platforms/XROS.platform/Developer/usr/lib -F /Users/admin/builder/spi-builder-workspace/.derivedData/Build/Products/Debug-xros -F /Applications/Xcode-15.4.0.app/Contents/Developer/Platforms/XROS.platform/Developer/Library/Frameworks -F /Applications/Xcode-15.4.0.app/Contents/Developer/Platforms/XROS.platform/Developer/SDKs/XROS1.2.sdk/Developer/Library/Frameworks -parse-as-library -c -j10 -enable-batch-mode -incremental -Xcc -ivfsstatcache -Xcc /Users/admin/builder/spi-builder-workspace/.derivedData/SDKStatCaches.noindex/xros1.2-21O5565d-70e6a4b4e6ce75e0f2056db95c07d51a.sdkstatcache -output-file-map /Users/admin/builder/spi-builder-workspace/.derivedData/Build/Intermediates.noindex/Signals.build/Debug-xros/Signals.build/Objects-normal/arm64/Signals-OutputFileMap.json -use-frontend-parseable-output -save-temps -no-color-diagnostics -serialize-diagnostics -emit-dependencies -emit-module -emit-module-path /Users/admin/builder/spi-builder-workspace/.derivedData/Build/Intermediates.noindex/Signals.build/Debug-xros/Signals.build/Objects-normal/arm64/Signals.swiftmodule -validate-clang-modules-once -clang-build-session-file /Users/admin/builder/spi-builder-workspace/.derivedData/ModuleCache.noindex/Session.modulevalidation -Xcc -I/Users/admin/builder/spi-builder-workspace/.derivedData/Build/Intermediates.noindex/Signals.build/Debug-xros/Signals.build/swift-overrides.hmap -emit-const-values -Xfrontend -const-gather-protocols-file -Xfrontend /Users/admin/builder/spi-builder-workspace/.derivedData/Build/Intermediates.noindex/Signals.build/Debug-xros/Signals.build/Objects-normal/arm64/Signals_const_extract_protocols.json -Xcc -I/Users/admin/builder/spi-builder-workspace/.derivedData/Build/Products/Debug-xros/include -Xcc -I/Users/admin/builder/spi-builder-workspace/.derivedData/Build/Intermediates.noindex/Signals.build/Debug-xros/Signals.build/DerivedSources-normal/arm64 -Xcc -I/Users/admin/builder/spi-builder-workspace/.derivedData/Build/Intermediates.noindex/Signals.build/Debug-xros/Signals.build/DerivedSources/arm64 -Xcc -I/Users/admin/builder/spi-builder-workspace/.derivedData/Build/Intermediates.noindex/Signals.build/Debug-xros/Signals.build/DerivedSources -Xcc -DSWIFT_PACKAGE -Xcc -DDEBUG\=1 -emit-objc-header -emit-objc-header-path /Users/admin/builder/spi-builder-workspace/.derivedData/Build/Intermediates.noindex/Signals.build/Debug-xros/Signals.build/Objects-normal/arm64/Signals-Swift.h -working-directory /Users/admin/builder/spi-builder-workspace/.dependencies/checkouts/BlueSignals -experimental-emit-module-separately -disable-cmo
SwiftEmitModule normal arm64 Emitting\ module\ for\ CLTLoggingModels (in target 'CLTLoggingModels' from project 'CommandLineToolkit')
    cd /Users/admin/builder/spi-builder-workspace
    builtin-swiftTaskExecution -- /Applications/Xcode-15.4.0.app/Contents/Developer/Toolchains/XcodeDefault.xctoolchain/usr/bin/swift-frontend -frontend -emit-module -experimental-skip-non-inlinable-function-bodies-without-types /Users/admin/builder/spi-builder-workspace/Sources/CLTLoggingModels/LogEntry.swift /Users/admin/builder/spi-builder-workspace/Sources/CLTLoggingModels/LogEntryCoordinate.swift /Users/admin/builder/spi-builder-workspace/Sources/CLTLoggingModels/LogEntryTextFormatter.swift /Users/admin/builder/spi-builder-workspace/Sources/CLTLoggingModels/LoggableDate.swift /Users/admin/builder/spi-builder-workspace/Sources/CLTLoggingModels/LoggableDouble.swift /Users/admin/builder/spi-builder-workspace/Sources/CLTLoggingModels/LoggableOptional.swift /Users/admin/builder/spi-builder-workspace/Sources/CLTLoggingModels/NSLogLikeLogEntryTextFormatter.swift /Users/admin/builder/spi-builder-workspace/Sources/CLTLoggingModels/PidInfo.swift /Users/admin/builder/spi-builder-workspace/Sources/CLTLoggingModels/Verbosity.swift -target arm64-apple-xros1.0 -Xllvm -aarch64-use-tbi -enable-objc-interop -stack-check -sdk /Applications/Xcode-15.4.0.app/Contents/Developer/Platforms/XROS.platform/Developer/SDKs/XROS1.2.sdk -I /Users/admin/builder/spi-builder-workspace/.derivedData/Build/Products/Debug-xros -I /Applications/Xcode-15.4.0.app/Contents/Developer/Platforms/XROS.platform/Developer/usr/lib -F /Users/admin/builder/spi-builder-workspace/.derivedData/Build/Products/Debug-xros -F /Applications/Xcode-15.4.0.app/Contents/Developer/Platforms/XROS.platform/Developer/Library/Frameworks -F /Applications/Xcode-15.4.0.app/Contents/Developer/Platforms/XROS.platform/Developer/SDKs/XROS1.2.sdk/Developer/Library/Frameworks -no-color-diagnostics -enable-testing -g -module-cache-path /Users/admin/builder/spi-builder-workspace/.derivedData/ModuleCache.noindex -profile-generate -profile-coverage-mapping -swift-version 5 -enforce-exclusivity\=checked -Onone -D SWIFT_PACKAGE -D DEBUG -D Xcode -serialize-debugging-options -package-name spi_builder_workspace -const-gather-protocols-file /Users/admin/builder/spi-builder-workspace/.derivedData/Build/Intermediates.noindex/CommandLineToolkit.build/Debug-xros/CLTLoggingModels.build/Objects-normal/arm64/CLTLoggingModels_const_extract_protocols.json -empty-abi-descriptor -validate-clang-modules-once -clang-build-session-file /Users/admin/builder/spi-builder-workspace/.derivedData/ModuleCache.noindex/Session.modulevalidation -Xcc -working-directory -Xcc /Users/admin/builder/spi-builder-workspace -resource-dir /Applications/Xcode-15.4.0.app/Contents/Developer/Toolchains/XcodeDefault.xctoolchain/usr/lib/swift -enable-anonymous-context-mangled-names -Xcc -ivfsstatcache -Xcc /Users/admin/builder/spi-builder-workspace/.derivedData/SDKStatCaches.noindex/xros1.2-21O5565d-70e6a4b4e6ce75e0f2056db95c07d51a.sdkstatcache -Xcc -I/Users/admin/builder/spi-builder-workspace/.derivedData/Build/Intermediates.noindex/CommandLineToolkit.build/Debug-xros/CLTLoggingModels.build/swift-overrides.hmap -Xcc -I/Users/admin/builder/spi-builder-workspace/.derivedData/Build/Products/Debug-xros/include -Xcc -I/Users/admin/builder/spi-builder-workspace/.derivedData/Build/Intermediates.noindex/CommandLineToolkit.build/Debug-xros/CLTLoggingModels.build/DerivedSources-normal/arm64 -Xcc -I/Users/admin/builder/spi-builder-workspace/.derivedData/Build/Intermediates.noindex/CommandLineToolkit.build/Debug-xros/CLTLoggingModels.build/DerivedSources/arm64 -Xcc -I/Users/admin/builder/spi-builder-workspace/.derivedData/Build/Intermediates.noindex/CommandLineToolkit.build/Debug-xros/CLTLoggingModels.build/DerivedSources -Xcc -DSWIFT_PACKAGE -Xcc -DDEBUG\=1 -module-name CLTLoggingModels -disable-clang-spi -target-sdk-version 1.2 -target-sdk-name xros1.2 -external-plugin-path /Applications/Xcode-15.4.0.app/Contents/Developer/Platforms/XROS.platform/Developer/SDKs/XROS1.2.sdk/usr/lib/swift/host/plugins\#/Applications/Xcode-15.4.0.app/Contents/Developer/Platforms/XROS.platform/Developer/SDKs/XROS1.2.sdk/usr/bin/swift-plugin-server -external-plugin-path /Applications/Xcode-15.4.0.app/Contents/Developer/Platforms/XROS.platform/Developer/SDKs/XROS1.2.sdk/usr/local/lib/swift/host/plugins\#/Applications/Xcode-15.4.0.app/Contents/Developer/Platforms/XROS.platform/Developer/SDKs/XROS1.2.sdk/usr/bin/swift-plugin-server -external-plugin-path /Applications/Xcode-15.4.0.app/Contents/Developer/Platforms/XROS.platform/Developer/usr/lib/swift/host/plugins\#/Applications/Xcode-15.4.0.app/Contents/Developer/Platforms/XROS.platform/Developer/usr/bin/swift-plugin-server -external-plugin-path /Applications/Xcode-15.4.0.app/Contents/Developer/Platforms/XROS.platform/Developer/usr/local/lib/swift/host/plugins\#/Applications/Xcode-15.4.0.app/Contents/Developer/Platforms/XROS.platform/Developer/usr/bin/swift-plugin-server -plugin-path /Applications/Xcode-15.4.0.app/Contents/Developer/Toolchains/XcodeDefault.xctoolchain/usr/lib/swift/host/plugins -plugin-path /Applications/Xcode-15.4.0.app/Contents/Developer/Toolchains/XcodeDefault.xctoolchain/usr/local/lib/swift/host/plugins -emit-module-doc-path /Users/admin/builder/spi-builder-workspace/.derivedData/Build/Intermediates.noindex/CommandLineToolkit.build/Debug-xros/CLTLoggingModels.build/Objects-normal/arm64/CLTLoggingModels.swiftdoc -emit-module-source-info-path /Users/admin/builder/spi-builder-workspace/.derivedData/Build/Intermediates.noindex/CommandLineToolkit.build/Debug-xros/CLTLoggingModels.build/Objects-normal/arm64/CLTLoggingModels.swiftsourceinfo -emit-objc-header-path /Users/admin/builder/spi-builder-workspace/.derivedData/Build/Intermediates.noindex/CommandLineToolkit.build/Debug-xros/CLTLoggingModels.build/Objects-normal/arm64/CLTLoggingModels-Swift.h -serialize-diagnostics-path /Users/admin/builder/spi-builder-workspace/.derivedData/Build/Intermediates.noindex/CommandLineToolkit.build/Debug-xros/CLTLoggingModels.build/Objects-normal/arm64/CLTLoggingModels-master-emit-module.dia -emit-dependencies-path /Users/admin/builder/spi-builder-workspace/.derivedData/Build/Intermediates.noindex/CommandLineToolkit.build/Debug-xros/CLTLoggingModels.build/Objects-normal/arm64/CLTLoggingModels-master-emit-module.d -o /Users/admin/builder/spi-builder-workspace/.derivedData/Build/Intermediates.noindex/CommandLineToolkit.build/Debug-xros/CLTLoggingModels.build/Objects-normal/arm64/CLTLoggingModels.swiftmodule -emit-abi-descriptor-path /Users/admin/builder/spi-builder-workspace/.derivedData/Build/Intermediates.noindex/CommandLineToolkit.build/Debug-xros/CLTLoggingModels.build/Objects-normal/arm64/CLTLoggingModels.abi.json
SwiftEmitModule normal arm64 Emitting\ module\ for\ CLTExtensions (in target 'CLTExtensions' from project 'CommandLineToolkit')
    cd /Users/admin/builder/spi-builder-workspace
    builtin-swiftTaskExecution -- /Applications/Xcode-15.4.0.app/Contents/Developer/Toolchains/XcodeDefault.xctoolchain/usr/bin/swift-frontend -frontend -emit-module -experimental-skip-non-inlinable-function-bodies-without-types /Users/admin/builder/spi-builder-workspace/Sources/CLTExtensions/Casting.swift /Users/admin/builder/spi-builder-workspace/Sources/CLTExtensions/Collections/Array+Comparable.swift /Users/admin/builder/spi-builder-workspace/Sources/CLTExtensions/Collections/Array+Uniquify.swift /Users/admin/builder/spi-builder-workspace/Sources/CLTExtensions/Collections/Bool+Order.swift /Users/admin/builder/spi-builder-workspace/Sources/CLTExtensions/Collections/Collection+OnlyOrTrow.swift /Users/admin/builder/spi-builder-workspace/Sources/CLTExtensions/Collections/Collection+Single.swift /Users/admin/builder/spi-builder-workspace/Sources/CLTExtensions/Collections/Dictionary+Inverse.swift /Users/admin/builder/spi-builder-workspace/Sources/CLTExtensions/Collections/Dictionary+Map.swift /Users/admin/builder/spi-builder-workspace/Sources/CLTExtensions/Collections/Sequence+FilterSplit.swift /Users/admin/builder/spi-builder-workspace/Sources/CLTExtensions/Collections/Sequence+Grouping.swift /Users/admin/builder/spi-builder-workspace/Sources/CLTExtensions/Collections/Sequence+SortingByKey.swift /Users/admin/builder/spi-builder-workspace/Sources/CLTExtensions/Collections/Set+PlusOperator.swift /Users/admin/builder/spi-builder-workspace/Sources/CLTExtensions/Collections/SetAlgebra+Intersects.swift /Users/admin/builder/spi-builder-workspace/Sources/CLTExtensions/DispatchGroup+wait.swift /Users/admin/builder/spi-builder-workspace/Sources/CLTExtensions/Models/KeyValuePair.swift /Users/admin/builder/spi-builder-workspace/Sources/CLTExtensions/NSLocking+WhileLocked.swift /Users/admin/builder/spi-builder-workspace/Sources/CLTExtensions/Optional+UnwrapOrThrow.swift /Users/admin/builder/spi-builder-workspace/Sources/CLTExtensions/String+LocalizedError.swift /Users/admin/builder/spi-builder-workspace/Sources/CLTExtensions/String+UTF8.swift /Users/admin/builder/spi-builder-workspace/Sources/CLTExtensions/UrlComponents+Throws.swift -target arm64-apple-xros1.0 -Xllvm -aarch64-use-tbi -enable-objc-interop -stack-check -sdk /Applications/Xcode-15.4.0.app/Contents/Developer/Platforms/XROS.platform/Developer/SDKs/XROS1.2.sdk -I /Users/admin/builder/spi-builder-workspace/.derivedData/Build/Products/Debug-xros -I /Applications/Xcode-15.4.0.app/Contents/Developer/Platforms/XROS.platform/Developer/usr/lib -F /Users/admin/builder/spi-builder-workspace/.derivedData/Build/Products/Debug-xros -F /Applications/Xcode-15.4.0.app/Contents/Developer/Platforms/XROS.platform/Developer/Library/Frameworks -F /Applications/Xcode-15.4.0.app/Contents/Developer/Platforms/XROS.platform/Developer/SDKs/XROS1.2.sdk/Developer/Library/Frameworks -no-color-diagnostics -enable-testing -g -module-cache-path /Users/admin/builder/spi-builder-workspace/.derivedData/ModuleCache.noindex -profile-generate -profile-coverage-mapping -swift-version 5 -enforce-exclusivity\=checked -Onone -D SWIFT_PACKAGE -D DEBUG -D Xcode -serialize-debugging-options -package-name spi_builder_workspace -const-gather-protocols-file /Users/admin/builder/spi-builder-workspace/.derivedData/Build/Intermediates.noindex/CommandLineToolkit.build/Debug-xros/CLTExtensions.build/Objects-normal/arm64/CLTExtensions_const_extract_protocols.json -empty-abi-descriptor -validate-clang-modules-once -clang-build-session-file /Users/admin/builder/spi-builder-workspace/.derivedData/ModuleCache.noindex/Session.modulevalidation -Xcc -working-directory -Xcc /Users/admin/builder/spi-builder-workspace -resource-dir /Applications/Xcode-15.4.0.app/Contents/Developer/Toolchains/XcodeDefault.xctoolchain/usr/lib/swift -enable-anonymous-context-mangled-names -Xcc -ivfsstatcache -Xcc /Users/admin/builder/spi-builder-workspace/.derivedData/SDKStatCaches.noindex/xros1.2-21O5565d-70e6a4b4e6ce75e0f2056db95c07d51a.sdkstatcache -Xcc -I/Users/admin/builder/spi-builder-workspace/.derivedData/Build/Intermediates.noindex/CommandLineToolkit.build/Debug-xros/CLTExtensions.build/swift-overrides.hmap -Xcc -I/Users/admin/builder/spi-builder-workspace/.derivedData/Build/Products/Debug-xros/include -Xcc -I/Users/admin/builder/spi-builder-workspace/.derivedData/Build/Intermediates.noindex/CommandLineToolkit.build/Debug-xros/CLTExtensions.build/DerivedSources-normal/arm64 -Xcc -I/Users/admin/builder/spi-builder-workspace/.derivedData/Build/Intermediates.noindex/CommandLineToolkit.build/Debug-xros/CLTExtensions.build/DerivedSources/arm64 -Xcc -I/Users/admin/builder/spi-builder-workspace/.derivedData/Build/Intermediates.noindex/CommandLineToolkit.build/Debug-xros/CLTExtensions.build/DerivedSources -Xcc -DSWIFT_PACKAGE -Xcc -DDEBUG\=1 -module-name CLTExtensions -disable-clang-spi -target-sdk-version 1.2 -target-sdk-name xros1.2 -external-plugin-path /Applications/Xcode-15.4.0.app/Contents/Developer/Platforms/XROS.platform/Developer/SDKs/XROS1.2.sdk/usr/lib/swift/host/plugins\#/Applications/Xcode-15.4.0.app/Contents/Developer/Platforms/XROS.platform/Developer/SDKs/XROS1.2.sdk/usr/bin/swift-plugin-server -external-plugin-path /Applications/Xcode-15.4.0.app/Contents/Developer/Platforms/XROS.platform/Developer/SDKs/XROS1.2.sdk/usr/local/lib/swift/host/plugins\#/Applications/Xcode-15.4.0.app/Contents/Developer/Platforms/XROS.platform/Developer/SDKs/XROS1.2.sdk/usr/bin/swift-plugin-server -external-plugin-path /Applications/Xcode-15.4.0.app/Contents/Developer/Platforms/XROS.platform/Developer/usr/lib/swift/host/plugins\#/Applications/Xcode-15.4.0.app/Contents/Developer/Platforms/XROS.platform/Developer/usr/bin/swift-plugin-server -external-plugin-path /Applications/Xcode-15.4.0.app/Contents/Developer/Platforms/XROS.platform/Developer/usr/local/lib/swift/host/plugins\#/Applications/Xcode-15.4.0.app/Contents/Developer/Platforms/XROS.platform/Developer/usr/bin/swift-plugin-server -plugin-path /Applications/Xcode-15.4.0.app/Contents/Developer/Toolchains/XcodeDefault.xctoolchain/usr/lib/swift/host/plugins -plugin-path /Applications/Xcode-15.4.0.app/Contents/Developer/Toolchains/XcodeDefault.xctoolchain/usr/local/lib/swift/host/plugins -emit-module-doc-path /Users/admin/builder/spi-builder-workspace/.derivedData/Build/Intermediates.noindex/CommandLineToolkit.build/Debug-xros/CLTExtensions.build/Objects-normal/arm64/CLTExtensions.swiftdoc -emit-module-source-info-path /Users/admin/builder/spi-builder-workspace/.derivedData/Build/Intermediates.noindex/CommandLineToolkit.build/Debug-xros/CLTExtensions.build/Objects-normal/arm64/CLTExtensions.swiftsourceinfo -emit-objc-header-path /Users/admin/builder/spi-builder-workspace/.derivedData/Build/Intermediates.noindex/CommandLineToolkit.build/Debug-xros/CLTExtensions.build/Objects-normal/arm64/CLTExtensions-Swift.h -serialize-diagnostics-path /Users/admin/builder/spi-builder-workspace/.derivedData/Build/Intermediates.noindex/CommandLineToolkit.build/Debug-xros/CLTExtensions.build/Objects-normal/arm64/CLTExtensions-master-emit-module.dia -emit-dependencies-path /Users/admin/builder/spi-builder-workspace/.derivedData/Build/Intermediates.noindex/CommandLineToolkit.build/Debug-xros/CLTExtensions.build/Objects-normal/arm64/CLTExtensions-master-emit-module.d -o /Users/admin/builder/spi-builder-workspace/.derivedData/Build/Intermediates.noindex/CommandLineToolkit.build/Debug-xros/CLTExtensions.build/Objects-normal/arm64/CLTExtensions.swiftmodule -emit-abi-descriptor-path /Users/admin/builder/spi-builder-workspace/.derivedData/Build/Intermediates.noindex/CommandLineToolkit.build/Debug-xros/CLTExtensions.build/Objects-normal/arm64/CLTExtensions.abi.json
SwiftMergeGeneratedHeaders /Users/admin/builder/spi-builder-workspace/.derivedData/Build/Intermediates.noindex/GeneratedModuleMaps-xros/Signals-Swift.h /Users/admin/builder/spi-builder-workspace/.derivedData/Build/Intermediates.noindex/Signals.build/Debug-xros/Signals.build/Objects-normal/arm64/Signals-Swift.h (in target 'Signals' from project 'Signals')
    cd /Users/admin/builder/spi-builder-workspace/.dependencies/checkouts/BlueSignals
    builtin-swiftHeaderTool -arch arm64 /Users/admin/builder/spi-builder-workspace/.derivedData/Build/Intermediates.noindex/Signals.build/Debug-xros/Signals.build/Objects-normal/arm64/Signals-Swift.h -o /Users/admin/builder/spi-builder-workspace/.derivedData/Build/Intermediates.noindex/GeneratedModuleMaps-xros/Signals-Swift.h
Copy /Users/admin/builder/spi-builder-workspace/.derivedData/Build/Products/Debug-xros/Signals.swiftmodule/arm64-apple-xros.swiftmodule /Users/admin/builder/spi-builder-workspace/.derivedData/Build/Intermediates.noindex/Signals.build/Debug-xros/Signals.build/Objects-normal/arm64/Signals.swiftmodule (in target 'Signals' from project 'Signals')
    cd /Users/admin/builder/spi-builder-workspace/.dependencies/checkouts/BlueSignals
    builtin-copy -exclude .DS_Store -exclude CVS -exclude .svn -exclude .git -exclude .hg -resolve-src-symlinks -rename /Users/admin/builder/spi-builder-workspace/.derivedData/Build/Intermediates.noindex/Signals.build/Debug-xros/Signals.build/Objects-normal/arm64/Signals.swiftmodule /Users/admin/builder/spi-builder-workspace/.derivedData/Build/Products/Debug-xros/Signals.swiftmodule/arm64-apple-xros.swiftmodule
** BUILD FAILED **
The following build commands failed:
	SwiftEmitModule normal arm64 Emitting\ module\ for\ Logging (in target 'Logging' from project 'swift-log')
(1 failure)
BUILD FAILURE 5.10 visionOS