The Swift Package Index logo.Swift Package Index

Track the adoption of Swift 6 strict concurrency checks for data race safety. How many packages are Ready for Swift 6?

Build Information

Failed to build HotReloading, reference main (59d1b9), with Swift 6.1 for watchOS using Xcode 16.3 on 29 Apr 2025 18:11:50 UTC.

Build Command

env DEVELOPER_DIR=/Applications/Xcode-16.3.0.app xcrun xcodebuild -IDEClonedSourcePackagesDirPathOverride=$PWD/.dependencies -skipMacroValidation -skipPackagePluginValidation -derivedDataPath $PWD/.derivedData build -scheme HotReloading-Package -destination generic/platform=watchOS

Build Log

CompileC /Users/admin/builder/spi-builder-workspace/.derivedData/Build/Intermediates.noindex/SwiftTrace.build/Debug-watchos/SwiftTraceGutsD.build/Objects-normal/armv7k/Trampolines.o /Users/admin/builder/spi-builder-workspace/.dependencies/checkouts/SwiftTrace/SwiftTraceGutsD/Trampolines.mm normal armv7k objective-c++ com.apple.compilers.llvm.clang.1_0.compiler (in target 'SwiftTraceGutsD' from project 'SwiftTrace')
    cd /Users/admin/builder/spi-builder-workspace/.swiftpm/xcode

    Using response file: /Users/admin/builder/spi-builder-workspace/.derivedData/Build/Intermediates.noindex/SwiftTrace.build/Debug-watchos/SwiftTraceGutsD.build/Objects-normal/armv7k/af3fcb34312c57c0f52879cdce924b91-common-args.resp

    /Applications/Xcode-16.3.0.app/Contents/Developer/Toolchains/XcodeDefault.xctoolchain/usr/bin/clang -x objective-c++ -ivfsstatcache /Users/admin/builder/spi-builder-workspace/.derivedData/SDKStatCaches.noindex/watchos11.4-22T246-43efb940ff07ba2497b70ec94253f576.sdkstatcache -fmessage-length\=0 -fdiagnostics-show-note-include-stack -fmacro-backtrace-limit\=0 -fno-color-diagnostics -fmodules-prune-interval\=86400 -fmodules-prune-after\=345600 -fbuild-session-file\=/Users/admin/builder/spi-builder-workspace/.derivedData/ModuleCache.noindex/Session.modulevalidation -fmodules-validate-once-per-build-session -Wnon-modular-include-in-framework-module -Werror\=non-modular-include-in-framework-module -Wno-trigraphs -Wno-missing-field-initializers -Wno-missing-prototypes -Wno-return-type -Wno-implicit-atomic-properties -Wno-objc-interface-ivars -Wno-arc-repeated-use-of-weak -Wno-non-virtual-dtor -Wno-overloaded-virtual -Wno-exit-time-destructors -Wno-missing-braces -Wparentheses -Wswitch -Wno-unused-function -Wno-unused-label -Wno-unused-parameter -Wno-unused-variable -Wunused-value -Wno-empty-body -Wno-uninitialized -Wno-unknown-pragmas -w -Wno-shadow -Wno-four-char-constants -Wno-conversion -Wno-constant-conversion -Wno-int-conversion -Wno-bool-conversion -Wno-enum-conversion -Wno-float-conversion -Wno-non-literal-null-conversion -Wno-objc-literal-conversion -Wno-shorten-64-to-32 -Wno-newline-eof -Wno-selector -Wno-strict-selector-match -Wno-undeclared-selector -Wno-deprecated-implementations -Wno-c++11-extensions -Wno-implicit-fallthrough -fstrict-aliasing -Wprotocol -Wdeprecated-declarations -Winvalid-offsetof -Wno-sign-conversion -Wno-infinite-recursion -Wno-move -Wno-comma -Wno-block-capture-autoreleasing -Wno-strict-prototypes -Wno-range-loop-analysis -Wno-semicolon-before-method-body -index-store-path /Users/admin/builder/spi-builder-workspace/.derivedData/Index.noindex/DataStore @/Users/admin/builder/spi-builder-workspace/.derivedData/Build/Intermediates.noindex/SwiftTrace.build/Debug-watchos/SwiftTraceGutsD.build/Objects-normal/armv7k/af3fcb34312c57c0f52879cdce924b91-common-args.resp -MMD -MT dependencies -MF /Users/admin/builder/spi-builder-workspace/.derivedData/Build/Intermediates.noindex/SwiftTrace.build/Debug-watchos/SwiftTraceGutsD.build/Objects-normal/armv7k/Trampolines.d --serialize-diagnostics /Users/admin/builder/spi-builder-workspace/.derivedData/Build/Intermediates.noindex/SwiftTrace.build/Debug-watchos/SwiftTraceGutsD.build/Objects-normal/armv7k/Trampolines.dia -c /Users/admin/builder/spi-builder-workspace/.dependencies/checkouts/SwiftTrace/SwiftTraceGutsD/Trampolines.mm -o /Users/admin/builder/spi-builder-workspace/.derivedData/Build/Intermediates.noindex/SwiftTrace.build/Debug-watchos/SwiftTraceGutsD.build/Objects-normal/armv7k/Trampolines.o -index-unit-output-path /SwiftTrace.build/Debug-watchos/SwiftTraceGutsD.build/Objects-normal/armv7k/Trampolines.o
SwiftDriverJobDiscovery normal armv7k Emitting module for SwiftRegex (in target 'SwiftRegex' from project 'SwiftRegex')
SwiftDriver\ Compilation\ Requirements SwiftRegex normal armv7k com.apple.xcode.tools.swift.compiler (in target 'SwiftRegex' from project 'SwiftRegex')
    cd /Users/admin/builder/spi-builder-workspace/.swiftpm/xcode
    builtin-Swift-Compilation-Requirements -- /Applications/Xcode-16.3.0.app/Contents/Developer/Toolchains/XcodeDefault.xctoolchain/usr/bin/swiftc -module-name SwiftRegex -Onone -enforce-exclusivity\=checked @/Users/admin/builder/spi-builder-workspace/.derivedData/Build/Intermediates.noindex/SwiftRegex.build/Debug-watchos/SwiftRegex.build/Objects-normal/armv7k/SwiftRegex.SwiftFileList -DSWIFT_PACKAGE -DDEBUG -stats-output-dir .stats -strict-concurrency\=complete -enable-upcoming-feature StrictConcurrency -enable-upcoming-feature DisableOutwardActorInference -enable-upcoming-feature GlobalActorIsolatedTypesUsability -enable-upcoming-feature InferSendableFromCaptures -plugin-path /Applications/Xcode-16.3.0.app/Contents/Developer/Toolchains/XcodeDefault.xctoolchain/usr/lib/swift/host/plugins/testing -enable-experimental-feature DebugDescriptionMacro -sdk /Applications/Xcode-16.3.0.app/Contents/Developer/Platforms/WatchOS.platform/Developer/SDKs/WatchOS11.4.sdk -target armv7k-apple-watchos5.0 -g -module-cache-path /Users/admin/builder/spi-builder-workspace/.derivedData/ModuleCache.noindex -Xfrontend -serialize-debugging-options -enable-testing -suppress-warnings -index-store-path /Users/admin/builder/spi-builder-workspace/.derivedData/Index.noindex/DataStore -swift-version 5 -I /Users/admin/builder/spi-builder-workspace/.derivedData/Build/Products/Debug-watchos -I /Applications/Xcode-16.3.0.app/Contents/Developer/Platforms/WatchOS.platform/Developer/usr/lib -F /Users/admin/builder/spi-builder-workspace/.derivedData/Build/Products/Debug-watchos -F /Applications/Xcode-16.3.0.app/Contents/Developer/Platforms/WatchOS.platform/Developer/Library/Frameworks -F /Applications/Xcode-16.3.0.app/Contents/Developer/Platforms/WatchOS.platform/Developer/SDKs/WatchOS11.4.sdk/Developer/Library/Frameworks -parse-as-library -c -j10 -enable-batch-mode -incremental -Xcc -ivfsstatcache -Xcc /Users/admin/builder/spi-builder-workspace/.derivedData/SDKStatCaches.noindex/watchos11.4-22T246-43efb940ff07ba2497b70ec94253f576.sdkstatcache -output-file-map /Users/admin/builder/spi-builder-workspace/.derivedData/Build/Intermediates.noindex/SwiftRegex.build/Debug-watchos/SwiftRegex.build/Objects-normal/armv7k/SwiftRegex-OutputFileMap.json -use-frontend-parseable-output -save-temps -no-color-diagnostics -serialize-diagnostics -emit-dependencies -emit-module -emit-module-path /Users/admin/builder/spi-builder-workspace/.derivedData/Build/Intermediates.noindex/SwiftRegex.build/Debug-watchos/SwiftRegex.build/Objects-normal/armv7k/SwiftRegex.swiftmodule -validate-clang-modules-once -clang-build-session-file /Users/admin/builder/spi-builder-workspace/.derivedData/ModuleCache.noindex/Session.modulevalidation -Xcc -I/Users/admin/builder/spi-builder-workspace/.derivedData/Build/Intermediates.noindex/SwiftRegex.build/Debug-watchos/SwiftRegex.build/swift-overrides.hmap -emit-const-values -Xfrontend -const-gather-protocols-file -Xfrontend /Users/admin/builder/spi-builder-workspace/.derivedData/Build/Intermediates.noindex/SwiftRegex.build/Debug-watchos/SwiftRegex.build/Objects-normal/armv7k/SwiftRegex_const_extract_protocols.json -Xcc -I/Users/admin/builder/spi-builder-workspace/.derivedData/Build/Products/Debug-watchos/include -Xcc -I/Users/admin/builder/spi-builder-workspace/.derivedData/Build/Intermediates.noindex/SwiftRegex.build/Debug-watchos/SwiftRegex.build/DerivedSources-normal/armv7k -Xcc -I/Users/admin/builder/spi-builder-workspace/.derivedData/Build/Intermediates.noindex/SwiftRegex.build/Debug-watchos/SwiftRegex.build/DerivedSources/armv7k -Xcc -I/Users/admin/builder/spi-builder-workspace/.derivedData/Build/Intermediates.noindex/SwiftRegex.build/Debug-watchos/SwiftRegex.build/DerivedSources -Xcc -DSWIFT_PACKAGE -Xcc -DDEBUG\=1 -emit-objc-header -emit-objc-header-path /Users/admin/builder/spi-builder-workspace/.derivedData/Build/Intermediates.noindex/SwiftRegex.build/Debug-watchos/SwiftRegex.build/Objects-normal/armv7k/SwiftRegex-Swift.h -working-directory /Users/admin/builder/spi-builder-workspace/.swiftpm/xcode -experimental-emit-module-separately -disable-cmo
SwiftDriverJobDiscovery normal arm64 Emitting module for SwiftRegex (in target 'SwiftRegex' from project 'SwiftRegex')
CompileC /Users/admin/builder/spi-builder-workspace/.derivedData/Build/Intermediates.noindex/SwiftTrace.build/Debug-watchos/SwiftTraceGutsD.build/Objects-normal/armv7k/SwiftTrace.o /Users/admin/builder/spi-builder-workspace/.dependencies/checkouts/SwiftTrace/SwiftTraceGutsD/SwiftTrace.mm normal armv7k objective-c++ com.apple.compilers.llvm.clang.1_0.compiler (in target 'SwiftTraceGutsD' from project 'SwiftTrace')
    cd /Users/admin/builder/spi-builder-workspace/.swiftpm/xcode

    Using response file: /Users/admin/builder/spi-builder-workspace/.derivedData/Build/Intermediates.noindex/SwiftTrace.build/Debug-watchos/SwiftTraceGutsD.build/Objects-normal/armv7k/af3fcb34312c57c0f52879cdce924b91-common-args.resp

    /Applications/Xcode-16.3.0.app/Contents/Developer/Toolchains/XcodeDefault.xctoolchain/usr/bin/clang -x objective-c++ -ivfsstatcache /Users/admin/builder/spi-builder-workspace/.derivedData/SDKStatCaches.noindex/watchos11.4-22T246-43efb940ff07ba2497b70ec94253f576.sdkstatcache -fmessage-length\=0 -fdiagnostics-show-note-include-stack -fmacro-backtrace-limit\=0 -fno-color-diagnostics -fmodules-prune-interval\=86400 -fmodules-prune-after\=345600 -fbuild-session-file\=/Users/admin/builder/spi-builder-workspace/.derivedData/ModuleCache.noindex/Session.modulevalidation -fmodules-validate-once-per-build-session -Wnon-modular-include-in-framework-module -Werror\=non-modular-include-in-framework-module -Wno-trigraphs -Wno-missing-field-initializers -Wno-missing-prototypes -Wno-return-type -Wno-implicit-atomic-properties -Wno-objc-interface-ivars -Wno-arc-repeated-use-of-weak -Wno-non-virtual-dtor -Wno-overloaded-virtual -Wno-exit-time-destructors -Wno-missing-braces -Wparentheses -Wswitch -Wno-unused-function -Wno-unused-label -Wno-unused-parameter -Wno-unused-variable -Wunused-value -Wno-empty-body -Wno-uninitialized -Wno-unknown-pragmas -w -Wno-shadow -Wno-four-char-constants -Wno-conversion -Wno-constant-conversion -Wno-int-conversion -Wno-bool-conversion -Wno-enum-conversion -Wno-float-conversion -Wno-non-literal-null-conversion -Wno-objc-literal-conversion -Wno-shorten-64-to-32 -Wno-newline-eof -Wno-selector -Wno-strict-selector-match -Wno-undeclared-selector -Wno-deprecated-implementations -Wno-c++11-extensions -Wno-implicit-fallthrough -fstrict-aliasing -Wprotocol -Wdeprecated-declarations -Winvalid-offsetof -Wno-sign-conversion -Wno-infinite-recursion -Wno-move -Wno-comma -Wno-block-capture-autoreleasing -Wno-strict-prototypes -Wno-range-loop-analysis -Wno-semicolon-before-method-body -index-store-path /Users/admin/builder/spi-builder-workspace/.derivedData/Index.noindex/DataStore @/Users/admin/builder/spi-builder-workspace/.derivedData/Build/Intermediates.noindex/SwiftTrace.build/Debug-watchos/SwiftTraceGutsD.build/Objects-normal/armv7k/af3fcb34312c57c0f52879cdce924b91-common-args.resp -MMD -MT dependencies -MF /Users/admin/builder/spi-builder-workspace/.derivedData/Build/Intermediates.noindex/SwiftTrace.build/Debug-watchos/SwiftTraceGutsD.build/Objects-normal/armv7k/SwiftTrace.d --serialize-diagnostics /Users/admin/builder/spi-builder-workspace/.derivedData/Build/Intermediates.noindex/SwiftTrace.build/Debug-watchos/SwiftTraceGutsD.build/Objects-normal/armv7k/SwiftTrace.dia -c /Users/admin/builder/spi-builder-workspace/.dependencies/checkouts/SwiftTrace/SwiftTraceGutsD/SwiftTrace.mm -o /Users/admin/builder/spi-builder-workspace/.derivedData/Build/Intermediates.noindex/SwiftTrace.build/Debug-watchos/SwiftTraceGutsD.build/Objects-normal/armv7k/SwiftTrace.o -index-unit-output-path /SwiftTrace.build/Debug-watchos/SwiftTraceGutsD.build/Objects-normal/armv7k/SwiftTrace.o
SwiftDriver\ Compilation\ Requirements SwiftRegex normal arm64 com.apple.xcode.tools.swift.compiler (in target 'SwiftRegex' from project 'SwiftRegex')
    cd /Users/admin/builder/spi-builder-workspace/.swiftpm/xcode
    builtin-Swift-Compilation-Requirements -- /Applications/Xcode-16.3.0.app/Contents/Developer/Toolchains/XcodeDefault.xctoolchain/usr/bin/swiftc -module-name SwiftRegex -Onone -enforce-exclusivity\=checked @/Users/admin/builder/spi-builder-workspace/.derivedData/Build/Intermediates.noindex/SwiftRegex.build/Debug-watchos/SwiftRegex.build/Objects-normal/arm64/SwiftRegex.SwiftFileList -DSWIFT_PACKAGE -DDEBUG -stats-output-dir .stats -strict-concurrency\=complete -enable-upcoming-feature StrictConcurrency -enable-upcoming-feature DisableOutwardActorInference -enable-upcoming-feature GlobalActorIsolatedTypesUsability -enable-upcoming-feature InferSendableFromCaptures -plugin-path /Applications/Xcode-16.3.0.app/Contents/Developer/Toolchains/XcodeDefault.xctoolchain/usr/lib/swift/host/plugins/testing -enable-experimental-feature DebugDescriptionMacro -sdk /Applications/Xcode-16.3.0.app/Contents/Developer/Platforms/WatchOS.platform/Developer/SDKs/WatchOS11.4.sdk -target arm64-apple-watchos5.0 -g -module-cache-path /Users/admin/builder/spi-builder-workspace/.derivedData/ModuleCache.noindex -Xfrontend -serialize-debugging-options -enable-testing -suppress-warnings -index-store-path /Users/admin/builder/spi-builder-workspace/.derivedData/Index.noindex/DataStore -swift-version 5 -I /Users/admin/builder/spi-builder-workspace/.derivedData/Build/Products/Debug-watchos -I /Applications/Xcode-16.3.0.app/Contents/Developer/Platforms/WatchOS.platform/Developer/usr/lib -F /Users/admin/builder/spi-builder-workspace/.derivedData/Build/Products/Debug-watchos -F /Applications/Xcode-16.3.0.app/Contents/Developer/Platforms/WatchOS.platform/Developer/Library/Frameworks -F /Applications/Xcode-16.3.0.app/Contents/Developer/Platforms/WatchOS.platform/Developer/SDKs/WatchOS11.4.sdk/Developer/Library/Frameworks -parse-as-library -c -j10 -enable-batch-mode -incremental -Xcc -ivfsstatcache -Xcc /Users/admin/builder/spi-builder-workspace/.derivedData/SDKStatCaches.noindex/watchos11.4-22T246-43efb940ff07ba2497b70ec94253f576.sdkstatcache -output-file-map /Users/admin/builder/spi-builder-workspace/.derivedData/Build/Intermediates.noindex/SwiftRegex.build/Debug-watchos/SwiftRegex.build/Objects-normal/arm64/SwiftRegex-OutputFileMap.json -use-frontend-parseable-output -save-temps -no-color-diagnostics -serialize-diagnostics -emit-dependencies -emit-module -emit-module-path /Users/admin/builder/spi-builder-workspace/.derivedData/Build/Intermediates.noindex/SwiftRegex.build/Debug-watchos/SwiftRegex.build/Objects-normal/arm64/SwiftRegex.swiftmodule -validate-clang-modules-once -clang-build-session-file /Users/admin/builder/spi-builder-workspace/.derivedData/ModuleCache.noindex/Session.modulevalidation -Xcc -I/Users/admin/builder/spi-builder-workspace/.derivedData/Build/Intermediates.noindex/SwiftRegex.build/Debug-watchos/SwiftRegex.build/swift-overrides.hmap -emit-const-values -Xfrontend -const-gather-protocols-file -Xfrontend /Users/admin/builder/spi-builder-workspace/.derivedData/Build/Intermediates.noindex/SwiftRegex.build/Debug-watchos/SwiftRegex.build/Objects-normal/arm64/SwiftRegex_const_extract_protocols.json -Xcc -I/Users/admin/builder/spi-builder-workspace/.derivedData/Build/Products/Debug-watchos/include -Xcc -I/Users/admin/builder/spi-builder-workspace/.derivedData/Build/Intermediates.noindex/SwiftRegex.build/Debug-watchos/SwiftRegex.build/DerivedSources-normal/arm64 -Xcc -I/Users/admin/builder/spi-builder-workspace/.derivedData/Build/Intermediates.noindex/SwiftRegex.build/Debug-watchos/SwiftRegex.build/DerivedSources/arm64 -Xcc -I/Users/admin/builder/spi-builder-workspace/.derivedData/Build/Intermediates.noindex/SwiftRegex.build/Debug-watchos/SwiftRegex.build/DerivedSources -Xcc -DSWIFT_PACKAGE -Xcc -DDEBUG\=1 -emit-objc-header -emit-objc-header-path /Users/admin/builder/spi-builder-workspace/.derivedData/Build/Intermediates.noindex/SwiftRegex.build/Debug-watchos/SwiftRegex.build/Objects-normal/arm64/SwiftRegex-Swift.h -working-directory /Users/admin/builder/spi-builder-workspace/.swiftpm/xcode -experimental-emit-module-separately -disable-cmo
SwiftDriverJobDiscovery normal arm64_32 Emitting module for SwiftRegex (in target 'SwiftRegex' from project 'SwiftRegex')
SwiftDriver\ Compilation\ Requirements SwiftRegex normal arm64_32 com.apple.xcode.tools.swift.compiler (in target 'SwiftRegex' from project 'SwiftRegex')
    cd /Users/admin/builder/spi-builder-workspace/.swiftpm/xcode
    builtin-Swift-Compilation-Requirements -- /Applications/Xcode-16.3.0.app/Contents/Developer/Toolchains/XcodeDefault.xctoolchain/usr/bin/swiftc -module-name SwiftRegex -Onone -enforce-exclusivity\=checked @/Users/admin/builder/spi-builder-workspace/.derivedData/Build/Intermediates.noindex/SwiftRegex.build/Debug-watchos/SwiftRegex.build/Objects-normal/arm64_32/SwiftRegex.SwiftFileList -DSWIFT_PACKAGE -DDEBUG -stats-output-dir .stats -strict-concurrency\=complete -enable-upcoming-feature StrictConcurrency -enable-upcoming-feature DisableOutwardActorInference -enable-upcoming-feature GlobalActorIsolatedTypesUsability -enable-upcoming-feature InferSendableFromCaptures -plugin-path /Applications/Xcode-16.3.0.app/Contents/Developer/Toolchains/XcodeDefault.xctoolchain/usr/lib/swift/host/plugins/testing -enable-experimental-feature DebugDescriptionMacro -sdk /Applications/Xcode-16.3.0.app/Contents/Developer/Platforms/WatchOS.platform/Developer/SDKs/WatchOS11.4.sdk -target arm64_32-apple-watchos5.0 -g -module-cache-path /Users/admin/builder/spi-builder-workspace/.derivedData/ModuleCache.noindex -Xfrontend -serialize-debugging-options -enable-testing -suppress-warnings -index-store-path /Users/admin/builder/spi-builder-workspace/.derivedData/Index.noindex/DataStore -swift-version 5 -I /Users/admin/builder/spi-builder-workspace/.derivedData/Build/Products/Debug-watchos -I /Applications/Xcode-16.3.0.app/Contents/Developer/Platforms/WatchOS.platform/Developer/usr/lib -F /Users/admin/builder/spi-builder-workspace/.derivedData/Build/Products/Debug-watchos -F /Applications/Xcode-16.3.0.app/Contents/Developer/Platforms/WatchOS.platform/Developer/Library/Frameworks -F /Applications/Xcode-16.3.0.app/Contents/Developer/Platforms/WatchOS.platform/Developer/SDKs/WatchOS11.4.sdk/Developer/Library/Frameworks -parse-as-library -c -j10 -enable-batch-mode -incremental -Xcc -ivfsstatcache -Xcc /Users/admin/builder/spi-builder-workspace/.derivedData/SDKStatCaches.noindex/watchos11.4-22T246-43efb940ff07ba2497b70ec94253f576.sdkstatcache -output-file-map /Users/admin/builder/spi-builder-workspace/.derivedData/Build/Intermediates.noindex/SwiftRegex.build/Debug-watchos/SwiftRegex.build/Objects-normal/arm64_32/SwiftRegex-OutputFileMap.json -use-frontend-parseable-output -save-temps -no-color-diagnostics -serialize-diagnostics -emit-dependencies -emit-module -emit-module-path /Users/admin/builder/spi-builder-workspace/.derivedData/Build/Intermediates.noindex/SwiftRegex.build/Debug-watchos/SwiftRegex.build/Objects-normal/arm64_32/SwiftRegex.swiftmodule -validate-clang-modules-once -clang-build-session-file /Users/admin/builder/spi-builder-workspace/.derivedData/ModuleCache.noindex/Session.modulevalidation -Xcc -I/Users/admin/builder/spi-builder-workspace/.derivedData/Build/Intermediates.noindex/SwiftRegex.build/Debug-watchos/SwiftRegex.build/swift-overrides.hmap -emit-const-values -Xfrontend -const-gather-protocols-file -Xfrontend /Users/admin/builder/spi-builder-workspace/.derivedData/Build/Intermediates.noindex/SwiftRegex.build/Debug-watchos/SwiftRegex.build/Objects-normal/arm64_32/SwiftRegex_const_extract_protocols.json -Xcc -I/Users/admin/builder/spi-builder-workspace/.derivedData/Build/Products/Debug-watchos/include -Xcc -I/Users/admin/builder/spi-builder-workspace/.derivedData/Build/Intermediates.noindex/SwiftRegex.build/Debug-watchos/SwiftRegex.build/DerivedSources-normal/arm64_32 -Xcc -I/Users/admin/builder/spi-builder-workspace/.derivedData/Build/Intermediates.noindex/SwiftRegex.build/Debug-watchos/SwiftRegex.build/DerivedSources/arm64_32 -Xcc -I/Users/admin/builder/spi-builder-workspace/.derivedData/Build/Intermediates.noindex/SwiftRegex.build/Debug-watchos/SwiftRegex.build/DerivedSources -Xcc -DSWIFT_PACKAGE -Xcc -DDEBUG\=1 -emit-objc-header -emit-objc-header-path /Users/admin/builder/spi-builder-workspace/.derivedData/Build/Intermediates.noindex/SwiftRegex.build/Debug-watchos/SwiftRegex.build/Objects-normal/arm64_32/SwiftRegex-Swift.h -working-directory /Users/admin/builder/spi-builder-workspace/.swiftpm/xcode -experimental-emit-module-separately -disable-cmo
Copy /Users/admin/builder/spi-builder-workspace/.derivedData/Build/Products/Debug-watchos/SwiftRegex.swiftmodule/armv7k-apple-watchos.swiftmodule /Users/admin/builder/spi-builder-workspace/.derivedData/Build/Intermediates.noindex/SwiftRegex.build/Debug-watchos/SwiftRegex.build/Objects-normal/armv7k/SwiftRegex.swiftmodule (in target 'SwiftRegex' from project 'SwiftRegex')
    cd /Users/admin/builder/spi-builder-workspace/.dependencies/checkouts/SwiftRegex5
    builtin-copy -exclude .DS_Store -exclude CVS -exclude .svn -exclude .git -exclude .hg -resolve-src-symlinks -rename /Users/admin/builder/spi-builder-workspace/.derivedData/Build/Intermediates.noindex/SwiftRegex.build/Debug-watchos/SwiftRegex.build/Objects-normal/armv7k/SwiftRegex.swiftmodule /Users/admin/builder/spi-builder-workspace/.derivedData/Build/Products/Debug-watchos/SwiftRegex.swiftmodule/armv7k-apple-watchos.swiftmodule
SwiftMergeGeneratedHeaders /Users/admin/builder/spi-builder-workspace/.derivedData/Build/Intermediates.noindex/GeneratedModuleMaps-watchos/SwiftRegex-Swift.h /Users/admin/builder/spi-builder-workspace/.derivedData/Build/Intermediates.noindex/SwiftRegex.build/Debug-watchos/SwiftRegex.build/Objects-normal/arm64/SwiftRegex-Swift.h /Users/admin/builder/spi-builder-workspace/.derivedData/Build/Intermediates.noindex/SwiftRegex.build/Debug-watchos/SwiftRegex.build/Objects-normal/arm64_32/SwiftRegex-Swift.h /Users/admin/builder/spi-builder-workspace/.derivedData/Build/Intermediates.noindex/SwiftRegex.build/Debug-watchos/SwiftRegex.build/Objects-normal/armv7k/SwiftRegex-Swift.h (in target 'SwiftRegex' from project 'SwiftRegex')
    cd /Users/admin/builder/spi-builder-workspace/.dependencies/checkouts/SwiftRegex5
    builtin-swiftHeaderTool -arch arm64 /Users/admin/builder/spi-builder-workspace/.derivedData/Build/Intermediates.noindex/SwiftRegex.build/Debug-watchos/SwiftRegex.build/Objects-normal/arm64/SwiftRegex-Swift.h -arch arm64_32 /Users/admin/builder/spi-builder-workspace/.derivedData/Build/Intermediates.noindex/SwiftRegex.build/Debug-watchos/SwiftRegex.build/Objects-normal/arm64_32/SwiftRegex-Swift.h -arch armv7k /Users/admin/builder/spi-builder-workspace/.derivedData/Build/Intermediates.noindex/SwiftRegex.build/Debug-watchos/SwiftRegex.build/Objects-normal/armv7k/SwiftRegex-Swift.h -o /Users/admin/builder/spi-builder-workspace/.derivedData/Build/Intermediates.noindex/GeneratedModuleMaps-watchos/SwiftRegex-Swift.h
Copy /Users/admin/builder/spi-builder-workspace/.derivedData/Build/Products/Debug-watchos/SwiftRegex.swiftmodule/armv7k-apple-watchos.swiftdoc /Users/admin/builder/spi-builder-workspace/.derivedData/Build/Intermediates.noindex/SwiftRegex.build/Debug-watchos/SwiftRegex.build/Objects-normal/armv7k/SwiftRegex.swiftdoc (in target 'SwiftRegex' from project 'SwiftRegex')
    cd /Users/admin/builder/spi-builder-workspace/.dependencies/checkouts/SwiftRegex5
    builtin-copy -exclude .DS_Store -exclude CVS -exclude .svn -exclude .git -exclude .hg -resolve-src-symlinks -rename /Users/admin/builder/spi-builder-workspace/.derivedData/Build/Intermediates.noindex/SwiftRegex.build/Debug-watchos/SwiftRegex.build/Objects-normal/armv7k/SwiftRegex.swiftdoc /Users/admin/builder/spi-builder-workspace/.derivedData/Build/Products/Debug-watchos/SwiftRegex.swiftmodule/armv7k-apple-watchos.swiftdoc
Copy /Users/admin/builder/spi-builder-workspace/.derivedData/Build/Products/Debug-watchos/SwiftRegex.swiftmodule/armv7k-apple-watchos.abi.json /Users/admin/builder/spi-builder-workspace/.derivedData/Build/Intermediates.noindex/SwiftRegex.build/Debug-watchos/SwiftRegex.build/Objects-normal/armv7k/SwiftRegex.abi.json (in target 'SwiftRegex' from project 'SwiftRegex')
    cd /Users/admin/builder/spi-builder-workspace/.dependencies/checkouts/SwiftRegex5
    builtin-copy -exclude .DS_Store -exclude CVS -exclude .svn -exclude .git -exclude .hg -resolve-src-symlinks -rename /Users/admin/builder/spi-builder-workspace/.derivedData/Build/Intermediates.noindex/SwiftRegex.build/Debug-watchos/SwiftRegex.build/Objects-normal/armv7k/SwiftRegex.abi.json /Users/admin/builder/spi-builder-workspace/.derivedData/Build/Products/Debug-watchos/SwiftRegex.swiftmodule/armv7k-apple-watchos.abi.json
Copy /Users/admin/builder/spi-builder-workspace/.derivedData/Build/Products/Debug-watchos/SwiftRegex.swiftmodule/arm64_32-apple-watchos.swiftmodule /Users/admin/builder/spi-builder-workspace/.derivedData/Build/Intermediates.noindex/SwiftRegex.build/Debug-watchos/SwiftRegex.build/Objects-normal/arm64_32/SwiftRegex.swiftmodule (in target 'SwiftRegex' from project 'SwiftRegex')
    cd /Users/admin/builder/spi-builder-workspace/.dependencies/checkouts/SwiftRegex5
    builtin-copy -exclude .DS_Store -exclude CVS -exclude .svn -exclude .git -exclude .hg -resolve-src-symlinks -rename /Users/admin/builder/spi-builder-workspace/.derivedData/Build/Intermediates.noindex/SwiftRegex.build/Debug-watchos/SwiftRegex.build/Objects-normal/arm64_32/SwiftRegex.swiftmodule /Users/admin/builder/spi-builder-workspace/.derivedData/Build/Products/Debug-watchos/SwiftRegex.swiftmodule/arm64_32-apple-watchos.swiftmodule
Copy /Users/admin/builder/spi-builder-workspace/.derivedData/Build/Products/Debug-watchos/SwiftRegex.swiftmodule/arm64_32-apple-watchos.swiftdoc /Users/admin/builder/spi-builder-workspace/.derivedData/Build/Intermediates.noindex/SwiftRegex.build/Debug-watchos/SwiftRegex.build/Objects-normal/arm64_32/SwiftRegex.swiftdoc (in target 'SwiftRegex' from project 'SwiftRegex')
    cd /Users/admin/builder/spi-builder-workspace/.dependencies/checkouts/SwiftRegex5
    builtin-copy -exclude .DS_Store -exclude CVS -exclude .svn -exclude .git -exclude .hg -resolve-src-symlinks -rename /Users/admin/builder/spi-builder-workspace/.derivedData/Build/Intermediates.noindex/SwiftRegex.build/Debug-watchos/SwiftRegex.build/Objects-normal/arm64_32/SwiftRegex.swiftdoc /Users/admin/builder/spi-builder-workspace/.derivedData/Build/Products/Debug-watchos/SwiftRegex.swiftmodule/arm64_32-apple-watchos.swiftdoc
Copy /Users/admin/builder/spi-builder-workspace/.derivedData/Build/Products/Debug-watchos/SwiftRegex.swiftmodule/arm64_32-apple-watchos.abi.json /Users/admin/builder/spi-builder-workspace/.derivedData/Build/Intermediates.noindex/SwiftRegex.build/Debug-watchos/SwiftRegex.build/Objects-normal/arm64_32/SwiftRegex.abi.json (in target 'SwiftRegex' from project 'SwiftRegex')
    cd /Users/admin/builder/spi-builder-workspace/.dependencies/checkouts/SwiftRegex5
    builtin-copy -exclude .DS_Store -exclude CVS -exclude .svn -exclude .git -exclude .hg -resolve-src-symlinks -rename /Users/admin/builder/spi-builder-workspace/.derivedData/Build/Intermediates.noindex/SwiftRegex.build/Debug-watchos/SwiftRegex.build/Objects-normal/arm64_32/SwiftRegex.abi.json /Users/admin/builder/spi-builder-workspace/.derivedData/Build/Products/Debug-watchos/SwiftRegex.swiftmodule/arm64_32-apple-watchos.abi.json
Copy /Users/admin/builder/spi-builder-workspace/.derivedData/Build/Products/Debug-watchos/SwiftRegex.swiftmodule/arm64-apple-watchos.swiftmodule /Users/admin/builder/spi-builder-workspace/.derivedData/Build/Intermediates.noindex/SwiftRegex.build/Debug-watchos/SwiftRegex.build/Objects-normal/arm64/SwiftRegex.swiftmodule (in target 'SwiftRegex' from project 'SwiftRegex')
    cd /Users/admin/builder/spi-builder-workspace/.dependencies/checkouts/SwiftRegex5
    builtin-copy -exclude .DS_Store -exclude CVS -exclude .svn -exclude .git -exclude .hg -resolve-src-symlinks -rename /Users/admin/builder/spi-builder-workspace/.derivedData/Build/Intermediates.noindex/SwiftRegex.build/Debug-watchos/SwiftRegex.build/Objects-normal/arm64/SwiftRegex.swiftmodule /Users/admin/builder/spi-builder-workspace/.derivedData/Build/Products/Debug-watchos/SwiftRegex.swiftmodule/arm64-apple-watchos.swiftmodule
Copy /Users/admin/builder/spi-builder-workspace/.derivedData/Build/Products/Debug-watchos/SwiftRegex.swiftmodule/arm64-apple-watchos.swiftdoc /Users/admin/builder/spi-builder-workspace/.derivedData/Build/Intermediates.noindex/SwiftRegex.build/Debug-watchos/SwiftRegex.build/Objects-normal/arm64/SwiftRegex.swiftdoc (in target 'SwiftRegex' from project 'SwiftRegex')
    cd /Users/admin/builder/spi-builder-workspace/.dependencies/checkouts/SwiftRegex5
    builtin-copy -exclude .DS_Store -exclude CVS -exclude .svn -exclude .git -exclude .hg -resolve-src-symlinks -rename /Users/admin/builder/spi-builder-workspace/.derivedData/Build/Intermediates.noindex/SwiftRegex.build/Debug-watchos/SwiftRegex.build/Objects-normal/arm64/SwiftRegex.swiftdoc /Users/admin/builder/spi-builder-workspace/.derivedData/Build/Products/Debug-watchos/SwiftRegex.swiftmodule/arm64-apple-watchos.swiftdoc
Copy /Users/admin/builder/spi-builder-workspace/.derivedData/Build/Products/Debug-watchos/SwiftRegex.swiftmodule/arm64-apple-watchos.abi.json /Users/admin/builder/spi-builder-workspace/.derivedData/Build/Intermediates.noindex/SwiftRegex.build/Debug-watchos/SwiftRegex.build/Objects-normal/arm64/SwiftRegex.abi.json (in target 'SwiftRegex' from project 'SwiftRegex')
    cd /Users/admin/builder/spi-builder-workspace/.dependencies/checkouts/SwiftRegex5
    builtin-copy -exclude .DS_Store -exclude CVS -exclude .svn -exclude .git -exclude .hg -resolve-src-symlinks -rename /Users/admin/builder/spi-builder-workspace/.derivedData/Build/Intermediates.noindex/SwiftRegex.build/Debug-watchos/SwiftRegex.build/Objects-normal/arm64/SwiftRegex.abi.json /Users/admin/builder/spi-builder-workspace/.derivedData/Build/Products/Debug-watchos/SwiftRegex.swiftmodule/arm64-apple-watchos.abi.json
Copy /Users/admin/builder/spi-builder-workspace/.derivedData/Build/Products/Debug-watchos/SwiftRegex.swiftmodule/Project/armv7k-apple-watchos.swiftsourceinfo /Users/admin/builder/spi-builder-workspace/.derivedData/Build/Intermediates.noindex/SwiftRegex.build/Debug-watchos/SwiftRegex.build/Objects-normal/armv7k/SwiftRegex.swiftsourceinfo (in target 'SwiftRegex' from project 'SwiftRegex')
    cd /Users/admin/builder/spi-builder-workspace/.dependencies/checkouts/SwiftRegex5
    builtin-copy -exclude .DS_Store -exclude CVS -exclude .svn -exclude .git -exclude .hg -resolve-src-symlinks -rename /Users/admin/builder/spi-builder-workspace/.derivedData/Build/Intermediates.noindex/SwiftRegex.build/Debug-watchos/SwiftRegex.build/Objects-normal/armv7k/SwiftRegex.swiftsourceinfo /Users/admin/builder/spi-builder-workspace/.derivedData/Build/Products/Debug-watchos/SwiftRegex.swiftmodule/Project/armv7k-apple-watchos.swiftsourceinfo
Copy /Users/admin/builder/spi-builder-workspace/.derivedData/Build/Products/Debug-watchos/SwiftRegex.swiftmodule/Project/arm64_32-apple-watchos.swiftsourceinfo /Users/admin/builder/spi-builder-workspace/.derivedData/Build/Intermediates.noindex/SwiftRegex.build/Debug-watchos/SwiftRegex.build/Objects-normal/arm64_32/SwiftRegex.swiftsourceinfo (in target 'SwiftRegex' from project 'SwiftRegex')
    cd /Users/admin/builder/spi-builder-workspace/.dependencies/checkouts/SwiftRegex5
    builtin-copy -exclude .DS_Store -exclude CVS -exclude .svn -exclude .git -exclude .hg -resolve-src-symlinks -rename /Users/admin/builder/spi-builder-workspace/.derivedData/Build/Intermediates.noindex/SwiftRegex.build/Debug-watchos/SwiftRegex.build/Objects-normal/arm64_32/SwiftRegex.swiftsourceinfo /Users/admin/builder/spi-builder-workspace/.derivedData/Build/Products/Debug-watchos/SwiftRegex.swiftmodule/Project/arm64_32-apple-watchos.swiftsourceinfo
Copy /Users/admin/builder/spi-builder-workspace/.derivedData/Build/Products/Debug-watchos/SwiftRegex.swiftmodule/Project/arm64-apple-watchos.swiftsourceinfo /Users/admin/builder/spi-builder-workspace/.derivedData/Build/Intermediates.noindex/SwiftRegex.build/Debug-watchos/SwiftRegex.build/Objects-normal/arm64/SwiftRegex.swiftsourceinfo (in target 'SwiftRegex' from project 'SwiftRegex')
    cd /Users/admin/builder/spi-builder-workspace/.dependencies/checkouts/SwiftRegex5
    builtin-copy -exclude .DS_Store -exclude CVS -exclude .svn -exclude .git -exclude .hg -resolve-src-symlinks -rename /Users/admin/builder/spi-builder-workspace/.derivedData/Build/Intermediates.noindex/SwiftRegex.build/Debug-watchos/SwiftRegex.build/Objects-normal/arm64/SwiftRegex.swiftsourceinfo /Users/admin/builder/spi-builder-workspace/.derivedData/Build/Products/Debug-watchos/SwiftRegex.swiftmodule/Project/arm64-apple-watchos.swiftsourceinfo
CompileC /Users/admin/builder/spi-builder-workspace/.derivedData/Build/Intermediates.noindex/SwiftTrace.build/Debug-watchos/SwiftTraceGutsD.build/Objects-normal/armv7k/ObjCBridge.o /Users/admin/builder/spi-builder-workspace/.dependencies/checkouts/SwiftTrace/SwiftTraceGutsD/ObjCBridge.mm normal armv7k objective-c++ com.apple.compilers.llvm.clang.1_0.compiler (in target 'SwiftTraceGutsD' from project 'SwiftTrace')
    cd /Users/admin/builder/spi-builder-workspace/.swiftpm/xcode

    Using response file: /Users/admin/builder/spi-builder-workspace/.derivedData/Build/Intermediates.noindex/SwiftTrace.build/Debug-watchos/SwiftTraceGutsD.build/Objects-normal/armv7k/af3fcb34312c57c0f52879cdce924b91-common-args.resp

    /Applications/Xcode-16.3.0.app/Contents/Developer/Toolchains/XcodeDefault.xctoolchain/usr/bin/clang -x objective-c++ -ivfsstatcache /Users/admin/builder/spi-builder-workspace/.derivedData/SDKStatCaches.noindex/watchos11.4-22T246-43efb940ff07ba2497b70ec94253f576.sdkstatcache -fmessage-length\=0 -fdiagnostics-show-note-include-stack -fmacro-backtrace-limit\=0 -fno-color-diagnostics -fmodules-prune-interval\=86400 -fmodules-prune-after\=345600 -fbuild-session-file\=/Users/admin/builder/spi-builder-workspace/.derivedData/ModuleCache.noindex/Session.modulevalidation -fmodules-validate-once-per-build-session -Wnon-modular-include-in-framework-module -Werror\=non-modular-include-in-framework-module -Wno-trigraphs -Wno-missing-field-initializers -Wno-missing-prototypes -Wno-return-type -Wno-implicit-atomic-properties -Wno-objc-interface-ivars -Wno-arc-repeated-use-of-weak -Wno-non-virtual-dtor -Wno-overloaded-virtual -Wno-exit-time-destructors -Wno-missing-braces -Wparentheses -Wswitch -Wno-unused-function -Wno-unused-label -Wno-unused-parameter -Wno-unused-variable -Wunused-value -Wno-empty-body -Wno-uninitialized -Wno-unknown-pragmas -w -Wno-shadow -Wno-four-char-constants -Wno-conversion -Wno-constant-conversion -Wno-int-conversion -Wno-bool-conversion -Wno-enum-conversion -Wno-float-conversion -Wno-non-literal-null-conversion -Wno-objc-literal-conversion -Wno-shorten-64-to-32 -Wno-newline-eof -Wno-selector -Wno-strict-selector-match -Wno-undeclared-selector -Wno-deprecated-implementations -Wno-c++11-extensions -Wno-implicit-fallthrough -fstrict-aliasing -Wprotocol -Wdeprecated-declarations -Winvalid-offsetof -Wno-sign-conversion -Wno-infinite-recursion -Wno-move -Wno-comma -Wno-block-capture-autoreleasing -Wno-strict-prototypes -Wno-range-loop-analysis -Wno-semicolon-before-method-body -index-store-path /Users/admin/builder/spi-builder-workspace/.derivedData/Index.noindex/DataStore @/Users/admin/builder/spi-builder-workspace/.derivedData/Build/Intermediates.noindex/SwiftTrace.build/Debug-watchos/SwiftTraceGutsD.build/Objects-normal/armv7k/af3fcb34312c57c0f52879cdce924b91-common-args.resp -MMD -MT dependencies -MF /Users/admin/builder/spi-builder-workspace/.derivedData/Build/Intermediates.noindex/SwiftTrace.build/Debug-watchos/SwiftTraceGutsD.build/Objects-normal/armv7k/ObjCBridge.d --serialize-diagnostics /Users/admin/builder/spi-builder-workspace/.derivedData/Build/Intermediates.noindex/SwiftTrace.build/Debug-watchos/SwiftTraceGutsD.build/Objects-normal/armv7k/ObjCBridge.dia -c /Users/admin/builder/spi-builder-workspace/.dependencies/checkouts/SwiftTrace/SwiftTraceGutsD/ObjCBridge.mm -o /Users/admin/builder/spi-builder-workspace/.derivedData/Build/Intermediates.noindex/SwiftTrace.build/Debug-watchos/SwiftTraceGutsD.build/Objects-normal/armv7k/ObjCBridge.o -index-unit-output-path /SwiftTrace.build/Debug-watchos/SwiftTraceGutsD.build/Objects-normal/armv7k/ObjCBridge.o
CompileC /Users/admin/builder/spi-builder-workspace/.derivedData/Build/Intermediates.noindex/SwiftTrace.build/Debug-watchos/SwiftTraceGutsD.build/Objects-normal/arm64_32/xt_forwarding_trampoline_x86.o /Users/admin/builder/spi-builder-workspace/.dependencies/checkouts/SwiftTrace/SwiftTraceGutsD/xt_forwarding_trampoline_x86.s normal arm64_32 assembler-with-cpp com.apple.compilers.llvm.clang.1_0.compiler (in target 'SwiftTraceGutsD' from project 'SwiftTrace')
    cd /Users/admin/builder/spi-builder-workspace/.swiftpm/xcode

    Using response file: /Users/admin/builder/spi-builder-workspace/.derivedData/Build/Intermediates.noindex/SwiftTrace.build/Debug-watchos/SwiftTraceGutsD.build/Objects-normal/arm64_32/533656923a283fa776881f304837ed9e-common-args.resp

    /Applications/Xcode-16.3.0.app/Contents/Developer/Toolchains/XcodeDefault.xctoolchain/usr/bin/clang -x assembler-with-cpp -ivfsstatcache /Users/admin/builder/spi-builder-workspace/.derivedData/SDKStatCaches.noindex/watchos11.4-22T246-43efb940ff07ba2497b70ec94253f576.sdkstatcache -fmessage-length\=0 -fdiagnostics-show-note-include-stack -fmacro-backtrace-limit\=0 -fno-color-diagnostics -fmodules-prune-interval\=86400 -fmodules-prune-after\=345600 -fbuild-session-file\=/Users/admin/builder/spi-builder-workspace/.derivedData/ModuleCache.noindex/Session.modulevalidation -fmodules-validate-once-per-build-session -Wnon-modular-include-in-framework-module -Werror\=non-modular-include-in-framework-module -Wno-trigraphs -Wno-missing-field-initializers -Wno-missing-prototypes -Wno-return-type -Wno-missing-braces -Wparentheses -Wswitch -Wno-unused-function -Wno-unused-label -Wno-unused-parameter -Wno-unused-variable -Wunused-value -Wno-empty-body -Wno-uninitialized -Wno-unknown-pragmas -w -Wno-shadow -Wno-four-char-constants -Wno-conversion -Wno-constant-conversion -Wno-int-conversion -Wno-bool-conversion -Wno-enum-conversion -Wno-float-conversion -Wno-non-literal-null-conversion -Wno-objc-literal-conversion -Wno-shorten-64-to-32 -Wno-newline-eof -Wno-implicit-fallthrough -fstrict-aliasing -Wdeprecated-declarations -Wno-sign-conversion -Wno-infinite-recursion -Wno-comma -Wno-block-capture-autoreleasing -Wno-strict-prototypes -Wno-semicolon-before-method-body -index-store-path /Users/admin/builder/spi-builder-workspace/.derivedData/Index.noindex/DataStore @/Users/admin/builder/spi-builder-workspace/.derivedData/Build/Intermediates.noindex/SwiftTrace.build/Debug-watchos/SwiftTraceGutsD.build/Objects-normal/arm64_32/533656923a283fa776881f304837ed9e-common-args.resp -MMD -MT dependencies -MF /Users/admin/builder/spi-builder-workspace/.derivedData/Build/Intermediates.noindex/SwiftTrace.build/Debug-watchos/SwiftTraceGutsD.build/Objects-normal/arm64_32/xt_forwarding_trampoline_x86.d --serialize-diagnostics /Users/admin/builder/spi-builder-workspace/.derivedData/Build/Intermediates.noindex/SwiftTrace.build/Debug-watchos/SwiftTraceGutsD.build/Objects-normal/arm64_32/xt_forwarding_trampoline_x86.dia -c /Users/admin/builder/spi-builder-workspace/.dependencies/checkouts/SwiftTrace/SwiftTraceGutsD/xt_forwarding_trampoline_x86.s -o /Users/admin/builder/spi-builder-workspace/.derivedData/Build/Intermediates.noindex/SwiftTrace.build/Debug-watchos/SwiftTraceGutsD.build/Objects-normal/arm64_32/xt_forwarding_trampoline_x86.o -index-unit-output-path /SwiftTrace.build/Debug-watchos/SwiftTraceGutsD.build/Objects-normal/arm64_32/xt_forwarding_trampoline_x86.o
CompileC /Users/admin/builder/spi-builder-workspace/.derivedData/Build/Intermediates.noindex/SwiftTrace.build/Debug-watchos/SwiftTraceGutsD.build/Objects-normal/arm64_32/xt_forwarding_trampoline_x64.o /Users/admin/builder/spi-builder-workspace/.dependencies/checkouts/SwiftTrace/SwiftTraceGutsD/xt_forwarding_trampoline_x64.s normal arm64_32 assembler-with-cpp com.apple.compilers.llvm.clang.1_0.compiler (in target 'SwiftTraceGutsD' from project 'SwiftTrace')
    cd /Users/admin/builder/spi-builder-workspace/.swiftpm/xcode

    Using response file: /Users/admin/builder/spi-builder-workspace/.derivedData/Build/Intermediates.noindex/SwiftTrace.build/Debug-watchos/SwiftTraceGutsD.build/Objects-normal/arm64_32/533656923a283fa776881f304837ed9e-common-args.resp

    /Applications/Xcode-16.3.0.app/Contents/Developer/Toolchains/XcodeDefault.xctoolchain/usr/bin/clang -x assembler-with-cpp -ivfsstatcache /Users/admin/builder/spi-builder-workspace/.derivedData/SDKStatCaches.noindex/watchos11.4-22T246-43efb940ff07ba2497b70ec94253f576.sdkstatcache -fmessage-length\=0 -fdiagnostics-show-note-include-stack -fmacro-backtrace-limit\=0 -fno-color-diagnostics -fmodules-prune-interval\=86400 -fmodules-prune-after\=345600 -fbuild-session-file\=/Users/admin/builder/spi-builder-workspace/.derivedData/ModuleCache.noindex/Session.modulevalidation -fmodules-validate-once-per-build-session -Wnon-modular-include-in-framework-module -Werror\=non-modular-include-in-framework-module -Wno-trigraphs -Wno-missing-field-initializers -Wno-missing-prototypes -Wno-return-type -Wno-missing-braces -Wparentheses -Wswitch -Wno-unused-function -Wno-unused-label -Wno-unused-parameter -Wno-unused-variable -Wunused-value -Wno-empty-body -Wno-uninitialized -Wno-unknown-pragmas -w -Wno-shadow -Wno-four-char-constants -Wno-conversion -Wno-constant-conversion -Wno-int-conversion -Wno-bool-conversion -Wno-enum-conversion -Wno-float-conversion -Wno-non-literal-null-conversion -Wno-objc-literal-conversion -Wno-shorten-64-to-32 -Wno-newline-eof -Wno-implicit-fallthrough -fstrict-aliasing -Wdeprecated-declarations -Wno-sign-conversion -Wno-infinite-recursion -Wno-comma -Wno-block-capture-autoreleasing -Wno-strict-prototypes -Wno-semicolon-before-method-body -index-store-path /Users/admin/builder/spi-builder-workspace/.derivedData/Index.noindex/DataStore @/Users/admin/builder/spi-builder-workspace/.derivedData/Build/Intermediates.noindex/SwiftTrace.build/Debug-watchos/SwiftTraceGutsD.build/Objects-normal/arm64_32/533656923a283fa776881f304837ed9e-common-args.resp -MMD -MT dependencies -MF /Users/admin/builder/spi-builder-workspace/.derivedData/Build/Intermediates.noindex/SwiftTrace.build/Debug-watchos/SwiftTraceGutsD.build/Objects-normal/arm64_32/xt_forwarding_trampoline_x64.d --serialize-diagnostics /Users/admin/builder/spi-builder-workspace/.derivedData/Build/Intermediates.noindex/SwiftTrace.build/Debug-watchos/SwiftTraceGutsD.build/Objects-normal/arm64_32/xt_forwarding_trampoline_x64.dia -c /Users/admin/builder/spi-builder-workspace/.dependencies/checkouts/SwiftTrace/SwiftTraceGutsD/xt_forwarding_trampoline_x64.s -o /Users/admin/builder/spi-builder-workspace/.derivedData/Build/Intermediates.noindex/SwiftTrace.build/Debug-watchos/SwiftTraceGutsD.build/Objects-normal/arm64_32/xt_forwarding_trampoline_x64.o -index-unit-output-path /SwiftTrace.build/Debug-watchos/SwiftTraceGutsD.build/Objects-normal/arm64_32/xt_forwarding_trampoline_x64.o
CompileC /Users/admin/builder/spi-builder-workspace/.derivedData/Build/Intermediates.noindex/SwiftTrace.build/Debug-watchos/SwiftTraceGutsD.build/Objects-normal/arm64_32/xt_forwarding_trampoline_arm7.o /Users/admin/builder/spi-builder-workspace/.dependencies/checkouts/SwiftTrace/SwiftTraceGutsD/xt_forwarding_trampoline_arm7.s normal arm64_32 assembler-with-cpp com.apple.compilers.llvm.clang.1_0.compiler (in target 'SwiftTraceGutsD' from project 'SwiftTrace')
    cd /Users/admin/builder/spi-builder-workspace/.swiftpm/xcode

    Using response file: /Users/admin/builder/spi-builder-workspace/.derivedData/Build/Intermediates.noindex/SwiftTrace.build/Debug-watchos/SwiftTraceGutsD.build/Objects-normal/arm64_32/533656923a283fa776881f304837ed9e-common-args.resp

    /Applications/Xcode-16.3.0.app/Contents/Developer/Toolchains/XcodeDefault.xctoolchain/usr/bin/clang -x assembler-with-cpp -ivfsstatcache /Users/admin/builder/spi-builder-workspace/.derivedData/SDKStatCaches.noindex/watchos11.4-22T246-43efb940ff07ba2497b70ec94253f576.sdkstatcache -fmessage-length\=0 -fdiagnostics-show-note-include-stack -fmacro-backtrace-limit\=0 -fno-color-diagnostics -fmodules-prune-interval\=86400 -fmodules-prune-after\=345600 -fbuild-session-file\=/Users/admin/builder/spi-builder-workspace/.derivedData/ModuleCache.noindex/Session.modulevalidation -fmodules-validate-once-per-build-session -Wnon-modular-include-in-framework-module -Werror\=non-modular-include-in-framework-module -Wno-trigraphs -Wno-missing-field-initializers -Wno-missing-prototypes -Wno-return-type -Wno-missing-braces -Wparentheses -Wswitch -Wno-unused-function -Wno-unused-label -Wno-unused-parameter -Wno-unused-variable -Wunused-value -Wno-empty-body -Wno-uninitialized -Wno-unknown-pragmas -w -Wno-shadow -Wno-four-char-constants -Wno-conversion -Wno-constant-conversion -Wno-int-conversion -Wno-bool-conversion -Wno-enum-conversion -Wno-float-conversion -Wno-non-literal-null-conversion -Wno-objc-literal-conversion -Wno-shorten-64-to-32 -Wno-newline-eof -Wno-implicit-fallthrough -fstrict-aliasing -Wdeprecated-declarations -Wno-sign-conversion -Wno-infinite-recursion -Wno-comma -Wno-block-capture-autoreleasing -Wno-strict-prototypes -Wno-semicolon-before-method-body -index-store-path /Users/admin/builder/spi-builder-workspace/.derivedData/Index.noindex/DataStore @/Users/admin/builder/spi-builder-workspace/.derivedData/Build/Intermediates.noindex/SwiftTrace.build/Debug-watchos/SwiftTraceGutsD.build/Objects-normal/arm64_32/533656923a283fa776881f304837ed9e-common-args.resp -MMD -MT dependencies -MF /Users/admin/builder/spi-builder-workspace/.derivedData/Build/Intermediates.noindex/SwiftTrace.build/Debug-watchos/SwiftTraceGutsD.build/Objects-normal/arm64_32/xt_forwarding_trampoline_arm7.d --serialize-diagnostics /Users/admin/builder/spi-builder-workspace/.derivedData/Build/Intermediates.noindex/SwiftTrace.build/Debug-watchos/SwiftTraceGutsD.build/Objects-normal/arm64_32/xt_forwarding_trampoline_arm7.dia -c /Users/admin/builder/spi-builder-workspace/.dependencies/checkouts/SwiftTrace/SwiftTraceGutsD/xt_forwarding_trampoline_arm7.s -o /Users/admin/builder/spi-builder-workspace/.derivedData/Build/Intermediates.noindex/SwiftTrace.build/Debug-watchos/SwiftTraceGutsD.build/Objects-normal/arm64_32/xt_forwarding_trampoline_arm7.o -index-unit-output-path /SwiftTrace.build/Debug-watchos/SwiftTraceGutsD.build/Objects-normal/arm64_32/xt_forwarding_trampoline_arm7.o
CompileC /Users/admin/builder/spi-builder-workspace/.derivedData/Build/Intermediates.noindex/SwiftTrace.build/Debug-watchos/SwiftTraceGutsD.build/Objects-normal/arm64_32/xt_forwarding_trampoline_arm64.o /Users/admin/builder/spi-builder-workspace/.dependencies/checkouts/SwiftTrace/SwiftTraceGutsD/xt_forwarding_trampoline_arm64.s normal arm64_32 assembler-with-cpp com.apple.compilers.llvm.clang.1_0.compiler (in target 'SwiftTraceGutsD' from project 'SwiftTrace')
    cd /Users/admin/builder/spi-builder-workspace/.swiftpm/xcode

    Using response file: /Users/admin/builder/spi-builder-workspace/.derivedData/Build/Intermediates.noindex/SwiftTrace.build/Debug-watchos/SwiftTraceGutsD.build/Objects-normal/arm64_32/533656923a283fa776881f304837ed9e-common-args.resp

    /Applications/Xcode-16.3.0.app/Contents/Developer/Toolchains/XcodeDefault.xctoolchain/usr/bin/clang -x assembler-with-cpp -ivfsstatcache /Users/admin/builder/spi-builder-workspace/.derivedData/SDKStatCaches.noindex/watchos11.4-22T246-43efb940ff07ba2497b70ec94253f576.sdkstatcache -fmessage-length\=0 -fdiagnostics-show-note-include-stack -fmacro-backtrace-limit\=0 -fno-color-diagnostics -fmodules-prune-interval\=86400 -fmodules-prune-after\=345600 -fbuild-session-file\=/Users/admin/builder/spi-builder-workspace/.derivedData/ModuleCache.noindex/Session.modulevalidation -fmodules-validate-once-per-build-session -Wnon-modular-include-in-framework-module -Werror\=non-modular-include-in-framework-module -Wno-trigraphs -Wno-missing-field-initializers -Wno-missing-prototypes -Wno-return-type -Wno-missing-braces -Wparentheses -Wswitch -Wno-unused-function -Wno-unused-label -Wno-unused-parameter -Wno-unused-variable -Wunused-value -Wno-empty-body -Wno-uninitialized -Wno-unknown-pragmas -w -Wno-shadow -Wno-four-char-constants -Wno-conversion -Wno-constant-conversion -Wno-int-conversion -Wno-bool-conversion -Wno-enum-conversion -Wno-float-conversion -Wno-non-literal-null-conversion -Wno-objc-literal-conversion -Wno-shorten-64-to-32 -Wno-newline-eof -Wno-implicit-fallthrough -fstrict-aliasing -Wdeprecated-declarations -Wno-sign-conversion -Wno-infinite-recursion -Wno-comma -Wno-block-capture-autoreleasing -Wno-strict-prototypes -Wno-semicolon-before-method-body -index-store-path /Users/admin/builder/spi-builder-workspace/.derivedData/Index.noindex/DataStore @/Users/admin/builder/spi-builder-workspace/.derivedData/Build/Intermediates.noindex/SwiftTrace.build/Debug-watchos/SwiftTraceGutsD.build/Objects-normal/arm64_32/533656923a283fa776881f304837ed9e-common-args.resp -MMD -MT dependencies -MF /Users/admin/builder/spi-builder-workspace/.derivedData/Build/Intermediates.noindex/SwiftTrace.build/Debug-watchos/SwiftTraceGutsD.build/Objects-normal/arm64_32/xt_forwarding_trampoline_arm64.d --serialize-diagnostics /Users/admin/builder/spi-builder-workspace/.derivedData/Build/Intermediates.noindex/SwiftTrace.build/Debug-watchos/SwiftTraceGutsD.build/Objects-normal/arm64_32/xt_forwarding_trampoline_arm64.dia -c /Users/admin/builder/spi-builder-workspace/.dependencies/checkouts/SwiftTrace/SwiftTraceGutsD/xt_forwarding_trampoline_arm64.s -o /Users/admin/builder/spi-builder-workspace/.derivedData/Build/Intermediates.noindex/SwiftTrace.build/Debug-watchos/SwiftTraceGutsD.build/Objects-normal/arm64_32/xt_forwarding_trampoline_arm64.o -index-unit-output-path /SwiftTrace.build/Debug-watchos/SwiftTraceGutsD.build/Objects-normal/arm64_32/xt_forwarding_trampoline_arm64.o
CompileC /Users/admin/builder/spi-builder-workspace/.derivedData/Build/Intermediates.noindex/SwiftTrace.build/Debug-watchos/SwiftTraceGutsD.build/Objects-normal/arm64_32/fast_dladdr.o /Users/admin/builder/spi-builder-workspace/.dependencies/checkouts/SwiftTrace/SwiftTraceGutsD/fast_dladdr.mm normal arm64_32 objective-c++ com.apple.compilers.llvm.clang.1_0.compiler (in target 'SwiftTraceGutsD' from project 'SwiftTrace')
    cd /Users/admin/builder/spi-builder-workspace/.swiftpm/xcode

    Using response file: /Users/admin/builder/spi-builder-workspace/.derivedData/Build/Intermediates.noindex/SwiftTrace.build/Debug-watchos/SwiftTraceGutsD.build/Objects-normal/arm64_32/af3fcb34312c57c0f52879cdce924b91-common-args.resp

    /Applications/Xcode-16.3.0.app/Contents/Developer/Toolchains/XcodeDefault.xctoolchain/usr/bin/clang -x objective-c++ -ivfsstatcache /Users/admin/builder/spi-builder-workspace/.derivedData/SDKStatCaches.noindex/watchos11.4-22T246-43efb940ff07ba2497b70ec94253f576.sdkstatcache -fmessage-length\=0 -fdiagnostics-show-note-include-stack -fmacro-backtrace-limit\=0 -fno-color-diagnostics -fmodules-prune-interval\=86400 -fmodules-prune-after\=345600 -fbuild-session-file\=/Users/admin/builder/spi-builder-workspace/.derivedData/ModuleCache.noindex/Session.modulevalidation -fmodules-validate-once-per-build-session -Wnon-modular-include-in-framework-module -Werror\=non-modular-include-in-framework-module -Wno-trigraphs -Wno-missing-field-initializers -Wno-missing-prototypes -Wno-return-type -Wno-implicit-atomic-properties -Wno-objc-interface-ivars -Wno-arc-repeated-use-of-weak -Wno-non-virtual-dtor -Wno-overloaded-virtual -Wno-exit-time-destructors -Wno-missing-braces -Wparentheses -Wswitch -Wno-unused-function -Wno-unused-label -Wno-unused-parameter -Wno-unused-variable -Wunused-value -Wno-empty-body -Wno-uninitialized -Wno-unknown-pragmas -w -Wno-shadow -Wno-four-char-constants -Wno-conversion -Wno-constant-conversion -Wno-int-conversion -Wno-bool-conversion -Wno-enum-conversion -Wno-float-conversion -Wno-non-literal-null-conversion -Wno-objc-literal-conversion -Wno-shorten-64-to-32 -Wno-newline-eof -Wno-selector -Wno-strict-selector-match -Wno-undeclared-selector -Wno-deprecated-implementations -Wno-c++11-extensions -Wno-implicit-fallthrough -fstrict-aliasing -Wprotocol -Wdeprecated-declarations -Winvalid-offsetof -Wno-sign-conversion -Wno-infinite-recursion -Wno-move -Wno-comma -Wno-block-capture-autoreleasing -Wno-strict-prototypes -Wno-range-loop-analysis -Wno-semicolon-before-method-body -index-store-path /Users/admin/builder/spi-builder-workspace/.derivedData/Index.noindex/DataStore @/Users/admin/builder/spi-builder-workspace/.derivedData/Build/Intermediates.noindex/SwiftTrace.build/Debug-watchos/SwiftTraceGutsD.build/Objects-normal/arm64_32/af3fcb34312c57c0f52879cdce924b91-common-args.resp -MMD -MT dependencies -MF /Users/admin/builder/spi-builder-workspace/.derivedData/Build/Intermediates.noindex/SwiftTrace.build/Debug-watchos/SwiftTraceGutsD.build/Objects-normal/arm64_32/fast_dladdr.d --serialize-diagnostics /Users/admin/builder/spi-builder-workspace/.derivedData/Build/Intermediates.noindex/SwiftTrace.build/Debug-watchos/SwiftTraceGutsD.build/Objects-normal/arm64_32/fast_dladdr.dia -c /Users/admin/builder/spi-builder-workspace/.dependencies/checkouts/SwiftTrace/SwiftTraceGutsD/fast_dladdr.mm -o /Users/admin/builder/spi-builder-workspace/.derivedData/Build/Intermediates.noindex/SwiftTrace.build/Debug-watchos/SwiftTraceGutsD.build/Objects-normal/arm64_32/fast_dladdr.o -index-unit-output-path /SwiftTrace.build/Debug-watchos/SwiftTraceGutsD.build/Objects-normal/arm64_32/fast_dladdr.o
CompileC /Users/admin/builder/spi-builder-workspace/.derivedData/Build/Intermediates.noindex/SwiftTrace.build/Debug-watchos/SwiftTraceGutsD.build/Objects-normal/arm64_32/Trampolines.o /Users/admin/builder/spi-builder-workspace/.dependencies/checkouts/SwiftTrace/SwiftTraceGutsD/Trampolines.mm normal arm64_32 objective-c++ com.apple.compilers.llvm.clang.1_0.compiler (in target 'SwiftTraceGutsD' from project 'SwiftTrace')
    cd /Users/admin/builder/spi-builder-workspace/.swiftpm/xcode

    Using response file: /Users/admin/builder/spi-builder-workspace/.derivedData/Build/Intermediates.noindex/SwiftTrace.build/Debug-watchos/SwiftTraceGutsD.build/Objects-normal/arm64_32/af3fcb34312c57c0f52879cdce924b91-common-args.resp

    /Applications/Xcode-16.3.0.app/Contents/Developer/Toolchains/XcodeDefault.xctoolchain/usr/bin/clang -x objective-c++ -ivfsstatcache /Users/admin/builder/spi-builder-workspace/.derivedData/SDKStatCaches.noindex/watchos11.4-22T246-43efb940ff07ba2497b70ec94253f576.sdkstatcache -fmessage-length\=0 -fdiagnostics-show-note-include-stack -fmacro-backtrace-limit\=0 -fno-color-diagnostics -fmodules-prune-interval\=86400 -fmodules-prune-after\=345600 -fbuild-session-file\=/Users/admin/builder/spi-builder-workspace/.derivedData/ModuleCache.noindex/Session.modulevalidation -fmodules-validate-once-per-build-session -Wnon-modular-include-in-framework-module -Werror\=non-modular-include-in-framework-module -Wno-trigraphs -Wno-missing-field-initializers -Wno-missing-prototypes -Wno-return-type -Wno-implicit-atomic-properties -Wno-objc-interface-ivars -Wno-arc-repeated-use-of-weak -Wno-non-virtual-dtor -Wno-overloaded-virtual -Wno-exit-time-destructors -Wno-missing-braces -Wparentheses -Wswitch -Wno-unused-function -Wno-unused-label -Wno-unused-parameter -Wno-unused-variable -Wunused-value -Wno-empty-body -Wno-uninitialized -Wno-unknown-pragmas -w -Wno-shadow -Wno-four-char-constants -Wno-conversion -Wno-constant-conversion -Wno-int-conversion -Wno-bool-conversion -Wno-enum-conversion -Wno-float-conversion -Wno-non-literal-null-conversion -Wno-objc-literal-conversion -Wno-shorten-64-to-32 -Wno-newline-eof -Wno-selector -Wno-strict-selector-match -Wno-undeclared-selector -Wno-deprecated-implementations -Wno-c++11-extensions -Wno-implicit-fallthrough -fstrict-aliasing -Wprotocol -Wdeprecated-declarations -Winvalid-offsetof -Wno-sign-conversion -Wno-infinite-recursion -Wno-move -Wno-comma -Wno-block-capture-autoreleasing -Wno-strict-prototypes -Wno-range-loop-analysis -Wno-semicolon-before-method-body -index-store-path /Users/admin/builder/spi-builder-workspace/.derivedData/Index.noindex/DataStore @/Users/admin/builder/spi-builder-workspace/.derivedData/Build/Intermediates.noindex/SwiftTrace.build/Debug-watchos/SwiftTraceGutsD.build/Objects-normal/arm64_32/af3fcb34312c57c0f52879cdce924b91-common-args.resp -MMD -MT dependencies -MF /Users/admin/builder/spi-builder-workspace/.derivedData/Build/Intermediates.noindex/SwiftTrace.build/Debug-watchos/SwiftTraceGutsD.build/Objects-normal/arm64_32/Trampolines.d --serialize-diagnostics /Users/admin/builder/spi-builder-workspace/.derivedData/Build/Intermediates.noindex/SwiftTrace.build/Debug-watchos/SwiftTraceGutsD.build/Objects-normal/arm64_32/Trampolines.dia -c /Users/admin/builder/spi-builder-workspace/.dependencies/checkouts/SwiftTrace/SwiftTraceGutsD/Trampolines.mm -o /Users/admin/builder/spi-builder-workspace/.derivedData/Build/Intermediates.noindex/SwiftTrace.build/Debug-watchos/SwiftTraceGutsD.build/Objects-normal/arm64_32/Trampolines.o -index-unit-output-path /SwiftTrace.build/Debug-watchos/SwiftTraceGutsD.build/Objects-normal/arm64_32/Trampolines.o
CompileC /Users/admin/builder/spi-builder-workspace/.derivedData/Build/Intermediates.noindex/SwiftTrace.build/Debug-watchos/SwiftTraceGutsD.build/Objects-normal/arm64_32/SwiftTrace.o /Users/admin/builder/spi-builder-workspace/.dependencies/checkouts/SwiftTrace/SwiftTraceGutsD/SwiftTrace.mm normal arm64_32 objective-c++ com.apple.compilers.llvm.clang.1_0.compiler (in target 'SwiftTraceGutsD' from project 'SwiftTrace')
    cd /Users/admin/builder/spi-builder-workspace/.swiftpm/xcode

    Using response file: /Users/admin/builder/spi-builder-workspace/.derivedData/Build/Intermediates.noindex/SwiftTrace.build/Debug-watchos/SwiftTraceGutsD.build/Objects-normal/arm64_32/af3fcb34312c57c0f52879cdce924b91-common-args.resp

    /Applications/Xcode-16.3.0.app/Contents/Developer/Toolchains/XcodeDefault.xctoolchain/usr/bin/clang -x objective-c++ -ivfsstatcache /Users/admin/builder/spi-builder-workspace/.derivedData/SDKStatCaches.noindex/watchos11.4-22T246-43efb940ff07ba2497b70ec94253f576.sdkstatcache -fmessage-length\=0 -fdiagnostics-show-note-include-stack -fmacro-backtrace-limit\=0 -fno-color-diagnostics -fmodules-prune-interval\=86400 -fmodules-prune-after\=345600 -fbuild-session-file\=/Users/admin/builder/spi-builder-workspace/.derivedData/ModuleCache.noindex/Session.modulevalidation -fmodules-validate-once-per-build-session -Wnon-modular-include-in-framework-module -Werror\=non-modular-include-in-framework-module -Wno-trigraphs -Wno-missing-field-initializers -Wno-missing-prototypes -Wno-return-type -Wno-implicit-atomic-properties -Wno-objc-interface-ivars -Wno-arc-repeated-use-of-weak -Wno-non-virtual-dtor -Wno-overloaded-virtual -Wno-exit-time-destructors -Wno-missing-braces -Wparentheses -Wswitch -Wno-unused-function -Wno-unused-label -Wno-unused-parameter -Wno-unused-variable -Wunused-value -Wno-empty-body -Wno-uninitialized -Wno-unknown-pragmas -w -Wno-shadow -Wno-four-char-constants -Wno-conversion -Wno-constant-conversion -Wno-int-conversion -Wno-bool-conversion -Wno-enum-conversion -Wno-float-conversion -Wno-non-literal-null-conversion -Wno-objc-literal-conversion -Wno-shorten-64-to-32 -Wno-newline-eof -Wno-selector -Wno-strict-selector-match -Wno-undeclared-selector -Wno-deprecated-implementations -Wno-c++11-extensions -Wno-implicit-fallthrough -fstrict-aliasing -Wprotocol -Wdeprecated-declarations -Winvalid-offsetof -Wno-sign-conversion -Wno-infinite-recursion -Wno-move -Wno-comma -Wno-block-capture-autoreleasing -Wno-strict-prototypes -Wno-range-loop-analysis -Wno-semicolon-before-method-body -index-store-path /Users/admin/builder/spi-builder-workspace/.derivedData/Index.noindex/DataStore @/Users/admin/builder/spi-builder-workspace/.derivedData/Build/Intermediates.noindex/SwiftTrace.build/Debug-watchos/SwiftTraceGutsD.build/Objects-normal/arm64_32/af3fcb34312c57c0f52879cdce924b91-common-args.resp -MMD -MT dependencies -MF /Users/admin/builder/spi-builder-workspace/.derivedData/Build/Intermediates.noindex/SwiftTrace.build/Debug-watchos/SwiftTraceGutsD.build/Objects-normal/arm64_32/SwiftTrace.d --serialize-diagnostics /Users/admin/builder/spi-builder-workspace/.derivedData/Build/Intermediates.noindex/SwiftTrace.build/Debug-watchos/SwiftTraceGutsD.build/Objects-normal/arm64_32/SwiftTrace.dia -c /Users/admin/builder/spi-builder-workspace/.dependencies/checkouts/SwiftTrace/SwiftTraceGutsD/SwiftTrace.mm -o /Users/admin/builder/spi-builder-workspace/.derivedData/Build/Intermediates.noindex/SwiftTrace.build/Debug-watchos/SwiftTraceGutsD.build/Objects-normal/arm64_32/SwiftTrace.o -index-unit-output-path /SwiftTrace.build/Debug-watchos/SwiftTraceGutsD.build/Objects-normal/arm64_32/SwiftTrace.o
SwiftDriverJobDiscovery normal armv7k Emitting module for SwiftTraceD (in target 'SwiftTraceD' from project 'SwiftTrace')
SwiftDriver\ Compilation\ Requirements SwiftTraceD normal armv7k com.apple.xcode.tools.swift.compiler (in target 'SwiftTraceD' from project 'SwiftTrace')
    cd /Users/admin/builder/spi-builder-workspace/.swiftpm/xcode
    builtin-Swift-Compilation-Requirements -- /Applications/Xcode-16.3.0.app/Contents/Developer/Toolchains/XcodeDefault.xctoolchain/usr/bin/swiftc -module-name SwiftTraceD -Onone -enforce-exclusivity\=checked @/Users/admin/builder/spi-builder-workspace/.derivedData/Build/Intermediates.noindex/SwiftTrace.build/Debug-watchos/SwiftTraceD.build/Objects-normal/armv7k/SwiftTraceD.SwiftFileList -DSWIFT_PACKAGE -DDEBUG -DDEBUG_ONLY -Xcc -fmodule-map-file\=/Users/admin/builder/spi-builder-workspace/.derivedData/Build/Intermediates.noindex/GeneratedModuleMaps-watchos/SwiftTraceGutsD.modulemap -stats-output-dir .stats -strict-concurrency\=complete -enable-upcoming-feature StrictConcurrency -enable-upcoming-feature DisableOutwardActorInference -enable-upcoming-feature GlobalActorIsolatedTypesUsability -enable-upcoming-feature InferSendableFromCaptures -plugin-path /Applications/Xcode-16.3.0.app/Contents/Developer/Toolchains/XcodeDefault.xctoolchain/usr/lib/swift/host/plugins/testing -enable-experimental-feature DebugDescriptionMacro -sdk /Applications/Xcode-16.3.0.app/Contents/Developer/Platforms/WatchOS.platform/Developer/SDKs/WatchOS11.4.sdk -target armv7k-apple-watchos5.0 -g -module-cache-path /Users/admin/builder/spi-builder-workspace/.derivedData/ModuleCache.noindex -Xfrontend -serialize-debugging-options -enable-testing -suppress-warnings -index-store-path /Users/admin/builder/spi-builder-workspace/.derivedData/Index.noindex/DataStore -swift-version 5 -I /Users/admin/builder/spi-builder-workspace/.derivedData/Build/Products/Debug-watchos -I /Applications/Xcode-16.3.0.app/Contents/Developer/Platforms/WatchOS.platform/Developer/usr/lib -F /Users/admin/builder/spi-builder-workspace/.derivedData/Build/Products/Debug-watchos/PackageFrameworks -F /Users/admin/builder/spi-builder-workspace/.derivedData/Build/Products/Debug-watchos -F /Applications/Xcode-16.3.0.app/Contents/Developer/Platforms/WatchOS.platform/Developer/Library/Frameworks -F /Applications/Xcode-16.3.0.app/Contents/Developer/Platforms/WatchOS.platform/Developer/SDKs/WatchOS11.4.sdk/Developer/Library/Frameworks -c -j10 -enable-batch-mode -incremental -Xcc -ivfsstatcache -Xcc /Users/admin/builder/spi-builder-workspace/.derivedData/SDKStatCaches.noindex/watchos11.4-22T246-43efb940ff07ba2497b70ec94253f576.sdkstatcache -output-file-map /Users/admin/builder/spi-builder-workspace/.derivedData/Build/Intermediates.noindex/SwiftTrace.build/Debug-watchos/SwiftTraceD.build/Objects-normal/armv7k/SwiftTraceD-OutputFileMap.json -use-frontend-parseable-output -save-temps -no-color-diagnostics -serialize-diagnostics -emit-dependencies -emit-module -emit-module-path /Users/admin/builder/spi-builder-workspace/.derivedData/Build/Intermediates.noindex/SwiftTrace.build/Debug-watchos/SwiftTraceD.build/Objects-normal/armv7k/SwiftTraceD.swiftmodule -validate-clang-modules-once -clang-build-session-file /Users/admin/builder/spi-builder-workspace/.derivedData/ModuleCache.noindex/Session.modulevalidation -Xcc -I/Users/admin/builder/spi-builder-workspace/.derivedData/Build/Intermediates.noindex/SwiftTrace.build/Debug-watchos/SwiftTraceD.build/swift-overrides.hmap -emit-const-values -Xfrontend -const-gather-protocols-file -Xfrontend /Users/admin/builder/spi-builder-workspace/.derivedData/Build/Intermediates.noindex/SwiftTrace.build/Debug-watchos/SwiftTraceD.build/Objects-normal/armv7k/SwiftTraceD_const_extract_protocols.json -Xcc -I/Users/admin/builder/spi-builder-workspace/.dependencies/checkouts/SwiftTrace/SwiftTraceGutsD/include -Xcc -I/Users/admin/builder/spi-builder-workspace/.derivedData/Build/Products/Debug-watchos/include -Xcc -I/Users/admin/builder/spi-builder-workspace/.derivedData/Build/Intermediates.noindex/SwiftTrace.build/Debug-watchos/SwiftTraceD.build/DerivedSources-normal/armv7k -Xcc -I/Users/admin/builder/spi-builder-workspace/.derivedData/Build/Intermediates.noindex/SwiftTrace.build/Debug-watchos/SwiftTraceD.build/DerivedSources/armv7k -Xcc -I/Users/admin/builder/spi-builder-workspace/.derivedData/Build/Intermediates.noindex/SwiftTrace.build/Debug-watchos/SwiftTraceD.build/DerivedSources -Xcc -DSWIFT_PACKAGE -Xcc -DDEBUG\=1 -emit-objc-header -emit-objc-header-path /Users/admin/builder/spi-builder-workspace/.derivedData/Build/Intermediates.noindex/SwiftTrace.build/Debug-watchos/SwiftTraceD.build/Objects-normal/armv7k/SwiftTraceD-Swift.h -working-directory /Users/admin/builder/spi-builder-workspace/.swiftpm/xcode -experimental-emit-module-separately -disable-cmo
CompileC /Users/admin/builder/spi-builder-workspace/.derivedData/Build/Intermediates.noindex/SwiftTrace.build/Debug-watchos/SwiftTraceGutsD.build/Objects-normal/arm64_32/ObjCBridge.o /Users/admin/builder/spi-builder-workspace/.dependencies/checkouts/SwiftTrace/SwiftTraceGutsD/ObjCBridge.mm normal arm64_32 objective-c++ com.apple.compilers.llvm.clang.1_0.compiler (in target 'SwiftTraceGutsD' from project 'SwiftTrace')
    cd /Users/admin/builder/spi-builder-workspace/.swiftpm/xcode

    Using response file: /Users/admin/builder/spi-builder-workspace/.derivedData/Build/Intermediates.noindex/SwiftTrace.build/Debug-watchos/SwiftTraceGutsD.build/Objects-normal/arm64_32/af3fcb34312c57c0f52879cdce924b91-common-args.resp

    /Applications/Xcode-16.3.0.app/Contents/Developer/Toolchains/XcodeDefault.xctoolchain/usr/bin/clang -x objective-c++ -ivfsstatcache /Users/admin/builder/spi-builder-workspace/.derivedData/SDKStatCaches.noindex/watchos11.4-22T246-43efb940ff07ba2497b70ec94253f576.sdkstatcache -fmessage-length\=0 -fdiagnostics-show-note-include-stack -fmacro-backtrace-limit\=0 -fno-color-diagnostics -fmodules-prune-interval\=86400 -fmodules-prune-after\=345600 -fbuild-session-file\=/Users/admin/builder/spi-builder-workspace/.derivedData/ModuleCache.noindex/Session.modulevalidation -fmodules-validate-once-per-build-session -Wnon-modular-include-in-framework-module -Werror\=non-modular-include-in-framework-module -Wno-trigraphs -Wno-missing-field-initializers -Wno-missing-prototypes -Wno-return-type -Wno-implicit-atomic-properties -Wno-objc-interface-ivars -Wno-arc-repeated-use-of-weak -Wno-non-virtual-dtor -Wno-overloaded-virtual -Wno-exit-time-destructors -Wno-missing-braces -Wparentheses -Wswitch -Wno-unused-function -Wno-unused-label -Wno-unused-parameter -Wno-unused-variable -Wunused-value -Wno-empty-body -Wno-uninitialized -Wno-unknown-pragmas -w -Wno-shadow -Wno-four-char-constants -Wno-conversion -Wno-constant-conversion -Wno-int-conversion -Wno-bool-conversion -Wno-enum-conversion -Wno-float-conversion -Wno-non-literal-null-conversion -Wno-objc-literal-conversion -Wno-shorten-64-to-32 -Wno-newline-eof -Wno-selector -Wno-strict-selector-match -Wno-undeclared-selector -Wno-deprecated-implementations -Wno-c++11-extensions -Wno-implicit-fallthrough -fstrict-aliasing -Wprotocol -Wdeprecated-declarations -Winvalid-offsetof -Wno-sign-conversion -Wno-infinite-recursion -Wno-move -Wno-comma -Wno-block-capture-autoreleasing -Wno-strict-prototypes -Wno-range-loop-analysis -Wno-semicolon-before-method-body -index-store-path /Users/admin/builder/spi-builder-workspace/.derivedData/Index.noindex/DataStore @/Users/admin/builder/spi-builder-workspace/.derivedData/Build/Intermediates.noindex/SwiftTrace.build/Debug-watchos/SwiftTraceGutsD.build/Objects-normal/arm64_32/af3fcb34312c57c0f52879cdce924b91-common-args.resp -MMD -MT dependencies -MF /Users/admin/builder/spi-builder-workspace/.derivedData/Build/Intermediates.noindex/SwiftTrace.build/Debug-watchos/SwiftTraceGutsD.build/Objects-normal/arm64_32/ObjCBridge.d --serialize-diagnostics /Users/admin/builder/spi-builder-workspace/.derivedData/Build/Intermediates.noindex/SwiftTrace.build/Debug-watchos/SwiftTraceGutsD.build/Objects-normal/arm64_32/ObjCBridge.dia -c /Users/admin/builder/spi-builder-workspace/.dependencies/checkouts/SwiftTrace/SwiftTraceGutsD/ObjCBridge.mm -o /Users/admin/builder/spi-builder-workspace/.derivedData/Build/Intermediates.noindex/SwiftTrace.build/Debug-watchos/SwiftTraceGutsD.build/Objects-normal/arm64_32/ObjCBridge.o -index-unit-output-path /SwiftTrace.build/Debug-watchos/SwiftTraceGutsD.build/Objects-normal/arm64_32/ObjCBridge.o
Copy /Users/admin/builder/spi-builder-workspace/.derivedData/Build/Products/Debug-watchos/SwiftTraceD.swiftmodule/armv7k-apple-watchos.swiftmodule /Users/admin/builder/spi-builder-workspace/.derivedData/Build/Intermediates.noindex/SwiftTrace.build/Debug-watchos/SwiftTraceD.build/Objects-normal/armv7k/SwiftTraceD.swiftmodule (in target 'SwiftTraceD' from project 'SwiftTrace')
    cd /Users/admin/builder/spi-builder-workspace/.dependencies/checkouts/SwiftTrace
    builtin-copy -exclude .DS_Store -exclude CVS -exclude .svn -exclude .git -exclude .hg -resolve-src-symlinks -rename /Users/admin/builder/spi-builder-workspace/.derivedData/Build/Intermediates.noindex/SwiftTrace.build/Debug-watchos/SwiftTraceD.build/Objects-normal/armv7k/SwiftTraceD.swiftmodule /Users/admin/builder/spi-builder-workspace/.derivedData/Build/Products/Debug-watchos/SwiftTraceD.swiftmodule/armv7k-apple-watchos.swiftmodule
SwiftDriverJobDiscovery normal arm64 Emitting module for SwiftTraceD (in target 'SwiftTraceD' from project 'SwiftTrace')
Copy /Users/admin/builder/spi-builder-workspace/.derivedData/Build/Products/Debug-watchos/SwiftTraceD.swiftmodule/armv7k-apple-watchos.swiftdoc /Users/admin/builder/spi-builder-workspace/.derivedData/Build/Intermediates.noindex/SwiftTrace.build/Debug-watchos/SwiftTraceD.build/Objects-normal/armv7k/SwiftTraceD.swiftdoc (in target 'SwiftTraceD' from project 'SwiftTrace')
    cd /Users/admin/builder/spi-builder-workspace/.dependencies/checkouts/SwiftTrace
    builtin-copy -exclude .DS_Store -exclude CVS -exclude .svn -exclude .git -exclude .hg -resolve-src-symlinks -rename /Users/admin/builder/spi-builder-workspace/.derivedData/Build/Intermediates.noindex/SwiftTrace.build/Debug-watchos/SwiftTraceD.build/Objects-normal/armv7k/SwiftTraceD.swiftdoc /Users/admin/builder/spi-builder-workspace/.derivedData/Build/Products/Debug-watchos/SwiftTraceD.swiftmodule/armv7k-apple-watchos.swiftdoc
SwiftDriver\ Compilation\ Requirements SwiftTraceD normal arm64 com.apple.xcode.tools.swift.compiler (in target 'SwiftTraceD' from project 'SwiftTrace')
    cd /Users/admin/builder/spi-builder-workspace/.swiftpm/xcode
    builtin-Swift-Compilation-Requirements -- /Applications/Xcode-16.3.0.app/Contents/Developer/Toolchains/XcodeDefault.xctoolchain/usr/bin/swiftc -module-name SwiftTraceD -Onone -enforce-exclusivity\=checked @/Users/admin/builder/spi-builder-workspace/.derivedData/Build/Intermediates.noindex/SwiftTrace.build/Debug-watchos/SwiftTraceD.build/Objects-normal/arm64/SwiftTraceD.SwiftFileList -DSWIFT_PACKAGE -DDEBUG -DDEBUG_ONLY -Xcc -fmodule-map-file\=/Users/admin/builder/spi-builder-workspace/.derivedData/Build/Intermediates.noindex/GeneratedModuleMaps-watchos/SwiftTraceGutsD.modulemap -stats-output-dir .stats -strict-concurrency\=complete -enable-upcoming-feature StrictConcurrency -enable-upcoming-feature DisableOutwardActorInference -enable-upcoming-feature GlobalActorIsolatedTypesUsability -enable-upcoming-feature InferSendableFromCaptures -plugin-path /Applications/Xcode-16.3.0.app/Contents/Developer/Toolchains/XcodeDefault.xctoolchain/usr/lib/swift/host/plugins/testing -enable-experimental-feature DebugDescriptionMacro -sdk /Applications/Xcode-16.3.0.app/Contents/Developer/Platforms/WatchOS.platform/Developer/SDKs/WatchOS11.4.sdk -target arm64-apple-watchos5.0 -g -module-cache-path /Users/admin/builder/spi-builder-workspace/.derivedData/ModuleCache.noindex -Xfrontend -serialize-debugging-options -enable-testing -suppress-warnings -index-store-path /Users/admin/builder/spi-builder-workspace/.derivedData/Index.noindex/DataStore -swift-version 5 -I /Users/admin/builder/spi-builder-workspace/.derivedData/Build/Products/Debug-watchos -I /Applications/Xcode-16.3.0.app/Contents/Developer/Platforms/WatchOS.platform/Developer/usr/lib -F /Users/admin/builder/spi-builder-workspace/.derivedData/Build/Products/Debug-watchos/PackageFrameworks -F /Users/admin/builder/spi-builder-workspace/.derivedData/Build/Products/Debug-watchos -F /Applications/Xcode-16.3.0.app/Contents/Developer/Platforms/WatchOS.platform/Developer/Library/Frameworks -F /Applications/Xcode-16.3.0.app/Contents/Developer/Platforms/WatchOS.platform/Developer/SDKs/WatchOS11.4.sdk/Developer/Library/Frameworks -c -j10 -enable-batch-mode -incremental -Xcc -ivfsstatcache -Xcc /Users/admin/builder/spi-builder-workspace/.derivedData/SDKStatCaches.noindex/watchos11.4-22T246-43efb940ff07ba2497b70ec94253f576.sdkstatcache -output-file-map /Users/admin/builder/spi-builder-workspace/.derivedData/Build/Intermediates.noindex/SwiftTrace.build/Debug-watchos/SwiftTraceD.build/Objects-normal/arm64/SwiftTraceD-OutputFileMap.json -use-frontend-parseable-output -save-temps -no-color-diagnostics -serialize-diagnostics -emit-dependencies -emit-module -emit-module-path /Users/admin/builder/spi-builder-workspace/.derivedData/Build/Intermediates.noindex/SwiftTrace.build/Debug-watchos/SwiftTraceD.build/Objects-normal/arm64/SwiftTraceD.swiftmodule -validate-clang-modules-once -clang-build-session-file /Users/admin/builder/spi-builder-workspace/.derivedData/ModuleCache.noindex/Session.modulevalidation -Xcc -I/Users/admin/builder/spi-builder-workspace/.derivedData/Build/Intermediates.noindex/SwiftTrace.build/Debug-watchos/SwiftTraceD.build/swift-overrides.hmap -emit-const-values -Xfrontend -const-gather-protocols-file -Xfrontend /Users/admin/builder/spi-builder-workspace/.derivedData/Build/Intermediates.noindex/SwiftTrace.build/Debug-watchos/SwiftTraceD.build/Objects-normal/arm64/SwiftTraceD_const_extract_protocols.json -Xcc -I/Users/admin/builder/spi-builder-workspace/.dependencies/checkouts/SwiftTrace/SwiftTraceGutsD/include -Xcc -I/Users/admin/builder/spi-builder-workspace/.derivedData/Build/Products/Debug-watchos/include -Xcc -I/Users/admin/builder/spi-builder-workspace/.derivedData/Build/Intermediates.noindex/SwiftTrace.build/Debug-watchos/SwiftTraceD.build/DerivedSources-normal/arm64 -Xcc -I/Users/admin/builder/spi-builder-workspace/.derivedData/Build/Intermediates.noindex/SwiftTrace.build/Debug-watchos/SwiftTraceD.build/DerivedSources/arm64 -Xcc -I/Users/admin/builder/spi-builder-workspace/.derivedData/Build/Intermediates.noindex/SwiftTrace.build/Debug-watchos/SwiftTraceD.build/DerivedSources -Xcc -DSWIFT_PACKAGE -Xcc -DDEBUG\=1 -emit-objc-header -emit-objc-header-path /Users/admin/builder/spi-builder-workspace/.derivedData/Build/Intermediates.noindex/SwiftTrace.build/Debug-watchos/SwiftTraceD.build/Objects-normal/arm64/SwiftTraceD-Swift.h -working-directory /Users/admin/builder/spi-builder-workspace/.swiftpm/xcode -experimental-emit-module-separately -disable-cmo
Copy /Users/admin/builder/spi-builder-workspace/.derivedData/Build/Products/Debug-watchos/SwiftTraceD.swiftmodule/armv7k-apple-watchos.abi.json /Users/admin/builder/spi-builder-workspace/.derivedData/Build/Intermediates.noindex/SwiftTrace.build/Debug-watchos/SwiftTraceD.build/Objects-normal/armv7k/SwiftTraceD.abi.json (in target 'SwiftTraceD' from project 'SwiftTrace')
    cd /Users/admin/builder/spi-builder-workspace/.dependencies/checkouts/SwiftTrace
    builtin-copy -exclude .DS_Store -exclude CVS -exclude .svn -exclude .git -exclude .hg -resolve-src-symlinks -rename /Users/admin/builder/spi-builder-workspace/.derivedData/Build/Intermediates.noindex/SwiftTrace.build/Debug-watchos/SwiftTraceD.build/Objects-normal/armv7k/SwiftTraceD.abi.json /Users/admin/builder/spi-builder-workspace/.derivedData/Build/Products/Debug-watchos/SwiftTraceD.swiftmodule/armv7k-apple-watchos.abi.json
Copy /Users/admin/builder/spi-builder-workspace/.derivedData/Build/Products/Debug-watchos/SwiftTraceD.swiftmodule/Project/armv7k-apple-watchos.swiftsourceinfo /Users/admin/builder/spi-builder-workspace/.derivedData/Build/Intermediates.noindex/SwiftTrace.build/Debug-watchos/SwiftTraceD.build/Objects-normal/armv7k/SwiftTraceD.swiftsourceinfo (in target 'SwiftTraceD' from project 'SwiftTrace')
    cd /Users/admin/builder/spi-builder-workspace/.dependencies/checkouts/SwiftTrace
    builtin-copy -exclude .DS_Store -exclude CVS -exclude .svn -exclude .git -exclude .hg -resolve-src-symlinks -rename /Users/admin/builder/spi-builder-workspace/.derivedData/Build/Intermediates.noindex/SwiftTrace.build/Debug-watchos/SwiftTraceD.build/Objects-normal/armv7k/SwiftTraceD.swiftsourceinfo /Users/admin/builder/spi-builder-workspace/.derivedData/Build/Products/Debug-watchos/SwiftTraceD.swiftmodule/Project/armv7k-apple-watchos.swiftsourceinfo
Copy /Users/admin/builder/spi-builder-workspace/.derivedData/Build/Products/Debug-watchos/SwiftTraceD.swiftmodule/arm64-apple-watchos.swiftmodule /Users/admin/builder/spi-builder-workspace/.derivedData/Build/Intermediates.noindex/SwiftTrace.build/Debug-watchos/SwiftTraceD.build/Objects-normal/arm64/SwiftTraceD.swiftmodule (in target 'SwiftTraceD' from project 'SwiftTrace')
    cd /Users/admin/builder/spi-builder-workspace/.dependencies/checkouts/SwiftTrace
    builtin-copy -exclude .DS_Store -exclude CVS -exclude .svn -exclude .git -exclude .hg -resolve-src-symlinks -rename /Users/admin/builder/spi-builder-workspace/.derivedData/Build/Intermediates.noindex/SwiftTrace.build/Debug-watchos/SwiftTraceD.build/Objects-normal/arm64/SwiftTraceD.swiftmodule /Users/admin/builder/spi-builder-workspace/.derivedData/Build/Products/Debug-watchos/SwiftTraceD.swiftmodule/arm64-apple-watchos.swiftmodule
Copy /Users/admin/builder/spi-builder-workspace/.derivedData/Build/Products/Debug-watchos/SwiftTraceD.swiftmodule/arm64-apple-watchos.swiftdoc /Users/admin/builder/spi-builder-workspace/.derivedData/Build/Intermediates.noindex/SwiftTrace.build/Debug-watchos/SwiftTraceD.build/Objects-normal/arm64/SwiftTraceD.swiftdoc (in target 'SwiftTraceD' from project 'SwiftTrace')
    cd /Users/admin/builder/spi-builder-workspace/.dependencies/checkouts/SwiftTrace
    builtin-copy -exclude .DS_Store -exclude CVS -exclude .svn -exclude .git -exclude .hg -resolve-src-symlinks -rename /Users/admin/builder/spi-builder-workspace/.derivedData/Build/Intermediates.noindex/SwiftTrace.build/Debug-watchos/SwiftTraceD.build/Objects-normal/arm64/SwiftTraceD.swiftdoc /Users/admin/builder/spi-builder-workspace/.derivedData/Build/Products/Debug-watchos/SwiftTraceD.swiftmodule/arm64-apple-watchos.swiftdoc
Copy /Users/admin/builder/spi-builder-workspace/.derivedData/Build/Products/Debug-watchos/SwiftTraceD.swiftmodule/arm64-apple-watchos.abi.json /Users/admin/builder/spi-builder-workspace/.derivedData/Build/Intermediates.noindex/SwiftTrace.build/Debug-watchos/SwiftTraceD.build/Objects-normal/arm64/SwiftTraceD.abi.json (in target 'SwiftTraceD' from project 'SwiftTrace')
    cd /Users/admin/builder/spi-builder-workspace/.dependencies/checkouts/SwiftTrace
    builtin-copy -exclude .DS_Store -exclude CVS -exclude .svn -exclude .git -exclude .hg -resolve-src-symlinks -rename /Users/admin/builder/spi-builder-workspace/.derivedData/Build/Intermediates.noindex/SwiftTrace.build/Debug-watchos/SwiftTraceD.build/Objects-normal/arm64/SwiftTraceD.abi.json /Users/admin/builder/spi-builder-workspace/.derivedData/Build/Products/Debug-watchos/SwiftTraceD.swiftmodule/arm64-apple-watchos.abi.json
Copy /Users/admin/builder/spi-builder-workspace/.derivedData/Build/Products/Debug-watchos/SwiftTraceD.swiftmodule/Project/arm64-apple-watchos.swiftsourceinfo /Users/admin/builder/spi-builder-workspace/.derivedData/Build/Intermediates.noindex/SwiftTrace.build/Debug-watchos/SwiftTraceD.build/Objects-normal/arm64/SwiftTraceD.swiftsourceinfo (in target 'SwiftTraceD' from project 'SwiftTrace')
    cd /Users/admin/builder/spi-builder-workspace/.dependencies/checkouts/SwiftTrace
    builtin-copy -exclude .DS_Store -exclude CVS -exclude .svn -exclude .git -exclude .hg -resolve-src-symlinks -rename /Users/admin/builder/spi-builder-workspace/.derivedData/Build/Intermediates.noindex/SwiftTrace.build/Debug-watchos/SwiftTraceD.build/Objects-normal/arm64/SwiftTraceD.swiftsourceinfo /Users/admin/builder/spi-builder-workspace/.derivedData/Build/Products/Debug-watchos/SwiftTraceD.swiftmodule/Project/arm64-apple-watchos.swiftsourceinfo
CompileC /Users/admin/builder/spi-builder-workspace/.derivedData/Build/Intermediates.noindex/SwiftTrace.build/Debug-watchos/SwiftTraceGutsD.build/Objects-normal/arm64/xt_forwarding_trampoline_x86.o /Users/admin/builder/spi-builder-workspace/.dependencies/checkouts/SwiftTrace/SwiftTraceGutsD/xt_forwarding_trampoline_x86.s normal arm64 assembler-with-cpp com.apple.compilers.llvm.clang.1_0.compiler (in target 'SwiftTraceGutsD' from project 'SwiftTrace')
    cd /Users/admin/builder/spi-builder-workspace/.swiftpm/xcode

    Using response file: /Users/admin/builder/spi-builder-workspace/.derivedData/Build/Intermediates.noindex/SwiftTrace.build/Debug-watchos/SwiftTraceGutsD.build/Objects-normal/arm64/533656923a283fa776881f304837ed9e-common-args.resp

    /Applications/Xcode-16.3.0.app/Contents/Developer/Toolchains/XcodeDefault.xctoolchain/usr/bin/clang -x assembler-with-cpp -ivfsstatcache /Users/admin/builder/spi-builder-workspace/.derivedData/SDKStatCaches.noindex/watchos11.4-22T246-43efb940ff07ba2497b70ec94253f576.sdkstatcache -fmessage-length\=0 -fdiagnostics-show-note-include-stack -fmacro-backtrace-limit\=0 -fno-color-diagnostics -fmodules-prune-interval\=86400 -fmodules-prune-after\=345600 -fbuild-session-file\=/Users/admin/builder/spi-builder-workspace/.derivedData/ModuleCache.noindex/Session.modulevalidation -fmodules-validate-once-per-build-session -Wnon-modular-include-in-framework-module -Werror\=non-modular-include-in-framework-module -Wno-trigraphs -Wno-missing-field-initializers -Wno-missing-prototypes -Wno-return-type -Wno-missing-braces -Wparentheses -Wswitch -Wno-unused-function -Wno-unused-label -Wno-unused-parameter -Wno-unused-variable -Wunused-value -Wno-empty-body -Wno-uninitialized -Wno-unknown-pragmas -w -Wno-shadow -Wno-four-char-constants -Wno-conversion -Wno-constant-conversion -Wno-int-conversion -Wno-bool-conversion -Wno-enum-conversion -Wno-float-conversion -Wno-non-literal-null-conversion -Wno-objc-literal-conversion -Wshorten-64-to-32 -Wno-newline-eof -Wno-implicit-fallthrough -fstrict-aliasing -Wdeprecated-declarations -Wno-sign-conversion -Wno-infinite-recursion -Wno-comma -Wno-block-capture-autoreleasing -Wno-strict-prototypes -Wno-semicolon-before-method-body -index-store-path /Users/admin/builder/spi-builder-workspace/.derivedData/Index.noindex/DataStore @/Users/admin/builder/spi-builder-workspace/.derivedData/Build/Intermediates.noindex/SwiftTrace.build/Debug-watchos/SwiftTraceGutsD.build/Objects-normal/arm64/533656923a283fa776881f304837ed9e-common-args.resp -MMD -MT dependencies -MF /Users/admin/builder/spi-builder-workspace/.derivedData/Build/Intermediates.noindex/SwiftTrace.build/Debug-watchos/SwiftTraceGutsD.build/Objects-normal/arm64/xt_forwarding_trampoline_x86.d --serialize-diagnostics /Users/admin/builder/spi-builder-workspace/.derivedData/Build/Intermediates.noindex/SwiftTrace.build/Debug-watchos/SwiftTraceGutsD.build/Objects-normal/arm64/xt_forwarding_trampoline_x86.dia -c /Users/admin/builder/spi-builder-workspace/.dependencies/checkouts/SwiftTrace/SwiftTraceGutsD/xt_forwarding_trampoline_x86.s -o /Users/admin/builder/spi-builder-workspace/.derivedData/Build/Intermediates.noindex/SwiftTrace.build/Debug-watchos/SwiftTraceGutsD.build/Objects-normal/arm64/xt_forwarding_trampoline_x86.o -index-unit-output-path /SwiftTrace.build/Debug-watchos/SwiftTraceGutsD.build/Objects-normal/arm64/xt_forwarding_trampoline_x86.o
CompileC /Users/admin/builder/spi-builder-workspace/.derivedData/Build/Intermediates.noindex/SwiftTrace.build/Debug-watchos/SwiftTraceGutsD.build/Objects-normal/arm64/xt_forwarding_trampoline_x64.o /Users/admin/builder/spi-builder-workspace/.dependencies/checkouts/SwiftTrace/SwiftTraceGutsD/xt_forwarding_trampoline_x64.s normal arm64 assembler-with-cpp com.apple.compilers.llvm.clang.1_0.compiler (in target 'SwiftTraceGutsD' from project 'SwiftTrace')
    cd /Users/admin/builder/spi-builder-workspace/.swiftpm/xcode

    Using response file: /Users/admin/builder/spi-builder-workspace/.derivedData/Build/Intermediates.noindex/SwiftTrace.build/Debug-watchos/SwiftTraceGutsD.build/Objects-normal/arm64/533656923a283fa776881f304837ed9e-common-args.resp

    /Applications/Xcode-16.3.0.app/Contents/Developer/Toolchains/XcodeDefault.xctoolchain/usr/bin/clang -x assembler-with-cpp -ivfsstatcache /Users/admin/builder/spi-builder-workspace/.derivedData/SDKStatCaches.noindex/watchos11.4-22T246-43efb940ff07ba2497b70ec94253f576.sdkstatcache -fmessage-length\=0 -fdiagnostics-show-note-include-stack -fmacro-backtrace-limit\=0 -fno-color-diagnostics -fmodules-prune-interval\=86400 -fmodules-prune-after\=345600 -fbuild-session-file\=/Users/admin/builder/spi-builder-workspace/.derivedData/ModuleCache.noindex/Session.modulevalidation -fmodules-validate-once-per-build-session -Wnon-modular-include-in-framework-module -Werror\=non-modular-include-in-framework-module -Wno-trigraphs -Wno-missing-field-initializers -Wno-missing-prototypes -Wno-return-type -Wno-missing-braces -Wparentheses -Wswitch -Wno-unused-function -Wno-unused-label -Wno-unused-parameter -Wno-unused-variable -Wunused-value -Wno-empty-body -Wno-uninitialized -Wno-unknown-pragmas -w -Wno-shadow -Wno-four-char-constants -Wno-conversion -Wno-constant-conversion -Wno-int-conversion -Wno-bool-conversion -Wno-enum-conversion -Wno-float-conversion -Wno-non-literal-null-conversion -Wno-objc-literal-conversion -Wshorten-64-to-32 -Wno-newline-eof -Wno-implicit-fallthrough -fstrict-aliasing -Wdeprecated-declarations -Wno-sign-conversion -Wno-infinite-recursion -Wno-comma -Wno-block-capture-autoreleasing -Wno-strict-prototypes -Wno-semicolon-before-method-body -index-store-path /Users/admin/builder/spi-builder-workspace/.derivedData/Index.noindex/DataStore @/Users/admin/builder/spi-builder-workspace/.derivedData/Build/Intermediates.noindex/SwiftTrace.build/Debug-watchos/SwiftTraceGutsD.build/Objects-normal/arm64/533656923a283fa776881f304837ed9e-common-args.resp -MMD -MT dependencies -MF /Users/admin/builder/spi-builder-workspace/.derivedData/Build/Intermediates.noindex/SwiftTrace.build/Debug-watchos/SwiftTraceGutsD.build/Objects-normal/arm64/xt_forwarding_trampoline_x64.d --serialize-diagnostics /Users/admin/builder/spi-builder-workspace/.derivedData/Build/Intermediates.noindex/SwiftTrace.build/Debug-watchos/SwiftTraceGutsD.build/Objects-normal/arm64/xt_forwarding_trampoline_x64.dia -c /Users/admin/builder/spi-builder-workspace/.dependencies/checkouts/SwiftTrace/SwiftTraceGutsD/xt_forwarding_trampoline_x64.s -o /Users/admin/builder/spi-builder-workspace/.derivedData/Build/Intermediates.noindex/SwiftTrace.build/Debug-watchos/SwiftTraceGutsD.build/Objects-normal/arm64/xt_forwarding_trampoline_x64.o -index-unit-output-path /SwiftTrace.build/Debug-watchos/SwiftTraceGutsD.build/Objects-normal/arm64/xt_forwarding_trampoline_x64.o
CompileC /Users/admin/builder/spi-builder-workspace/.derivedData/Build/Intermediates.noindex/SwiftTrace.build/Debug-watchos/SwiftTraceGutsD.build/Objects-normal/arm64/xt_forwarding_trampoline_arm7.o /Users/admin/builder/spi-builder-workspace/.dependencies/checkouts/SwiftTrace/SwiftTraceGutsD/xt_forwarding_trampoline_arm7.s normal arm64 assembler-with-cpp com.apple.compilers.llvm.clang.1_0.compiler (in target 'SwiftTraceGutsD' from project 'SwiftTrace')
    cd /Users/admin/builder/spi-builder-workspace/.swiftpm/xcode

    Using response file: /Users/admin/builder/spi-builder-workspace/.derivedData/Build/Intermediates.noindex/SwiftTrace.build/Debug-watchos/SwiftTraceGutsD.build/Objects-normal/arm64/533656923a283fa776881f304837ed9e-common-args.resp

    /Applications/Xcode-16.3.0.app/Contents/Developer/Toolchains/XcodeDefault.xctoolchain/usr/bin/clang -x assembler-with-cpp -ivfsstatcache /Users/admin/builder/spi-builder-workspace/.derivedData/SDKStatCaches.noindex/watchos11.4-22T246-43efb940ff07ba2497b70ec94253f576.sdkstatcache -fmessage-length\=0 -fdiagnostics-show-note-include-stack -fmacro-backtrace-limit\=0 -fno-color-diagnostics -fmodules-prune-interval\=86400 -fmodules-prune-after\=345600 -fbuild-session-file\=/Users/admin/builder/spi-builder-workspace/.derivedData/ModuleCache.noindex/Session.modulevalidation -fmodules-validate-once-per-build-session -Wnon-modular-include-in-framework-module -Werror\=non-modular-include-in-framework-module -Wno-trigraphs -Wno-missing-field-initializers -Wno-missing-prototypes -Wno-return-type -Wno-missing-braces -Wparentheses -Wswitch -Wno-unused-function -Wno-unused-label -Wno-unused-parameter -Wno-unused-variable -Wunused-value -Wno-empty-body -Wno-uninitialized -Wno-unknown-pragmas -w -Wno-shadow -Wno-four-char-constants -Wno-conversion -Wno-constant-conversion -Wno-int-conversion -Wno-bool-conversion -Wno-enum-conversion -Wno-float-conversion -Wno-non-literal-null-conversion -Wno-objc-literal-conversion -Wshorten-64-to-32 -Wno-newline-eof -Wno-implicit-fallthrough -fstrict-aliasing -Wdeprecated-declarations -Wno-sign-conversion -Wno-infinite-recursion -Wno-comma -Wno-block-capture-autoreleasing -Wno-strict-prototypes -Wno-semicolon-before-method-body -index-store-path /Users/admin/builder/spi-builder-workspace/.derivedData/Index.noindex/DataStore @/Users/admin/builder/spi-builder-workspace/.derivedData/Build/Intermediates.noindex/SwiftTrace.build/Debug-watchos/SwiftTraceGutsD.build/Objects-normal/arm64/533656923a283fa776881f304837ed9e-common-args.resp -MMD -MT dependencies -MF /Users/admin/builder/spi-builder-workspace/.derivedData/Build/Intermediates.noindex/SwiftTrace.build/Debug-watchos/SwiftTraceGutsD.build/Objects-normal/arm64/xt_forwarding_trampoline_arm7.d --serialize-diagnostics /Users/admin/builder/spi-builder-workspace/.derivedData/Build/Intermediates.noindex/SwiftTrace.build/Debug-watchos/SwiftTraceGutsD.build/Objects-normal/arm64/xt_forwarding_trampoline_arm7.dia -c /Users/admin/builder/spi-builder-workspace/.dependencies/checkouts/SwiftTrace/SwiftTraceGutsD/xt_forwarding_trampoline_arm7.s -o /Users/admin/builder/spi-builder-workspace/.derivedData/Build/Intermediates.noindex/SwiftTrace.build/Debug-watchos/SwiftTraceGutsD.build/Objects-normal/arm64/xt_forwarding_trampoline_arm7.o -index-unit-output-path /SwiftTrace.build/Debug-watchos/SwiftTraceGutsD.build/Objects-normal/arm64/xt_forwarding_trampoline_arm7.o
SwiftDriverJobDiscovery normal arm64_32 Emitting module for SwiftTraceD (in target 'SwiftTraceD' from project 'SwiftTrace')
SwiftDriver\ Compilation\ Requirements SwiftTraceD normal arm64_32 com.apple.xcode.tools.swift.compiler (in target 'SwiftTraceD' from project 'SwiftTrace')
    cd /Users/admin/builder/spi-builder-workspace/.swiftpm/xcode
    builtin-Swift-Compilation-Requirements -- /Applications/Xcode-16.3.0.app/Contents/Developer/Toolchains/XcodeDefault.xctoolchain/usr/bin/swiftc -module-name SwiftTraceD -Onone -enforce-exclusivity\=checked @/Users/admin/builder/spi-builder-workspace/.derivedData/Build/Intermediates.noindex/SwiftTrace.build/Debug-watchos/SwiftTraceD.build/Objects-normal/arm64_32/SwiftTraceD.SwiftFileList -DSWIFT_PACKAGE -DDEBUG -DDEBUG_ONLY -Xcc -fmodule-map-file\=/Users/admin/builder/spi-builder-workspace/.derivedData/Build/Intermediates.noindex/GeneratedModuleMaps-watchos/SwiftTraceGutsD.modulemap -stats-output-dir .stats -strict-concurrency\=complete -enable-upcoming-feature StrictConcurrency -enable-upcoming-feature DisableOutwardActorInference -enable-upcoming-feature GlobalActorIsolatedTypesUsability -enable-upcoming-feature InferSendableFromCaptures -plugin-path /Applications/Xcode-16.3.0.app/Contents/Developer/Toolchains/XcodeDefault.xctoolchain/usr/lib/swift/host/plugins/testing -enable-experimental-feature DebugDescriptionMacro -sdk /Applications/Xcode-16.3.0.app/Contents/Developer/Platforms/WatchOS.platform/Developer/SDKs/WatchOS11.4.sdk -target arm64_32-apple-watchos5.0 -g -module-cache-path /Users/admin/builder/spi-builder-workspace/.derivedData/ModuleCache.noindex -Xfrontend -serialize-debugging-options -enable-testing -suppress-warnings -index-store-path /Users/admin/builder/spi-builder-workspace/.derivedData/Index.noindex/DataStore -swift-version 5 -I /Users/admin/builder/spi-builder-workspace/.derivedData/Build/Products/Debug-watchos -I /Applications/Xcode-16.3.0.app/Contents/Developer/Platforms/WatchOS.platform/Developer/usr/lib -F /Users/admin/builder/spi-builder-workspace/.derivedData/Build/Products/Debug-watchos/PackageFrameworks -F /Users/admin/builder/spi-builder-workspace/.derivedData/Build/Products/Debug-watchos -F /Applications/Xcode-16.3.0.app/Contents/Developer/Platforms/WatchOS.platform/Developer/Library/Frameworks -F /Applications/Xcode-16.3.0.app/Contents/Developer/Platforms/WatchOS.platform/Developer/SDKs/WatchOS11.4.sdk/Developer/Library/Frameworks -c -j10 -enable-batch-mode -incremental -Xcc -ivfsstatcache -Xcc /Users/admin/builder/spi-builder-workspace/.derivedData/SDKStatCaches.noindex/watchos11.4-22T246-43efb940ff07ba2497b70ec94253f576.sdkstatcache -output-file-map /Users/admin/builder/spi-builder-workspace/.derivedData/Build/Intermediates.noindex/SwiftTrace.build/Debug-watchos/SwiftTraceD.build/Objects-normal/arm64_32/SwiftTraceD-OutputFileMap.json -use-frontend-parseable-output -save-temps -no-color-diagnostics -serialize-diagnostics -emit-dependencies -emit-module -emit-module-path /Users/admin/builder/spi-builder-workspace/.derivedData/Build/Intermediates.noindex/SwiftTrace.build/Debug-watchos/SwiftTraceD.build/Objects-normal/arm64_32/SwiftTraceD.swiftmodule -validate-clang-modules-once -clang-build-session-file /Users/admin/builder/spi-builder-workspace/.derivedData/ModuleCache.noindex/Session.modulevalidation -Xcc -I/Users/admin/builder/spi-builder-workspace/.derivedData/Build/Intermediates.noindex/SwiftTrace.build/Debug-watchos/SwiftTraceD.build/swift-overrides.hmap -emit-const-values -Xfrontend -const-gather-protocols-file -Xfrontend /Users/admin/builder/spi-builder-workspace/.derivedData/Build/Intermediates.noindex/SwiftTrace.build/Debug-watchos/SwiftTraceD.build/Objects-normal/arm64_32/SwiftTraceD_const_extract_protocols.json -Xcc -I/Users/admin/builder/spi-builder-workspace/.dependencies/checkouts/SwiftTrace/SwiftTraceGutsD/include -Xcc -I/Users/admin/builder/spi-builder-workspace/.derivedData/Build/Products/Debug-watchos/include -Xcc -I/Users/admin/builder/spi-builder-workspace/.derivedData/Build/Intermediates.noindex/SwiftTrace.build/Debug-watchos/SwiftTraceD.build/DerivedSources-normal/arm64_32 -Xcc -I/Users/admin/builder/spi-builder-workspace/.derivedData/Build/Intermediates.noindex/SwiftTrace.build/Debug-watchos/SwiftTraceD.build/DerivedSources/arm64_32 -Xcc -I/Users/admin/builder/spi-builder-workspace/.derivedData/Build/Intermediates.noindex/SwiftTrace.build/Debug-watchos/SwiftTraceD.build/DerivedSources -Xcc -DSWIFT_PACKAGE -Xcc -DDEBUG\=1 -emit-objc-header -emit-objc-header-path /Users/admin/builder/spi-builder-workspace/.derivedData/Build/Intermediates.noindex/SwiftTrace.build/Debug-watchos/SwiftTraceD.build/Objects-normal/arm64_32/SwiftTraceD-Swift.h -working-directory /Users/admin/builder/spi-builder-workspace/.swiftpm/xcode -experimental-emit-module-separately -disable-cmo
CompileC /Users/admin/builder/spi-builder-workspace/.derivedData/Build/Intermediates.noindex/SwiftTrace.build/Debug-watchos/SwiftTraceGutsD.build/Objects-normal/arm64/xt_forwarding_trampoline_arm64.o /Users/admin/builder/spi-builder-workspace/.dependencies/checkouts/SwiftTrace/SwiftTraceGutsD/xt_forwarding_trampoline_arm64.s normal arm64 assembler-with-cpp com.apple.compilers.llvm.clang.1_0.compiler (in target 'SwiftTraceGutsD' from project 'SwiftTrace')
    cd /Users/admin/builder/spi-builder-workspace/.swiftpm/xcode

    Using response file: /Users/admin/builder/spi-builder-workspace/.derivedData/Build/Intermediates.noindex/SwiftTrace.build/Debug-watchos/SwiftTraceGutsD.build/Objects-normal/arm64/533656923a283fa776881f304837ed9e-common-args.resp

    /Applications/Xcode-16.3.0.app/Contents/Developer/Toolchains/XcodeDefault.xctoolchain/usr/bin/clang -x assembler-with-cpp -ivfsstatcache /Users/admin/builder/spi-builder-workspace/.derivedData/SDKStatCaches.noindex/watchos11.4-22T246-43efb940ff07ba2497b70ec94253f576.sdkstatcache -fmessage-length\=0 -fdiagnostics-show-note-include-stack -fmacro-backtrace-limit\=0 -fno-color-diagnostics -fmodules-prune-interval\=86400 -fmodules-prune-after\=345600 -fbuild-session-file\=/Users/admin/builder/spi-builder-workspace/.derivedData/ModuleCache.noindex/Session.modulevalidation -fmodules-validate-once-per-build-session -Wnon-modular-include-in-framework-module -Werror\=non-modular-include-in-framework-module -Wno-trigraphs -Wno-missing-field-initializers -Wno-missing-prototypes -Wno-return-type -Wno-missing-braces -Wparentheses -Wswitch -Wno-unused-function -Wno-unused-label -Wno-unused-parameter -Wno-unused-variable -Wunused-value -Wno-empty-body -Wno-uninitialized -Wno-unknown-pragmas -w -Wno-shadow -Wno-four-char-constants -Wno-conversion -Wno-constant-conversion -Wno-int-conversion -Wno-bool-conversion -Wno-enum-conversion -Wno-float-conversion -Wno-non-literal-null-conversion -Wno-objc-literal-conversion -Wshorten-64-to-32 -Wno-newline-eof -Wno-implicit-fallthrough -fstrict-aliasing -Wdeprecated-declarations -Wno-sign-conversion -Wno-infinite-recursion -Wno-comma -Wno-block-capture-autoreleasing -Wno-strict-prototypes -Wno-semicolon-before-method-body -index-store-path /Users/admin/builder/spi-builder-workspace/.derivedData/Index.noindex/DataStore @/Users/admin/builder/spi-builder-workspace/.derivedData/Build/Intermediates.noindex/SwiftTrace.build/Debug-watchos/SwiftTraceGutsD.build/Objects-normal/arm64/533656923a283fa776881f304837ed9e-common-args.resp -MMD -MT dependencies -MF /Users/admin/builder/spi-builder-workspace/.derivedData/Build/Intermediates.noindex/SwiftTrace.build/Debug-watchos/SwiftTraceGutsD.build/Objects-normal/arm64/xt_forwarding_trampoline_arm64.d --serialize-diagnostics /Users/admin/builder/spi-builder-workspace/.derivedData/Build/Intermediates.noindex/SwiftTrace.build/Debug-watchos/SwiftTraceGutsD.build/Objects-normal/arm64/xt_forwarding_trampoline_arm64.dia -c /Users/admin/builder/spi-builder-workspace/.dependencies/checkouts/SwiftTrace/SwiftTraceGutsD/xt_forwarding_trampoline_arm64.s -o /Users/admin/builder/spi-builder-workspace/.derivedData/Build/Intermediates.noindex/SwiftTrace.build/Debug-watchos/SwiftTraceGutsD.build/Objects-normal/arm64/xt_forwarding_trampoline_arm64.o -index-unit-output-path /SwiftTrace.build/Debug-watchos/SwiftTraceGutsD.build/Objects-normal/arm64/xt_forwarding_trampoline_arm64.o
CompileC /Users/admin/builder/spi-builder-workspace/.derivedData/Build/Intermediates.noindex/SwiftTrace.build/Debug-watchos/SwiftTraceGutsD.build/Objects-normal/arm64/fast_dladdr.o /Users/admin/builder/spi-builder-workspace/.dependencies/checkouts/SwiftTrace/SwiftTraceGutsD/fast_dladdr.mm normal arm64 objective-c++ com.apple.compilers.llvm.clang.1_0.compiler (in target 'SwiftTraceGutsD' from project 'SwiftTrace')
    cd /Users/admin/builder/spi-builder-workspace/.swiftpm/xcode

    Using response file: /Users/admin/builder/spi-builder-workspace/.derivedData/Build/Intermediates.noindex/SwiftTrace.build/Debug-watchos/SwiftTraceGutsD.build/Objects-normal/arm64/af3fcb34312c57c0f52879cdce924b91-common-args.resp

    /Applications/Xcode-16.3.0.app/Contents/Developer/Toolchains/XcodeDefault.xctoolchain/usr/bin/clang -x objective-c++ -ivfsstatcache /Users/admin/builder/spi-builder-workspace/.derivedData/SDKStatCaches.noindex/watchos11.4-22T246-43efb940ff07ba2497b70ec94253f576.sdkstatcache -fmessage-length\=0 -fdiagnostics-show-note-include-stack -fmacro-backtrace-limit\=0 -fno-color-diagnostics -fmodules-prune-interval\=86400 -fmodules-prune-after\=345600 -fbuild-session-file\=/Users/admin/builder/spi-builder-workspace/.derivedData/ModuleCache.noindex/Session.modulevalidation -fmodules-validate-once-per-build-session -Wnon-modular-include-in-framework-module -Werror\=non-modular-include-in-framework-module -Wno-trigraphs -Wno-missing-field-initializers -Wno-missing-prototypes -Wno-return-type -Wno-implicit-atomic-properties -Wno-objc-interface-ivars -Wno-arc-repeated-use-of-weak -Wno-non-virtual-dtor -Wno-overloaded-virtual -Wno-exit-time-destructors -Wno-missing-braces -Wparentheses -Wswitch -Wno-unused-function -Wno-unused-label -Wno-unused-parameter -Wno-unused-variable -Wunused-value -Wno-empty-body -Wno-uninitialized -Wno-unknown-pragmas -w -Wno-shadow -Wno-four-char-constants -Wno-conversion -Wno-constant-conversion -Wno-int-conversion -Wno-bool-conversion -Wno-enum-conversion -Wno-float-conversion -Wno-non-literal-null-conversion -Wno-objc-literal-conversion -Wshorten-64-to-32 -Wno-newline-eof -Wno-selector -Wno-strict-selector-match -Wno-undeclared-selector -Wno-deprecated-implementations -Wno-c++11-extensions -Wno-implicit-fallthrough -fstrict-aliasing -Wprotocol -Wdeprecated-declarations -Winvalid-offsetof -Wno-sign-conversion -Wno-infinite-recursion -Wno-move -Wno-comma -Wno-block-capture-autoreleasing -Wno-strict-prototypes -Wno-range-loop-analysis -Wno-semicolon-before-method-body -index-store-path /Users/admin/builder/spi-builder-workspace/.derivedData/Index.noindex/DataStore @/Users/admin/builder/spi-builder-workspace/.derivedData/Build/Intermediates.noindex/SwiftTrace.build/Debug-watchos/SwiftTraceGutsD.build/Objects-normal/arm64/af3fcb34312c57c0f52879cdce924b91-common-args.resp -MMD -MT dependencies -MF /Users/admin/builder/spi-builder-workspace/.derivedData/Build/Intermediates.noindex/SwiftTrace.build/Debug-watchos/SwiftTraceGutsD.build/Objects-normal/arm64/fast_dladdr.d --serialize-diagnostics /Users/admin/builder/spi-builder-workspace/.derivedData/Build/Intermediates.noindex/SwiftTrace.build/Debug-watchos/SwiftTraceGutsD.build/Objects-normal/arm64/fast_dladdr.dia -c /Users/admin/builder/spi-builder-workspace/.dependencies/checkouts/SwiftTrace/SwiftTraceGutsD/fast_dladdr.mm -o /Users/admin/builder/spi-builder-workspace/.derivedData/Build/Intermediates.noindex/SwiftTrace.build/Debug-watchos/SwiftTraceGutsD.build/Objects-normal/arm64/fast_dladdr.o -index-unit-output-path /SwiftTrace.build/Debug-watchos/SwiftTraceGutsD.build/Objects-normal/arm64/fast_dladdr.o
SwiftMergeGeneratedHeaders /Users/admin/builder/spi-builder-workspace/.derivedData/Build/Intermediates.noindex/GeneratedModuleMaps-watchos/SwiftTraceD-Swift.h /Users/admin/builder/spi-builder-workspace/.derivedData/Build/Intermediates.noindex/SwiftTrace.build/Debug-watchos/SwiftTraceD.build/Objects-normal/arm64/SwiftTraceD-Swift.h /Users/admin/builder/spi-builder-workspace/.derivedData/Build/Intermediates.noindex/SwiftTrace.build/Debug-watchos/SwiftTraceD.build/Objects-normal/arm64_32/SwiftTraceD-Swift.h /Users/admin/builder/spi-builder-workspace/.derivedData/Build/Intermediates.noindex/SwiftTrace.build/Debug-watchos/SwiftTraceD.build/Objects-normal/armv7k/SwiftTraceD-Swift.h (in target 'SwiftTraceD' from project 'SwiftTrace')
    cd /Users/admin/builder/spi-builder-workspace/.dependencies/checkouts/SwiftTrace
    builtin-swiftHeaderTool -arch arm64 /Users/admin/builder/spi-builder-workspace/.derivedData/Build/Intermediates.noindex/SwiftTrace.build/Debug-watchos/SwiftTraceD.build/Objects-normal/arm64/SwiftTraceD-Swift.h -arch arm64_32 /Users/admin/builder/spi-builder-workspace/.derivedData/Build/Intermediates.noindex/SwiftTrace.build/Debug-watchos/SwiftTraceD.build/Objects-normal/arm64_32/SwiftTraceD-Swift.h -arch armv7k /Users/admin/builder/spi-builder-workspace/.derivedData/Build/Intermediates.noindex/SwiftTrace.build/Debug-watchos/SwiftTraceD.build/Objects-normal/armv7k/SwiftTraceD-Swift.h -o /Users/admin/builder/spi-builder-workspace/.derivedData/Build/Intermediates.noindex/GeneratedModuleMaps-watchos/SwiftTraceD-Swift.h
Copy /Users/admin/builder/spi-builder-workspace/.derivedData/Build/Products/Debug-watchos/SwiftTraceD.swiftmodule/arm64_32-apple-watchos.swiftmodule /Users/admin/builder/spi-builder-workspace/.derivedData/Build/Intermediates.noindex/SwiftTrace.build/Debug-watchos/SwiftTraceD.build/Objects-normal/arm64_32/SwiftTraceD.swiftmodule (in target 'SwiftTraceD' from project 'SwiftTrace')
    cd /Users/admin/builder/spi-builder-workspace/.dependencies/checkouts/SwiftTrace
    builtin-copy -exclude .DS_Store -exclude CVS -exclude .svn -exclude .git -exclude .hg -resolve-src-symlinks -rename /Users/admin/builder/spi-builder-workspace/.derivedData/Build/Intermediates.noindex/SwiftTrace.build/Debug-watchos/SwiftTraceD.build/Objects-normal/arm64_32/SwiftTraceD.swiftmodule /Users/admin/builder/spi-builder-workspace/.derivedData/Build/Products/Debug-watchos/SwiftTraceD.swiftmodule/arm64_32-apple-watchos.swiftmodule
Copy /Users/admin/builder/spi-builder-workspace/.derivedData/Build/Products/Debug-watchos/SwiftTraceD.swiftmodule/arm64_32-apple-watchos.swiftdoc /Users/admin/builder/spi-builder-workspace/.derivedData/Build/Intermediates.noindex/SwiftTrace.build/Debug-watchos/SwiftTraceD.build/Objects-normal/arm64_32/SwiftTraceD.swiftdoc (in target 'SwiftTraceD' from project 'SwiftTrace')
    cd /Users/admin/builder/spi-builder-workspace/.dependencies/checkouts/SwiftTrace
    builtin-copy -exclude .DS_Store -exclude CVS -exclude .svn -exclude .git -exclude .hg -resolve-src-symlinks -rename /Users/admin/builder/spi-builder-workspace/.derivedData/Build/Intermediates.noindex/SwiftTrace.build/Debug-watchos/SwiftTraceD.build/Objects-normal/arm64_32/SwiftTraceD.swiftdoc /Users/admin/builder/spi-builder-workspace/.derivedData/Build/Products/Debug-watchos/SwiftTraceD.swiftmodule/arm64_32-apple-watchos.swiftdoc
Copy /Users/admin/builder/spi-builder-workspace/.derivedData/Build/Products/Debug-watchos/SwiftTraceD.swiftmodule/arm64_32-apple-watchos.abi.json /Users/admin/builder/spi-builder-workspace/.derivedData/Build/Intermediates.noindex/SwiftTrace.build/Debug-watchos/SwiftTraceD.build/Objects-normal/arm64_32/SwiftTraceD.abi.json (in target 'SwiftTraceD' from project 'SwiftTrace')
    cd /Users/admin/builder/spi-builder-workspace/.dependencies/checkouts/SwiftTrace
    builtin-copy -exclude .DS_Store -exclude CVS -exclude .svn -exclude .git -exclude .hg -resolve-src-symlinks -rename /Users/admin/builder/spi-builder-workspace/.derivedData/Build/Intermediates.noindex/SwiftTrace.build/Debug-watchos/SwiftTraceD.build/Objects-normal/arm64_32/SwiftTraceD.abi.json /Users/admin/builder/spi-builder-workspace/.derivedData/Build/Products/Debug-watchos/SwiftTraceD.swiftmodule/arm64_32-apple-watchos.abi.json
Copy /Users/admin/builder/spi-builder-workspace/.derivedData/Build/Products/Debug-watchos/SwiftTraceD.swiftmodule/Project/arm64_32-apple-watchos.swiftsourceinfo /Users/admin/builder/spi-builder-workspace/.derivedData/Build/Intermediates.noindex/SwiftTrace.build/Debug-watchos/SwiftTraceD.build/Objects-normal/arm64_32/SwiftTraceD.swiftsourceinfo (in target 'SwiftTraceD' from project 'SwiftTrace')
    cd /Users/admin/builder/spi-builder-workspace/.dependencies/checkouts/SwiftTrace
    builtin-copy -exclude .DS_Store -exclude CVS -exclude .svn -exclude .git -exclude .hg -resolve-src-symlinks -rename /Users/admin/builder/spi-builder-workspace/.derivedData/Build/Intermediates.noindex/SwiftTrace.build/Debug-watchos/SwiftTraceD.build/Objects-normal/arm64_32/SwiftTraceD.swiftsourceinfo /Users/admin/builder/spi-builder-workspace/.derivedData/Build/Products/Debug-watchos/SwiftTraceD.swiftmodule/Project/arm64_32-apple-watchos.swiftsourceinfo
CompileC /Users/admin/builder/spi-builder-workspace/.derivedData/Build/Intermediates.noindex/SwiftTrace.build/Debug-watchos/SwiftTraceGutsD.build/Objects-normal/arm64/Trampolines.o /Users/admin/builder/spi-builder-workspace/.dependencies/checkouts/SwiftTrace/SwiftTraceGutsD/Trampolines.mm normal arm64 objective-c++ com.apple.compilers.llvm.clang.1_0.compiler (in target 'SwiftTraceGutsD' from project 'SwiftTrace')
    cd /Users/admin/builder/spi-builder-workspace/.swiftpm/xcode

    Using response file: /Users/admin/builder/spi-builder-workspace/.derivedData/Build/Intermediates.noindex/SwiftTrace.build/Debug-watchos/SwiftTraceGutsD.build/Objects-normal/arm64/af3fcb34312c57c0f52879cdce924b91-common-args.resp

    /Applications/Xcode-16.3.0.app/Contents/Developer/Toolchains/XcodeDefault.xctoolchain/usr/bin/clang -x objective-c++ -ivfsstatcache /Users/admin/builder/spi-builder-workspace/.derivedData/SDKStatCaches.noindex/watchos11.4-22T246-43efb940ff07ba2497b70ec94253f576.sdkstatcache -fmessage-length\=0 -fdiagnostics-show-note-include-stack -fmacro-backtrace-limit\=0 -fno-color-diagnostics -fmodules-prune-interval\=86400 -fmodules-prune-after\=345600 -fbuild-session-file\=/Users/admin/builder/spi-builder-workspace/.derivedData/ModuleCache.noindex/Session.modulevalidation -fmodules-validate-once-per-build-session -Wnon-modular-include-in-framework-module -Werror\=non-modular-include-in-framework-module -Wno-trigraphs -Wno-missing-field-initializers -Wno-missing-prototypes -Wno-return-type -Wno-implicit-atomic-properties -Wno-objc-interface-ivars -Wno-arc-repeated-use-of-weak -Wno-non-virtual-dtor -Wno-overloaded-virtual -Wno-exit-time-destructors -Wno-missing-braces -Wparentheses -Wswitch -Wno-unused-function -Wno-unused-label -Wno-unused-parameter -Wno-unused-variable -Wunused-value -Wno-empty-body -Wno-uninitialized -Wno-unknown-pragmas -w -Wno-shadow -Wno-four-char-constants -Wno-conversion -Wno-constant-conversion -Wno-int-conversion -Wno-bool-conversion -Wno-enum-conversion -Wno-float-conversion -Wno-non-literal-null-conversion -Wno-objc-literal-conversion -Wshorten-64-to-32 -Wno-newline-eof -Wno-selector -Wno-strict-selector-match -Wno-undeclared-selector -Wno-deprecated-implementations -Wno-c++11-extensions -Wno-implicit-fallthrough -fstrict-aliasing -Wprotocol -Wdeprecated-declarations -Winvalid-offsetof -Wno-sign-conversion -Wno-infinite-recursion -Wno-move -Wno-comma -Wno-block-capture-autoreleasing -Wno-strict-prototypes -Wno-range-loop-analysis -Wno-semicolon-before-method-body -index-store-path /Users/admin/builder/spi-builder-workspace/.derivedData/Index.noindex/DataStore @/Users/admin/builder/spi-builder-workspace/.derivedData/Build/Intermediates.noindex/SwiftTrace.build/Debug-watchos/SwiftTraceGutsD.build/Objects-normal/arm64/af3fcb34312c57c0f52879cdce924b91-common-args.resp -MMD -MT dependencies -MF /Users/admin/builder/spi-builder-workspace/.derivedData/Build/Intermediates.noindex/SwiftTrace.build/Debug-watchos/SwiftTraceGutsD.build/Objects-normal/arm64/Trampolines.d --serialize-diagnostics /Users/admin/builder/spi-builder-workspace/.derivedData/Build/Intermediates.noindex/SwiftTrace.build/Debug-watchos/SwiftTraceGutsD.build/Objects-normal/arm64/Trampolines.dia -c /Users/admin/builder/spi-builder-workspace/.dependencies/checkouts/SwiftTrace/SwiftTraceGutsD/Trampolines.mm -o /Users/admin/builder/spi-builder-workspace/.derivedData/Build/Intermediates.noindex/SwiftTrace.build/Debug-watchos/SwiftTraceGutsD.build/Objects-normal/arm64/Trampolines.o -index-unit-output-path /SwiftTrace.build/Debug-watchos/SwiftTraceGutsD.build/Objects-normal/arm64/Trampolines.o
CompileC /Users/admin/builder/spi-builder-workspace/.derivedData/Build/Intermediates.noindex/SwiftTrace.build/Debug-watchos/SwiftTraceGutsD.build/Objects-normal/arm64/SwiftTrace.o /Users/admin/builder/spi-builder-workspace/.dependencies/checkouts/SwiftTrace/SwiftTraceGutsD/SwiftTrace.mm normal arm64 objective-c++ com.apple.compilers.llvm.clang.1_0.compiler (in target 'SwiftTraceGutsD' from project 'SwiftTrace')
    cd /Users/admin/builder/spi-builder-workspace/.swiftpm/xcode

    Using response file: /Users/admin/builder/spi-builder-workspace/.derivedData/Build/Intermediates.noindex/SwiftTrace.build/Debug-watchos/SwiftTraceGutsD.build/Objects-normal/arm64/af3fcb34312c57c0f52879cdce924b91-common-args.resp

    /Applications/Xcode-16.3.0.app/Contents/Developer/Toolchains/XcodeDefault.xctoolchain/usr/bin/clang -x objective-c++ -ivfsstatcache /Users/admin/builder/spi-builder-workspace/.derivedData/SDKStatCaches.noindex/watchos11.4-22T246-43efb940ff07ba2497b70ec94253f576.sdkstatcache -fmessage-length\=0 -fdiagnostics-show-note-include-stack -fmacro-backtrace-limit\=0 -fno-color-diagnostics -fmodules-prune-interval\=86400 -fmodules-prune-after\=345600 -fbuild-session-file\=/Users/admin/builder/spi-builder-workspace/.derivedData/ModuleCache.noindex/Session.modulevalidation -fmodules-validate-once-per-build-session -Wnon-modular-include-in-framework-module -Werror\=non-modular-include-in-framework-module -Wno-trigraphs -Wno-missing-field-initializers -Wno-missing-prototypes -Wno-return-type -Wno-implicit-atomic-properties -Wno-objc-interface-ivars -Wno-arc-repeated-use-of-weak -Wno-non-virtual-dtor -Wno-overloaded-virtual -Wno-exit-time-destructors -Wno-missing-braces -Wparentheses -Wswitch -Wno-unused-function -Wno-unused-label -Wno-unused-parameter -Wno-unused-variable -Wunused-value -Wno-empty-body -Wno-uninitialized -Wno-unknown-pragmas -w -Wno-shadow -Wno-four-char-constants -Wno-conversion -Wno-constant-conversion -Wno-int-conversion -Wno-bool-conversion -Wno-enum-conversion -Wno-float-conversion -Wno-non-literal-null-conversion -Wno-objc-literal-conversion -Wshorten-64-to-32 -Wno-newline-eof -Wno-selector -Wno-strict-selector-match -Wno-undeclared-selector -Wno-deprecated-implementations -Wno-c++11-extensions -Wno-implicit-fallthrough -fstrict-aliasing -Wprotocol -Wdeprecated-declarations -Winvalid-offsetof -Wno-sign-conversion -Wno-infinite-recursion -Wno-move -Wno-comma -Wno-block-capture-autoreleasing -Wno-strict-prototypes -Wno-range-loop-analysis -Wno-semicolon-before-method-body -index-store-path /Users/admin/builder/spi-builder-workspace/.derivedData/Index.noindex/DataStore @/Users/admin/builder/spi-builder-workspace/.derivedData/Build/Intermediates.noindex/SwiftTrace.build/Debug-watchos/SwiftTraceGutsD.build/Objects-normal/arm64/af3fcb34312c57c0f52879cdce924b91-common-args.resp -MMD -MT dependencies -MF /Users/admin/builder/spi-builder-workspace/.derivedData/Build/Intermediates.noindex/SwiftTrace.build/Debug-watchos/SwiftTraceGutsD.build/Objects-normal/arm64/SwiftTrace.d --serialize-diagnostics /Users/admin/builder/spi-builder-workspace/.derivedData/Build/Intermediates.noindex/SwiftTrace.build/Debug-watchos/SwiftTraceGutsD.build/Objects-normal/arm64/SwiftTrace.dia -c /Users/admin/builder/spi-builder-workspace/.dependencies/checkouts/SwiftTrace/SwiftTraceGutsD/SwiftTrace.mm -o /Users/admin/builder/spi-builder-workspace/.derivedData/Build/Intermediates.noindex/SwiftTrace.build/Debug-watchos/SwiftTraceGutsD.build/Objects-normal/arm64/SwiftTrace.o -index-unit-output-path /SwiftTrace.build/Debug-watchos/SwiftTraceGutsD.build/Objects-normal/arm64/SwiftTrace.o
CompileC /Users/admin/builder/spi-builder-workspace/.derivedData/Build/Intermediates.noindex/SwiftTrace.build/Debug-watchos/SwiftTraceGutsD.build/Objects-normal/arm64/ObjCBridge.o /Users/admin/builder/spi-builder-workspace/.dependencies/checkouts/SwiftTrace/SwiftTraceGutsD/ObjCBridge.mm normal arm64 objective-c++ com.apple.compilers.llvm.clang.1_0.compiler (in target 'SwiftTraceGutsD' from project 'SwiftTrace')
    cd /Users/admin/builder/spi-builder-workspace/.swiftpm/xcode

    Using response file: /Users/admin/builder/spi-builder-workspace/.derivedData/Build/Intermediates.noindex/SwiftTrace.build/Debug-watchos/SwiftTraceGutsD.build/Objects-normal/arm64/af3fcb34312c57c0f52879cdce924b91-common-args.resp

    /Applications/Xcode-16.3.0.app/Contents/Developer/Toolchains/XcodeDefault.xctoolchain/usr/bin/clang -x objective-c++ -ivfsstatcache /Users/admin/builder/spi-builder-workspace/.derivedData/SDKStatCaches.noindex/watchos11.4-22T246-43efb940ff07ba2497b70ec94253f576.sdkstatcache -fmessage-length\=0 -fdiagnostics-show-note-include-stack -fmacro-backtrace-limit\=0 -fno-color-diagnostics -fmodules-prune-interval\=86400 -fmodules-prune-after\=345600 -fbuild-session-file\=/Users/admin/builder/spi-builder-workspace/.derivedData/ModuleCache.noindex/Session.modulevalidation -fmodules-validate-once-per-build-session -Wnon-modular-include-in-framework-module -Werror\=non-modular-include-in-framework-module -Wno-trigraphs -Wno-missing-field-initializers -Wno-missing-prototypes -Wno-return-type -Wno-implicit-atomic-properties -Wno-objc-interface-ivars -Wno-arc-repeated-use-of-weak -Wno-non-virtual-dtor -Wno-overloaded-virtual -Wno-exit-time-destructors -Wno-missing-braces -Wparentheses -Wswitch -Wno-unused-function -Wno-unused-label -Wno-unused-parameter -Wno-unused-variable -Wunused-value -Wno-empty-body -Wno-uninitialized -Wno-unknown-pragmas -w -Wno-shadow -Wno-four-char-constants -Wno-conversion -Wno-constant-conversion -Wno-int-conversion -Wno-bool-conversion -Wno-enum-conversion -Wno-float-conversion -Wno-non-literal-null-conversion -Wno-objc-literal-conversion -Wshorten-64-to-32 -Wno-newline-eof -Wno-selector -Wno-strict-selector-match -Wno-undeclared-selector -Wno-deprecated-implementations -Wno-c++11-extensions -Wno-implicit-fallthrough -fstrict-aliasing -Wprotocol -Wdeprecated-declarations -Winvalid-offsetof -Wno-sign-conversion -Wno-infinite-recursion -Wno-move -Wno-comma -Wno-block-capture-autoreleasing -Wno-strict-prototypes -Wno-range-loop-analysis -Wno-semicolon-before-method-body -index-store-path /Users/admin/builder/spi-builder-workspace/.derivedData/Index.noindex/DataStore @/Users/admin/builder/spi-builder-workspace/.derivedData/Build/Intermediates.noindex/SwiftTrace.build/Debug-watchos/SwiftTraceGutsD.build/Objects-normal/arm64/af3fcb34312c57c0f52879cdce924b91-common-args.resp -MMD -MT dependencies -MF /Users/admin/builder/spi-builder-workspace/.derivedData/Build/Intermediates.noindex/SwiftTrace.build/Debug-watchos/SwiftTraceGutsD.build/Objects-normal/arm64/ObjCBridge.d --serialize-diagnostics /Users/admin/builder/spi-builder-workspace/.derivedData/Build/Intermediates.noindex/SwiftTrace.build/Debug-watchos/SwiftTraceGutsD.build/Objects-normal/arm64/ObjCBridge.dia -c /Users/admin/builder/spi-builder-workspace/.dependencies/checkouts/SwiftTrace/SwiftTraceGutsD/ObjCBridge.mm -o /Users/admin/builder/spi-builder-workspace/.derivedData/Build/Intermediates.noindex/SwiftTrace.build/Debug-watchos/SwiftTraceGutsD.build/Objects-normal/arm64/ObjCBridge.o -index-unit-output-path /SwiftTrace.build/Debug-watchos/SwiftTraceGutsD.build/Objects-normal/arm64/ObjCBridge.o
** BUILD FAILED **
The following build commands failed:
	SwiftEmitModule normal armv7k Emitting\ module\ for\ RemoteMovie (in target 'RemoteMovie' from project 'RemotePlugin')
	SwiftCompile normal armv7k /Users/admin/builder/spi-builder-workspace/.dependencies/checkouts/Remote/Sources/RemoteMovie/TimeLapseBuilder.swift (in target 'RemoteMovie' from project 'RemotePlugin')
	Building workspace spi-builder-workspace with scheme HotReloading-Package
(3 failures)
Command line invocation:
    /Applications/Xcode-16.3.0.app/Contents/Developer/usr/bin/xcodebuild -IDEClonedSourcePackagesDirPathOverride=/Users/admin/builder/spi-builder-workspace/.dependencies -resolvePackageDependencies
Resolve Package Graph
Resolved source packages:
  SwiftRegex: https://github.com/johnno1962/SwiftRegex5 @ 6.1.3
  DLKit: https://github.com/johnno1962/DLKit @ 3.4.7
  ProfileSwiftUI: https://github.com/johnno1962/ProfileSwiftUI @ 1.1.3
  XprobePlugin: https://github.com/johnno1962/XprobePlugin @ 2.9.10
  RemotePlugin: https://github.com/johnno1962/Remote @ 2.3.5
  fishhook: https://github.com/johnno1962/fishhook @ 1.2.1
  HotReloading: /Users/admin/builder/spi-builder-workspace
  SwiftTrace: https://github.com/johnno1962/SwiftTrace @ 8.6.1
resolved source packages: SwiftRegex, DLKit, ProfileSwiftUI, XprobePlugin, RemotePlugin, fishhook, HotReloading, SwiftTrace
{
  "cxx_language_standard" : "c++11",
  "dependencies" : [
    {
      "identity" : "swifttrace",
      "requirement" : {
        "range" : [
          {
            "lower_bound" : "8.6.1",
            "upper_bound" : "8.7.0"
          }
        ]
      },
      "type" : "sourceControl",
      "url" : "https://github.com/johnno1962/SwiftTrace"
    },
    {
      "identity" : "swiftregex5",
      "requirement" : {
        "range" : [
          {
            "lower_bound" : "6.1.2",
            "upper_bound" : "6.2.0"
          }
        ]
      },
      "type" : "sourceControl",
      "url" : "https://github.com/johnno1962/SwiftRegex5"
    },
    {
      "identity" : "xprobeplugin",
      "requirement" : {
        "range" : [
          {
            "lower_bound" : "2.9.10",
            "upper_bound" : "2.10.0"
          }
        ]
      },
      "type" : "sourceControl",
      "url" : "https://github.com/johnno1962/XprobePlugin"
    },
    {
      "identity" : "remote",
      "requirement" : {
        "range" : [
          {
            "lower_bound" : "2.3.5",
            "upper_bound" : "2.4.0"
          }
        ]
      },
      "type" : "sourceControl",
      "url" : "https://github.com/johnno1962/Remote"
    },
    {
      "identity" : "profileswiftui",
      "requirement" : {
        "range" : [
          {
            "lower_bound" : "1.1.3",
            "upper_bound" : "1.2.0"
          }
        ]
      },
      "type" : "sourceControl",
      "url" : "https://github.com/johnno1962/ProfileSwiftUI"
    }
  ],
  "manifest_display_name" : "HotReloading",
  "name" : "HotReloading",
  "path" : "/Users/admin/builder/spi-builder-workspace",
  "platforms" : [
    {
      "name" : "macos",
      "version" : "10.12"
    },
    {
      "name" : "ios",
      "version" : "10.0"
    },
    {
      "name" : "tvos",
      "version" : "10.0"
    }
  ],
  "products" : [
    {
      "name" : "HotReloading",
      "targets" : [
        "HotReloading"
      ],
      "type" : {
        "library" : [
          "automatic"
        ]
      }
    },
    {
      "name" : "HotReloadingGuts",
      "targets" : [
        "HotReloadingGuts"
      ],
      "type" : {
        "library" : [
          "automatic"
        ]
      }
    },
    {
      "name" : "injectiondGuts",
      "targets" : [
        "injectiondGuts"
      ],
      "type" : {
        "library" : [
          "automatic"
        ]
      }
    },
    {
      "name" : "injectiond",
      "targets" : [
        "injectiond"
      ],
      "type" : {
        "executable" : null
      }
    }
  ],
  "targets" : [
    {
      "c99name" : "injectiondGuts",
      "module_type" : "ClangTarget",
      "name" : "injectiondGuts",
      "path" : "Sources/injectiondGuts",
      "product_memberships" : [
        "injectiondGuts",
        "injectiond"
      ],
      "sources" : [
        "SignerService.m"
      ],
      "type" : "library"
    },
    {
      "c99name" : "injectiond",
      "module_type" : "SwiftTarget",
      "name" : "injectiond",
      "path" : "Sources/injectiond",
      "product_dependencies" : [
        "SwiftRegex",
        "XprobeUI",
        "RemoteUI"
      ],
      "product_memberships" : [
        "injectiond"
      ],
      "sources" : [
        "AppDelegate.swift",
        "DeviceServer.swift",
        "Experimental.swift",
        "FileWatcher.swift",
        "InjectionServer.swift",
        "SwiftEval.swift",
        "UnhidingEval.swift",
        "UpdateCheck.swift",
        "main.swift"
      ],
      "target_dependencies" : [
        "HotReloadingGuts",
        "injectiondGuts"
      ],
      "type" : "executable"
    },
    {
      "c99name" : "HotReloadingGuts",
      "module_type" : "ClangTarget",
      "name" : "HotReloadingGuts",
      "path" : "Sources/HotReloadingGuts",
      "product_memberships" : [
        "HotReloading",
        "HotReloadingGuts",
        "injectiond"
      ],
      "sources" : [
        "ClientBoot.mm",
        "SimpleSocket.mm",
        "Unhide.mm"
      ],
      "type" : "library"
    },
    {
      "c99name" : "HotReloading",
      "module_type" : "SwiftTarget",
      "name" : "HotReloading",
      "path" : "Sources/HotReloading",
      "product_dependencies" : [
        "SwiftTraceD",
        "Xprobe",
        "SwiftRegex",
        "ProfileSwiftUI"
      ],
      "product_memberships" : [
        "HotReloading"
      ],
      "sources" : [
        "DeviceInjection.swift",
        "DynamicCast.swift",
        "FileWatcher.swift",
        "InjectionClient.swift",
        "InjectionStats.swift",
        "ObjcInjection.swift",
        "ReducerInjection.swift",
        "StandaloneInjection.swift",
        "SwiftEval.swift",
        "SwiftInjection.swift",
        "SwiftInterpose.swift",
        "SwiftKeyPath.swift",
        "SwiftSweeper.swift",
        "UnhidingEval.swift",
        "Vaccine.swift"
      ],
      "target_dependencies" : [
        "HotReloadingGuts"
      ],
      "type" : "library"
    }
  ],
  "tools_version" : "5.2"
}
{
  "workspace" : {
    "name" : "spi-builder-workspace",
    "schemes" : [
      "HotReloading",
      "HotReloading-Package",
      "HotReloadingGuts",
      "injectiond",
      "injectiondGuts"
    ]
  }
}
Running build ...
env DEVELOPER_DIR=/Applications/Xcode-16.3.0.app xcrun xcodebuild -IDEClonedSourcePackagesDirPathOverride=$PWD/.dependencies -skipMacroValidation -skipPackagePluginValidation -derivedDataPath $PWD/.derivedData build -scheme HotReloading-Package -destination generic/platform=watchOS
Command line invocation:
    /Applications/Xcode-16.3.0.app/Contents/Developer/usr/bin/xcodebuild -IDEClonedSourcePackagesDirPathOverride=/Users/admin/builder/spi-builder-workspace/.dependencies -skipMacroValidation -skipPackagePluginValidation -derivedDataPath /Users/admin/builder/spi-builder-workspace/.derivedData build -scheme HotReloading-Package -destination generic/platform=watchOS
Resolve Package Graph
Resolved source packages:
  SwiftRegex: https://github.com/johnno1962/SwiftRegex5 @ 6.1.3
  SwiftTrace: https://github.com/johnno1962/SwiftTrace @ 8.6.1
  XprobePlugin: https://github.com/johnno1962/XprobePlugin @ 2.9.10
  fishhook: https://github.com/johnno1962/fishhook @ 1.2.1
  ProfileSwiftUI: https://github.com/johnno1962/ProfileSwiftUI @ 1.1.3
  RemotePlugin: https://github.com/johnno1962/Remote @ 2.3.5
  HotReloading: /Users/admin/builder/spi-builder-workspace
  DLKit: https://github.com/johnno1962/DLKit @ 3.4.7
ComputePackagePrebuildTargetDependencyGraph
Prepare packages
CreateBuildRequest
SendProjectDescription
CreateBuildOperation
ComputeTargetDependencyGraph
note: Building targets in dependency order
note: Target dependency graph (28 targets)
    Target 'injectiond' in project 'HotReloading'
        ➜ Explicit dependency on target 'HotReloadingGuts' in project 'HotReloading'
        ➜ Explicit dependency on target 'injectiondGuts' in project 'HotReloading'
        ➜ Explicit dependency on target 'SwiftRegex' in project 'SwiftRegex'
        ➜ Explicit dependency on target 'XprobeUI' in project 'XprobePlugin'
        ➜ Explicit dependency on target 'RemoteUI' in project 'RemotePlugin'
    Target 'RemoteUI' in project 'RemotePlugin'
        ➜ Explicit dependency on target 'RemoteUI' in project 'RemotePlugin'
        ➜ Explicit dependency on target 'RemoteCapture' in project 'RemotePlugin'
        ➜ Explicit dependency on target 'RemoteMovie' in project 'RemotePlugin'
    Target 'RemoteUI' in project 'RemotePlugin'
        ➜ Explicit dependency on target 'RemoteCapture' in project 'RemotePlugin'
        ➜ Explicit dependency on target 'RemoteMovie' in project 'RemotePlugin'
    Target 'RemoteMovie' in project 'RemotePlugin' (no dependencies)
    Target 'RemoteCapture' in project 'RemotePlugin' (no dependencies)
    Target 'XprobeUI' in project 'XprobePlugin'
        ➜ Explicit dependency on target 'XprobeUI' in project 'XprobePlugin'
    Target 'XprobeUI' in project 'XprobePlugin' (no dependencies)
    Target 'injectiondGuts' in project 'HotReloading'
        ➜ Explicit dependency on target 'injectiondGuts' in project 'HotReloading'
    Target 'injectiondGuts' in project 'HotReloading' (no dependencies)
    Target 'HotReloadingGuts' in project 'HotReloading'
        ➜ Explicit dependency on target 'HotReloadingGuts' in project 'HotReloading'
    Target 'HotReloading' in project 'HotReloading'
        ➜ Explicit dependency on target 'HotReloading' in project 'HotReloading'
        ➜ Explicit dependency on target 'HotReloadingGuts' in project 'HotReloading'
        ➜ Explicit dependency on target 'SwiftTraceD' in project 'SwiftTrace'
        ➜ Explicit dependency on target 'Xprobe' in project 'XprobePlugin'
        ➜ Explicit dependency on target 'SwiftRegex' in project 'SwiftRegex'
        ➜ Explicit dependency on target 'ProfileSwiftUI' in project 'ProfileSwiftUI'
    Target 'HotReloading' in project 'HotReloading'
        ➜ Explicit dependency on target 'HotReloadingGuts' in project 'HotReloading'
        ➜ Explicit dependency on target 'SwiftTraceD' in project 'SwiftTrace'
        ➜ Explicit dependency on target 'Xprobe' in project 'XprobePlugin'
        ➜ Explicit dependency on target 'SwiftRegex' in project 'SwiftRegex'
        ➜ Explicit dependency on target 'ProfileSwiftUI' in project 'ProfileSwiftUI'
    Target 'ProfileSwiftUI' in project 'ProfileSwiftUI'
        ➜ Explicit dependency on target 'ProfileSwiftUI' in project 'ProfileSwiftUI'
        ➜ Explicit dependency on target 'SwiftTraceD' in project 'SwiftTrace'
        ➜ Explicit dependency on target 'DLKitCD' in project 'DLKit'
        ➜ Explicit dependency on target 'SwiftRegex' in project 'SwiftRegex'
    Target 'ProfileSwiftUI' in project 'ProfileSwiftUI'
        ➜ Explicit dependency on target 'SwiftTraceD' in project 'SwiftTrace'
        ➜ Explicit dependency on target 'DLKitCD' in project 'DLKit'
        ➜ Explicit dependency on target 'SwiftRegex' in project 'SwiftRegex'
    Target 'DLKitCD' in project 'DLKit'
        ➜ Explicit dependency on target 'DLKitCD' in project 'DLKit'
        ➜ Explicit dependency on target 'fishhookD' in project 'fishhook'
    Target 'DLKitCD' in project 'DLKit'
        ➜ Explicit dependency on target 'fishhookD' in project 'fishhook'
    Target 'fishhookD' in project 'fishhook'
        ➜ Explicit dependency on target 'fishhookD' in project 'fishhook'
    Target 'fishhookD' in project 'fishhook' (no dependencies)
    Target 'SwiftRegex' in project 'SwiftRegex'
        ➜ Explicit dependency on target 'SwiftRegex' in project 'SwiftRegex'
    Target 'SwiftRegex' in project 'SwiftRegex' (no dependencies)
    Target 'Xprobe' in project 'XprobePlugin'
        ➜ Explicit dependency on target 'Xprobe' in project 'XprobePlugin'
        ➜ Explicit dependency on target 'XprobeSweep' in project 'XprobePlugin'
        ➜ Explicit dependency on target 'SwiftTraceD' in project 'SwiftTrace'
        ➜ Explicit dependency on target 'XprobeSwift' in project 'XprobePlugin'
    Target 'Xprobe' in project 'XprobePlugin'
        ➜ Explicit dependency on target 'XprobeSweep' in project 'XprobePlugin'
        ➜ Explicit dependency on target 'SwiftTraceD' in project 'SwiftTrace'
        ➜ Explicit dependency on target 'XprobeSwift' in project 'XprobePlugin'
    Target 'XprobeSwift' in project 'XprobePlugin'
        ➜ Explicit dependency on target 'XprobeSweep' in project 'XprobePlugin'
        ➜ Explicit dependency on target 'SwiftTraceD' in project 'SwiftTrace'
    Target 'XprobeSweep' in project 'XprobePlugin' (no dependencies)
    Target 'SwiftTraceD' in project 'SwiftTrace'
        ➜ Explicit dependency on target 'SwiftTraceD' in project 'SwiftTrace'
        ➜ Explicit dependency on target 'SwiftTraceGutsD' in project 'SwiftTrace'
    Target 'SwiftTraceD' in project 'SwiftTrace'
        ➜ Explicit dependency on target 'SwiftTraceGutsD' in project 'SwiftTrace'
    Target 'SwiftTraceGutsD' in project 'SwiftTrace' (no dependencies)
    Target 'HotReloadingGuts' in project 'HotReloading' (no dependencies)
GatherProvisioningInputs
CreateBuildDescription
ExecuteExternalTool /Applications/Xcode-16.3.0.app/Contents/Developer/Toolchains/XcodeDefault.xctoolchain/usr/bin/clang -v -E -dM -arch arm64 -isysroot /Applications/Xcode-16.3.0.app/Contents/Developer/Platforms/WatchOS.platform/Developer/SDKs/WatchOS11.4.sdk -x objective-c++ -c /dev/null
ExecuteExternalTool /Applications/Xcode-16.3.0.app/Contents/Developer/Toolchains/XcodeDefault.xctoolchain/usr/bin/swiftc --version
ExecuteExternalTool /Applications/Xcode-16.3.0.app/Contents/Developer/Toolchains/XcodeDefault.xctoolchain/usr/bin/clang -v -E -dM -arch arm64 -isysroot /Applications/Xcode-16.3.0.app/Contents/Developer/Platforms/WatchOS.platform/Developer/SDKs/WatchOS11.4.sdk -x objective-c -c /dev/null
ExecuteExternalTool /Applications/Xcode-16.3.0.app/Contents/Developer/Toolchains/XcodeDefault.xctoolchain/usr/bin/ld -version_details
ExecuteExternalTool /Applications/Xcode-16.3.0.app/Contents/Developer/Toolchains/XcodeDefault.xctoolchain/usr/bin/clang -v -E -dM -arch arm64 -isysroot /Applications/Xcode-16.3.0.app/Contents/Developer/Platforms/WatchOS.platform/Developer/SDKs/WatchOS11.4.sdk -x c -c /dev/null
ExecuteExternalTool /Applications/Xcode-16.3.0.app/Contents/Developer/Toolchains/XcodeDefault.xctoolchain/usr/bin/clang -v -E -dM -isysroot /Applications/Xcode-16.3.0.app/Contents/Developer/Platforms/WatchOS.platform/Developer/SDKs/WatchOS11.4.sdk -x c -c /dev/null
ExecuteExternalTool /Applications/Xcode-16.3.0.app/Contents/Developer/Toolchains/XcodeDefault.xctoolchain/usr/bin/clang -v -E -dM -arch armv7k -isysroot /Applications/Xcode-16.3.0.app/Contents/Developer/Platforms/WatchOS.platform/Developer/SDKs/WatchOS11.4.sdk -x objective-c++ -c /dev/null
ExecuteExternalTool /Applications/Xcode-16.3.0.app/Contents/Developer/Toolchains/XcodeDefault.xctoolchain/usr/bin/clang -v -E -dM -arch arm64 -isysroot /Applications/Xcode-16.3.0.app/Contents/Developer/Platforms/WatchOS.platform/Developer/SDKs/WatchOS11.4.sdk -x assembler-with-cpp -c /dev/null
ExecuteExternalTool /Applications/Xcode-16.3.0.app/Contents/Developer/Toolchains/XcodeDefault.xctoolchain/usr/bin/clang -v -E -dM -arch armv7k -isysroot /Applications/Xcode-16.3.0.app/Contents/Developer/Platforms/WatchOS.platform/Developer/SDKs/WatchOS11.4.sdk -x objective-c -c /dev/null
ExecuteExternalTool /Applications/Xcode-16.3.0.app/Contents/Developer/Toolchains/XcodeDefault.xctoolchain/usr/bin/clang -v -E -dM -arch armv7k -isysroot /Applications/Xcode-16.3.0.app/Contents/Developer/Platforms/WatchOS.platform/Developer/SDKs/WatchOS11.4.sdk -x c -c /dev/null
ExecuteExternalTool /Applications/Xcode-16.3.0.app/Contents/Developer/Toolchains/XcodeDefault.xctoolchain/usr/bin/clang -v -E -dM -arch arm64_32 -isysroot /Applications/Xcode-16.3.0.app/Contents/Developer/Platforms/WatchOS.platform/Developer/SDKs/WatchOS11.4.sdk -x objective-c++ -c /dev/null
ExecuteExternalTool /Applications/Xcode-16.3.0.app/Contents/Developer/Toolchains/XcodeDefault.xctoolchain/usr/bin/clang -v -E -dM -arch arm64_32 -isysroot /Applications/Xcode-16.3.0.app/Contents/Developer/Platforms/WatchOS.platform/Developer/SDKs/WatchOS11.4.sdk -x c -c /dev/null
ExecuteExternalTool /Applications/Xcode-16.3.0.app/Contents/Developer/Toolchains/XcodeDefault.xctoolchain/usr/bin/clang -v -E -dM -arch arm64_32 -isysroot /Applications/Xcode-16.3.0.app/Contents/Developer/Platforms/WatchOS.platform/Developer/SDKs/WatchOS11.4.sdk -x objective-c -c /dev/null
ExecuteExternalTool /Applications/Xcode-16.3.0.app/Contents/Developer/Toolchains/XcodeDefault.xctoolchain/usr/bin/clang -v -E -dM -arch armv7k -isysroot /Applications/Xcode-16.3.0.app/Contents/Developer/Platforms/WatchOS.platform/Developer/SDKs/WatchOS11.4.sdk -x assembler-with-cpp -c /dev/null
ExecuteExternalTool /Applications/Xcode-16.3.0.app/Contents/Developer/Toolchains/XcodeDefault.xctoolchain/usr/bin/clang -v -E -dM -arch arm64_32 -isysroot /Applications/Xcode-16.3.0.app/Contents/Developer/Platforms/WatchOS.platform/Developer/SDKs/WatchOS11.4.sdk -x assembler-with-cpp -c /dev/null
Build description signature: d02ccdb48eb95c34df68eaa2a0671d6a
Build description path: /Users/admin/builder/spi-builder-workspace/.derivedData/Build/Intermediates.noindex/XCBuildData/d02ccdb48eb95c34df68eaa2a0671d6a.xcbuilddata
ClangStatCache /Applications/Xcode-16.3.0.app/Contents/Developer/Toolchains/XcodeDefault.xctoolchain/usr/bin/clang-stat-cache /Applications/Xcode-16.3.0.app/Contents/Developer/Platforms/WatchOS.platform/Developer/SDKs/WatchOS11.4.sdk /Users/admin/builder/spi-builder-workspace/.derivedData/SDKStatCaches.noindex/watchos11.4-22T246-43efb940ff07ba2497b70ec94253f576.sdkstatcache
    cd /Users/admin/builder/spi-builder-workspace/.swiftpm/xcode
    /Applications/Xcode-16.3.0.app/Contents/Developer/Toolchains/XcodeDefault.xctoolchain/usr/bin/clang-stat-cache /Applications/Xcode-16.3.0.app/Contents/Developer/Platforms/WatchOS.platform/Developer/SDKs/WatchOS11.4.sdk -o /Users/admin/builder/spi-builder-workspace/.derivedData/SDKStatCaches.noindex/watchos11.4-22T246-43efb940ff07ba2497b70ec94253f576.sdkstatcache
ScanDependencies /Users/admin/builder/spi-builder-workspace/.derivedData/Build/Intermediates.noindex/XprobePlugin.build/Debug-watchos/XprobeUI.build/Objects-normal/armv7k/XprobePluginMenuController.o /Users/admin/builder/spi-builder-workspace/.dependencies/checkouts/XprobePlugin/Sources/XprobeUI/XprobePluginMenuController.m normal armv7k objective-c com.apple.compilers.llvm.clang.1_0.compiler (in target 'XprobeUI' from project 'XprobePlugin')
    cd /Users/admin/builder/spi-builder-workspace/.swiftpm/xcode

    Using response file: /Users/admin/builder/spi-builder-workspace/.derivedData/Build/Intermediates.noindex/XprobePlugin.build/Debug-watchos/XprobeUI.build/Objects-normal/armv7k/e6072d4f65d7061329687fe24e3d63a7-common-args.resp

    builtin-ScanDependencies -o /Users/admin/builder/spi-builder-workspace/.derivedData/Build/Intermediates.noindex/XprobePlugin.build/Debug-watchos/XprobeUI.build/Objects-normal/armv7k/XprobePluginMenuController.o.scan -- /Applications/Xcode-16.3.0.app/Contents/Developer/Toolchains/XcodeDefault.xctoolchain/usr/bin/clang -x objective-c -ivfsstatcache /Users/admin/builder/spi-builder-workspace/.derivedData/SDKStatCaches.noindex/watchos11.4-22T246-43efb940ff07ba2497b70ec94253f576.sdkstatcache -fmessage-length\=0 -fdiagnostics-show-note-include-stack -fmacro-backtrace-limit\=0 -fno-color-diagnostics -fmodules-prune-interval\=86400 -fmodules-prune-after\=345600 -fbuild-session-file\=/Users/admin/builder/spi-builder-workspace/.derivedData/ModuleCache.noindex/Session.modulevalidation -fmodules-validate-once-per-build-session -Wnon-modular-include-in-framework-module -Werror\=non-modular-include-in-framework-module -Wno-trigraphs -Wno-missing-field-initializers -Wno-missing-prototypes -Wno-return-type -Wno-implicit-atomic-properties -Wno-objc-interface-ivars -Wno-arc-repeated-use-of-weak -Wno-missing-braces -Wparentheses -Wswitch -Wno-unused-function -Wno-unused-label -Wno-unused-parameter -Wno-unused-variable -Wunused-value -Wno-empty-body -Wno-uninitialized -Wno-unknown-pragmas -w -Wno-shadow -Wno-four-char-constants -Wno-conversion -Wno-constant-conversion -Wno-int-conversion -Wno-bool-conversion -Wno-enum-conversion -Wno-float-conversion -Wno-non-literal-null-conversion -Wno-objc-literal-conversion -Wno-shorten-64-to-32 -Wpointer-sign -Wno-newline-eof -Wno-selector -Wno-strict-selector-match -Wno-undeclared-selector -Wno-deprecated-implementations -Wno-implicit-fallthrough -fstrict-aliasing -Wprotocol -Wdeprecated-declarations -Wno-sign-conversion -Wno-infinite-recursion -Wno-comma -Wno-block-capture-autoreleasing -Wno-strict-prototypes -Wno-semicolon-before-method-body -index-store-path /Users/admin/builder/spi-builder-workspace/.derivedData/Index.noindex/DataStore @/Users/admin/builder/spi-builder-workspace/.derivedData/Build/Intermediates.noindex/XprobePlugin.build/Debug-watchos/XprobeUI.build/Objects-normal/armv7k/e6072d4f65d7061329687fe24e3d63a7-common-args.resp -MMD -MT dependencies -MF /Users/admin/builder/spi-builder-workspace/.derivedData/Build/Intermediates.noindex/XprobePlugin.build/Debug-watchos/XprobeUI.build/Objects-normal/armv7k/XprobePluginMenuController.d --serialize-diagnostics /Users/admin/builder/spi-builder-workspace/.derivedData/Build/Intermediates.noindex/XprobePlugin.build/Debug-watchos/XprobeUI.build/Objects-normal/armv7k/XprobePluginMenuController.dia -c /Users/admin/builder/spi-builder-workspace/.dependencies/checkouts/XprobePlugin/Sources/XprobeUI/XprobePluginMenuController.m -o /Users/admin/builder/spi-builder-workspace/.derivedData/Build/Intermediates.noindex/XprobePlugin.build/Debug-watchos/XprobeUI.build/Objects-normal/armv7k/XprobePluginMenuController.o -index-unit-output-path /XprobePlugin.build/Debug-watchos/XprobeUI.build/Objects-normal/armv7k/XprobePluginMenuController.o
/Users/admin/builder/spi-builder-workspace/.dependencies/checkouts/XprobePlugin/Sources/XprobeUI/include/XprobePluginMenuController.h:11:9: error: 'Cocoa/Cocoa.h' file not found (in target 'XprobeUI' from project 'XprobePlugin')
    /Users/admin/builder/spi-builder-workspace/.dependencies/checkouts/XprobePlugin/Sources/XprobeUI/XprobePluginMenuController.m:11:9: note: in file included from /Users/admin/builder/spi-builder-workspace/.dependencies/checkouts/XprobePlugin/Sources/XprobeUI/XprobePluginMenuController.m:11:
ScanDependencies /Users/admin/builder/spi-builder-workspace/.derivedData/Build/Intermediates.noindex/XprobePlugin.build/Debug-watchos/XprobeUI.build/Objects-normal/armv7k/XprobeConsole.o /Users/admin/builder/spi-builder-workspace/.dependencies/checkouts/XprobePlugin/Sources/XprobeUI/XprobeConsole.m normal armv7k objective-c com.apple.compilers.llvm.clang.1_0.compiler (in target 'XprobeUI' from project 'XprobePlugin')
    cd /Users/admin/builder/spi-builder-workspace/.swiftpm/xcode

    Using response file: /Users/admin/builder/spi-builder-workspace/.derivedData/Build/Intermediates.noindex/XprobePlugin.build/Debug-watchos/XprobeUI.build/Objects-normal/armv7k/e6072d4f65d7061329687fe24e3d63a7-common-args.resp

    builtin-ScanDependencies -o /Users/admin/builder/spi-builder-workspace/.derivedData/Build/Intermediates.noindex/XprobePlugin.build/Debug-watchos/XprobeUI.build/Objects-normal/armv7k/XprobeConsole.o.scan -- /Applications/Xcode-16.3.0.app/Contents/Developer/Toolchains/XcodeDefault.xctoolchain/usr/bin/clang -x objective-c -ivfsstatcache /Users/admin/builder/spi-builder-workspace/.derivedData/SDKStatCaches.noindex/watchos11.4-22T246-43efb940ff07ba2497b70ec94253f576.sdkstatcache -fmessage-length\=0 -fdiagnostics-show-note-include-stack -fmacro-backtrace-limit\=0 -fno-color-diagnostics -fmodules-prune-interval\=86400 -fmodules-prune-after\=345600 -fbuild-session-file\=/Users/admin/builder/spi-builder-workspace/.derivedData/ModuleCache.noindex/Session.modulevalidation -fmodules-validate-once-per-build-session -Wnon-modular-include-in-framework-module -Werror\=non-modular-include-in-framework-module -Wno-trigraphs -Wno-missing-field-initializers -Wno-missing-prototypes -Wno-return-type -Wno-implicit-atomic-properties -Wno-objc-interface-ivars -Wno-arc-repeated-use-of-weak -Wno-missing-braces -Wparentheses -Wswitch -Wno-unused-function -Wno-unused-label -Wno-unused-parameter -Wno-unused-variable -Wunused-value -Wno-empty-body -Wno-uninitialized -Wno-unknown-pragmas -w -Wno-shadow -Wno-four-char-constants -Wno-conversion -Wno-constant-conversion -Wno-int-conversion -Wno-bool-conversion -Wno-enum-conversion -Wno-float-conversion -Wno-non-literal-null-conversion -Wno-objc-literal-conversion -Wno-shorten-64-to-32 -Wpointer-sign -Wno-newline-eof -Wno-selector -Wno-strict-selector-match -Wno-undeclared-selector -Wno-deprecated-implementations -Wno-implicit-fallthrough -fstrict-aliasing -Wprotocol -Wdeprecated-declarations -Wno-sign-conversion -Wno-infinite-recursion -Wno-comma -Wno-block-capture-autoreleasing -Wno-strict-prototypes -Wno-semicolon-before-method-body -index-store-path /Users/admin/builder/spi-builder-workspace/.derivedData/Index.noindex/DataStore @/Users/admin/builder/spi-builder-workspace/.derivedData/Build/Intermediates.noindex/XprobePlugin.build/Debug-watchos/XprobeUI.build/Objects-normal/armv7k/e6072d4f65d7061329687fe24e3d63a7-common-args.resp -MMD -MT dependencies -MF /Users/admin/builder/spi-builder-workspace/.derivedData/Build/Intermediates.noindex/XprobePlugin.build/Debug-watchos/XprobeUI.build/Objects-normal/armv7k/XprobeConsole.d --serialize-diagnostics /Users/admin/builder/spi-builder-workspace/.derivedData/Build/Intermediates.noindex/XprobePlugin.build/Debug-watchos/XprobeUI.build/Objects-normal/armv7k/XprobeConsole.dia -c /Users/admin/builder/spi-builder-workspace/.dependencies/checkouts/XprobePlugin/Sources/XprobeUI/XprobeConsole.m -o /Users/admin/builder/spi-builder-workspace/.derivedData/Build/Intermediates.noindex/XprobePlugin.build/Debug-watchos/XprobeUI.build/Objects-normal/armv7k/XprobeConsole.o -index-unit-output-path /XprobePlugin.build/Debug-watchos/XprobeUI.build/Objects-normal/armv7k/XprobeConsole.o
/Users/admin/builder/spi-builder-workspace/.dependencies/checkouts/XprobePlugin/Sources/XprobeUI/include/XprobePluginMenuController.h:11:9: error: 'Cocoa/Cocoa.h' file not found (in target 'XprobeUI' from project 'XprobePlugin')
    /Users/admin/builder/spi-builder-workspace/.dependencies/checkouts/XprobePlugin/Sources/XprobeUI/XprobeConsole.m:11:9: note: in file included from /Users/admin/builder/spi-builder-workspace/.dependencies/checkouts/XprobePlugin/Sources/XprobeUI/XprobeConsole.m:11:
ScanDependencies /Users/admin/builder/spi-builder-workspace/.derivedData/Build/Intermediates.noindex/XprobePlugin.build/Debug-watchos/XprobeUI.build/Objects-normal/arm64_32/XprobePluginMenuController.o /Users/admin/builder/spi-builder-workspace/.dependencies/checkouts/XprobePlugin/Sources/XprobeUI/XprobePluginMenuController.m normal arm64_32 objective-c com.apple.compilers.llvm.clang.1_0.compiler (in target 'XprobeUI' from project 'XprobePlugin')
    cd /Users/admin/builder/spi-builder-workspace/.swiftpm/xcode

    Using response file: /Users/admin/builder/spi-builder-workspace/.derivedData/Build/Intermediates.noindex/XprobePlugin.build/Debug-watchos/XprobeUI.build/Objects-normal/arm64_32/e6072d4f65d7061329687fe24e3d63a7-common-args.resp

    builtin-ScanDependencies -o /Users/admin/builder/spi-builder-workspace/.derivedData/Build/Intermediates.noindex/XprobePlugin.build/Debug-watchos/XprobeUI.build/Objects-normal/arm64_32/XprobePluginMenuController.o.scan -- /Applications/Xcode-16.3.0.app/Contents/Developer/Toolchains/XcodeDefault.xctoolchain/usr/bin/clang -x objective-c -ivfsstatcache /Users/admin/builder/spi-builder-workspace/.derivedData/SDKStatCaches.noindex/watchos11.4-22T246-43efb940ff07ba2497b70ec94253f576.sdkstatcache -fmessage-length\=0 -fdiagnostics-show-note-include-stack -fmacro-backtrace-limit\=0 -fno-color-diagnostics -fmodules-prune-interval\=86400 -fmodules-prune-after\=345600 -fbuild-session-file\=/Users/admin/builder/spi-builder-workspace/.derivedData/ModuleCache.noindex/Session.modulevalidation -fmodules-validate-once-per-build-session -Wnon-modular-include-in-framework-module -Werror\=non-modular-include-in-framework-module -Wno-trigraphs -Wno-missing-field-initializers -Wno-missing-prototypes -Wno-return-type -Wno-implicit-atomic-properties -Wno-objc-interface-ivars -Wno-arc-repeated-use-of-weak -Wno-missing-braces -Wparentheses -Wswitch -Wno-unused-function -Wno-unused-label -Wno-unused-parameter -Wno-unused-variable -Wunused-value -Wno-empty-body -Wno-uninitialized -Wno-unknown-pragmas -w -Wno-shadow -Wno-four-char-constants -Wno-conversion -Wno-constant-conversion -Wno-int-conversion -Wno-bool-conversion -Wno-enum-conversion -Wno-float-conversion -Wno-non-literal-null-conversion -Wno-objc-literal-conversion -Wno-shorten-64-to-32 -Wpointer-sign -Wno-newline-eof -Wno-selector -Wno-strict-selector-match -Wno-undeclared-selector -Wno-deprecated-implementations -Wno-implicit-fallthrough -fstrict-aliasing -Wprotocol -Wdeprecated-declarations -Wno-sign-conversion -Wno-infinite-recursion -Wno-comma -Wno-block-capture-autoreleasing -Wno-strict-prototypes -Wno-semicolon-before-method-body -index-store-path /Users/admin/builder/spi-builder-workspace/.derivedData/Index.noindex/DataStore @/Users/admin/builder/spi-builder-workspace/.derivedData/Build/Intermediates.noindex/XprobePlugin.build/Debug-watchos/XprobeUI.build/Objects-normal/arm64_32/e6072d4f65d7061329687fe24e3d63a7-common-args.resp -MMD -MT dependencies -MF /Users/admin/builder/spi-builder-workspace/.derivedData/Build/Intermediates.noindex/XprobePlugin.build/Debug-watchos/XprobeUI.build/Objects-normal/arm64_32/XprobePluginMenuController.d --serialize-diagnostics /Users/admin/builder/spi-builder-workspace/.derivedData/Build/Intermediates.noindex/XprobePlugin.build/Debug-watchos/XprobeUI.build/Objects-normal/arm64_32/XprobePluginMenuController.dia -c /Users/admin/builder/spi-builder-workspace/.dependencies/checkouts/XprobePlugin/Sources/XprobeUI/XprobePluginMenuController.m -o /Users/admin/builder/spi-builder-workspace/.derivedData/Build/Intermediates.noindex/XprobePlugin.build/Debug-watchos/XprobeUI.build/Objects-normal/arm64_32/XprobePluginMenuController.o -index-unit-output-path /XprobePlugin.build/Debug-watchos/XprobeUI.build/Objects-normal/arm64_32/XprobePluginMenuController.o
/Users/admin/builder/spi-builder-workspace/.dependencies/checkouts/XprobePlugin/Sources/XprobeUI/include/XprobePluginMenuController.h:11:9: error: 'Cocoa/Cocoa.h' file not found (in target 'XprobeUI' from project 'XprobePlugin')
    /Users/admin/builder/spi-builder-workspace/.dependencies/checkouts/XprobePlugin/Sources/XprobeUI/XprobePluginMenuController.m:11:9: note: in file included from /Users/admin/builder/spi-builder-workspace/.dependencies/checkouts/XprobePlugin/Sources/XprobeUI/XprobePluginMenuController.m:11:
ScanDependencies /Users/admin/builder/spi-builder-workspace/.derivedData/Build/Intermediates.noindex/XprobePlugin.build/Debug-watchos/XprobeUI.build/Objects-normal/arm64_32/XprobeConsole.o /Users/admin/builder/spi-builder-workspace/.dependencies/checkouts/XprobePlugin/Sources/XprobeUI/XprobeConsole.m normal arm64_32 objective-c com.apple.compilers.llvm.clang.1_0.compiler (in target 'XprobeUI' from project 'XprobePlugin')
    cd /Users/admin/builder/spi-builder-workspace/.swiftpm/xcode

    Using response file: /Users/admin/builder/spi-builder-workspace/.derivedData/Build/Intermediates.noindex/XprobePlugin.build/Debug-watchos/XprobeUI.build/Objects-normal/arm64_32/e6072d4f65d7061329687fe24e3d63a7-common-args.resp

    builtin-ScanDependencies -o /Users/admin/builder/spi-builder-workspace/.derivedData/Build/Intermediates.noindex/XprobePlugin.build/Debug-watchos/XprobeUI.build/Objects-normal/arm64_32/XprobeConsole.o.scan -- /Applications/Xcode-16.3.0.app/Contents/Developer/Toolchains/XcodeDefault.xctoolchain/usr/bin/clang -x objective-c -ivfsstatcache /Users/admin/builder/spi-builder-workspace/.derivedData/SDKStatCaches.noindex/watchos11.4-22T246-43efb940ff07ba2497b70ec94253f576.sdkstatcache -fmessage-length\=0 -fdiagnostics-show-note-include-stack -fmacro-backtrace-limit\=0 -fno-color-diagnostics -fmodules-prune-interval\=86400 -fmodules-prune-after\=345600 -fbuild-session-file\=/Users/admin/builder/spi-builder-workspace/.derivedData/ModuleCache.noindex/Session.modulevalidation -fmodules-validate-once-per-build-session -Wnon-modular-include-in-framework-module -Werror\=non-modular-include-in-framework-module -Wno-trigraphs -Wno-missing-field-initializers -Wno-missing-prototypes -Wno-return-type -Wno-implicit-atomic-properties -Wno-objc-interface-ivars -Wno-arc-repeated-use-of-weak -Wno-missing-braces -Wparentheses -Wswitch -Wno-unused-function -Wno-unused-label -Wno-unused-parameter -Wno-unused-variable -Wunused-value -Wno-empty-body -Wno-uninitialized -Wno-unknown-pragmas -w -Wno-shadow -Wno-four-char-constants -Wno-conversion -Wno-constant-conversion -Wno-int-conversion -Wno-bool-conversion -Wno-enum-conversion -Wno-float-conversion -Wno-non-literal-null-conversion -Wno-objc-literal-conversion -Wno-shorten-64-to-32 -Wpointer-sign -Wno-newline-eof -Wno-selector -Wno-strict-selector-match -Wno-undeclared-selector -Wno-deprecated-implementations -Wno-implicit-fallthrough -fstrict-aliasing -Wprotocol -Wdeprecated-declarations -Wno-sign-conversion -Wno-infinite-recursion -Wno-comma -Wno-block-capture-autoreleasing -Wno-strict-prototypes -Wno-semicolon-before-method-body -index-store-path /Users/admin/builder/spi-builder-workspace/.derivedData/Index.noindex/DataStore @/Users/admin/builder/spi-builder-workspace/.derivedData/Build/Intermediates.noindex/XprobePlugin.build/Debug-watchos/XprobeUI.build/Objects-normal/arm64_32/e6072d4f65d7061329687fe24e3d63a7-common-args.resp -MMD -MT dependencies -MF /Users/admin/builder/spi-builder-workspace/.derivedData/Build/Intermediates.noindex/XprobePlugin.build/Debug-watchos/XprobeUI.build/Objects-normal/arm64_32/XprobeConsole.d --serialize-diagnostics /Users/admin/builder/spi-builder-workspace/.derivedData/Build/Intermediates.noindex/XprobePlugin.build/Debug-watchos/XprobeUI.build/Objects-normal/arm64_32/XprobeConsole.dia -c /Users/admin/builder/spi-builder-workspace/.dependencies/checkouts/XprobePlugin/Sources/XprobeUI/XprobeConsole.m -o /Users/admin/builder/spi-builder-workspace/.derivedData/Build/Intermediates.noindex/XprobePlugin.build/Debug-watchos/XprobeUI.build/Objects-normal/arm64_32/XprobeConsole.o -index-unit-output-path /XprobePlugin.build/Debug-watchos/XprobeUI.build/Objects-normal/arm64_32/XprobeConsole.o
/Users/admin/builder/spi-builder-workspace/.dependencies/checkouts/XprobePlugin/Sources/XprobeUI/include/XprobePluginMenuController.h:11:9: error: 'Cocoa/Cocoa.h' file not found (in target 'XprobeUI' from project 'XprobePlugin')
    /Users/admin/builder/spi-builder-workspace/.dependencies/checkouts/XprobePlugin/Sources/XprobeUI/XprobeConsole.m:11:9: note: in file included from /Users/admin/builder/spi-builder-workspace/.dependencies/checkouts/XprobePlugin/Sources/XprobeUI/XprobeConsole.m:11:
ScanDependencies /Users/admin/builder/spi-builder-workspace/.derivedData/Build/Intermediates.noindex/XprobePlugin.build/Debug-watchos/XprobeUI.build/Objects-normal/arm64/XprobePluginMenuController.o /Users/admin/builder/spi-builder-workspace/.dependencies/checkouts/XprobePlugin/Sources/XprobeUI/XprobePluginMenuController.m normal arm64 objective-c com.apple.compilers.llvm.clang.1_0.compiler (in target 'XprobeUI' from project 'XprobePlugin')
    cd /Users/admin/builder/spi-builder-workspace/.swiftpm/xcode

    Using response file: /Users/admin/builder/spi-builder-workspace/.derivedData/Build/Intermediates.noindex/XprobePlugin.build/Debug-watchos/XprobeUI.build/Objects-normal/arm64/e6072d4f65d7061329687fe24e3d63a7-common-args.resp

    builtin-ScanDependencies -o /Users/admin/builder/spi-builder-workspace/.derivedData/Build/Intermediates.noindex/XprobePlugin.build/Debug-watchos/XprobeUI.build/Objects-normal/arm64/XprobePluginMenuController.o.scan -- /Applications/Xcode-16.3.0.app/Contents/Developer/Toolchains/XcodeDefault.xctoolchain/usr/bin/clang -x objective-c -ivfsstatcache /Users/admin/builder/spi-builder-workspace/.derivedData/SDKStatCaches.noindex/watchos11.4-22T246-43efb940ff07ba2497b70ec94253f576.sdkstatcache -fmessage-length\=0 -fdiagnostics-show-note-include-stack -fmacro-backtrace-limit\=0 -fno-color-diagnostics -fmodules-prune-interval\=86400 -fmodules-prune-after\=345600 -fbuild-session-file\=/Users/admin/builder/spi-builder-workspace/.derivedData/ModuleCache.noindex/Session.modulevalidation -fmodules-validate-once-per-build-session -Wnon-modular-include-in-framework-module -Werror\=non-modular-include-in-framework-module -Wno-trigraphs -Wno-missing-field-initializers -Wno-missing-prototypes -Wno-return-type -Wno-implicit-atomic-properties -Wno-objc-interface-ivars -Wno-arc-repeated-use-of-weak -Wno-missing-braces -Wparentheses -Wswitch -Wno-unused-function -Wno-unused-label -Wno-unused-parameter -Wno-unused-variable -Wunused-value -Wno-empty-body -Wno-uninitialized -Wno-unknown-pragmas -w -Wno-shadow -Wno-four-char-constants -Wno-conversion -Wno-constant-conversion -Wno-int-conversion -Wno-bool-conversion -Wno-enum-conversion -Wno-float-conversion -Wno-non-literal-null-conversion -Wno-objc-literal-conversion -Wshorten-64-to-32 -Wpointer-sign -Wno-newline-eof -Wno-selector -Wno-strict-selector-match -Wno-undeclared-selector -Wno-deprecated-implementations -Wno-implicit-fallthrough -fstrict-aliasing -Wprotocol -Wdeprecated-declarations -Wno-sign-conversion -Wno-infinite-recursion -Wno-comma -Wno-block-capture-autoreleasing -Wno-strict-prototypes -Wno-semicolon-before-method-body -index-store-path /Users/admin/builder/spi-builder-workspace/.derivedData/Index.noindex/DataStore @/Users/admin/builder/spi-builder-workspace/.derivedData/Build/Intermediates.noindex/XprobePlugin.build/Debug-watchos/XprobeUI.build/Objects-normal/arm64/e6072d4f65d7061329687fe24e3d63a7-common-args.resp -MMD -MT dependencies -MF /Users/admin/builder/spi-builder-workspace/.derivedData/Build/Intermediates.noindex/XprobePlugin.build/Debug-watchos/XprobeUI.build/Objects-normal/arm64/XprobePluginMenuController.d --serialize-diagnostics /Users/admin/builder/spi-builder-workspace/.derivedData/Build/Intermediates.noindex/XprobePlugin.build/Debug-watchos/XprobeUI.build/Objects-normal/arm64/XprobePluginMenuController.dia -c /Users/admin/builder/spi-builder-workspace/.dependencies/checkouts/XprobePlugin/Sources/XprobeUI/XprobePluginMenuController.m -o /Users/admin/builder/spi-builder-workspace/.derivedData/Build/Intermediates.noindex/XprobePlugin.build/Debug-watchos/XprobeUI.build/Objects-normal/arm64/XprobePluginMenuController.o -index-unit-output-path /XprobePlugin.build/Debug-watchos/XprobeUI.build/Objects-normal/arm64/XprobePluginMenuController.o
/Users/admin/builder/spi-builder-workspace/.dependencies/checkouts/XprobePlugin/Sources/XprobeUI/include/XprobePluginMenuController.h:11:9: error: 'Cocoa/Cocoa.h' file not found (in target 'XprobeUI' from project 'XprobePlugin')
    /Users/admin/builder/spi-builder-workspace/.dependencies/checkouts/XprobePlugin/Sources/XprobeUI/XprobePluginMenuController.m:11:9: note: in file included from /Users/admin/builder/spi-builder-workspace/.dependencies/checkouts/XprobePlugin/Sources/XprobeUI/XprobePluginMenuController.m:11:
ScanDependencies /Users/admin/builder/spi-builder-workspace/.derivedData/Build/Intermediates.noindex/XprobePlugin.build/Debug-watchos/XprobeSweep.build/Objects-normal/armv7k/XprobeSweep.o /Users/admin/builder/spi-builder-workspace/.dependencies/checkouts/XprobePlugin/Sources/XprobeSweep/XprobeSweep.m normal armv7k objective-c com.apple.compilers.llvm.clang.1_0.compiler (in target 'XprobeSweep' from project 'XprobePlugin')
    cd /Users/admin/builder/spi-builder-workspace/.swiftpm/xcode

    Using response file: /Users/admin/builder/spi-builder-workspace/.derivedData/Build/Intermediates.noindex/XprobePlugin.build/Debug-watchos/XprobeSweep.build/Objects-normal/armv7k/e6072d4f65d7061329687fe24e3d63a7-common-args.resp

    builtin-ScanDependencies -o /Users/admin/builder/spi-builder-workspace/.derivedData/Build/Intermediates.noindex/XprobePlugin.build/Debug-watchos/XprobeSweep.build/Objects-normal/armv7k/XprobeSweep.o.scan -- /Applications/Xcode-16.3.0.app/Contents/Developer/Toolchains/XcodeDefault.xctoolchain/usr/bin/clang -x objective-c -ivfsstatcache /Users/admin/builder/spi-builder-workspace/.derivedData/SDKStatCaches.noindex/watchos11.4-22T246-43efb940ff07ba2497b70ec94253f576.sdkstatcache -fmessage-length\=0 -fdiagnostics-show-note-include-stack -fmacro-backtrace-limit\=0 -fno-color-diagnostics -fmodules-prune-interval\=86400 -fmodules-prune-after\=345600 -fbuild-session-file\=/Users/admin/builder/spi-builder-workspace/.derivedData/ModuleCache.noindex/Session.modulevalidation -fmodules-validate-once-per-build-session -Wnon-modular-include-in-framework-module -Werror\=non-modular-include-in-framework-module -Wno-trigraphs -Wno-missing-field-initializers -Wno-missing-prototypes -Wno-return-type -Wno-implicit-atomic-properties -Wno-objc-interface-ivars -Wno-arc-repeated-use-of-weak -Wno-missing-braces -Wparentheses -Wswitch -Wno-unused-function -Wno-unused-label -Wno-unused-parameter -Wno-unused-variable -Wunused-value -Wno-empty-body -Wno-uninitialized -Wno-unknown-pragmas -w -Wno-shadow -Wno-four-char-constants -Wno-conversion -Wno-constant-conversion -Wno-int-conversion -Wno-bool-conversion -Wno-enum-conversion -Wno-float-conversion -Wno-non-literal-null-conversion -Wno-objc-literal-conversion -Wno-shorten-64-to-32 -Wpointer-sign -Wno-newline-eof -Wno-selector -Wno-strict-selector-match -Wno-undeclared-selector -Wno-deprecated-implementations -Wno-implicit-fallthrough -fstrict-aliasing -Wprotocol -Wdeprecated-declarations -Wno-sign-conversion -Wno-infinite-recursion -Wno-comma -Wno-block-capture-autoreleasing -Wno-strict-prototypes -Wno-semicolon-before-method-body -index-store-path /Users/admin/builder/spi-builder-workspace/.derivedData/Index.noindex/DataStore @/Users/admin/builder/spi-builder-workspace/.derivedData/Build/Intermediates.noindex/XprobePlugin.build/Debug-watchos/XprobeSweep.build/Objects-normal/armv7k/e6072d4f65d7061329687fe24e3d63a7-common-args.resp -MMD -MT dependencies -MF /Users/admin/builder/spi-builder-workspace/.derivedData/Build/Intermediates.noindex/XprobePlugin.build/Debug-watchos/XprobeSweep.build/Objects-normal/armv7k/XprobeSweep.d --serialize-diagnostics /Users/admin/builder/spi-builder-workspace/.derivedData/Build/Intermediates.noindex/XprobePlugin.build/Debug-watchos/XprobeSweep.build/Objects-normal/armv7k/XprobeSweep.dia -c /Users/admin/builder/spi-builder-workspace/.dependencies/checkouts/XprobePlugin/Sources/XprobeSweep/XprobeSweep.m -o /Users/admin/builder/spi-builder-workspace/.derivedData/Build/Intermediates.noindex/XprobePlugin.build/Debug-watchos/XprobeSweep.build/Objects-normal/armv7k/XprobeSweep.o -index-unit-output-path /XprobePlugin.build/Debug-watchos/XprobeSweep.build/Objects-normal/armv7k/XprobeSweep.o
ScanDependencies /Users/admin/builder/spi-builder-workspace/.derivedData/Build/Intermediates.noindex/XprobePlugin.build/Debug-watchos/XprobeUI.build/Objects-normal/arm64/XprobeConsole.o /Users/admin/builder/spi-builder-workspace/.dependencies/checkouts/XprobePlugin/Sources/XprobeUI/XprobeConsole.m normal arm64 objective-c com.apple.compilers.llvm.clang.1_0.compiler (in target 'XprobeUI' from project 'XprobePlugin')
    cd /Users/admin/builder/spi-builder-workspace/.swiftpm/xcode

    Using response file: /Users/admin/builder/spi-builder-workspace/.derivedData/Build/Intermediates.noindex/XprobePlugin.build/Debug-watchos/XprobeUI.build/Objects-normal/arm64/e6072d4f65d7061329687fe24e3d63a7-common-args.resp

    builtin-ScanDependencies -o /Users/admin/builder/spi-builder-workspace/.derivedData/Build/Intermediates.noindex/XprobePlugin.build/Debug-watchos/XprobeUI.build/Objects-normal/arm64/XprobeConsole.o.scan -- /Applications/Xcode-16.3.0.app/Contents/Developer/Toolchains/XcodeDefault.xctoolchain/usr/bin/clang -x objective-c -ivfsstatcache /Users/admin/builder/spi-builder-workspace/.derivedData/SDKStatCaches.noindex/watchos11.4-22T246-43efb940ff07ba2497b70ec94253f576.sdkstatcache -fmessage-length\=0 -fdiagnostics-show-note-include-stack -fmacro-backtrace-limit\=0 -fno-color-diagnostics -fmodules-prune-interval\=86400 -fmodules-prune-after\=345600 -fbuild-session-file\=/Users/admin/builder/spi-builder-workspace/.derivedData/ModuleCache.noindex/Session.modulevalidation -fmodules-validate-once-per-build-session -Wnon-modular-include-in-framework-module -Werror\=non-modular-include-in-framework-module -Wno-trigraphs -Wno-missing-field-initializers -Wno-missing-prototypes -Wno-return-type -Wno-implicit-atomic-properties -Wno-objc-interface-ivars -Wno-arc-repeated-use-of-weak -Wno-missing-braces -Wparentheses -Wswitch -Wno-unused-function -Wno-unused-label -Wno-unused-parameter -Wno-unused-variable -Wunused-value -Wno-empty-body -Wno-uninitialized -Wno-unknown-pragmas -w -Wno-shadow -Wno-four-char-constants -Wno-conversion -Wno-constant-conversion -Wno-int-conversion -Wno-bool-conversion -Wno-enum-conversion -Wno-float-conversion -Wno-non-literal-null-conversion -Wno-objc-literal-conversion -Wshorten-64-to-32 -Wpointer-sign -Wno-newline-eof -Wno-selector -Wno-strict-selector-match -Wno-undeclared-selector -Wno-deprecated-implementations -Wno-implicit-fallthrough -fstrict-aliasing -Wprotocol -Wdeprecated-declarations -Wno-sign-conversion -Wno-infinite-recursion -Wno-comma -Wno-block-capture-autoreleasing -Wno-strict-prototypes -Wno-semicolon-before-method-body -index-store-path /Users/admin/builder/spi-builder-workspace/.derivedData/Index.noindex/DataStore @/Users/admin/builder/spi-builder-workspace/.derivedData/Build/Intermediates.noindex/XprobePlugin.build/Debug-watchos/XprobeUI.build/Objects-normal/arm64/e6072d4f65d7061329687fe24e3d63a7-common-args.resp -MMD -MT dependencies -MF /Users/admin/builder/spi-builder-workspace/.derivedData/Build/Intermediates.noindex/XprobePlugin.build/Debug-watchos/XprobeUI.build/Objects-normal/arm64/XprobeConsole.d --serialize-diagnostics /Users/admin/builder/spi-builder-workspace/.derivedData/Build/Intermediates.noindex/XprobePlugin.build/Debug-watchos/XprobeUI.build/Objects-normal/arm64/XprobeConsole.dia -c /Users/admin/builder/spi-builder-workspace/.dependencies/checkouts/XprobePlugin/Sources/XprobeUI/XprobeConsole.m -o /Users/admin/builder/spi-builder-workspace/.derivedData/Build/Intermediates.noindex/XprobePlugin.build/Debug-watchos/XprobeUI.build/Objects-normal/arm64/XprobeConsole.o -index-unit-output-path /XprobePlugin.build/Debug-watchos/XprobeUI.build/Objects-normal/arm64/XprobeConsole.o
/Users/admin/builder/spi-builder-workspace/.dependencies/checkouts/XprobePlugin/Sources/XprobeUI/include/XprobePluginMenuController.h:11:9: error: 'Cocoa/Cocoa.h' file not found (in target 'XprobeUI' from project 'XprobePlugin')
    /Users/admin/builder/spi-builder-workspace/.dependencies/checkouts/XprobePlugin/Sources/XprobeUI/XprobeConsole.m:11:9: note: in file included from /Users/admin/builder/spi-builder-workspace/.dependencies/checkouts/XprobePlugin/Sources/XprobeUI/XprobeConsole.m:11:
ScanDependencies /Users/admin/builder/spi-builder-workspace/.derivedData/Build/Intermediates.noindex/XprobePlugin.build/Debug-watchos/XprobeSweep.build/Objects-normal/arm64_32/XprobeSweep.o /Users/admin/builder/spi-builder-workspace/.dependencies/checkouts/XprobePlugin/Sources/XprobeSweep/XprobeSweep.m normal arm64_32 objective-c com.apple.compilers.llvm.clang.1_0.compiler (in target 'XprobeSweep' from project 'XprobePlugin')
    cd /Users/admin/builder/spi-builder-workspace/.swiftpm/xcode

    Using response file: /Users/admin/builder/spi-builder-workspace/.derivedData/Build/Intermediates.noindex/XprobePlugin.build/Debug-watchos/XprobeSweep.build/Objects-normal/arm64_32/e6072d4f65d7061329687fe24e3d63a7-common-args.resp

    builtin-ScanDependencies -o /Users/admin/builder/spi-builder-workspace/.derivedData/Build/Intermediates.noindex/XprobePlugin.build/Debug-watchos/XprobeSweep.build/Objects-normal/arm64_32/XprobeSweep.o.scan -- /Applications/Xcode-16.3.0.app/Contents/Developer/Toolchains/XcodeDefault.xctoolchain/usr/bin/clang -x objective-c -ivfsstatcache /Users/admin/builder/spi-builder-workspace/.derivedData/SDKStatCaches.noindex/watchos11.4-22T246-43efb940ff07ba2497b70ec94253f576.sdkstatcache -fmessage-length\=0 -fdiagnostics-show-note-include-stack -fmacro-backtrace-limit\=0 -fno-color-diagnostics -fmodules-prune-interval\=86400 -fmodules-prune-after\=345600 -fbuild-session-file\=/Users/admin/builder/spi-builder-workspace/.derivedData/ModuleCache.noindex/Session.modulevalidation -fmodules-validate-once-per-build-session -Wnon-modular-include-in-framework-module -Werror\=non-modular-include-in-framework-module -Wno-trigraphs -Wno-missing-field-initializers -Wno-missing-prototypes -Wno-return-type -Wno-implicit-atomic-properties -Wno-objc-interface-ivars -Wno-arc-repeated-use-of-weak -Wno-missing-braces -Wparentheses -Wswitch -Wno-unused-function -Wno-unused-label -Wno-unused-parameter -Wno-unused-variable -Wunused-value -Wno-empty-body -Wno-uninitialized -Wno-unknown-pragmas -w -Wno-shadow -Wno-four-char-constants -Wno-conversion -Wno-constant-conversion -Wno-int-conversion -Wno-bool-conversion -Wno-enum-conversion -Wno-float-conversion -Wno-non-literal-null-conversion -Wno-objc-literal-conversion -Wno-shorten-64-to-32 -Wpointer-sign -Wno-newline-eof -Wno-selector -Wno-strict-selector-match -Wno-undeclared-selector -Wno-deprecated-implementations -Wno-implicit-fallthrough -fstrict-aliasing -Wprotocol -Wdeprecated-declarations -Wno-sign-conversion -Wno-infinite-recursion -Wno-comma -Wno-block-capture-autoreleasing -Wno-strict-prototypes -Wno-semicolon-before-method-body -index-store-path /Users/admin/builder/spi-builder-workspace/.derivedData/Index.noindex/DataStore @/Users/admin/builder/spi-builder-workspace/.derivedData/Build/Intermediates.noindex/XprobePlugin.build/Debug-watchos/XprobeSweep.build/Objects-normal/arm64_32/e6072d4f65d7061329687fe24e3d63a7-common-args.resp -MMD -MT dependencies -MF /Users/admin/builder/spi-builder-workspace/.derivedData/Build/Intermediates.noindex/XprobePlugin.build/Debug-watchos/XprobeSweep.build/Objects-normal/arm64_32/XprobeSweep.d --serialize-diagnostics /Users/admin/builder/spi-builder-workspace/.derivedData/Build/Intermediates.noindex/XprobePlugin.build/Debug-watchos/XprobeSweep.build/Objects-normal/arm64_32/XprobeSweep.dia -c /Users/admin/builder/spi-builder-workspace/.dependencies/checkouts/XprobePlugin/Sources/XprobeSweep/XprobeSweep.m -o /Users/admin/builder/spi-builder-workspace/.derivedData/Build/Intermediates.noindex/XprobePlugin.build/Debug-watchos/XprobeSweep.build/Objects-normal/arm64_32/XprobeSweep.o -index-unit-output-path /XprobePlugin.build/Debug-watchos/XprobeSweep.build/Objects-normal/arm64_32/XprobeSweep.o
ScanDependencies /Users/admin/builder/spi-builder-workspace/.derivedData/Build/Intermediates.noindex/SwiftTrace.build/Debug-watchos/SwiftTraceGutsD.build/Objects-normal/armv7k/fishhook.o /Users/admin/builder/spi-builder-workspace/.dependencies/checkouts/SwiftTrace/SwiftTraceGutsD/fishhook.c normal armv7k c com.apple.compilers.llvm.clang.1_0.compiler (in target 'SwiftTraceGutsD' from project 'SwiftTrace')
    cd /Users/admin/builder/spi-builder-workspace/.swiftpm/xcode

    Using response file: /Users/admin/builder/spi-builder-workspace/.derivedData/Build/Intermediates.noindex/SwiftTrace.build/Debug-watchos/SwiftTraceGutsD.build/Objects-normal/armv7k/7187679823f38a2a940e0043cdf9d637-common-args.resp

    builtin-ScanDependencies -o /Users/admin/builder/spi-builder-workspace/.derivedData/Build/Intermediates.noindex/SwiftTrace.build/Debug-watchos/SwiftTraceGutsD.build/Objects-normal/armv7k/fishhook.o.scan -- /Applications/Xcode-16.3.0.app/Contents/Developer/Toolchains/XcodeDefault.xctoolchain/usr/bin/clang -x c -ivfsstatcache /Users/admin/builder/spi-builder-workspace/.derivedData/SDKStatCaches.noindex/watchos11.4-22T246-43efb940ff07ba2497b70ec94253f576.sdkstatcache -fmessage-length\=0 -fdiagnostics-show-note-include-stack -fmacro-backtrace-limit\=0 -fno-color-diagnostics -fmodules-prune-interval\=86400 -fmodules-prune-after\=345600 -fbuild-session-file\=/Users/admin/builder/spi-builder-workspace/.derivedData/ModuleCache.noindex/Session.modulevalidation -fmodules-validate-once-per-build-session -Wnon-modular-include-in-framework-module -Werror\=non-modular-include-in-framework-module -Wno-trigraphs -Wno-missing-field-initializers -Wno-missing-prototypes -Wno-return-type -Wno-missing-braces -Wparentheses -Wswitch -Wno-unused-function -Wno-unused-label -Wno-unused-parameter -Wno-unused-variable -Wunused-value -Wno-empty-body -Wno-uninitialized -Wno-unknown-pragmas -w -Wno-shadow -Wno-four-char-constants -Wno-conversion -Wno-constant-conversion -Wno-int-conversion -Wno-bool-conversion -Wno-enum-conversion -Wno-float-conversion -Wno-non-literal-null-conversion -Wno-objc-literal-conversion -Wno-shorten-64-to-32 -Wpointer-sign -Wno-newline-eof -Wno-implicit-fallthrough -fstrict-aliasing -Wdeprecated-declarations -Wno-sign-conversion -Wno-infinite-recursion -Wno-comma -Wno-block-capture-autoreleasing -Wno-strict-prototypes -Wno-semicolon-before-method-body -index-store-path /Users/admin/builder/spi-builder-workspace/.derivedData/Index.noindex/DataStore @/Users/admin/builder/spi-builder-workspace/.derivedData/Build/Intermediates.noindex/SwiftTrace.build/Debug-watchos/SwiftTraceGutsD.build/Objects-normal/armv7k/7187679823f38a2a940e0043cdf9d637-common-args.resp -MMD -MT dependencies -MF /Users/admin/builder/spi-builder-workspace/.derivedData/Build/Intermediates.noindex/SwiftTrace.build/Debug-watchos/SwiftTraceGutsD.build/Objects-normal/armv7k/fishhook.d --serialize-diagnostics /Users/admin/builder/spi-builder-workspace/.derivedData/Build/Intermediates.noindex/SwiftTrace.build/Debug-watchos/SwiftTraceGutsD.build/Objects-normal/armv7k/fishhook.dia -c /Users/admin/builder/spi-builder-workspace/.dependencies/checkouts/SwiftTrace/SwiftTraceGutsD/fishhook.c -o /Users/admin/builder/spi-builder-workspace/.derivedData/Build/Intermediates.noindex/SwiftTrace.build/Debug-watchos/SwiftTraceGutsD.build/Objects-normal/armv7k/fishhook.o -index-unit-output-path /SwiftTrace.build/Debug-watchos/SwiftTraceGutsD.build/Objects-normal/armv7k/fishhook.o
CompileC /Users/admin/builder/spi-builder-workspace/.derivedData/Build/Intermediates.noindex/SwiftTrace.build/Debug-watchos/SwiftTraceGutsD.build/Objects-normal/arm64_32/fast_dladdr.o /Users/admin/builder/spi-builder-workspace/.dependencies/checkouts/SwiftTrace/SwiftTraceGutsD/fast_dladdr.mm normal arm64_32 objective-c++ com.apple.compilers.llvm.clang.1_0.compiler (in target 'SwiftTraceGutsD' from project 'SwiftTrace')
    cd /Users/admin/builder/spi-builder-workspace/.swiftpm/xcode

    Using response file: /Users/admin/builder/spi-builder-workspace/.derivedData/Build/Intermediates.noindex/SwiftTrace.build/Debug-watchos/SwiftTraceGutsD.build/Objects-normal/arm64_32/af3fcb34312c57c0f52879cdce924b91-common-args.resp

    /Applications/Xcode-16.3.0.app/Contents/Developer/Toolchains/XcodeDefault.xctoolchain/usr/bin/clang -x objective-c++ -ivfsstatcache /Users/admin/builder/spi-builder-workspace/.derivedData/SDKStatCaches.noindex/watchos11.4-22T246-43efb940ff07ba2497b70ec94253f576.sdkstatcache -fmessage-length\=0 -fdiagnostics-show-note-include-stack -fmacro-backtrace-limit\=0 -fno-color-diagnostics -fmodules-prune-interval\=86400 -fmodules-prune-after\=345600 -fbuild-session-file\=/Users/admin/builder/spi-builder-workspace/.derivedData/ModuleCache.noindex/Session.modulevalidation -fmodules-validate-once-per-build-session -Wnon-modular-include-in-framework-module -Werror\=non-modular-include-in-framework-module -Wno-trigraphs -Wno-missing-field-initializers -Wno-missing-prototypes -Wno-return-type -Wno-implicit-atomic-properties -Wno-objc-interface-ivars -Wno-arc-repeated-use-of-weak -Wno-non-virtual-dtor -Wno-overloaded-virtual -Wno-exit-time-destructors -Wno-missing-braces -Wparentheses -Wswitch -Wno-unused-function -Wno-unused-label -Wno-unused-parameter -Wno-unused-variable -Wunused-value -Wno-empty-body -Wno-uninitialized -Wno-unknown-pragmas -w -Wno-shadow -Wno-four-char-constants -Wno-conversion -Wno-constant-conversion -Wno-int-conversion -Wno-bool-conversion -Wno-enum-conversion -Wno-float-conversion -Wno-non-literal-null-conversion -Wno-objc-literal-conversion -Wno-shorten-64-to-32 -Wno-newline-eof -Wno-selector -Wno-strict-selector-match -Wno-undeclared-selector -Wno-deprecated-implementations -Wno-c++11-extensions -Wno-implicit-fallthrough -fstrict-aliasing -Wprotocol -Wdeprecated-declarations -Winvalid-offsetof -Wno-sign-conversion -Wno-infinite-recursion -Wno-move -Wno-comma -Wno-block-capture-autoreleasing -Wno-strict-prototypes -Wno-range-loop-analysis -Wno-semicolon-before-method-body -index-store-path /Users/admin/builder/spi-builder-workspace/.derivedData/Index.noindex/DataStore @/Users/admin/builder/spi-builder-workspace/.derivedData/Build/Intermediates.noindex/SwiftTrace.build/Debug-watchos/SwiftTraceGutsD.build/Objects-normal/arm64_32/af3fcb34312c57c0f52879cdce924b91-common-args.resp -MMD -MT dependencies -MF /Users/admin/builder/spi-builder-workspace/.derivedData/Build/Intermediates.noindex/SwiftTrace.build/Debug-watchos/SwiftTraceGutsD.build/Objects-normal/arm64_32/fast_dladdr.d --serialize-diagnostics /Users/admin/builder/spi-builder-workspace/.derivedData/Build/Intermediates.noindex/SwiftTrace.build/Debug-watchos/SwiftTraceGutsD.build/Objects-normal/arm64_32/fast_dladdr.dia -c /Users/admin/builder/spi-builder-workspace/.dependencies/checkouts/SwiftTrace/SwiftTraceGutsD/fast_dladdr.mm -o /Users/admin/builder/spi-builder-workspace/.derivedData/Build/Intermediates.noindex/SwiftTrace.build/Debug-watchos/SwiftTraceGutsD.build/Objects-normal/arm64_32/fast_dladdr.o -index-unit-output-path /SwiftTrace.build/Debug-watchos/SwiftTraceGutsD.build/Objects-normal/arm64_32/fast_dladdr.o
CompileC /Users/admin/builder/spi-builder-workspace/.derivedData/Build/Intermediates.noindex/SwiftTrace.build/Debug-watchos/SwiftTraceGutsD.build/Objects-normal/arm64_32/Trampolines.o /Users/admin/builder/spi-builder-workspace/.dependencies/checkouts/SwiftTrace/SwiftTraceGutsD/Trampolines.mm normal arm64_32 objective-c++ com.apple.compilers.llvm.clang.1_0.compiler (in target 'SwiftTraceGutsD' from project 'SwiftTrace')
    cd /Users/admin/builder/spi-builder-workspace/.swiftpm/xcode

    Using response file: /Users/admin/builder/spi-builder-workspace/.derivedData/Build/Intermediates.noindex/SwiftTrace.build/Debug-watchos/SwiftTraceGutsD.build/Objects-normal/arm64_32/af3fcb34312c57c0f52879cdce924b91-common-args.resp

    /Applications/Xcode-16.3.0.app/Contents/Developer/Toolchains/XcodeDefault.xctoolchain/usr/bin/clang -x objective-c++ -ivfsstatcache /Users/admin/builder/spi-builder-workspace/.derivedData/SDKStatCaches.noindex/watchos11.4-22T246-43efb940ff07ba2497b70ec94253f576.sdkstatcache -fmessage-length\=0 -fdiagnostics-show-note-include-stack -fmacro-backtrace-limit\=0 -fno-color-diagnostics -fmodules-prune-interval\=86400 -fmodules-prune-after\=345600 -fbuild-session-file\=/Users/admin/builder/spi-builder-workspace/.derivedData/ModuleCache.noindex/Session.modulevalidation -fmodules-validate-once-per-build-session -Wnon-modular-include-in-framework-module -Werror\=non-modular-include-in-framework-module -Wno-trigraphs -Wno-missing-field-initializers -Wno-missing-prototypes -Wno-return-type -Wno-implicit-atomic-properties -Wno-objc-interface-ivars -Wno-arc-repeated-use-of-weak -Wno-non-virtual-dtor -Wno-overloaded-virtual -Wno-exit-time-destructors -Wno-missing-braces -Wparentheses -Wswitch -Wno-unused-function -Wno-unused-label -Wno-unused-parameter -Wno-unused-variable -Wunused-value -Wno-empty-body -Wno-uninitialized -Wno-unknown-pragmas -w -Wno-shadow -Wno-four-char-constants -Wno-conversion -Wno-constant-conversion -Wno-int-conversion -Wno-bool-conversion -Wno-enum-conversion -Wno-float-conversion -Wno-non-literal-null-conversion -Wno-objc-literal-conversion -Wno-shorten-64-to-32 -Wno-newline-eof -Wno-selector -Wno-strict-selector-match -Wno-undeclared-selector -Wno-deprecated-implementations -Wno-c++11-extensions -Wno-implicit-fallthrough -fstrict-aliasing -Wprotocol -Wdeprecated-declarations -Winvalid-offsetof -Wno-sign-conversion -Wno-infinite-recursion -Wno-move -Wno-comma -Wno-block-capture-autoreleasing -Wno-strict-prototypes -Wno-range-loop-analysis -Wno-semicolon-before-method-body -index-store-path /Users/admin/builder/spi-builder-workspace/.derivedData/Index.noindex/DataStore @/Users/admin/builder/spi-builder-workspace/.derivedData/Build/Intermediates.noindex/SwiftTrace.build/Debug-watchos/SwiftTraceGutsD.build/Objects-normal/arm64_32/af3fcb34312c57c0f52879cdce924b91-common-args.resp -MMD -MT dependencies -MF /Users/admin/builder/spi-builder-workspace/.derivedData/Build/Intermediates.noindex/SwiftTrace.build/Debug-watchos/SwiftTraceGutsD.build/Objects-normal/arm64_32/Trampolines.d --serialize-diagnostics /Users/admin/builder/spi-builder-workspace/.derivedData/Build/Intermediates.noindex/SwiftTrace.build/Debug-watchos/SwiftTraceGutsD.build/Objects-normal/arm64_32/Trampolines.dia -c /Users/admin/builder/spi-builder-workspace/.dependencies/checkouts/SwiftTrace/SwiftTraceGutsD/Trampolines.mm -o /Users/admin/builder/spi-builder-workspace/.derivedData/Build/Intermediates.noindex/SwiftTrace.build/Debug-watchos/SwiftTraceGutsD.build/Objects-normal/arm64_32/Trampolines.o -index-unit-output-path /SwiftTrace.build/Debug-watchos/SwiftTraceGutsD.build/Objects-normal/arm64_32/Trampolines.o
CompileC /Users/admin/builder/spi-builder-workspace/.derivedData/Build/Intermediates.noindex/SwiftTrace.build/Debug-watchos/SwiftTraceGutsD.build/Objects-normal/arm64_32/SwiftTrace.o /Users/admin/builder/spi-builder-workspace/.dependencies/checkouts/SwiftTrace/SwiftTraceGutsD/SwiftTrace.mm normal arm64_32 objective-c++ com.apple.compilers.llvm.clang.1_0.compiler (in target 'SwiftTraceGutsD' from project 'SwiftTrace')
    cd /Users/admin/builder/spi-builder-workspace/.swiftpm/xcode

    Using response file: /Users/admin/builder/spi-builder-workspace/.derivedData/Build/Intermediates.noindex/SwiftTrace.build/Debug-watchos/SwiftTraceGutsD.build/Objects-normal/arm64_32/af3fcb34312c57c0f52879cdce924b91-common-args.resp

    /Applications/Xcode-16.3.0.app/Contents/Developer/Toolchains/XcodeDefault.xctoolchain/usr/bin/clang -x objective-c++ -ivfsstatcache /Users/admin/builder/spi-builder-workspace/.derivedData/SDKStatCaches.noindex/watchos11.4-22T246-43efb940ff07ba2497b70ec94253f576.sdkstatcache -fmessage-length\=0 -fdiagnostics-show-note-include-stack -fmacro-backtrace-limit\=0 -fno-color-diagnostics -fmodules-prune-interval\=86400 -fmodules-prune-after\=345600 -fbuild-session-file\=/Users/admin/builder/spi-builder-workspace/.derivedData/ModuleCache.noindex/Session.modulevalidation -fmodules-validate-once-per-build-session -Wnon-modular-include-in-framework-module -Werror\=non-modular-include-in-framework-module -Wno-trigraphs -Wno-missing-field-initializers -Wno-missing-prototypes -Wno-return-type -Wno-implicit-atomic-properties -Wno-objc-interface-ivars -Wno-arc-repeated-use-of-weak -Wno-non-virtual-dtor -Wno-overloaded-virtual -Wno-exit-time-destructors -Wno-missing-braces -Wparentheses -Wswitch -Wno-unused-function -Wno-unused-label -Wno-unused-parameter -Wno-unused-variable -Wunused-value -Wno-empty-body -Wno-uninitialized -Wno-unknown-pragmas -w -Wno-shadow -Wno-four-char-constants -Wno-conversion -Wno-constant-conversion -Wno-int-conversion -Wno-bool-conversion -Wno-enum-conversion -Wno-float-conversion -Wno-non-literal-null-conversion -Wno-objc-literal-conversion -Wno-shorten-64-to-32 -Wno-newline-eof -Wno-selector -Wno-strict-selector-match -Wno-undeclared-selector -Wno-deprecated-implementations -Wno-c++11-extensions -Wno-implicit-fallthrough -fstrict-aliasing -Wprotocol -Wdeprecated-declarations -Winvalid-offsetof -Wno-sign-conversion -Wno-infinite-recursion -Wno-move -Wno-comma -Wno-block-capture-autoreleasing -Wno-strict-prototypes -Wno-range-loop-analysis -Wno-semicolon-before-method-body -index-store-path /Users/admin/builder/spi-builder-workspace/.derivedData/Index.noindex/DataStore @/Users/admin/builder/spi-builder-workspace/.derivedData/Build/Intermediates.noindex/SwiftTrace.build/Debug-watchos/SwiftTraceGutsD.build/Objects-normal/arm64_32/af3fcb34312c57c0f52879cdce924b91-common-args.resp -MMD -MT dependencies -MF /Users/admin/builder/spi-builder-workspace/.derivedData/Build/Intermediates.noindex/SwiftTrace.build/Debug-watchos/SwiftTraceGutsD.build/Objects-normal/arm64_32/SwiftTrace.d --serialize-diagnostics /Users/admin/builder/spi-builder-workspace/.derivedData/Build/Intermediates.noindex/SwiftTrace.build/Debug-watchos/SwiftTraceGutsD.build/Objects-normal/arm64_32/SwiftTrace.dia -c /Users/admin/builder/spi-builder-workspace/.dependencies/checkouts/SwiftTrace/SwiftTraceGutsD/SwiftTrace.mm -o /Users/admin/builder/spi-builder-workspace/.derivedData/Build/Intermediates.noindex/SwiftTrace.build/Debug-watchos/SwiftTraceGutsD.build/Objects-normal/arm64_32/SwiftTrace.o -index-unit-output-path /SwiftTrace.build/Debug-watchos/SwiftTraceGutsD.build/Objects-normal/arm64_32/SwiftTrace.o
SwiftDriver SwiftTraceD normal armv7k com.apple.xcode.tools.swift.compiler (in target 'SwiftTraceD' from project 'SwiftTrace')
    cd /Users/admin/builder/spi-builder-workspace/.swiftpm/xcode
    builtin-SwiftDriver -- /Applications/Xcode-16.3.0.app/Contents/Developer/Toolchains/XcodeDefault.xctoolchain/usr/bin/swiftc -module-name SwiftTraceD -Onone -enforce-exclusivity\=checked @/Users/admin/builder/spi-builder-workspace/.derivedData/Build/Intermediates.noindex/SwiftTrace.build/Debug-watchos/SwiftTraceD.build/Objects-normal/armv7k/SwiftTraceD.SwiftFileList -DSWIFT_PACKAGE -DDEBUG -DDEBUG_ONLY -Xcc -fmodule-map-file\=/Users/admin/builder/spi-builder-workspace/.derivedData/Build/Intermediates.noindex/GeneratedModuleMaps-watchos/SwiftTraceGutsD.modulemap -DXcode -plugin-path /Applications/Xcode-16.3.0.app/Contents/Developer/Toolchains/XcodeDefault.xctoolchain/usr/lib/swift/host/plugins/testing -enable-experimental-feature DebugDescriptionMacro -sdk /Applications/Xcode-16.3.0.app/Contents/Developer/Platforms/WatchOS.platform/Developer/SDKs/WatchOS11.4.sdk -target armv7k-apple-watchos5.0 -g -module-cache-path /Users/admin/builder/spi-builder-workspace/.derivedData/ModuleCache.noindex -Xfrontend -serialize-debugging-options -enable-testing -suppress-warnings -index-store-path /Users/admin/builder/spi-builder-workspace/.derivedData/Index.noindex/DataStore -swift-version 5 -I /Users/admin/builder/spi-builder-workspace/.derivedData/Build/Products/Debug-watchos -I /Applications/Xcode-16.3.0.app/Contents/Developer/Platforms/WatchOS.platform/Developer/usr/lib -F /Users/admin/builder/spi-builder-workspace/.derivedData/Build/Products/Debug-watchos/PackageFrameworks -F /Users/admin/builder/spi-builder-workspace/.derivedData/Build/Products/Debug-watchos -F /Applications/Xcode-16.3.0.app/Contents/Developer/Platforms/WatchOS.platform/Developer/Library/Frameworks -F /Applications/Xcode-16.3.0.app/Contents/Developer/Platforms/WatchOS.platform/Developer/SDKs/WatchOS11.4.sdk/Developer/Library/Frameworks -c -j10 -enable-batch-mode -incremental -Xcc -ivfsstatcache -Xcc /Users/admin/builder/spi-builder-workspace/.derivedData/SDKStatCaches.noindex/watchos11.4-22T246-43efb940ff07ba2497b70ec94253f576.sdkstatcache -output-file-map /Users/admin/builder/spi-builder-workspace/.derivedData/Build/Intermediates.noindex/SwiftTrace.build/Debug-watchos/SwiftTraceD.build/Objects-normal/armv7k/SwiftTraceD-OutputFileMap.json -use-frontend-parseable-output -save-temps -no-color-diagnostics -serialize-diagnostics -emit-dependencies -emit-module -emit-module-path /Users/admin/builder/spi-builder-workspace/.derivedData/Build/Intermediates.noindex/SwiftTrace.build/Debug-watchos/SwiftTraceD.build/Objects-normal/armv7k/SwiftTraceD.swiftmodule -validate-clang-modules-once -clang-build-session-file /Users/admin/builder/spi-builder-workspace/.derivedData/ModuleCache.noindex/Session.modulevalidation -Xcc -I/Users/admin/builder/spi-builder-workspace/.derivedData/Build/Intermediates.noindex/SwiftTrace.build/Debug-watchos/SwiftTraceD.build/swift-overrides.hmap -emit-const-values -Xfrontend -const-gather-protocols-file -Xfrontend /Users/admin/builder/spi-builder-workspace/.derivedData/Build/Intermediates.noindex/SwiftTrace.build/Debug-watchos/SwiftTraceD.build/Objects-normal/armv7k/SwiftTraceD_const_extract_protocols.json -Xcc -I/Users/admin/builder/spi-builder-workspace/.dependencies/checkouts/SwiftTrace/SwiftTraceGutsD/include -Xcc -I/Users/admin/builder/spi-builder-workspace/.derivedData/Build/Products/Debug-watchos/include -Xcc -I/Users/admin/builder/spi-builder-workspace/.derivedData/Build/Intermediates.noindex/SwiftTrace.build/Debug-watchos/SwiftTraceD.build/DerivedSources-normal/armv7k -Xcc -I/Users/admin/builder/spi-builder-workspace/.derivedData/Build/Intermediates.noindex/SwiftTrace.build/Debug-watchos/SwiftTraceD.build/DerivedSources/armv7k -Xcc -I/Users/admin/builder/spi-builder-workspace/.derivedData/Build/Intermediates.noindex/SwiftTrace.build/Debug-watchos/SwiftTraceD.build/DerivedSources -Xcc -DSWIFT_PACKAGE -Xcc -DDEBUG\=1 -emit-objc-header -emit-objc-header-path /Users/admin/builder/spi-builder-workspace/.derivedData/Build/Intermediates.noindex/SwiftTrace.build/Debug-watchos/SwiftTraceD.build/Objects-normal/armv7k/SwiftTraceD-Swift.h -working-directory /Users/admin/builder/spi-builder-workspace/.swiftpm/xcode -experimental-emit-module-separately -disable-cmo
SwiftDriver SwiftTraceD normal arm64 com.apple.xcode.tools.swift.compiler (in target 'SwiftTraceD' from project 'SwiftTrace')
    cd /Users/admin/builder/spi-builder-workspace/.swiftpm/xcode
    builtin-SwiftDriver -- /Applications/Xcode-16.3.0.app/Contents/Developer/Toolchains/XcodeDefault.xctoolchain/usr/bin/swiftc -module-name SwiftTraceD -Onone -enforce-exclusivity\=checked @/Users/admin/builder/spi-builder-workspace/.derivedData/Build/Intermediates.noindex/SwiftTrace.build/Debug-watchos/SwiftTraceD.build/Objects-normal/arm64/SwiftTraceD.SwiftFileList -DSWIFT_PACKAGE -DDEBUG -DDEBUG_ONLY -Xcc -fmodule-map-file\=/Users/admin/builder/spi-builder-workspace/.derivedData/Build/Intermediates.noindex/GeneratedModuleMaps-watchos/SwiftTraceGutsD.modulemap -DXcode -plugin-path /Applications/Xcode-16.3.0.app/Contents/Developer/Toolchains/XcodeDefault.xctoolchain/usr/lib/swift/host/plugins/testing -enable-experimental-feature DebugDescriptionMacro -sdk /Applications/Xcode-16.3.0.app/Contents/Developer/Platforms/WatchOS.platform/Developer/SDKs/WatchOS11.4.sdk -target arm64-apple-watchos5.0 -g -module-cache-path /Users/admin/builder/spi-builder-workspace/.derivedData/ModuleCache.noindex -Xfrontend -serialize-debugging-options -enable-testing -suppress-warnings -index-store-path /Users/admin/builder/spi-builder-workspace/.derivedData/Index.noindex/DataStore -swift-version 5 -I /Users/admin/builder/spi-builder-workspace/.derivedData/Build/Products/Debug-watchos -I /Applications/Xcode-16.3.0.app/Contents/Developer/Platforms/WatchOS.platform/Developer/usr/lib -F /Users/admin/builder/spi-builder-workspace/.derivedData/Build/Products/Debug-watchos/PackageFrameworks -F /Users/admin/builder/spi-builder-workspace/.derivedData/Build/Products/Debug-watchos -F /Applications/Xcode-16.3.0.app/Contents/Developer/Platforms/WatchOS.platform/Developer/Library/Frameworks -F /Applications/Xcode-16.3.0.app/Contents/Developer/Platforms/WatchOS.platform/Developer/SDKs/WatchOS11.4.sdk/Developer/Library/Frameworks -c -j10 -enable-batch-mode -incremental -Xcc -ivfsstatcache -Xcc /Users/admin/builder/spi-builder-workspace/.derivedData/SDKStatCaches.noindex/watchos11.4-22T246-43efb940ff07ba2497b70ec94253f576.sdkstatcache -output-file-map /Users/admin/builder/spi-builder-workspace/.derivedData/Build/Intermediates.noindex/SwiftTrace.build/Debug-watchos/SwiftTraceD.build/Objects-normal/arm64/SwiftTraceD-OutputFileMap.json -use-frontend-parseable-output -save-temps -no-color-diagnostics -serialize-diagnostics -emit-dependencies -emit-module -emit-module-path /Users/admin/builder/spi-builder-workspace/.derivedData/Build/Intermediates.noindex/SwiftTrace.build/Debug-watchos/SwiftTraceD.build/Objects-normal/arm64/SwiftTraceD.swiftmodule -validate-clang-modules-once -clang-build-session-file /Users/admin/builder/spi-builder-workspace/.derivedData/ModuleCache.noindex/Session.modulevalidation -Xcc -I/Users/admin/builder/spi-builder-workspace/.derivedData/Build/Intermediates.noindex/SwiftTrace.build/Debug-watchos/SwiftTraceD.build/swift-overrides.hmap -emit-const-values -Xfrontend -const-gather-protocols-file -Xfrontend /Users/admin/builder/spi-builder-workspace/.derivedData/Build/Intermediates.noindex/SwiftTrace.build/Debug-watchos/SwiftTraceD.build/Objects-normal/arm64/SwiftTraceD_const_extract_protocols.json -Xcc -I/Users/admin/builder/spi-builder-workspace/.dependencies/checkouts/SwiftTrace/SwiftTraceGutsD/include -Xcc -I/Users/admin/builder/spi-builder-workspace/.derivedData/Build/Products/Debug-watchos/include -Xcc -I/Users/admin/builder/spi-builder-workspace/.derivedData/Build/Intermediates.noindex/SwiftTrace.build/Debug-watchos/SwiftTraceD.build/DerivedSources-normal/arm64 -Xcc -I/Users/admin/builder/spi-builder-workspace/.derivedData/Build/Intermediates.noindex/SwiftTrace.build/Debug-watchos/SwiftTraceD.build/DerivedSources/arm64 -Xcc -I/Users/admin/builder/spi-builder-workspace/.derivedData/Build/Intermediates.noindex/SwiftTrace.build/Debug-watchos/SwiftTraceD.build/DerivedSources -Xcc -DSWIFT_PACKAGE -Xcc -DDEBUG\=1 -emit-objc-header -emit-objc-header-path /Users/admin/builder/spi-builder-workspace/.derivedData/Build/Intermediates.noindex/SwiftTrace.build/Debug-watchos/SwiftTraceD.build/Objects-normal/arm64/SwiftTraceD-Swift.h -working-directory /Users/admin/builder/spi-builder-workspace/.swiftpm/xcode -experimental-emit-module-separately -disable-cmo
** BUILD FAILED **
The following build commands failed:
	ScanDependencies /Users/admin/builder/spi-builder-workspace/.derivedData/Build/Intermediates.noindex/XprobePlugin.build/Debug-watchos/XprobeUI.build/Objects-normal/armv7k/XprobePluginMenuController.o /Users/admin/builder/spi-builder-workspace/.dependencies/checkouts/XprobePlugin/Sources/XprobeUI/XprobePluginMenuController.m normal armv7k objective-c com.apple.compilers.llvm.clang.1_0.compiler (in target 'XprobeUI' from project 'XprobePlugin')
	ScanDependencies /Users/admin/builder/spi-builder-workspace/.derivedData/Build/Intermediates.noindex/XprobePlugin.build/Debug-watchos/XprobeUI.build/Objects-normal/armv7k/XprobeConsole.o /Users/admin/builder/spi-builder-workspace/.dependencies/checkouts/XprobePlugin/Sources/XprobeUI/XprobeConsole.m normal armv7k objective-c com.apple.compilers.llvm.clang.1_0.compiler (in target 'XprobeUI' from project 'XprobePlugin')
	ScanDependencies /Users/admin/builder/spi-builder-workspace/.derivedData/Build/Intermediates.noindex/XprobePlugin.build/Debug-watchos/XprobeUI.build/Objects-normal/arm64_32/XprobePluginMenuController.o /Users/admin/builder/spi-builder-workspace/.dependencies/checkouts/XprobePlugin/Sources/XprobeUI/XprobePluginMenuController.m normal arm64_32 objective-c com.apple.compilers.llvm.clang.1_0.compiler (in target 'XprobeUI' from project 'XprobePlugin')
	ScanDependencies /Users/admin/builder/spi-builder-workspace/.derivedData/Build/Intermediates.noindex/XprobePlugin.build/Debug-watchos/XprobeUI.build/Objects-normal/arm64_32/XprobeConsole.o /Users/admin/builder/spi-builder-workspace/.dependencies/checkouts/XprobePlugin/Sources/XprobeUI/XprobeConsole.m normal arm64_32 objective-c com.apple.compilers.llvm.clang.1_0.compiler (in target 'XprobeUI' from project 'XprobePlugin')
	ScanDependencies /Users/admin/builder/spi-builder-workspace/.derivedData/Build/Intermediates.noindex/XprobePlugin.build/Debug-watchos/XprobeUI.build/Objects-normal/arm64/XprobePluginMenuController.o /Users/admin/builder/spi-builder-workspace/.dependencies/checkouts/XprobePlugin/Sources/XprobeUI/XprobePluginMenuController.m normal arm64 objective-c com.apple.compilers.llvm.clang.1_0.compiler (in target 'XprobeUI' from project 'XprobePlugin')
	ScanDependencies /Users/admin/builder/spi-builder-workspace/.derivedData/Build/Intermediates.noindex/XprobePlugin.build/Debug-watchos/XprobeUI.build/Objects-normal/arm64/XprobeConsole.o /Users/admin/builder/spi-builder-workspace/.dependencies/checkouts/XprobePlugin/Sources/XprobeUI/XprobeConsole.m normal arm64 objective-c com.apple.compilers.llvm.clang.1_0.compiler (in target 'XprobeUI' from project 'XprobePlugin')
	Building workspace spi-builder-workspace with scheme HotReloading-Package
(7 failures)
BUILD FAILURE 6.1 watchOS