Build Information
Failed to build BuildAnalyzer, reference main (39e1c2
), with Swift 6.1 for iOS using Xcode 16.3 on 27 Apr 2025 22:09:10 UTC.
Build Command
env DEVELOPER_DIR=/Applications/Xcode-16.3.0.app xcrun xcodebuild -IDEClonedSourcePackagesDirPathOverride=$PWD/.dependencies -skipMacroValidation -skipPackagePluginValidation -derivedDataPath $PWD/.derivedData build -scheme BuildAnalyzer-Package -destination generic/platform=iOS
Build Log
^
/Users/admin/builder/spi-builder-workspace/Sources/BuildAnalyzerKit/BuildGraph.swift:31:23: note: convert 'empty' to a 'let' constant to make 'Sendable' shared state immutable
public static var empty: BuildGraph = {
~~~ ^
let
/Users/admin/builder/spi-builder-workspace/Sources/BuildAnalyzerKit/BuildGraph.swift:31:23: note: add '@MainActor' to make static property 'empty' part of global actor 'MainActor'
public static var empty: BuildGraph = {
^
@MainActor
/Users/admin/builder/spi-builder-workspace/Sources/BuildAnalyzerKit/BuildGraph.swift:31:23: note: disable concurrency-safety checks if accesses are protected by an external synchronization mechanism
public static var empty: BuildGraph = {
^
nonisolated(unsafe)
/Users/admin/builder/spi-builder-workspace/Sources/BuildAnalyzerKit/BuildGraphNodeKind.swift:4:5: warning: 'public' modifier is redundant for enum declared in a public extension
public enum NodeType {
^~~~~~~
/Users/admin/builder/spi-builder-workspace/Sources/BuildAnalyzerKit/BuildGraphNodeKind.swift:132:1: warning: extension declares a conformance of imported type 'Array' to imported protocol 'Comparable'; this will not behave correctly if the owners of 'Swift' introduce this conformance in the future
extension Array<String>: Comparable {
^
/Users/admin/builder/spi-builder-workspace/Sources/BuildAnalyzerKit/BuildGraphNodeKind.swift:132:1: note: add '@retroactive' to silence this warning
extension Array<String>: Comparable {
^ ~~~~~~~~~~
@retroactive Comparable
/Users/admin/builder/spi-builder-workspace/Sources/BuildAnalyzerKit/Timing/BuildGraphNodeTimingSqlReader.swift:12:10: warning: associated value 'unexpectedRowFormat' of 'Sendable'-conforming enum 'BuildGraphNodeTimingSqlReaderError' has non-sendable type 'any Binding'; this is an error in the Swift 6 language mode
case unexpectedRowFormat(Binding?)
^
/Users/admin/builder/spi-builder-workspace/.dependencies/checkouts/SQLite.swift/Sources/SQLite/Core/Value.swift:30:17: note: protocol 'Binding' does not conform to the 'Sendable' protocol
public protocol Binding {}
^
/Users/admin/builder/spi-builder-workspace/Sources/BuildAnalyzerKit/Timing/BuildGraphNodeTimingSqlReader.swift:9:1: warning: add '@preconcurrency' to suppress 'Sendable'-related warnings from module 'SQLite'
import SQLite
^
@preconcurrency
SwiftDriverJobDiscovery normal arm64 Compiling NoPadding.swift, Operators.swift, DER.swift, PBKDF1.swift, PBKDF2.swift, PKCS1v15.swift, PKCS5.swift, PKCS7.swift, PKCS7Padding.swift, Padding.swift, Poly1305.swift (in target 'CryptoSwift' from project 'CryptoSwift')
SwiftCompile normal arm64 Compiling\ BuildGraphProtocol+Expansion.swift /Users/admin/builder/spi-builder-workspace/Sources/BuildAnalyzerKit/Projection/BuildGraphProtocol+Expansion.swift (in target 'BuildAnalyzerKit' from project 'BuildAnalyzer')
SwiftCompile normal arm64 /Users/admin/builder/spi-builder-workspace/Sources/BuildAnalyzerKit/Projection/BuildGraphProtocol+Expansion.swift (in target 'BuildAnalyzerKit' from project 'BuildAnalyzer')
cd /Users/admin/builder/spi-builder-workspace/.swiftpm/xcode
SwiftDriverJobDiscovery normal arm64 Compiling BatchedCollection.swift, Bit.swift, BlockCipher.swift, BlockDecryptor.swift, BlockEncryptor.swift, BlockMode.swift, BlockModeOptions.swift, CBC.swift, CCM.swift, CFB.swift, CTR.swift, CipherModeWorker.swift (in target 'CryptoSwift' from project 'CryptoSwift')
SwiftCompile normal arm64 Compiling\ BuildGraphProjection.swift /Users/admin/builder/spi-builder-workspace/Sources/BuildAnalyzerKit/Projection/BuildGraphProjection.swift (in target 'BuildAnalyzerKit' from project 'BuildAnalyzer')
SwiftCompile normal arm64 /Users/admin/builder/spi-builder-workspace/Sources/BuildAnalyzerKit/Projection/BuildGraphProjection.swift (in target 'BuildAnalyzerKit' from project 'BuildAnalyzer')
cd /Users/admin/builder/spi-builder-workspace/.swiftpm/xcode
SwiftDriverJobDiscovery normal arm64 Compiling StreamEncryptor.swift, String+Extension.swift, UInt128.swift, UInt16+Extension.swift, UInt32+Extension.swift, UInt64+Extension.swift, UInt8+Extension.swift, Updatable.swift, Utils.swift, XChaCha20.swift, ZeroPadding.swift (in target 'CryptoSwift' from project 'CryptoSwift')
SwiftCompile normal arm64 Compiling\ BuildGraphNodeProjectionNode.swift /Users/admin/builder/spi-builder-workspace/Sources/BuildAnalyzerKit/Projection/BuildGraphNodeProjectionNode.swift (in target 'BuildAnalyzerKit' from project 'BuildAnalyzer')
SwiftCompile normal arm64 /Users/admin/builder/spi-builder-workspace/Sources/BuildAnalyzerKit/Projection/BuildGraphNodeProjectionNode.swift (in target 'BuildAnalyzerKit' from project 'BuildAnalyzer')
cd /Users/admin/builder/spi-builder-workspace/.swiftpm/xcode
SwiftDriverJobDiscovery normal arm64 Emitting module for XcodeHasher (in target 'XcodeHasher' from project 'BuildAnalyzer')
SwiftDriver\ Compilation\ Requirements XcodeHasher normal arm64 com.apple.xcode.tools.swift.compiler (in target 'XcodeHasher' from project 'BuildAnalyzer')
cd /Users/admin/builder/spi-builder-workspace/.swiftpm/xcode
builtin-Swift-Compilation-Requirements -- /Applications/Xcode-16.3.0.app/Contents/Developer/Toolchains/XcodeDefault.xctoolchain/usr/bin/swiftc -module-name XcodeHasher -Onone -enforce-exclusivity\=checked @/Users/admin/builder/spi-builder-workspace/.derivedData/Build/Intermediates.noindex/BuildAnalyzer.build/Debug-iphoneos/XcodeHasher.build/Objects-normal/arm64/XcodeHasher.SwiftFileList -DSWIFT_PACKAGE -DDEBUG -stats-output-dir .stats -strict-concurrency\=complete -enable-upcoming-feature StrictConcurrency -enable-upcoming-feature DisableOutwardActorInference -enable-upcoming-feature GlobalActorIsolatedTypesUsability -enable-upcoming-feature InferSendableFromCaptures -plugin-path /Applications/Xcode-16.3.0.app/Contents/Developer/Toolchains/XcodeDefault.xctoolchain/usr/lib/swift/host/plugins/testing -enable-experimental-feature DebugDescriptionMacro -sdk /Applications/Xcode-16.3.0.app/Contents/Developer/Platforms/iPhoneOS.platform/Developer/SDKs/iPhoneOS18.4.sdk -target arm64-apple-ios12.0 -g -module-cache-path /Users/admin/builder/spi-builder-workspace/.derivedData/ModuleCache.noindex -Xfrontend -serialize-debugging-options -profile-coverage-mapping -profile-generate -enable-testing -index-store-path /Users/admin/builder/spi-builder-workspace/.derivedData/Index.noindex/DataStore -swift-version 5 -I /Users/admin/builder/spi-builder-workspace/.derivedData/Build/Products/Debug-iphoneos -I /Applications/Xcode-16.3.0.app/Contents/Developer/Platforms/iPhoneOS.platform/Developer/usr/lib -F /Users/admin/builder/spi-builder-workspace/.derivedData/Build/Products/Debug-iphoneos/PackageFrameworks -F /Users/admin/builder/spi-builder-workspace/.derivedData/Build/Products/Debug-iphoneos -F /Applications/Xcode-16.3.0.app/Contents/Developer/Platforms/iPhoneOS.platform/Developer/Library/Frameworks -F /Applications/Xcode-16.3.0.app/Contents/Developer/Platforms/iPhoneOS.platform/Developer/SDKs/iPhoneOS18.4.sdk/Developer/Library/Frameworks -parse-as-library -c -j10 -enable-batch-mode -incremental -Xcc -ivfsstatcache -Xcc /Users/admin/builder/spi-builder-workspace/.derivedData/SDKStatCaches.noindex/iphoneos18.4-22E235-339d34bc69d7fc736c3220795c36f340.sdkstatcache -output-file-map /Users/admin/builder/spi-builder-workspace/.derivedData/Build/Intermediates.noindex/BuildAnalyzer.build/Debug-iphoneos/XcodeHasher.build/Objects-normal/arm64/XcodeHasher-OutputFileMap.json -use-frontend-parseable-output -save-temps -no-color-diagnostics -serialize-diagnostics -emit-dependencies -emit-module -emit-module-path /Users/admin/builder/spi-builder-workspace/.derivedData/Build/Intermediates.noindex/BuildAnalyzer.build/Debug-iphoneos/XcodeHasher.build/Objects-normal/arm64/XcodeHasher.swiftmodule -validate-clang-modules-once -clang-build-session-file /Users/admin/builder/spi-builder-workspace/.derivedData/ModuleCache.noindex/Session.modulevalidation -package-name spi_builder_workspace -Xcc -I/Users/admin/builder/spi-builder-workspace/.derivedData/Build/Intermediates.noindex/BuildAnalyzer.build/Debug-iphoneos/XcodeHasher.build/swift-overrides.hmap -emit-const-values -Xfrontend -const-gather-protocols-file -Xfrontend /Users/admin/builder/spi-builder-workspace/.derivedData/Build/Intermediates.noindex/BuildAnalyzer.build/Debug-iphoneos/XcodeHasher.build/Objects-normal/arm64/XcodeHasher_const_extract_protocols.json -Xcc -I/Users/admin/builder/spi-builder-workspace/.derivedData/Build/Products/Debug-iphoneos/include -Xcc -I/Users/admin/builder/spi-builder-workspace/.derivedData/Build/Intermediates.noindex/BuildAnalyzer.build/Debug-iphoneos/XcodeHasher.build/DerivedSources-normal/arm64 -Xcc -I/Users/admin/builder/spi-builder-workspace/.derivedData/Build/Intermediates.noindex/BuildAnalyzer.build/Debug-iphoneos/XcodeHasher.build/DerivedSources/arm64 -Xcc -I/Users/admin/builder/spi-builder-workspace/.derivedData/Build/Intermediates.noindex/BuildAnalyzer.build/Debug-iphoneos/XcodeHasher.build/DerivedSources -Xcc -DSWIFT_PACKAGE -Xcc -DDEBUG\=1 -emit-objc-header -emit-objc-header-path /Users/admin/builder/spi-builder-workspace/.derivedData/Build/Intermediates.noindex/BuildAnalyzer.build/Debug-iphoneos/XcodeHasher.build/Objects-normal/arm64/XcodeHasher-Swift.h -working-directory /Users/admin/builder/spi-builder-workspace/.swiftpm/xcode -experimental-emit-module-separately -disable-cmo
** BUILD FAILED **
The following build commands failed:
SwiftEmitModule normal arm64 Emitting\ module\ for\ BuildAnalyzerKit (in target 'BuildAnalyzerKit' from project 'BuildAnalyzer')
EmitSwiftModule normal arm64 (in target 'BuildAnalyzerKit' from project 'BuildAnalyzer')
Building workspace spi-builder-workspace with scheme BuildAnalyzer-Package
(3 failures)
Command line invocation:
/Applications/Xcode-16.3.0.app/Contents/Developer/usr/bin/xcodebuild -IDEClonedSourcePackagesDirPathOverride=/Users/admin/builder/spi-builder-workspace/.dependencies -resolvePackageDependencies
Resolve Package Graph
Resolved source packages:
BuildAnalyzer: /Users/admin/builder/spi-builder-workspace
CryptoSwift: https://github.com/krzyzanowskim/CryptoSwift.git @ 1.8.4
SQLite.swift: https://github.com/stephencelis/SQLite.swift.git @ 0.15.3
resolved source packages: BuildAnalyzer, CryptoSwift, SQLite.swift
{
"dependencies" : [
{
"identity" : "sqlite.swift",
"requirement" : {
"range" : [
{
"lower_bound" : "0.14.1",
"upper_bound" : "1.0.0"
}
]
},
"type" : "sourceControl",
"url" : "https://github.com/stephencelis/SQLite.swift.git"
},
{
"identity" : "cryptoswift",
"requirement" : {
"range" : [
{
"lower_bound" : "1.3.3",
"upper_bound" : "2.0.0"
}
]
},
"type" : "sourceControl",
"url" : "https://github.com/krzyzanowskim/CryptoSwift.git"
}
],
"manifest_display_name" : "BuildAnalyzer",
"name" : "BuildAnalyzer",
"path" : "/Users/admin/builder/spi-builder-workspace",
"platforms" : [
{
"name" : "macos",
"version" : "13.0"
}
],
"products" : [
{
"name" : "BuildAnalyzerKit",
"targets" : [
"BuildAnalyzerKit"
],
"type" : {
"library" : [
"automatic"
]
}
},
{
"name" : "GraphKit",
"targets" : [
"GraphKit"
],
"type" : {
"library" : [
"automatic"
]
}
},
{
"name" : "XcodeHasher",
"targets" : [
"XcodeHasher"
],
"type" : {
"library" : [
"automatic"
]
}
}
],
"targets" : [
{
"c99name" : "XcodeHasher",
"module_type" : "SwiftTarget",
"name" : "XcodeHasher",
"path" : "Sources/XcodeHasher",
"product_dependencies" : [
"CryptoSwift"
],
"product_memberships" : [
"XcodeHasher"
],
"sources" : [
"XcodeHasher.swift"
],
"type" : "library"
},
{
"c99name" : "GraphKitTests",
"module_type" : "SwiftTarget",
"name" : "GraphKitTests",
"path" : "Tests/GraphKitTests",
"sources" : [
"StartingFileTests.swift"
],
"target_dependencies" : [
"GraphKit"
],
"type" : "test"
},
{
"c99name" : "GraphKit",
"module_type" : "SwiftTarget",
"name" : "GraphKit",
"path" : "Sources/GraphKit",
"product_memberships" : [
"GraphKit"
],
"sources" : [
"D3Projector.swift"
],
"type" : "library"
},
{
"c99name" : "BuildAnalyzerKitTests",
"module_type" : "SwiftTarget",
"name" : "BuildAnalyzerKitTests",
"path" : "Tests/BuildAnalyzerKitTests",
"sources" : [
"AnalyzerTests.swift",
"BuildGraphNodeKindTests.swift"
],
"target_dependencies" : [
"BuildAnalyzerKit"
],
"type" : "test"
},
{
"c99name" : "BuildAnalyzerKit",
"module_type" : "SwiftTarget",
"name" : "BuildAnalyzerKit",
"path" : "Sources/BuildAnalyzerKit",
"product_dependencies" : [
"SQLite"
],
"product_memberships" : [
"BuildAnalyzerKit"
],
"sources" : [
"BuildGraph.swift",
"BuildGraphGenerator.swift",
"BuildGraphNode.swift",
"BuildGraphNodeKind.swift",
"BuildGraphProtocol.swift",
"BuildManifestParser.swift",
"DataStructure/Queue.swift",
"Projection/BuildGraphNodeProjectionNode.swift",
"Projection/BuildGraphProjection.swift",
"Projection/BuildGraphProjectionExpansion.swift",
"Projection/BuildGraphProtocol+Expansion.swift",
"Timing/BuildGraphNodeTimingReader.swift",
"Timing/BuildGraphNodeTimingSqlReader.swift"
],
"type" : "library"
}
],
"tools_version" : "5.9"
}
{
"workspace" : {
"name" : "spi-builder-workspace",
"schemes" : [
"BuildAnalyzer-Package",
"BuildAnalyzerKit",
"GraphKit",
"XcodeHasher"
]
}
}
Running build ...
env DEVELOPER_DIR=/Applications/Xcode-16.3.0.app xcrun xcodebuild -IDEClonedSourcePackagesDirPathOverride=$PWD/.dependencies -skipMacroValidation -skipPackagePluginValidation -derivedDataPath $PWD/.derivedData build -scheme BuildAnalyzer-Package -destination generic/platform=iOS
Command line invocation:
/Applications/Xcode-16.3.0.app/Contents/Developer/usr/bin/xcodebuild -IDEClonedSourcePackagesDirPathOverride=/Users/admin/builder/spi-builder-workspace/.dependencies -skipMacroValidation -skipPackagePluginValidation -derivedDataPath /Users/admin/builder/spi-builder-workspace/.derivedData build -scheme BuildAnalyzer-Package -destination generic/platform=iOS
Resolve Package Graph
Resolved source packages:
SQLite.swift: https://github.com/stephencelis/SQLite.swift.git @ 0.15.3
CryptoSwift: https://github.com/krzyzanowskim/CryptoSwift.git @ 1.8.4
BuildAnalyzer: /Users/admin/builder/spi-builder-workspace
ComputePackagePrebuildTargetDependencyGraph
Prepare packages
CreateBuildRequest
SendProjectDescription
CreateBuildOperation
ComputeTargetDependencyGraph
note: Building targets in dependency order
note: Target dependency graph (11 targets)
Target 'XcodeHasher' in project 'BuildAnalyzer'
➜ Explicit dependency on target 'XcodeHasher' in project 'BuildAnalyzer'
➜ Explicit dependency on target 'CryptoSwift' in project 'CryptoSwift'
Target 'XcodeHasher' in project 'BuildAnalyzer'
➜ Explicit dependency on target 'CryptoSwift' in project 'CryptoSwift'
Target 'CryptoSwift' in project 'CryptoSwift'
➜ Explicit dependency on target 'CryptoSwift' in project 'CryptoSwift'
➜ Explicit dependency on target 'CryptoSwift_CryptoSwift' in project 'CryptoSwift'
Target 'CryptoSwift' in project 'CryptoSwift'
➜ Explicit dependency on target 'CryptoSwift_CryptoSwift' in project 'CryptoSwift'
Target 'CryptoSwift_CryptoSwift' in project 'CryptoSwift' (no dependencies)
Target 'GraphKit' in project 'BuildAnalyzer'
➜ Explicit dependency on target 'GraphKit' in project 'BuildAnalyzer'
Target 'GraphKit' in project 'BuildAnalyzer' (no dependencies)
Target 'BuildAnalyzerKit' in project 'BuildAnalyzer'
➜ Explicit dependency on target 'BuildAnalyzerKit' in project 'BuildAnalyzer'
➜ Explicit dependency on target 'SQLite' in project 'SQLite.swift'
Target 'BuildAnalyzerKit' in project 'BuildAnalyzer'
➜ Explicit dependency on target 'SQLite' in project 'SQLite.swift'
Target 'SQLite' in project 'SQLite.swift'
➜ Explicit dependency on target 'SQLite' in project 'SQLite.swift'
Target 'SQLite' in project 'SQLite.swift' (no dependencies)
GatherProvisioningInputs
CreateBuildDescription
ExecuteExternalTool /Applications/Xcode-16.3.0.app/Contents/Developer/Toolchains/XcodeDefault.xctoolchain/usr/bin/swiftc --version
ExecuteExternalTool /Applications/Xcode-16.3.0.app/Contents/Developer/Toolchains/XcodeDefault.xctoolchain/usr/bin/clang -v -E -dM -isysroot /Applications/Xcode-16.3.0.app/Contents/Developer/Platforms/iPhoneOS.platform/Developer/SDKs/iPhoneOS18.4.sdk -x c -c /dev/null
ExecuteExternalTool /Applications/Xcode-16.3.0.app/Contents/Developer/Toolchains/XcodeDefault.xctoolchain/usr/bin/ld -version_details
Build description signature: 6dae164a50b7b5ce836746d893a6f381
Build description path: /Users/admin/builder/spi-builder-workspace/.derivedData/Build/Intermediates.noindex/XCBuildData/6dae164a50b7b5ce836746d893a6f381.xcbuilddata
ClangStatCache /Applications/Xcode-16.3.0.app/Contents/Developer/Toolchains/XcodeDefault.xctoolchain/usr/bin/clang-stat-cache /Applications/Xcode-16.3.0.app/Contents/Developer/Platforms/iPhoneOS.platform/Developer/SDKs/iPhoneOS18.4.sdk /Users/admin/builder/spi-builder-workspace/.derivedData/SDKStatCaches.noindex/iphoneos18.4-22E235-339d34bc69d7fc736c3220795c36f340.sdkstatcache
cd /Users/admin/builder/spi-builder-workspace/.swiftpm/xcode
/Applications/Xcode-16.3.0.app/Contents/Developer/Toolchains/XcodeDefault.xctoolchain/usr/bin/clang-stat-cache /Applications/Xcode-16.3.0.app/Contents/Developer/Platforms/iPhoneOS.platform/Developer/SDKs/iPhoneOS18.4.sdk -o /Users/admin/builder/spi-builder-workspace/.derivedData/SDKStatCaches.noindex/iphoneos18.4-22E235-339d34bc69d7fc736c3220795c36f340.sdkstatcache
ProcessInfoPlistFile /Users/admin/builder/spi-builder-workspace/.derivedData/Build/Products/Debug-iphoneos/CryptoSwift_CryptoSwift.bundle/Info.plist /Users/admin/builder/spi-builder-workspace/.derivedData/Build/Intermediates.noindex/CryptoSwift.build/Debug-iphoneos/CryptoSwift_CryptoSwift.build/empty-CryptoSwift_CryptoSwift.plist (in target 'CryptoSwift_CryptoSwift' from project 'CryptoSwift')
cd /Users/admin/builder/spi-builder-workspace/.dependencies/checkouts/CryptoSwift
builtin-infoPlistUtility /Users/admin/builder/spi-builder-workspace/.derivedData/Build/Intermediates.noindex/CryptoSwift.build/Debug-iphoneos/CryptoSwift_CryptoSwift.build/empty-CryptoSwift_CryptoSwift.plist -producttype com.apple.product-type.bundle -expandbuildsettings -format binary -platform iphoneos -requiredArchitecture arm64 -o /Users/admin/builder/spi-builder-workspace/.derivedData/Build/Products/Debug-iphoneos/CryptoSwift_CryptoSwift.bundle/Info.plist
SwiftDriver SQLite normal arm64 com.apple.xcode.tools.swift.compiler (in target 'SQLite' from project 'SQLite.swift')
cd /Users/admin/builder/spi-builder-workspace/.swiftpm/xcode
builtin-SwiftDriver -- /Applications/Xcode-16.3.0.app/Contents/Developer/Toolchains/XcodeDefault.xctoolchain/usr/bin/swiftc -module-name SQLite -Onone -enforce-exclusivity\=checked @/Users/admin/builder/spi-builder-workspace/.derivedData/Build/Intermediates.noindex/SQLite.swift.build/Debug-iphoneos/SQLite.build/Objects-normal/arm64/SQLite.SwiftFileList -DSWIFT_PACKAGE -DDEBUG -DXcode -plugin-path /Applications/Xcode-16.3.0.app/Contents/Developer/Toolchains/XcodeDefault.xctoolchain/usr/lib/swift/host/plugins/testing -enable-experimental-feature DebugDescriptionMacro -sdk /Applications/Xcode-16.3.0.app/Contents/Developer/Platforms/iPhoneOS.platform/Developer/SDKs/iPhoneOS18.4.sdk -target arm64-apple-ios12.0 -g -module-cache-path /Users/admin/builder/spi-builder-workspace/.derivedData/ModuleCache.noindex -Xfrontend -serialize-debugging-options -profile-coverage-mapping -profile-generate -enable-testing -suppress-warnings -index-store-path /Users/admin/builder/spi-builder-workspace/.derivedData/Index.noindex/DataStore -swift-version 5 -I /Users/admin/builder/spi-builder-workspace/.derivedData/Build/Products/Debug-iphoneos -I /Applications/Xcode-16.3.0.app/Contents/Developer/Platforms/iPhoneOS.platform/Developer/usr/lib -F /Users/admin/builder/spi-builder-workspace/.derivedData/Build/Products/Debug-iphoneos -F /Applications/Xcode-16.3.0.app/Contents/Developer/Platforms/iPhoneOS.platform/Developer/Library/Frameworks -F /Applications/Xcode-16.3.0.app/Contents/Developer/Platforms/iPhoneOS.platform/Developer/SDKs/iPhoneOS18.4.sdk/Developer/Library/Frameworks -c -j10 -enable-batch-mode -incremental -Xcc -ivfsstatcache -Xcc /Users/admin/builder/spi-builder-workspace/.derivedData/SDKStatCaches.noindex/iphoneos18.4-22E235-339d34bc69d7fc736c3220795c36f340.sdkstatcache -output-file-map /Users/admin/builder/spi-builder-workspace/.derivedData/Build/Intermediates.noindex/SQLite.swift.build/Debug-iphoneos/SQLite.build/Objects-normal/arm64/SQLite-OutputFileMap.json -use-frontend-parseable-output -save-temps -no-color-diagnostics -serialize-diagnostics -emit-dependencies -emit-module -emit-module-path /Users/admin/builder/spi-builder-workspace/.derivedData/Build/Intermediates.noindex/SQLite.swift.build/Debug-iphoneos/SQLite.build/Objects-normal/arm64/SQLite.swiftmodule -validate-clang-modules-once -clang-build-session-file /Users/admin/builder/spi-builder-workspace/.derivedData/ModuleCache.noindex/Session.modulevalidation -package-name sqlite_swift -Xcc -I/Users/admin/builder/spi-builder-workspace/.derivedData/Build/Intermediates.noindex/SQLite.swift.build/Debug-iphoneos/SQLite.build/swift-overrides.hmap -emit-const-values -Xfrontend -const-gather-protocols-file -Xfrontend /Users/admin/builder/spi-builder-workspace/.derivedData/Build/Intermediates.noindex/SQLite.swift.build/Debug-iphoneos/SQLite.build/Objects-normal/arm64/SQLite_const_extract_protocols.json -Xcc -I/Users/admin/builder/spi-builder-workspace/.derivedData/Build/Products/Debug-iphoneos/include -Xcc -I/Users/admin/builder/spi-builder-workspace/.derivedData/Build/Intermediates.noindex/SQLite.swift.build/Debug-iphoneos/SQLite.build/DerivedSources-normal/arm64 -Xcc -I/Users/admin/builder/spi-builder-workspace/.derivedData/Build/Intermediates.noindex/SQLite.swift.build/Debug-iphoneos/SQLite.build/DerivedSources/arm64 -Xcc -I/Users/admin/builder/spi-builder-workspace/.derivedData/Build/Intermediates.noindex/SQLite.swift.build/Debug-iphoneos/SQLite.build/DerivedSources -Xcc -DSWIFT_PACKAGE -Xcc -DDEBUG\=1 -emit-objc-header -emit-objc-header-path /Users/admin/builder/spi-builder-workspace/.derivedData/Build/Intermediates.noindex/SQLite.swift.build/Debug-iphoneos/SQLite.build/Objects-normal/arm64/SQLite-Swift.h -working-directory /Users/admin/builder/spi-builder-workspace/.swiftpm/xcode -experimental-emit-module-separately -disable-cmo
SwiftDriver GraphKit normal arm64 com.apple.xcode.tools.swift.compiler (in target 'GraphKit' from project 'BuildAnalyzer')
cd /Users/admin/builder/spi-builder-workspace/.swiftpm/xcode
builtin-SwiftDriver -- /Applications/Xcode-16.3.0.app/Contents/Developer/Toolchains/XcodeDefault.xctoolchain/usr/bin/swiftc -module-name GraphKit -Onone -enforce-exclusivity\=checked @/Users/admin/builder/spi-builder-workspace/.derivedData/Build/Intermediates.noindex/BuildAnalyzer.build/Debug-iphoneos/GraphKit.build/Objects-normal/arm64/GraphKit.SwiftFileList -DSWIFT_PACKAGE -DDEBUG -DXcode -plugin-path /Applications/Xcode-16.3.0.app/Contents/Developer/Toolchains/XcodeDefault.xctoolchain/usr/lib/swift/host/plugins/testing -enable-experimental-feature DebugDescriptionMacro -sdk /Applications/Xcode-16.3.0.app/Contents/Developer/Platforms/iPhoneOS.platform/Developer/SDKs/iPhoneOS18.4.sdk -target arm64-apple-ios12.0 -g -module-cache-path /Users/admin/builder/spi-builder-workspace/.derivedData/ModuleCache.noindex -Xfrontend -serialize-debugging-options -profile-coverage-mapping -profile-generate -enable-testing -index-store-path /Users/admin/builder/spi-builder-workspace/.derivedData/Index.noindex/DataStore -swift-version 5 -I /Users/admin/builder/spi-builder-workspace/.derivedData/Build/Products/Debug-iphoneos -I /Applications/Xcode-16.3.0.app/Contents/Developer/Platforms/iPhoneOS.platform/Developer/usr/lib -F /Users/admin/builder/spi-builder-workspace/.derivedData/Build/Products/Debug-iphoneos -F /Applications/Xcode-16.3.0.app/Contents/Developer/Platforms/iPhoneOS.platform/Developer/Library/Frameworks -F /Applications/Xcode-16.3.0.app/Contents/Developer/Platforms/iPhoneOS.platform/Developer/SDKs/iPhoneOS18.4.sdk/Developer/Library/Frameworks -parse-as-library -c -j10 -enable-batch-mode -incremental -Xcc -ivfsstatcache -Xcc /Users/admin/builder/spi-builder-workspace/.derivedData/SDKStatCaches.noindex/iphoneos18.4-22E235-339d34bc69d7fc736c3220795c36f340.sdkstatcache -output-file-map /Users/admin/builder/spi-builder-workspace/.derivedData/Build/Intermediates.noindex/BuildAnalyzer.build/Debug-iphoneos/GraphKit.build/Objects-normal/arm64/GraphKit-OutputFileMap.json -use-frontend-parseable-output -save-temps -no-color-diagnostics -serialize-diagnostics -emit-dependencies -emit-module -emit-module-path /Users/admin/builder/spi-builder-workspace/.derivedData/Build/Intermediates.noindex/BuildAnalyzer.build/Debug-iphoneos/GraphKit.build/Objects-normal/arm64/GraphKit.swiftmodule -validate-clang-modules-once -clang-build-session-file /Users/admin/builder/spi-builder-workspace/.derivedData/ModuleCache.noindex/Session.modulevalidation -package-name spi_builder_workspace -Xcc -I/Users/admin/builder/spi-builder-workspace/.derivedData/Build/Intermediates.noindex/BuildAnalyzer.build/Debug-iphoneos/GraphKit.build/swift-overrides.hmap -emit-const-values -Xfrontend -const-gather-protocols-file -Xfrontend /Users/admin/builder/spi-builder-workspace/.derivedData/Build/Intermediates.noindex/BuildAnalyzer.build/Debug-iphoneos/GraphKit.build/Objects-normal/arm64/GraphKit_const_extract_protocols.json -Xcc -I/Users/admin/builder/spi-builder-workspace/.derivedData/Build/Products/Debug-iphoneos/include -Xcc -I/Users/admin/builder/spi-builder-workspace/.derivedData/Build/Intermediates.noindex/BuildAnalyzer.build/Debug-iphoneos/GraphKit.build/DerivedSources-normal/arm64 -Xcc -I/Users/admin/builder/spi-builder-workspace/.derivedData/Build/Intermediates.noindex/BuildAnalyzer.build/Debug-iphoneos/GraphKit.build/DerivedSources/arm64 -Xcc -I/Users/admin/builder/spi-builder-workspace/.derivedData/Build/Intermediates.noindex/BuildAnalyzer.build/Debug-iphoneos/GraphKit.build/DerivedSources -Xcc -DSWIFT_PACKAGE -Xcc -DDEBUG\=1 -emit-objc-header -emit-objc-header-path /Users/admin/builder/spi-builder-workspace/.derivedData/Build/Intermediates.noindex/BuildAnalyzer.build/Debug-iphoneos/GraphKit.build/Objects-normal/arm64/GraphKit-Swift.h -working-directory /Users/admin/builder/spi-builder-workspace/.swiftpm/xcode -experimental-emit-module-separately -disable-cmo
SwiftDriver CryptoSwift normal arm64 com.apple.xcode.tools.swift.compiler (in target 'CryptoSwift' from project 'CryptoSwift')
cd /Users/admin/builder/spi-builder-workspace/.swiftpm/xcode
builtin-SwiftDriver -- /Applications/Xcode-16.3.0.app/Contents/Developer/Toolchains/XcodeDefault.xctoolchain/usr/bin/swiftc -module-name CryptoSwift -Onone -enforce-exclusivity\=checked @/Users/admin/builder/spi-builder-workspace/.derivedData/Build/Intermediates.noindex/CryptoSwift.build/Debug-iphoneos/CryptoSwift.build/Objects-normal/arm64/CryptoSwift.SwiftFileList -DSWIFT_PACKAGE -DDEBUG -DXcode -plugin-path /Applications/Xcode-16.3.0.app/Contents/Developer/Toolchains/XcodeDefault.xctoolchain/usr/lib/swift/host/plugins/testing -enable-experimental-feature DebugDescriptionMacro -sdk /Applications/Xcode-16.3.0.app/Contents/Developer/Platforms/iPhoneOS.platform/Developer/SDKs/iPhoneOS18.4.sdk -target arm64-apple-ios12.0 -g -module-cache-path /Users/admin/builder/spi-builder-workspace/.derivedData/ModuleCache.noindex -Xfrontend -serialize-debugging-options -profile-coverage-mapping -profile-generate -enable-testing -suppress-warnings -index-store-path /Users/admin/builder/spi-builder-workspace/.derivedData/Index.noindex/DataStore -swift-version 5 -I /Users/admin/builder/spi-builder-workspace/.derivedData/Build/Products/Debug-iphoneos -I /Applications/Xcode-16.3.0.app/Contents/Developer/Platforms/iPhoneOS.platform/Developer/usr/lib -F /Users/admin/builder/spi-builder-workspace/.derivedData/Build/Products/Debug-iphoneos -F /Applications/Xcode-16.3.0.app/Contents/Developer/Platforms/iPhoneOS.platform/Developer/Library/Frameworks -F /Applications/Xcode-16.3.0.app/Contents/Developer/Platforms/iPhoneOS.platform/Developer/SDKs/iPhoneOS18.4.sdk/Developer/Library/Frameworks -c -j10 -enable-batch-mode -incremental -Xcc -ivfsstatcache -Xcc /Users/admin/builder/spi-builder-workspace/.derivedData/SDKStatCaches.noindex/iphoneos18.4-22E235-339d34bc69d7fc736c3220795c36f340.sdkstatcache -output-file-map /Users/admin/builder/spi-builder-workspace/.derivedData/Build/Intermediates.noindex/CryptoSwift.build/Debug-iphoneos/CryptoSwift.build/Objects-normal/arm64/CryptoSwift-OutputFileMap.json -use-frontend-parseable-output -save-temps -no-color-diagnostics -serialize-diagnostics -emit-dependencies -emit-module -emit-module-path /Users/admin/builder/spi-builder-workspace/.derivedData/Build/Intermediates.noindex/CryptoSwift.build/Debug-iphoneos/CryptoSwift.build/Objects-normal/arm64/CryptoSwift.swiftmodule -validate-clang-modules-once -clang-build-session-file /Users/admin/builder/spi-builder-workspace/.derivedData/ModuleCache.noindex/Session.modulevalidation -Xcc -I/Users/admin/builder/spi-builder-workspace/.derivedData/Build/Intermediates.noindex/CryptoSwift.build/Debug-iphoneos/CryptoSwift.build/swift-overrides.hmap -emit-const-values -Xfrontend -const-gather-protocols-file -Xfrontend /Users/admin/builder/spi-builder-workspace/.derivedData/Build/Intermediates.noindex/CryptoSwift.build/Debug-iphoneos/CryptoSwift.build/Objects-normal/arm64/CryptoSwift_const_extract_protocols.json -Xcc -I/Users/admin/builder/spi-builder-workspace/.derivedData/Build/Products/Debug-iphoneos/include -Xcc -I/Users/admin/builder/spi-builder-workspace/.derivedData/Build/Intermediates.noindex/CryptoSwift.build/Debug-iphoneos/CryptoSwift.build/DerivedSources-normal/arm64 -Xcc -I/Users/admin/builder/spi-builder-workspace/.derivedData/Build/Intermediates.noindex/CryptoSwift.build/Debug-iphoneos/CryptoSwift.build/DerivedSources/arm64 -Xcc -I/Users/admin/builder/spi-builder-workspace/.derivedData/Build/Intermediates.noindex/CryptoSwift.build/Debug-iphoneos/CryptoSwift.build/DerivedSources -Xcc -DSWIFT_PACKAGE -Xcc -DDEBUG\=1 -emit-objc-header -emit-objc-header-path /Users/admin/builder/spi-builder-workspace/.derivedData/Build/Intermediates.noindex/CryptoSwift.build/Debug-iphoneos/CryptoSwift.build/Objects-normal/arm64/CryptoSwift-Swift.h -working-directory /Users/admin/builder/spi-builder-workspace/.swiftpm/xcode -experimental-emit-module-separately -disable-cmo
SwiftEmitModule normal arm64 Emitting\ module\ for\ GraphKit (in target 'GraphKit' from project 'BuildAnalyzer')
SwiftCompile normal arm64 /Users/admin/builder/spi-builder-workspace/Sources/GraphKit/D3Projector.swift (in target 'GraphKit' from project 'BuildAnalyzer')
cd /Users/admin/builder/spi-builder-workspace/.swiftpm/xcode
SwiftCompile normal arm64 Compiling\ D3Projector.swift /Users/admin/builder/spi-builder-workspace/Sources/GraphKit/D3Projector.swift (in target 'GraphKit' from project 'BuildAnalyzer')
SwiftCompile normal arm64 /Users/admin/builder/spi-builder-workspace/Sources/GraphKit/D3Projector.swift (in target 'GraphKit' from project 'BuildAnalyzer')
cd /Users/admin/builder/spi-builder-workspace/.swiftpm/xcode
SwiftCompile normal arm64 Compiling\ CS.swift,\ Codable.swift,\ Comparable.swift,\ DataConversion.swift,\ Division.swift,\ Exponentiation.swift,\ FloatingPointConversion.swift,\ GCD.swift,\ Hashable.swift,\ IntegerConversion.swift,\ Multiplication.swift,\ PrimeTest.swift /Users/admin/builder/spi-builder-workspace/.dependencies/checkouts/CryptoSwift/Sources/CryptoSwift/CS_BigInt/CS.swift /Users/admin/builder/spi-builder-workspace/.dependencies/checkouts/CryptoSwift/Sources/CryptoSwift/CS_BigInt/Codable.swift /Users/admin/builder/spi-builder-workspace/.dependencies/checkouts/CryptoSwift/Sources/CryptoSwift/CS_BigInt/Comparable.swift /Users/admin/builder/spi-builder-workspace/.dependencies/checkouts/CryptoSwift/Sources/CryptoSwift/CS_BigInt/DataConversion.swift /Users/admin/builder/spi-builder-workspace/.dependencies/checkouts/CryptoSwift/Sources/CryptoSwift/CS_BigInt/Division.swift /Users/admin/builder/spi-builder-workspace/.dependencies/checkouts/CryptoSwift/Sources/CryptoSwift/CS_BigInt/Exponentiation.swift /Users/admin/builder/spi-builder-workspace/.dependencies/checkouts/CryptoSwift/Sources/CryptoSwift/CS_BigInt/FloatingPointConversion.swift /Users/admin/builder/spi-builder-workspace/.dependencies/checkouts/CryptoSwift/Sources/CryptoSwift/CS_BigInt/GCD.swift /Users/admin/builder/spi-builder-workspace/.dependencies/checkouts/CryptoSwift/Sources/CryptoSwift/CS_BigInt/Hashable.swift /Users/admin/builder/spi-builder-workspace/.dependencies/checkouts/CryptoSwift/Sources/CryptoSwift/CS_BigInt/IntegerConversion.swift /Users/admin/builder/spi-builder-workspace/.dependencies/checkouts/CryptoSwift/Sources/CryptoSwift/CS_BigInt/Multiplication.swift /Users/admin/builder/spi-builder-workspace/.dependencies/checkouts/CryptoSwift/Sources/CryptoSwift/CS_BigInt/PrimeTest.swift (in target 'CryptoSwift' from project 'CryptoSwift')
SwiftCompile normal arm64 /Users/admin/builder/spi-builder-workspace/.dependencies/checkouts/CryptoSwift/Sources/CryptoSwift/CS_BigInt/CS.swift (in target 'CryptoSwift' from project 'CryptoSwift')
cd /Users/admin/builder/spi-builder-workspace/.swiftpm/xcode
SwiftCompile normal arm64 /Users/admin/builder/spi-builder-workspace/.dependencies/checkouts/CryptoSwift/Sources/CryptoSwift/CS_BigInt/Codable.swift (in target 'CryptoSwift' from project 'CryptoSwift')
cd /Users/admin/builder/spi-builder-workspace/.swiftpm/xcode
SwiftCompile normal arm64 /Users/admin/builder/spi-builder-workspace/.dependencies/checkouts/CryptoSwift/Sources/CryptoSwift/CS_BigInt/Comparable.swift (in target 'CryptoSwift' from project 'CryptoSwift')
cd /Users/admin/builder/spi-builder-workspace/.swiftpm/xcode
SwiftCompile normal arm64 /Users/admin/builder/spi-builder-workspace/.dependencies/checkouts/CryptoSwift/Sources/CryptoSwift/CS_BigInt/DataConversion.swift (in target 'CryptoSwift' from project 'CryptoSwift')
cd /Users/admin/builder/spi-builder-workspace/.swiftpm/xcode
SwiftCompile normal arm64 /Users/admin/builder/spi-builder-workspace/.dependencies/checkouts/CryptoSwift/Sources/CryptoSwift/CS_BigInt/Division.swift (in target 'CryptoSwift' from project 'CryptoSwift')
cd /Users/admin/builder/spi-builder-workspace/.swiftpm/xcode
SwiftCompile normal arm64 /Users/admin/builder/spi-builder-workspace/.dependencies/checkouts/CryptoSwift/Sources/CryptoSwift/CS_BigInt/Exponentiation.swift (in target 'CryptoSwift' from project 'CryptoSwift')
cd /Users/admin/builder/spi-builder-workspace/.swiftpm/xcode
SwiftCompile normal arm64 /Users/admin/builder/spi-builder-workspace/.dependencies/checkouts/CryptoSwift/Sources/CryptoSwift/CS_BigInt/FloatingPointConversion.swift (in target 'CryptoSwift' from project 'CryptoSwift')
cd /Users/admin/builder/spi-builder-workspace/.swiftpm/xcode
SwiftCompile normal arm64 /Users/admin/builder/spi-builder-workspace/.dependencies/checkouts/CryptoSwift/Sources/CryptoSwift/CS_BigInt/GCD.swift (in target 'CryptoSwift' from project 'CryptoSwift')
cd /Users/admin/builder/spi-builder-workspace/.swiftpm/xcode
SwiftCompile normal arm64 /Users/admin/builder/spi-builder-workspace/.dependencies/checkouts/CryptoSwift/Sources/CryptoSwift/CS_BigInt/Hashable.swift (in target 'CryptoSwift' from project 'CryptoSwift')
cd /Users/admin/builder/spi-builder-workspace/.swiftpm/xcode
SwiftCompile normal arm64 /Users/admin/builder/spi-builder-workspace/.dependencies/checkouts/CryptoSwift/Sources/CryptoSwift/CS_BigInt/IntegerConversion.swift (in target 'CryptoSwift' from project 'CryptoSwift')
cd /Users/admin/builder/spi-builder-workspace/.swiftpm/xcode
SwiftCompile normal arm64 /Users/admin/builder/spi-builder-workspace/.dependencies/checkouts/CryptoSwift/Sources/CryptoSwift/CS_BigInt/Multiplication.swift (in target 'CryptoSwift' from project 'CryptoSwift')
cd /Users/admin/builder/spi-builder-workspace/.swiftpm/xcode
SwiftCompile normal arm64 /Users/admin/builder/spi-builder-workspace/.dependencies/checkouts/CryptoSwift/Sources/CryptoSwift/CS_BigInt/PrimeTest.swift (in target 'CryptoSwift' from project 'CryptoSwift')
cd /Users/admin/builder/spi-builder-workspace/.swiftpm/xcode
SwiftEmitModule normal arm64 Emitting\ module\ for\ CryptoSwift (in target 'CryptoSwift' from project 'CryptoSwift')
EmitSwiftModule normal arm64 (in target 'CryptoSwift' from project 'CryptoSwift')
cd /Users/admin/builder/spi-builder-workspace/.swiftpm/xcode
SwiftCompile normal arm64 Compiling\ NoPadding.swift,\ Operators.swift,\ DER.swift,\ PBKDF1.swift,\ PBKDF2.swift,\ PKCS1v15.swift,\ PKCS5.swift,\ PKCS7.swift,\ PKCS7Padding.swift,\ Padding.swift,\ Poly1305.swift /Users/admin/builder/spi-builder-workspace/.dependencies/checkouts/CryptoSwift/Sources/CryptoSwift/NoPadding.swift /Users/admin/builder/spi-builder-workspace/.dependencies/checkouts/CryptoSwift/Sources/CryptoSwift/Operators.swift /Users/admin/builder/spi-builder-workspace/.dependencies/checkouts/CryptoSwift/Sources/CryptoSwift/PEM/DER.swift /Users/admin/builder/spi-builder-workspace/.dependencies/checkouts/CryptoSwift/Sources/CryptoSwift/PKCS/PBKDF1.swift /Users/admin/builder/spi-builder-workspace/.dependencies/checkouts/CryptoSwift/Sources/CryptoSwift/PKCS/PBKDF2.swift /Users/admin/builder/spi-builder-workspace/.dependencies/checkouts/CryptoSwift/Sources/CryptoSwift/PKCS/PKCS1v15.swift /Users/admin/builder/spi-builder-workspace/.dependencies/checkouts/CryptoSwift/Sources/CryptoSwift/PKCS/PKCS5.swift /Users/admin/builder/spi-builder-workspace/.dependencies/checkouts/CryptoSwift/Sources/CryptoSwift/PKCS/PKCS7.swift /Users/admin/builder/spi-builder-workspace/.dependencies/checkouts/CryptoSwift/Sources/CryptoSwift/PKCS/PKCS7Padding.swift /Users/admin/builder/spi-builder-workspace/.dependencies/checkouts/CryptoSwift/Sources/CryptoSwift/Padding.swift /Users/admin/builder/spi-builder-workspace/.dependencies/checkouts/CryptoSwift/Sources/CryptoSwift/Poly1305.swift (in target 'CryptoSwift' from project 'CryptoSwift')
SwiftCompile normal arm64 /Users/admin/builder/spi-builder-workspace/.dependencies/checkouts/CryptoSwift/Sources/CryptoSwift/NoPadding.swift (in target 'CryptoSwift' from project 'CryptoSwift')
cd /Users/admin/builder/spi-builder-workspace/.swiftpm/xcode
SwiftCompile normal arm64 /Users/admin/builder/spi-builder-workspace/.dependencies/checkouts/CryptoSwift/Sources/CryptoSwift/Operators.swift (in target 'CryptoSwift' from project 'CryptoSwift')
cd /Users/admin/builder/spi-builder-workspace/.swiftpm/xcode
SwiftCompile normal arm64 /Users/admin/builder/spi-builder-workspace/.dependencies/checkouts/CryptoSwift/Sources/CryptoSwift/PEM/DER.swift (in target 'CryptoSwift' from project 'CryptoSwift')
cd /Users/admin/builder/spi-builder-workspace/.swiftpm/xcode
SwiftCompile normal arm64 /Users/admin/builder/spi-builder-workspace/.dependencies/checkouts/CryptoSwift/Sources/CryptoSwift/PKCS/PBKDF1.swift (in target 'CryptoSwift' from project 'CryptoSwift')
cd /Users/admin/builder/spi-builder-workspace/.swiftpm/xcode
SwiftCompile normal arm64 /Users/admin/builder/spi-builder-workspace/.dependencies/checkouts/CryptoSwift/Sources/CryptoSwift/PKCS/PBKDF2.swift (in target 'CryptoSwift' from project 'CryptoSwift')
cd /Users/admin/builder/spi-builder-workspace/.swiftpm/xcode
SwiftCompile normal arm64 /Users/admin/builder/spi-builder-workspace/.dependencies/checkouts/CryptoSwift/Sources/CryptoSwift/PKCS/PKCS1v15.swift (in target 'CryptoSwift' from project 'CryptoSwift')
cd /Users/admin/builder/spi-builder-workspace/.swiftpm/xcode
SwiftCompile normal arm64 /Users/admin/builder/spi-builder-workspace/.dependencies/checkouts/CryptoSwift/Sources/CryptoSwift/PKCS/PKCS5.swift (in target 'CryptoSwift' from project 'CryptoSwift')
cd /Users/admin/builder/spi-builder-workspace/.swiftpm/xcode
SwiftCompile normal arm64 /Users/admin/builder/spi-builder-workspace/.dependencies/checkouts/CryptoSwift/Sources/CryptoSwift/PKCS/PKCS7.swift (in target 'CryptoSwift' from project 'CryptoSwift')
cd /Users/admin/builder/spi-builder-workspace/.swiftpm/xcode
SwiftCompile normal arm64 /Users/admin/builder/spi-builder-workspace/.dependencies/checkouts/CryptoSwift/Sources/CryptoSwift/PKCS/PKCS7Padding.swift (in target 'CryptoSwift' from project 'CryptoSwift')
cd /Users/admin/builder/spi-builder-workspace/.swiftpm/xcode
SwiftCompile normal arm64 /Users/admin/builder/spi-builder-workspace/.dependencies/checkouts/CryptoSwift/Sources/CryptoSwift/Padding.swift (in target 'CryptoSwift' from project 'CryptoSwift')
cd /Users/admin/builder/spi-builder-workspace/.swiftpm/xcode
SwiftCompile normal arm64 /Users/admin/builder/spi-builder-workspace/.dependencies/checkouts/CryptoSwift/Sources/CryptoSwift/Poly1305.swift (in target 'CryptoSwift' from project 'CryptoSwift')
cd /Users/admin/builder/spi-builder-workspace/.swiftpm/xcode
SwiftCompile normal arm64 Compiling\ Rabbit+Foundation.swift,\ String+FoundationExtension.swift,\ Utils+Foundation.swift,\ XChaCha20+Foundation.swift,\ Generics.swift,\ HKDF.swift,\ HMAC.swift,\ ISO10126Padding.swift,\ ISO78164Padding.swift,\ Int+Extension.swift,\ MD5.swift /Users/admin/builder/spi-builder-workspace/.dependencies/checkouts/CryptoSwift/Sources/CryptoSwift/Foundation/Rabbit+Foundation.swift /Users/admin/builder/spi-builder-workspace/.dependencies/checkouts/CryptoSwift/Sources/CryptoSwift/Foundation/String+FoundationExtension.swift /Users/admin/builder/spi-builder-workspace/.dependencies/checkouts/CryptoSwift/Sources/CryptoSwift/Foundation/Utils+Foundation.swift /Users/admin/builder/spi-builder-workspace/.dependencies/checkouts/CryptoSwift/Sources/CryptoSwift/Foundation/XChaCha20+Foundation.swift /Users/admin/builder/spi-builder-workspace/.dependencies/checkouts/CryptoSwift/Sources/CryptoSwift/Generics.swift /Users/admin/builder/spi-builder-workspace/.dependencies/checkouts/CryptoSwift/Sources/CryptoSwift/HKDF.swift /Users/admin/builder/spi-builder-workspace/.dependencies/checkouts/CryptoSwift/Sources/CryptoSwift/HMAC.swift /Users/admin/builder/spi-builder-workspace/.dependencies/checkouts/CryptoSwift/Sources/CryptoSwift/ISO10126Padding.swift /Users/admin/builder/spi-builder-workspace/.dependencies/checkouts/CryptoSwift/Sources/CryptoSwift/ISO78164Padding.swift /Users/admin/builder/spi-builder-workspace/.dependencies/checkouts/CryptoSwift/Sources/CryptoSwift/Int+Extension.swift /Users/admin/builder/spi-builder-workspace/.dependencies/checkouts/CryptoSwift/Sources/CryptoSwift/MD5.swift (in target 'CryptoSwift' from project 'CryptoSwift')
SwiftCompile normal arm64 /Users/admin/builder/spi-builder-workspace/.dependencies/checkouts/CryptoSwift/Sources/CryptoSwift/Foundation/Rabbit+Foundation.swift (in target 'CryptoSwift' from project 'CryptoSwift')
cd /Users/admin/builder/spi-builder-workspace/.swiftpm/xcode
SwiftCompile normal arm64 /Users/admin/builder/spi-builder-workspace/.dependencies/checkouts/CryptoSwift/Sources/CryptoSwift/Foundation/String+FoundationExtension.swift (in target 'CryptoSwift' from project 'CryptoSwift')
cd /Users/admin/builder/spi-builder-workspace/.swiftpm/xcode
SwiftCompile normal arm64 /Users/admin/builder/spi-builder-workspace/.dependencies/checkouts/CryptoSwift/Sources/CryptoSwift/Foundation/Utils+Foundation.swift (in target 'CryptoSwift' from project 'CryptoSwift')
cd /Users/admin/builder/spi-builder-workspace/.swiftpm/xcode
SwiftCompile normal arm64 /Users/admin/builder/spi-builder-workspace/.dependencies/checkouts/CryptoSwift/Sources/CryptoSwift/Foundation/XChaCha20+Foundation.swift (in target 'CryptoSwift' from project 'CryptoSwift')
cd /Users/admin/builder/spi-builder-workspace/.swiftpm/xcode
SwiftCompile normal arm64 /Users/admin/builder/spi-builder-workspace/.dependencies/checkouts/CryptoSwift/Sources/CryptoSwift/Generics.swift (in target 'CryptoSwift' from project 'CryptoSwift')
cd /Users/admin/builder/spi-builder-workspace/.swiftpm/xcode
SwiftCompile normal arm64 /Users/admin/builder/spi-builder-workspace/.dependencies/checkouts/CryptoSwift/Sources/CryptoSwift/HKDF.swift (in target 'CryptoSwift' from project 'CryptoSwift')
cd /Users/admin/builder/spi-builder-workspace/.swiftpm/xcode
SwiftCompile normal arm64 /Users/admin/builder/spi-builder-workspace/.dependencies/checkouts/CryptoSwift/Sources/CryptoSwift/HMAC.swift (in target 'CryptoSwift' from project 'CryptoSwift')
cd /Users/admin/builder/spi-builder-workspace/.swiftpm/xcode
SwiftCompile normal arm64 /Users/admin/builder/spi-builder-workspace/.dependencies/checkouts/CryptoSwift/Sources/CryptoSwift/ISO10126Padding.swift (in target 'CryptoSwift' from project 'CryptoSwift')
cd /Users/admin/builder/spi-builder-workspace/.swiftpm/xcode
SwiftCompile normal arm64 /Users/admin/builder/spi-builder-workspace/.dependencies/checkouts/CryptoSwift/Sources/CryptoSwift/ISO78164Padding.swift (in target 'CryptoSwift' from project 'CryptoSwift')
cd /Users/admin/builder/spi-builder-workspace/.swiftpm/xcode
SwiftCompile normal arm64 /Users/admin/builder/spi-builder-workspace/.dependencies/checkouts/CryptoSwift/Sources/CryptoSwift/Int+Extension.swift (in target 'CryptoSwift' from project 'CryptoSwift')
cd /Users/admin/builder/spi-builder-workspace/.swiftpm/xcode
SwiftCompile normal arm64 /Users/admin/builder/spi-builder-workspace/.dependencies/checkouts/CryptoSwift/Sources/CryptoSwift/MD5.swift (in target 'CryptoSwift' from project 'CryptoSwift')
cd /Users/admin/builder/spi-builder-workspace/.swiftpm/xcode
SwiftCompile normal arm64 Compiling\ ECB.swift,\ GCM.swift,\ OCB.swift,\ OFB.swift,\ PCBC.swift,\ Blowfish.swift,\ CBCMAC.swift,\ CMAC.swift,\ Addition.swift,\ BigInt.swift,\ BigUInt.swift,\ BitwiseOps.swift /Users/admin/builder/spi-builder-workspace/.dependencies/checkouts/CryptoSwift/Sources/CryptoSwift/BlockMode/ECB.swift /Users/admin/builder/spi-builder-workspace/.dependencies/checkouts/CryptoSwift/Sources/CryptoSwift/BlockMode/GCM.swift /Users/admin/builder/spi-builder-workspace/.dependencies/checkouts/CryptoSwift/Sources/CryptoSwift/BlockMode/OCB.swift /Users/admin/builder/spi-builder-workspace/.dependencies/checkouts/CryptoSwift/Sources/CryptoSwift/BlockMode/OFB.swift /Users/admin/builder/spi-builder-workspace/.dependencies/checkouts/CryptoSwift/Sources/CryptoSwift/BlockMode/PCBC.swift /Users/admin/builder/spi-builder-workspace/.dependencies/checkouts/CryptoSwift/Sources/CryptoSwift/Blowfish.swift /Users/admin/builder/spi-builder-workspace/.dependencies/checkouts/CryptoSwift/Sources/CryptoSwift/CBCMAC.swift /Users/admin/builder/spi-builder-workspace/.dependencies/checkouts/CryptoSwift/Sources/CryptoSwift/CMAC.swift /Users/admin/builder/spi-builder-workspace/.dependencies/checkouts/CryptoSwift/Sources/CryptoSwift/CS_BigInt/Addition.swift /Users/admin/builder/spi-builder-workspace/.dependencies/checkouts/CryptoSwift/Sources/CryptoSwift/CS_BigInt/BigInt.swift /Users/admin/builder/spi-builder-workspace/.dependencies/checkouts/CryptoSwift/Sources/CryptoSwift/CS_BigInt/BigUInt.swift /Users/admin/builder/spi-builder-workspace/.dependencies/checkouts/CryptoSwift/Sources/CryptoSwift/CS_BigInt/BitwiseOps.swift (in target 'CryptoSwift' from project 'CryptoSwift')
SwiftCompile normal arm64 /Users/admin/builder/spi-builder-workspace/.dependencies/checkouts/CryptoSwift/Sources/CryptoSwift/BlockMode/ECB.swift (in target 'CryptoSwift' from project 'CryptoSwift')
cd /Users/admin/builder/spi-builder-workspace/.swiftpm/xcode
SwiftCompile normal arm64 /Users/admin/builder/spi-builder-workspace/.dependencies/checkouts/CryptoSwift/Sources/CryptoSwift/BlockMode/GCM.swift (in target 'CryptoSwift' from project 'CryptoSwift')
cd /Users/admin/builder/spi-builder-workspace/.swiftpm/xcode
SwiftCompile normal arm64 /Users/admin/builder/spi-builder-workspace/.dependencies/checkouts/CryptoSwift/Sources/CryptoSwift/BlockMode/OCB.swift (in target 'CryptoSwift' from project 'CryptoSwift')
cd /Users/admin/builder/spi-builder-workspace/.swiftpm/xcode
SwiftCompile normal arm64 /Users/admin/builder/spi-builder-workspace/.dependencies/checkouts/CryptoSwift/Sources/CryptoSwift/BlockMode/OFB.swift (in target 'CryptoSwift' from project 'CryptoSwift')
cd /Users/admin/builder/spi-builder-workspace/.swiftpm/xcode
SwiftCompile normal arm64 /Users/admin/builder/spi-builder-workspace/.dependencies/checkouts/CryptoSwift/Sources/CryptoSwift/BlockMode/PCBC.swift (in target 'CryptoSwift' from project 'CryptoSwift')
cd /Users/admin/builder/spi-builder-workspace/.swiftpm/xcode
SwiftCompile normal arm64 /Users/admin/builder/spi-builder-workspace/.dependencies/checkouts/CryptoSwift/Sources/CryptoSwift/Blowfish.swift (in target 'CryptoSwift' from project 'CryptoSwift')
cd /Users/admin/builder/spi-builder-workspace/.swiftpm/xcode
SwiftCompile normal arm64 /Users/admin/builder/spi-builder-workspace/.dependencies/checkouts/CryptoSwift/Sources/CryptoSwift/CBCMAC.swift (in target 'CryptoSwift' from project 'CryptoSwift')
cd /Users/admin/builder/spi-builder-workspace/.swiftpm/xcode
SwiftCompile normal arm64 /Users/admin/builder/spi-builder-workspace/.dependencies/checkouts/CryptoSwift/Sources/CryptoSwift/CMAC.swift (in target 'CryptoSwift' from project 'CryptoSwift')
cd /Users/admin/builder/spi-builder-workspace/.swiftpm/xcode
SwiftCompile normal arm64 /Users/admin/builder/spi-builder-workspace/.dependencies/checkouts/CryptoSwift/Sources/CryptoSwift/CS_BigInt/Addition.swift (in target 'CryptoSwift' from project 'CryptoSwift')
cd /Users/admin/builder/spi-builder-workspace/.swiftpm/xcode
SwiftCompile normal arm64 /Users/admin/builder/spi-builder-workspace/.dependencies/checkouts/CryptoSwift/Sources/CryptoSwift/CS_BigInt/BigInt.swift (in target 'CryptoSwift' from project 'CryptoSwift')
cd /Users/admin/builder/spi-builder-workspace/.swiftpm/xcode
SwiftCompile normal arm64 /Users/admin/builder/spi-builder-workspace/.dependencies/checkouts/CryptoSwift/Sources/CryptoSwift/CS_BigInt/BigUInt.swift (in target 'CryptoSwift' from project 'CryptoSwift')
cd /Users/admin/builder/spi-builder-workspace/.swiftpm/xcode
SwiftCompile normal arm64 /Users/admin/builder/spi-builder-workspace/.dependencies/checkouts/CryptoSwift/Sources/CryptoSwift/CS_BigInt/BitwiseOps.swift (in target 'CryptoSwift' from project 'CryptoSwift')
cd /Users/admin/builder/spi-builder-workspace/.swiftpm/xcode
SwiftCompile normal arm64 Compiling\ RSA+Cipher.swift,\ RSA+Signature.swift,\ RSA.swift,\ Rabbit.swift,\ SHA1.swift,\ SHA2.swift,\ SHA3.swift,\ Scrypt.swift,\ SecureBytes.swift,\ Signature.swift,\ StreamDecryptor.swift /Users/admin/builder/spi-builder-workspace/.dependencies/checkouts/CryptoSwift/Sources/CryptoSwift/RSA/RSA+Cipher.swift /Users/admin/builder/spi-builder-workspace/.dependencies/checkouts/CryptoSwift/Sources/CryptoSwift/RSA/RSA+Signature.swift /Users/admin/builder/spi-builder-workspace/.dependencies/checkouts/CryptoSwift/Sources/CryptoSwift/RSA/RSA.swift /Users/admin/builder/spi-builder-workspace/.dependencies/checkouts/CryptoSwift/Sources/CryptoSwift/Rabbit.swift /Users/admin/builder/spi-builder-workspace/.dependencies/checkouts/CryptoSwift/Sources/CryptoSwift/SHA1.swift /Users/admin/builder/spi-builder-workspace/.dependencies/checkouts/CryptoSwift/Sources/CryptoSwift/SHA2.swift /Users/admin/builder/spi-builder-workspace/.dependencies/checkouts/CryptoSwift/Sources/CryptoSwift/SHA3.swift /Users/admin/builder/spi-builder-workspace/.dependencies/checkouts/CryptoSwift/Sources/CryptoSwift/Scrypt.swift /Users/admin/builder/spi-builder-workspace/.dependencies/checkouts/CryptoSwift/Sources/CryptoSwift/SecureBytes.swift /Users/admin/builder/spi-builder-workspace/.dependencies/checkouts/CryptoSwift/Sources/CryptoSwift/Signature.swift /Users/admin/builder/spi-builder-workspace/.dependencies/checkouts/CryptoSwift/Sources/CryptoSwift/StreamDecryptor.swift (in target 'CryptoSwift' from project 'CryptoSwift')
SwiftCompile normal arm64 /Users/admin/builder/spi-builder-workspace/.dependencies/checkouts/CryptoSwift/Sources/CryptoSwift/RSA/RSA+Cipher.swift (in target 'CryptoSwift' from project 'CryptoSwift')
cd /Users/admin/builder/spi-builder-workspace/.swiftpm/xcode
SwiftCompile normal arm64 /Users/admin/builder/spi-builder-workspace/.dependencies/checkouts/CryptoSwift/Sources/CryptoSwift/RSA/RSA+Signature.swift (in target 'CryptoSwift' from project 'CryptoSwift')
cd /Users/admin/builder/spi-builder-workspace/.swiftpm/xcode
SwiftCompile normal arm64 /Users/admin/builder/spi-builder-workspace/.dependencies/checkouts/CryptoSwift/Sources/CryptoSwift/RSA/RSA.swift (in target 'CryptoSwift' from project 'CryptoSwift')
cd /Users/admin/builder/spi-builder-workspace/.swiftpm/xcode
SwiftCompile normal arm64 /Users/admin/builder/spi-builder-workspace/.dependencies/checkouts/CryptoSwift/Sources/CryptoSwift/Rabbit.swift (in target 'CryptoSwift' from project 'CryptoSwift')
cd /Users/admin/builder/spi-builder-workspace/.swiftpm/xcode
SwiftCompile normal arm64 /Users/admin/builder/spi-builder-workspace/.dependencies/checkouts/CryptoSwift/Sources/CryptoSwift/SHA1.swift (in target 'CryptoSwift' from project 'CryptoSwift')
cd /Users/admin/builder/spi-builder-workspace/.swiftpm/xcode
SwiftCompile normal arm64 /Users/admin/builder/spi-builder-workspace/.dependencies/checkouts/CryptoSwift/Sources/CryptoSwift/SHA2.swift (in target 'CryptoSwift' from project 'CryptoSwift')
cd /Users/admin/builder/spi-builder-workspace/.swiftpm/xcode
SwiftCompile normal arm64 /Users/admin/builder/spi-builder-workspace/.dependencies/checkouts/CryptoSwift/Sources/CryptoSwift/SHA3.swift (in target 'CryptoSwift' from project 'CryptoSwift')
cd /Users/admin/builder/spi-builder-workspace/.swiftpm/xcode
SwiftCompile normal arm64 /Users/admin/builder/spi-builder-workspace/.dependencies/checkouts/CryptoSwift/Sources/CryptoSwift/Scrypt.swift (in target 'CryptoSwift' from project 'CryptoSwift')
cd /Users/admin/builder/spi-builder-workspace/.swiftpm/xcode
SwiftCompile normal arm64 /Users/admin/builder/spi-builder-workspace/.dependencies/checkouts/CryptoSwift/Sources/CryptoSwift/SecureBytes.swift (in target 'CryptoSwift' from project 'CryptoSwift')
cd /Users/admin/builder/spi-builder-workspace/.swiftpm/xcode
SwiftCompile normal arm64 /Users/admin/builder/spi-builder-workspace/.dependencies/checkouts/CryptoSwift/Sources/CryptoSwift/Signature.swift (in target 'CryptoSwift' from project 'CryptoSwift')
cd /Users/admin/builder/spi-builder-workspace/.swiftpm/xcode
SwiftCompile normal arm64 /Users/admin/builder/spi-builder-workspace/.dependencies/checkouts/CryptoSwift/Sources/CryptoSwift/StreamDecryptor.swift (in target 'CryptoSwift' from project 'CryptoSwift')
cd /Users/admin/builder/spi-builder-workspace/.swiftpm/xcode
SwiftCompile normal arm64 Compiling\ Random.swift,\ Shifts.swift,\ SquareRoot.swift,\ Strideable.swift,\ StringConversion.swift,\ Subtraction.swift,\ WordsAndBits.swift,\ ChaCha20.swift,\ Checksum.swift,\ Cipher.swift,\ Collection+Extension.swift /Users/admin/builder/spi-builder-workspace/.dependencies/checkouts/CryptoSwift/Sources/CryptoSwift/CS_BigInt/Random.swift /Users/admin/builder/spi-builder-workspace/.dependencies/checkouts/CryptoSwift/Sources/CryptoSwift/CS_BigInt/Shifts.swift /Users/admin/builder/spi-builder-workspace/.dependencies/checkouts/CryptoSwift/Sources/CryptoSwift/CS_BigInt/SquareRoot.swift /Users/admin/builder/spi-builder-workspace/.dependencies/checkouts/CryptoSwift/Sources/CryptoSwift/CS_BigInt/Strideable.swift /Users/admin/builder/spi-builder-workspace/.dependencies/checkouts/CryptoSwift/Sources/CryptoSwift/CS_BigInt/StringConversion.swift /Users/admin/builder/spi-builder-workspace/.dependencies/checkouts/CryptoSwift/Sources/CryptoSwift/CS_BigInt/Subtraction.swift /Users/admin/builder/spi-builder-workspace/.dependencies/checkouts/CryptoSwift/Sources/CryptoSwift/CS_BigInt/WordsAndBits.swift /Users/admin/builder/spi-builder-workspace/.dependencies/checkouts/CryptoSwift/Sources/CryptoSwift/ChaCha20.swift /Users/admin/builder/spi-builder-workspace/.dependencies/checkouts/CryptoSwift/Sources/CryptoSwift/Checksum.swift /Users/admin/builder/spi-builder-workspace/.dependencies/checkouts/CryptoSwift/Sources/CryptoSwift/Cipher.swift /Users/admin/builder/spi-builder-workspace/.dependencies/checkouts/CryptoSwift/Sources/CryptoSwift/Collection+Extension.swift (in target 'CryptoSwift' from project 'CryptoSwift')
SwiftCompile normal arm64 /Users/admin/builder/spi-builder-workspace/.dependencies/checkouts/CryptoSwift/Sources/CryptoSwift/CS_BigInt/Random.swift (in target 'CryptoSwift' from project 'CryptoSwift')
cd /Users/admin/builder/spi-builder-workspace/.swiftpm/xcode
SwiftCompile normal arm64 /Users/admin/builder/spi-builder-workspace/.dependencies/checkouts/CryptoSwift/Sources/CryptoSwift/CS_BigInt/Shifts.swift (in target 'CryptoSwift' from project 'CryptoSwift')
cd /Users/admin/builder/spi-builder-workspace/.swiftpm/xcode
SwiftCompile normal arm64 /Users/admin/builder/spi-builder-workspace/.dependencies/checkouts/CryptoSwift/Sources/CryptoSwift/CS_BigInt/SquareRoot.swift (in target 'CryptoSwift' from project 'CryptoSwift')
cd /Users/admin/builder/spi-builder-workspace/.swiftpm/xcode
SwiftCompile normal arm64 /Users/admin/builder/spi-builder-workspace/.dependencies/checkouts/CryptoSwift/Sources/CryptoSwift/CS_BigInt/Strideable.swift (in target 'CryptoSwift' from project 'CryptoSwift')
cd /Users/admin/builder/spi-builder-workspace/.swiftpm/xcode
SwiftCompile normal arm64 /Users/admin/builder/spi-builder-workspace/.dependencies/checkouts/CryptoSwift/Sources/CryptoSwift/CS_BigInt/StringConversion.swift (in target 'CryptoSwift' from project 'CryptoSwift')
cd /Users/admin/builder/spi-builder-workspace/.swiftpm/xcode
SwiftCompile normal arm64 /Users/admin/builder/spi-builder-workspace/.dependencies/checkouts/CryptoSwift/Sources/CryptoSwift/CS_BigInt/Subtraction.swift (in target 'CryptoSwift' from project 'CryptoSwift')
cd /Users/admin/builder/spi-builder-workspace/.swiftpm/xcode
SwiftCompile normal arm64 /Users/admin/builder/spi-builder-workspace/.dependencies/checkouts/CryptoSwift/Sources/CryptoSwift/CS_BigInt/WordsAndBits.swift (in target 'CryptoSwift' from project 'CryptoSwift')
cd /Users/admin/builder/spi-builder-workspace/.swiftpm/xcode
SwiftCompile normal arm64 /Users/admin/builder/spi-builder-workspace/.dependencies/checkouts/CryptoSwift/Sources/CryptoSwift/ChaCha20.swift (in target 'CryptoSwift' from project 'CryptoSwift')
cd /Users/admin/builder/spi-builder-workspace/.swiftpm/xcode
SwiftCompile normal arm64 /Users/admin/builder/spi-builder-workspace/.dependencies/checkouts/CryptoSwift/Sources/CryptoSwift/Checksum.swift (in target 'CryptoSwift' from project 'CryptoSwift')
cd /Users/admin/builder/spi-builder-workspace/.swiftpm/xcode
SwiftCompile normal arm64 /Users/admin/builder/spi-builder-workspace/.dependencies/checkouts/CryptoSwift/Sources/CryptoSwift/Cipher.swift (in target 'CryptoSwift' from project 'CryptoSwift')
cd /Users/admin/builder/spi-builder-workspace/.swiftpm/xcode
SwiftCompile normal arm64 /Users/admin/builder/spi-builder-workspace/.dependencies/checkouts/CryptoSwift/Sources/CryptoSwift/Collection+Extension.swift (in target 'CryptoSwift' from project 'CryptoSwift')
cd /Users/admin/builder/spi-builder-workspace/.swiftpm/xcode
SwiftCompile normal arm64 Compiling\ resource_bundle_accessor.swift,\ AEAD.swift,\ AEADChaCha20Poly1305.swift,\ AEADXChaCha20Poly1305.swift,\ AES.Cryptors.swift,\ AES.swift,\ ASN1.swift,\ ASN1Decoder.swift,\ ASN1Encoder.swift,\ ASN1Scanner.swift,\ Array+Extension.swift,\ Authenticator.swift /Users/admin/builder/spi-builder-workspace/.derivedData/Build/Intermediates.noindex/CryptoSwift.build/Debug-iphoneos/CryptoSwift.build/DerivedSources/resource_bundle_accessor.swift /Users/admin/builder/spi-builder-workspace/.dependencies/checkouts/CryptoSwift/Sources/CryptoSwift/AEAD/AEAD.swift /Users/admin/builder/spi-builder-workspace/.dependencies/checkouts/CryptoSwift/Sources/CryptoSwift/AEAD/AEADChaCha20Poly1305.swift /Users/admin/builder/spi-builder-workspace/.dependencies/checkouts/CryptoSwift/Sources/CryptoSwift/AEAD/AEADXChaCha20Poly1305.swift /Users/admin/builder/spi-builder-workspace/.dependencies/checkouts/CryptoSwift/Sources/CryptoSwift/AES.Cryptors.swift /Users/admin/builder/spi-builder-workspace/.dependencies/checkouts/CryptoSwift/Sources/CryptoSwift/AES.swift /Users/admin/builder/spi-builder-workspace/.dependencies/checkouts/CryptoSwift/Sources/CryptoSwift/ASN1/ASN1.swift /Users/admin/builder/spi-builder-workspace/.dependencies/checkouts/CryptoSwift/Sources/CryptoSwift/ASN1/ASN1Decoder.swift /Users/admin/builder/spi-builder-workspace/.dependencies/checkouts/CryptoSwift/Sources/CryptoSwift/ASN1/ASN1Encoder.swift /Users/admin/builder/spi-builder-workspace/.dependencies/checkouts/CryptoSwift/Sources/CryptoSwift/ASN1/ASN1Scanner.swift /Users/admin/builder/spi-builder-workspace/.dependencies/checkouts/CryptoSwift/Sources/CryptoSwift/Array+Extension.swift /Users/admin/builder/spi-builder-workspace/.dependencies/checkouts/CryptoSwift/Sources/CryptoSwift/Authenticator.swift (in target 'CryptoSwift' from project 'CryptoSwift')
SwiftCompile normal arm64 /Users/admin/builder/spi-builder-workspace/.derivedData/Build/Intermediates.noindex/CryptoSwift.build/Debug-iphoneos/CryptoSwift.build/DerivedSources/resource_bundle_accessor.swift (in target 'CryptoSwift' from project 'CryptoSwift')
cd /Users/admin/builder/spi-builder-workspace/.swiftpm/xcode
SwiftCompile normal arm64 /Users/admin/builder/spi-builder-workspace/.dependencies/checkouts/CryptoSwift/Sources/CryptoSwift/AEAD/AEAD.swift (in target 'CryptoSwift' from project 'CryptoSwift')
cd /Users/admin/builder/spi-builder-workspace/.swiftpm/xcode
SwiftCompile normal arm64 /Users/admin/builder/spi-builder-workspace/.dependencies/checkouts/CryptoSwift/Sources/CryptoSwift/AEAD/AEADChaCha20Poly1305.swift (in target 'CryptoSwift' from project 'CryptoSwift')
cd /Users/admin/builder/spi-builder-workspace/.swiftpm/xcode
SwiftCompile normal arm64 /Users/admin/builder/spi-builder-workspace/.dependencies/checkouts/CryptoSwift/Sources/CryptoSwift/AEAD/AEADXChaCha20Poly1305.swift (in target 'CryptoSwift' from project 'CryptoSwift')
cd /Users/admin/builder/spi-builder-workspace/.swiftpm/xcode
SwiftCompile normal arm64 /Users/admin/builder/spi-builder-workspace/.dependencies/checkouts/CryptoSwift/Sources/CryptoSwift/AES.Cryptors.swift (in target 'CryptoSwift' from project 'CryptoSwift')
cd /Users/admin/builder/spi-builder-workspace/.swiftpm/xcode
SwiftCompile normal arm64 /Users/admin/builder/spi-builder-workspace/.dependencies/checkouts/CryptoSwift/Sources/CryptoSwift/AES.swift (in target 'CryptoSwift' from project 'CryptoSwift')
cd /Users/admin/builder/spi-builder-workspace/.swiftpm/xcode
SwiftCompile normal arm64 /Users/admin/builder/spi-builder-workspace/.dependencies/checkouts/CryptoSwift/Sources/CryptoSwift/ASN1/ASN1.swift (in target 'CryptoSwift' from project 'CryptoSwift')
cd /Users/admin/builder/spi-builder-workspace/.swiftpm/xcode
SwiftCompile normal arm64 /Users/admin/builder/spi-builder-workspace/.dependencies/checkouts/CryptoSwift/Sources/CryptoSwift/ASN1/ASN1Decoder.swift (in target 'CryptoSwift' from project 'CryptoSwift')
cd /Users/admin/builder/spi-builder-workspace/.swiftpm/xcode
SwiftCompile normal arm64 /Users/admin/builder/spi-builder-workspace/.dependencies/checkouts/CryptoSwift/Sources/CryptoSwift/ASN1/ASN1Encoder.swift (in target 'CryptoSwift' from project 'CryptoSwift')
cd /Users/admin/builder/spi-builder-workspace/.swiftpm/xcode
SwiftCompile normal arm64 /Users/admin/builder/spi-builder-workspace/.dependencies/checkouts/CryptoSwift/Sources/CryptoSwift/ASN1/ASN1Scanner.swift (in target 'CryptoSwift' from project 'CryptoSwift')
cd /Users/admin/builder/spi-builder-workspace/.swiftpm/xcode
SwiftCompile normal arm64 /Users/admin/builder/spi-builder-workspace/.dependencies/checkouts/CryptoSwift/Sources/CryptoSwift/Array+Extension.swift (in target 'CryptoSwift' from project 'CryptoSwift')
cd /Users/admin/builder/spi-builder-workspace/.swiftpm/xcode
SwiftCompile normal arm64 /Users/admin/builder/spi-builder-workspace/.dependencies/checkouts/CryptoSwift/Sources/CryptoSwift/Authenticator.swift (in target 'CryptoSwift' from project 'CryptoSwift')
cd /Users/admin/builder/spi-builder-workspace/.swiftpm/xcode
SwiftEmitModule normal arm64 Emitting\ module\ for\ SQLite (in target 'SQLite' from project 'SQLite.swift')
EmitSwiftModule normal arm64 (in target 'SQLite' from project 'SQLite.swift')
cd /Users/admin/builder/spi-builder-workspace/.swiftpm/xcode
SwiftCompile normal arm64 Compiling\ Value.swift,\ Cipher.swift,\ FTS4.swift,\ FTS5.swift /Users/admin/builder/spi-builder-workspace/.dependencies/checkouts/SQLite.swift/Sources/SQLite/Core/Value.swift /Users/admin/builder/spi-builder-workspace/.dependencies/checkouts/SQLite.swift/Sources/SQLite/Extensions/Cipher.swift /Users/admin/builder/spi-builder-workspace/.dependencies/checkouts/SQLite.swift/Sources/SQLite/Extensions/FTS4.swift /Users/admin/builder/spi-builder-workspace/.dependencies/checkouts/SQLite.swift/Sources/SQLite/Extensions/FTS5.swift (in target 'SQLite' from project 'SQLite.swift')
SwiftCompile normal arm64 /Users/admin/builder/spi-builder-workspace/.dependencies/checkouts/SQLite.swift/Sources/SQLite/Core/Value.swift (in target 'SQLite' from project 'SQLite.swift')
cd /Users/admin/builder/spi-builder-workspace/.swiftpm/xcode
SwiftCompile normal arm64 /Users/admin/builder/spi-builder-workspace/.dependencies/checkouts/SQLite.swift/Sources/SQLite/Extensions/Cipher.swift (in target 'SQLite' from project 'SQLite.swift')
cd /Users/admin/builder/spi-builder-workspace/.swiftpm/xcode
SwiftCompile normal arm64 /Users/admin/builder/spi-builder-workspace/.dependencies/checkouts/SQLite.swift/Sources/SQLite/Extensions/FTS4.swift (in target 'SQLite' from project 'SQLite.swift')
cd /Users/admin/builder/spi-builder-workspace/.swiftpm/xcode
SwiftCompile normal arm64 /Users/admin/builder/spi-builder-workspace/.dependencies/checkouts/SQLite.swift/Sources/SQLite/Extensions/FTS5.swift (in target 'SQLite' from project 'SQLite.swift')
cd /Users/admin/builder/spi-builder-workspace/.swiftpm/xcode
SwiftDriverJobDiscovery normal arm64 Emitting module for GraphKit (in target 'GraphKit' from project 'BuildAnalyzer')
SwiftDriverJobDiscovery normal arm64 Compiling D3Projector.swift (in target 'GraphKit' from project 'BuildAnalyzer')
SwiftDriver\ Compilation\ Requirements GraphKit normal arm64 com.apple.xcode.tools.swift.compiler (in target 'GraphKit' from project 'BuildAnalyzer')
cd /Users/admin/builder/spi-builder-workspace/.swiftpm/xcode
builtin-Swift-Compilation-Requirements -- /Applications/Xcode-16.3.0.app/Contents/Developer/Toolchains/XcodeDefault.xctoolchain/usr/bin/swiftc -module-name GraphKit -Onone -enforce-exclusivity\=checked @/Users/admin/builder/spi-builder-workspace/.derivedData/Build/Intermediates.noindex/BuildAnalyzer.build/Debug-iphoneos/GraphKit.build/Objects-normal/arm64/GraphKit.SwiftFileList -DSWIFT_PACKAGE -DDEBUG -DXcode -plugin-path /Applications/Xcode-16.3.0.app/Contents/Developer/Toolchains/XcodeDefault.xctoolchain/usr/lib/swift/host/plugins/testing -enable-experimental-feature DebugDescriptionMacro -sdk /Applications/Xcode-16.3.0.app/Contents/Developer/Platforms/iPhoneOS.platform/Developer/SDKs/iPhoneOS18.4.sdk -target arm64-apple-ios12.0 -g -module-cache-path /Users/admin/builder/spi-builder-workspace/.derivedData/ModuleCache.noindex -Xfrontend -serialize-debugging-options -profile-coverage-mapping -profile-generate -enable-testing -index-store-path /Users/admin/builder/spi-builder-workspace/.derivedData/Index.noindex/DataStore -swift-version 5 -I /Users/admin/builder/spi-builder-workspace/.derivedData/Build/Products/Debug-iphoneos -I /Applications/Xcode-16.3.0.app/Contents/Developer/Platforms/iPhoneOS.platform/Developer/usr/lib -F /Users/admin/builder/spi-builder-workspace/.derivedData/Build/Products/Debug-iphoneos -F /Applications/Xcode-16.3.0.app/Contents/Developer/Platforms/iPhoneOS.platform/Developer/Library/Frameworks -F /Applications/Xcode-16.3.0.app/Contents/Developer/Platforms/iPhoneOS.platform/Developer/SDKs/iPhoneOS18.4.sdk/Developer/Library/Frameworks -parse-as-library -c -j10 -enable-batch-mode -incremental -Xcc -ivfsstatcache -Xcc /Users/admin/builder/spi-builder-workspace/.derivedData/SDKStatCaches.noindex/iphoneos18.4-22E235-339d34bc69d7fc736c3220795c36f340.sdkstatcache -output-file-map /Users/admin/builder/spi-builder-workspace/.derivedData/Build/Intermediates.noindex/BuildAnalyzer.build/Debug-iphoneos/GraphKit.build/Objects-normal/arm64/GraphKit-OutputFileMap.json -use-frontend-parseable-output -save-temps -no-color-diagnostics -serialize-diagnostics -emit-dependencies -emit-module -emit-module-path /Users/admin/builder/spi-builder-workspace/.derivedData/Build/Intermediates.noindex/BuildAnalyzer.build/Debug-iphoneos/GraphKit.build/Objects-normal/arm64/GraphKit.swiftmodule -validate-clang-modules-once -clang-build-session-file /Users/admin/builder/spi-builder-workspace/.derivedData/ModuleCache.noindex/Session.modulevalidation -package-name spi_builder_workspace -Xcc -I/Users/admin/builder/spi-builder-workspace/.derivedData/Build/Intermediates.noindex/BuildAnalyzer.build/Debug-iphoneos/GraphKit.build/swift-overrides.hmap -emit-const-values -Xfrontend -const-gather-protocols-file -Xfrontend /Users/admin/builder/spi-builder-workspace/.derivedData/Build/Intermediates.noindex/BuildAnalyzer.build/Debug-iphoneos/GraphKit.build/Objects-normal/arm64/GraphKit_const_extract_protocols.json -Xcc -I/Users/admin/builder/spi-builder-workspace/.derivedData/Build/Products/Debug-iphoneos/include -Xcc -I/Users/admin/builder/spi-builder-workspace/.derivedData/Build/Intermediates.noindex/BuildAnalyzer.build/Debug-iphoneos/GraphKit.build/DerivedSources-normal/arm64 -Xcc -I/Users/admin/builder/spi-builder-workspace/.derivedData/Build/Intermediates.noindex/BuildAnalyzer.build/Debug-iphoneos/GraphKit.build/DerivedSources/arm64 -Xcc -I/Users/admin/builder/spi-builder-workspace/.derivedData/Build/Intermediates.noindex/BuildAnalyzer.build/Debug-iphoneos/GraphKit.build/DerivedSources -Xcc -DSWIFT_PACKAGE -Xcc -DDEBUG\=1 -emit-objc-header -emit-objc-header-path /Users/admin/builder/spi-builder-workspace/.derivedData/Build/Intermediates.noindex/BuildAnalyzer.build/Debug-iphoneos/GraphKit.build/Objects-normal/arm64/GraphKit-Swift.h -working-directory /Users/admin/builder/spi-builder-workspace/.swiftpm/xcode -experimental-emit-module-separately -disable-cmo
SwiftDriverJobDiscovery normal arm64 Compiling Value.swift, Cipher.swift, FTS4.swift, FTS5.swift (in target 'SQLite' from project 'SQLite.swift')
SwiftCompile normal arm64 Compiling\ Backup.swift,\ Blob.swift,\ Connection+Aggregation.swift,\ Connection+Attach.swift /Users/admin/builder/spi-builder-workspace/.dependencies/checkouts/SQLite.swift/Sources/SQLite/Core/Backup.swift /Users/admin/builder/spi-builder-workspace/.dependencies/checkouts/SQLite.swift/Sources/SQLite/Core/Blob.swift /Users/admin/builder/spi-builder-workspace/.dependencies/checkouts/SQLite.swift/Sources/SQLite/Core/Connection+Aggregation.swift /Users/admin/builder/spi-builder-workspace/.dependencies/checkouts/SQLite.swift/Sources/SQLite/Core/Connection+Attach.swift (in target 'SQLite' from project 'SQLite.swift')
SwiftCompile normal arm64 /Users/admin/builder/spi-builder-workspace/.dependencies/checkouts/SQLite.swift/Sources/SQLite/Core/Backup.swift (in target 'SQLite' from project 'SQLite.swift')
cd /Users/admin/builder/spi-builder-workspace/.swiftpm/xcode
SwiftCompile normal arm64 /Users/admin/builder/spi-builder-workspace/.dependencies/checkouts/SQLite.swift/Sources/SQLite/Core/Blob.swift (in target 'SQLite' from project 'SQLite.swift')
cd /Users/admin/builder/spi-builder-workspace/.swiftpm/xcode
SwiftCompile normal arm64 /Users/admin/builder/spi-builder-workspace/.dependencies/checkouts/SQLite.swift/Sources/SQLite/Core/Connection+Aggregation.swift (in target 'SQLite' from project 'SQLite.swift')
cd /Users/admin/builder/spi-builder-workspace/.swiftpm/xcode
SwiftCompile normal arm64 /Users/admin/builder/spi-builder-workspace/.dependencies/checkouts/SQLite.swift/Sources/SQLite/Core/Connection+Attach.swift (in target 'SQLite' from project 'SQLite.swift')
cd /Users/admin/builder/spi-builder-workspace/.swiftpm/xcode
Copy /Users/admin/builder/spi-builder-workspace/.derivedData/Build/Products/Debug-iphoneos/GraphKit.swiftmodule/arm64-apple-ios.abi.json /Users/admin/builder/spi-builder-workspace/.derivedData/Build/Intermediates.noindex/BuildAnalyzer.build/Debug-iphoneos/GraphKit.build/Objects-normal/arm64/GraphKit.abi.json (in target 'GraphKit' from project 'BuildAnalyzer')
cd /Users/admin/builder/spi-builder-workspace
builtin-copy -exclude .DS_Store -exclude CVS -exclude .svn -exclude .git -exclude .hg -resolve-src-symlinks -rename /Users/admin/builder/spi-builder-workspace/.derivedData/Build/Intermediates.noindex/BuildAnalyzer.build/Debug-iphoneos/GraphKit.build/Objects-normal/arm64/GraphKit.abi.json /Users/admin/builder/spi-builder-workspace/.derivedData/Build/Products/Debug-iphoneos/GraphKit.swiftmodule/arm64-apple-ios.abi.json
SwiftDriverJobDiscovery normal arm64 Emitting module for SQLite (in target 'SQLite' from project 'SQLite.swift')
SwiftDriver\ Compilation\ Requirements SQLite normal arm64 com.apple.xcode.tools.swift.compiler (in target 'SQLite' from project 'SQLite.swift')
cd /Users/admin/builder/spi-builder-workspace/.swiftpm/xcode
builtin-Swift-Compilation-Requirements -- /Applications/Xcode-16.3.0.app/Contents/Developer/Toolchains/XcodeDefault.xctoolchain/usr/bin/swiftc -module-name SQLite -Onone -enforce-exclusivity\=checked @/Users/admin/builder/spi-builder-workspace/.derivedData/Build/Intermediates.noindex/SQLite.swift.build/Debug-iphoneos/SQLite.build/Objects-normal/arm64/SQLite.SwiftFileList -DSWIFT_PACKAGE -DDEBUG -DXcode -plugin-path /Applications/Xcode-16.3.0.app/Contents/Developer/Toolchains/XcodeDefault.xctoolchain/usr/lib/swift/host/plugins/testing -enable-experimental-feature DebugDescriptionMacro -sdk /Applications/Xcode-16.3.0.app/Contents/Developer/Platforms/iPhoneOS.platform/Developer/SDKs/iPhoneOS18.4.sdk -target arm64-apple-ios12.0 -g -module-cache-path /Users/admin/builder/spi-builder-workspace/.derivedData/ModuleCache.noindex -Xfrontend -serialize-debugging-options -profile-coverage-mapping -profile-generate -enable-testing -suppress-warnings -index-store-path /Users/admin/builder/spi-builder-workspace/.derivedData/Index.noindex/DataStore -swift-version 5 -I /Users/admin/builder/spi-builder-workspace/.derivedData/Build/Products/Debug-iphoneos -I /Applications/Xcode-16.3.0.app/Contents/Developer/Platforms/iPhoneOS.platform/Developer/usr/lib -F /Users/admin/builder/spi-builder-workspace/.derivedData/Build/Products/Debug-iphoneos -F /Applications/Xcode-16.3.0.app/Contents/Developer/Platforms/iPhoneOS.platform/Developer/Library/Frameworks -F /Applications/Xcode-16.3.0.app/Contents/Developer/Platforms/iPhoneOS.platform/Developer/SDKs/iPhoneOS18.4.sdk/Developer/Library/Frameworks -c -j10 -enable-batch-mode -incremental -Xcc -ivfsstatcache -Xcc /Users/admin/builder/spi-builder-workspace/.derivedData/SDKStatCaches.noindex/iphoneos18.4-22E235-339d34bc69d7fc736c3220795c36f340.sdkstatcache -output-file-map /Users/admin/builder/spi-builder-workspace/.derivedData/Build/Intermediates.noindex/SQLite.swift.build/Debug-iphoneos/SQLite.build/Objects-normal/arm64/SQLite-OutputFileMap.json -use-frontend-parseable-output -save-temps -no-color-diagnostics -serialize-diagnostics -emit-dependencies -emit-module -emit-module-path /Users/admin/builder/spi-builder-workspace/.derivedData/Build/Intermediates.noindex/SQLite.swift.build/Debug-iphoneos/SQLite.build/Objects-normal/arm64/SQLite.swiftmodule -validate-clang-modules-once -clang-build-session-file /Users/admin/builder/spi-builder-workspace/.derivedData/ModuleCache.noindex/Session.modulevalidation -package-name sqlite_swift -Xcc -I/Users/admin/builder/spi-builder-workspace/.derivedData/Build/Intermediates.noindex/SQLite.swift.build/Debug-iphoneos/SQLite.build/swift-overrides.hmap -emit-const-values -Xfrontend -const-gather-protocols-file -Xfrontend /Users/admin/builder/spi-builder-workspace/.derivedData/Build/Intermediates.noindex/SQLite.swift.build/Debug-iphoneos/SQLite.build/Objects-normal/arm64/SQLite_const_extract_protocols.json -Xcc -I/Users/admin/builder/spi-builder-workspace/.derivedData/Build/Products/Debug-iphoneos/include -Xcc -I/Users/admin/builder/spi-builder-workspace/.derivedData/Build/Intermediates.noindex/SQLite.swift.build/Debug-iphoneos/SQLite.build/DerivedSources-normal/arm64 -Xcc -I/Users/admin/builder/spi-builder-workspace/.derivedData/Build/Intermediates.noindex/SQLite.swift.build/Debug-iphoneos/SQLite.build/DerivedSources/arm64 -Xcc -I/Users/admin/builder/spi-builder-workspace/.derivedData/Build/Intermediates.noindex/SQLite.swift.build/Debug-iphoneos/SQLite.build/DerivedSources -Xcc -DSWIFT_PACKAGE -Xcc -DDEBUG\=1 -emit-objc-header -emit-objc-header-path /Users/admin/builder/spi-builder-workspace/.derivedData/Build/Intermediates.noindex/SQLite.swift.build/Debug-iphoneos/SQLite.build/Objects-normal/arm64/SQLite-Swift.h -working-directory /Users/admin/builder/spi-builder-workspace/.swiftpm/xcode -experimental-emit-module-separately -disable-cmo
SwiftCompile normal arm64 Compiling\ Connection+Pragmas.swift,\ Connection.swift,\ Errors.swift,\ Result.swift /Users/admin/builder/spi-builder-workspace/.dependencies/checkouts/SQLite.swift/Sources/SQLite/Core/Connection+Pragmas.swift /Users/admin/builder/spi-builder-workspace/.dependencies/checkouts/SQLite.swift/Sources/SQLite/Core/Connection.swift /Users/admin/builder/spi-builder-workspace/.dependencies/checkouts/SQLite.swift/Sources/SQLite/Core/Errors.swift /Users/admin/builder/spi-builder-workspace/.dependencies/checkouts/SQLite.swift/Sources/SQLite/Core/Result.swift (in target 'SQLite' from project 'SQLite.swift')
SwiftCompile normal arm64 /Users/admin/builder/spi-builder-workspace/.dependencies/checkouts/SQLite.swift/Sources/SQLite/Core/Connection+Pragmas.swift (in target 'SQLite' from project 'SQLite.swift')
cd /Users/admin/builder/spi-builder-workspace/.swiftpm/xcode
SwiftCompile normal arm64 /Users/admin/builder/spi-builder-workspace/.dependencies/checkouts/SQLite.swift/Sources/SQLite/Core/Connection.swift (in target 'SQLite' from project 'SQLite.swift')
cd /Users/admin/builder/spi-builder-workspace/.swiftpm/xcode
SwiftCompile normal arm64 /Users/admin/builder/spi-builder-workspace/.dependencies/checkouts/SQLite.swift/Sources/SQLite/Core/Errors.swift (in target 'SQLite' from project 'SQLite.swift')
cd /Users/admin/builder/spi-builder-workspace/.swiftpm/xcode
SwiftCompile normal arm64 /Users/admin/builder/spi-builder-workspace/.dependencies/checkouts/SQLite.swift/Sources/SQLite/Core/Result.swift (in target 'SQLite' from project 'SQLite.swift')
cd /Users/admin/builder/spi-builder-workspace/.swiftpm/xcode
Copy /Users/admin/builder/spi-builder-workspace/.derivedData/Build/Products/Debug-iphoneos/SQLite.swiftmodule/arm64-apple-ios.abi.json /Users/admin/builder/spi-builder-workspace/.derivedData/Build/Intermediates.noindex/SQLite.swift.build/Debug-iphoneos/SQLite.build/Objects-normal/arm64/SQLite.abi.json (in target 'SQLite' from project 'SQLite.swift')
cd /Users/admin/builder/spi-builder-workspace/.dependencies/checkouts/SQLite.swift
builtin-copy -exclude .DS_Store -exclude CVS -exclude .svn -exclude .git -exclude .hg -resolve-src-symlinks -rename /Users/admin/builder/spi-builder-workspace/.derivedData/Build/Intermediates.noindex/SQLite.swift.build/Debug-iphoneos/SQLite.build/Objects-normal/arm64/SQLite.abi.json /Users/admin/builder/spi-builder-workspace/.derivedData/Build/Products/Debug-iphoneos/SQLite.swiftmodule/arm64-apple-ios.abi.json
SwiftDriverJobDiscovery normal arm64 Compiling Rabbit+Foundation.swift, String+FoundationExtension.swift, Utils+Foundation.swift, XChaCha20+Foundation.swift, Generics.swift, HKDF.swift, HMAC.swift, ISO10126Padding.swift, ISO78164Padding.swift, Int+Extension.swift, MD5.swift (in target 'CryptoSwift' from project 'CryptoSwift')
SwiftCompile normal arm64 Compiling\ RTree.swift,\ Foundation.swift,\ Helpers.swift,\ Connection+Schema.swift /Users/admin/builder/spi-builder-workspace/.dependencies/checkouts/SQLite.swift/Sources/SQLite/Extensions/RTree.swift /Users/admin/builder/spi-builder-workspace/.dependencies/checkouts/SQLite.swift/Sources/SQLite/Foundation.swift /Users/admin/builder/spi-builder-workspace/.dependencies/checkouts/SQLite.swift/Sources/SQLite/Helpers.swift /Users/admin/builder/spi-builder-workspace/.dependencies/checkouts/SQLite.swift/Sources/SQLite/Schema/Connection+Schema.swift (in target 'SQLite' from project 'SQLite.swift')
SwiftCompile normal arm64 /Users/admin/builder/spi-builder-workspace/.dependencies/checkouts/SQLite.swift/Sources/SQLite/Extensions/RTree.swift (in target 'SQLite' from project 'SQLite.swift')
cd /Users/admin/builder/spi-builder-workspace/.swiftpm/xcode
SwiftCompile normal arm64 /Users/admin/builder/spi-builder-workspace/.dependencies/checkouts/SQLite.swift/Sources/SQLite/Foundation.swift (in target 'SQLite' from project 'SQLite.swift')
cd /Users/admin/builder/spi-builder-workspace/.swiftpm/xcode
SwiftCompile normal arm64 /Users/admin/builder/spi-builder-workspace/.dependencies/checkouts/SQLite.swift/Sources/SQLite/Helpers.swift (in target 'SQLite' from project 'SQLite.swift')
cd /Users/admin/builder/spi-builder-workspace/.swiftpm/xcode
SwiftCompile normal arm64 /Users/admin/builder/spi-builder-workspace/.dependencies/checkouts/SQLite.swift/Sources/SQLite/Schema/Connection+Schema.swift (in target 'SQLite' from project 'SQLite.swift')
cd /Users/admin/builder/spi-builder-workspace/.swiftpm/xcode
SwiftCompile normal arm64 Compiling\ SchemaChanger.swift,\ SchemaDefinitions.swift,\ SchemaReader.swift,\ AggregateFunctions.swift /Users/admin/builder/spi-builder-workspace/.dependencies/checkouts/SQLite.swift/Sources/SQLite/Schema/SchemaChanger.swift /Users/admin/builder/spi-builder-workspace/.dependencies/checkouts/SQLite.swift/Sources/SQLite/Schema/SchemaDefinitions.swift /Users/admin/builder/spi-builder-workspace/.dependencies/checkouts/SQLite.swift/Sources/SQLite/Schema/SchemaReader.swift /Users/admin/builder/spi-builder-workspace/.dependencies/checkouts/SQLite.swift/Sources/SQLite/Typed/AggregateFunctions.swift (in target 'SQLite' from project 'SQLite.swift')
SwiftCompile normal arm64 /Users/admin/builder/spi-builder-workspace/.dependencies/checkouts/SQLite.swift/Sources/SQLite/Schema/SchemaChanger.swift (in target 'SQLite' from project 'SQLite.swift')
cd /Users/admin/builder/spi-builder-workspace/.swiftpm/xcode
SwiftCompile normal arm64 /Users/admin/builder/spi-builder-workspace/.dependencies/checkouts/SQLite.swift/Sources/SQLite/Schema/SchemaDefinitions.swift (in target 'SQLite' from project 'SQLite.swift')
cd /Users/admin/builder/spi-builder-workspace/.swiftpm/xcode
SwiftCompile normal arm64 /Users/admin/builder/spi-builder-workspace/.dependencies/checkouts/SQLite.swift/Sources/SQLite/Schema/SchemaReader.swift (in target 'SQLite' from project 'SQLite.swift')
cd /Users/admin/builder/spi-builder-workspace/.swiftpm/xcode
SwiftCompile normal arm64 /Users/admin/builder/spi-builder-workspace/.dependencies/checkouts/SQLite.swift/Sources/SQLite/Typed/AggregateFunctions.swift (in target 'SQLite' from project 'SQLite.swift')
cd /Users/admin/builder/spi-builder-workspace/.swiftpm/xcode
SwiftDriverJobDiscovery normal arm64 Compiling Backup.swift, Blob.swift, Connection+Aggregation.swift, Connection+Attach.swift (in target 'SQLite' from project 'SQLite.swift')
SwiftDriver BuildAnalyzerKit normal arm64 com.apple.xcode.tools.swift.compiler (in target 'BuildAnalyzerKit' from project 'BuildAnalyzer')
cd /Users/admin/builder/spi-builder-workspace/.swiftpm/xcode
builtin-SwiftDriver -- /Applications/Xcode-16.3.0.app/Contents/Developer/Toolchains/XcodeDefault.xctoolchain/usr/bin/swiftc -module-name BuildAnalyzerKit -Onone -enforce-exclusivity\=checked @/Users/admin/builder/spi-builder-workspace/.derivedData/Build/Intermediates.noindex/BuildAnalyzer.build/Debug-iphoneos/BuildAnalyzerKit.build/Objects-normal/arm64/BuildAnalyzerKit.SwiftFileList -DSWIFT_PACKAGE -DDEBUG -DXcode -enable-upcoming-feature BareSlashRegexLiterals -plugin-path /Applications/Xcode-16.3.0.app/Contents/Developer/Toolchains/XcodeDefault.xctoolchain/usr/lib/swift/host/plugins/testing -enable-experimental-feature DebugDescriptionMacro -sdk /Applications/Xcode-16.3.0.app/Contents/Developer/Platforms/iPhoneOS.platform/Developer/SDKs/iPhoneOS18.4.sdk -target arm64-apple-ios12.0 -g -module-cache-path /Users/admin/builder/spi-builder-workspace/.derivedData/ModuleCache.noindex -Xfrontend -serialize-debugging-options -profile-coverage-mapping -profile-generate -enable-testing -index-store-path /Users/admin/builder/spi-builder-workspace/.derivedData/Index.noindex/DataStore -swift-version 5 -I /Users/admin/builder/spi-builder-workspace/.derivedData/Build/Products/Debug-iphoneos -I /Applications/Xcode-16.3.0.app/Contents/Developer/Platforms/iPhoneOS.platform/Developer/usr/lib -F /Users/admin/builder/spi-builder-workspace/.derivedData/Build/Products/Debug-iphoneos/PackageFrameworks -F /Users/admin/builder/spi-builder-workspace/.derivedData/Build/Products/Debug-iphoneos -F /Applications/Xcode-16.3.0.app/Contents/Developer/Platforms/iPhoneOS.platform/Developer/Library/Frameworks -F /Applications/Xcode-16.3.0.app/Contents/Developer/Platforms/iPhoneOS.platform/Developer/SDKs/iPhoneOS18.4.sdk/Developer/Library/Frameworks -c -j10 -enable-batch-mode -incremental -Xcc -ivfsstatcache -Xcc /Users/admin/builder/spi-builder-workspace/.derivedData/SDKStatCaches.noindex/iphoneos18.4-22E235-339d34bc69d7fc736c3220795c36f340.sdkstatcache -output-file-map /Users/admin/builder/spi-builder-workspace/.derivedData/Build/Intermediates.noindex/BuildAnalyzer.build/Debug-iphoneos/BuildAnalyzerKit.build/Objects-normal/arm64/BuildAnalyzerKit-OutputFileMap.json -use-frontend-parseable-output -save-temps -no-color-diagnostics -serialize-diagnostics -emit-dependencies -emit-module -emit-module-path /Users/admin/builder/spi-builder-workspace/.derivedData/Build/Intermediates.noindex/BuildAnalyzer.build/Debug-iphoneos/BuildAnalyzerKit.build/Objects-normal/arm64/BuildAnalyzerKit.swiftmodule -validate-clang-modules-once -clang-build-session-file /Users/admin/builder/spi-builder-workspace/.derivedData/ModuleCache.noindex/Session.modulevalidation -package-name spi_builder_workspace -Xcc -I/Users/admin/builder/spi-builder-workspace/.derivedData/Build/Intermediates.noindex/BuildAnalyzer.build/Debug-iphoneos/BuildAnalyzerKit.build/swift-overrides.hmap -emit-const-values -Xfrontend -const-gather-protocols-file -Xfrontend /Users/admin/builder/spi-builder-workspace/.derivedData/Build/Intermediates.noindex/BuildAnalyzer.build/Debug-iphoneos/BuildAnalyzerKit.build/Objects-normal/arm64/BuildAnalyzerKit_const_extract_protocols.json -Xcc -I/Users/admin/builder/spi-builder-workspace/.derivedData/Build/Products/Debug-iphoneos/include -Xcc -I/Users/admin/builder/spi-builder-workspace/.derivedData/Build/Intermediates.noindex/BuildAnalyzer.build/Debug-iphoneos/BuildAnalyzerKit.build/DerivedSources-normal/arm64 -Xcc -I/Users/admin/builder/spi-builder-workspace/.derivedData/Build/Intermediates.noindex/BuildAnalyzer.build/Debug-iphoneos/BuildAnalyzerKit.build/DerivedSources/arm64 -Xcc -I/Users/admin/builder/spi-builder-workspace/.derivedData/Build/Intermediates.noindex/BuildAnalyzer.build/Debug-iphoneos/BuildAnalyzerKit.build/DerivedSources -Xcc -DSWIFT_PACKAGE -Xcc -DDEBUG\=1 -emit-objc-header -emit-objc-header-path /Users/admin/builder/spi-builder-workspace/.derivedData/Build/Intermediates.noindex/BuildAnalyzer.build/Debug-iphoneos/BuildAnalyzerKit.build/Objects-normal/arm64/BuildAnalyzerKit-Swift.h -working-directory /Users/admin/builder/spi-builder-workspace/.swiftpm/xcode -experimental-emit-module-separately -disable-cmo
SwiftDriverJobDiscovery normal arm64 Compiling NoPadding.swift, Operators.swift, DER.swift, PBKDF1.swift, PBKDF2.swift, PKCS1v15.swift, PKCS5.swift, PKCS7.swift, PKCS7Padding.swift, Padding.swift, Poly1305.swift (in target 'CryptoSwift' from project 'CryptoSwift')
SwiftCompile normal arm64 Compiling\ SQLiteFeature.swift,\ SQLiteVersion.swift,\ Statement.swift,\ URIQueryParameter.swift /Users/admin/builder/spi-builder-workspace/.dependencies/checkouts/SQLite.swift/Sources/SQLite/Core/SQLiteFeature.swift /Users/admin/builder/spi-builder-workspace/.dependencies/checkouts/SQLite.swift/Sources/SQLite/Core/SQLiteVersion.swift /Users/admin/builder/spi-builder-workspace/.dependencies/checkouts/SQLite.swift/Sources/SQLite/Core/Statement.swift /Users/admin/builder/spi-builder-workspace/.dependencies/checkouts/SQLite.swift/Sources/SQLite/Core/URIQueryParameter.swift (in target 'SQLite' from project 'SQLite.swift')
SwiftCompile normal arm64 /Users/admin/builder/spi-builder-workspace/.dependencies/checkouts/SQLite.swift/Sources/SQLite/Core/SQLiteFeature.swift (in target 'SQLite' from project 'SQLite.swift')
cd /Users/admin/builder/spi-builder-workspace/.swiftpm/xcode
SwiftCompile normal arm64 /Users/admin/builder/spi-builder-workspace/.dependencies/checkouts/SQLite.swift/Sources/SQLite/Core/SQLiteVersion.swift (in target 'SQLite' from project 'SQLite.swift')
cd /Users/admin/builder/spi-builder-workspace/.swiftpm/xcode
SwiftCompile normal arm64 /Users/admin/builder/spi-builder-workspace/.dependencies/checkouts/SQLite.swift/Sources/SQLite/Core/Statement.swift (in target 'SQLite' from project 'SQLite.swift')
cd /Users/admin/builder/spi-builder-workspace/.swiftpm/xcode
SwiftCompile normal arm64 /Users/admin/builder/spi-builder-workspace/.dependencies/checkouts/SQLite.swift/Sources/SQLite/Core/URIQueryParameter.swift (in target 'SQLite' from project 'SQLite.swift')
cd /Users/admin/builder/spi-builder-workspace/.swiftpm/xcode
SwiftEmitModule normal arm64 Emitting\ module\ for\ BuildAnalyzerKit (in target 'BuildAnalyzerKit' from project 'BuildAnalyzer')
EmitSwiftModule normal arm64 (in target 'BuildAnalyzerKit' from project 'BuildAnalyzer')
cd /Users/admin/builder/spi-builder-workspace/.swiftpm/xcode
/Users/admin/builder/spi-builder-workspace/Sources/BuildAnalyzerKit/BuildGraphNodeKind.swift:4:5: warning: 'public' modifier is redundant for enum declared in a public extension
public enum NodeType {
^~~~~~~
/Users/admin/builder/spi-builder-workspace/Sources/BuildAnalyzerKit/BuildGraphNodeKind.swift:132:1: warning: extension declares a conformance of imported type 'Array' to imported protocol 'Comparable'; this will not behave correctly if the owners of 'Swift' introduce this conformance in the future
extension Array<String>: Comparable {
^
/Users/admin/builder/spi-builder-workspace/Sources/BuildAnalyzerKit/BuildGraphNodeKind.swift:132:1: note: add '@retroactive' to silence this warning
extension Array<String>: Comparable {
^ ~~~~~~~~~~
@retroactive Comparable
SwiftDriverJobDiscovery normal arm64 Compiling RTree.swift, Foundation.swift, Helpers.swift, Connection+Schema.swift (in target 'SQLite' from project 'SQLite.swift')
SwiftCompile normal arm64 Compiling\ Schema.swift,\ Setter.swift,\ WindowFunctions.swift /Users/admin/builder/spi-builder-workspace/.dependencies/checkouts/SQLite.swift/Sources/SQLite/Typed/Schema.swift /Users/admin/builder/spi-builder-workspace/.dependencies/checkouts/SQLite.swift/Sources/SQLite/Typed/Setter.swift /Users/admin/builder/spi-builder-workspace/.dependencies/checkouts/SQLite.swift/Sources/SQLite/Typed/WindowFunctions.swift (in target 'SQLite' from project 'SQLite.swift')
SwiftCompile normal arm64 /Users/admin/builder/spi-builder-workspace/.dependencies/checkouts/SQLite.swift/Sources/SQLite/Typed/Schema.swift (in target 'SQLite' from project 'SQLite.swift')
cd /Users/admin/builder/spi-builder-workspace/.swiftpm/xcode
SwiftCompile normal arm64 /Users/admin/builder/spi-builder-workspace/.dependencies/checkouts/SQLite.swift/Sources/SQLite/Typed/Setter.swift (in target 'SQLite' from project 'SQLite.swift')
cd /Users/admin/builder/spi-builder-workspace/.swiftpm/xcode
SwiftCompile normal arm64 /Users/admin/builder/spi-builder-workspace/.dependencies/checkouts/SQLite.swift/Sources/SQLite/Typed/WindowFunctions.swift (in target 'SQLite' from project 'SQLite.swift')
cd /Users/admin/builder/spi-builder-workspace/.swiftpm/xcode
SwiftDriverJobDiscovery normal arm64 Compiling Connection+Pragmas.swift, Connection.swift, Errors.swift, Result.swift (in target 'SQLite' from project 'SQLite.swift')
SwiftCompile normal arm64 Compiling\ CustomFunctions.swift,\ DateAndTimeFunctions.swift,\ Expression.swift /Users/admin/builder/spi-builder-workspace/.dependencies/checkouts/SQLite.swift/Sources/SQLite/Typed/CustomFunctions.swift /Users/admin/builder/spi-builder-workspace/.dependencies/checkouts/SQLite.swift/Sources/SQLite/Typed/DateAndTimeFunctions.swift /Users/admin/builder/spi-builder-workspace/.dependencies/checkouts/SQLite.swift/Sources/SQLite/Typed/Expression.swift (in target 'SQLite' from project 'SQLite.swift')
SwiftCompile normal arm64 /Users/admin/builder/spi-builder-workspace/.dependencies/checkouts/SQLite.swift/Sources/SQLite/Typed/CustomFunctions.swift (in target 'SQLite' from project 'SQLite.swift')
cd /Users/admin/builder/spi-builder-workspace/.swiftpm/xcode
SwiftCompile normal arm64 /Users/admin/builder/spi-builder-workspace/.dependencies/checkouts/SQLite.swift/Sources/SQLite/Typed/DateAndTimeFunctions.swift (in target 'SQLite' from project 'SQLite.swift')
cd /Users/admin/builder/spi-builder-workspace/.swiftpm/xcode
SwiftCompile normal arm64 /Users/admin/builder/spi-builder-workspace/.dependencies/checkouts/SQLite.swift/Sources/SQLite/Typed/Expression.swift (in target 'SQLite' from project 'SQLite.swift')
cd /Users/admin/builder/spi-builder-workspace/.swiftpm/xcode
SwiftDriverJobDiscovery normal arm64 Compiling CS.swift, Codable.swift, Comparable.swift, DataConversion.swift, Division.swift, Exponentiation.swift, FloatingPointConversion.swift, GCD.swift, Hashable.swift, IntegerConversion.swift, Multiplication.swift, PrimeTest.swift (in target 'CryptoSwift' from project 'CryptoSwift')
SwiftCompile normal arm64 Compiling\ Operators.swift,\ Query+with.swift,\ Query.swift /Users/admin/builder/spi-builder-workspace/.dependencies/checkouts/SQLite.swift/Sources/SQLite/Typed/Operators.swift /Users/admin/builder/spi-builder-workspace/.dependencies/checkouts/SQLite.swift/Sources/SQLite/Typed/Query+with.swift /Users/admin/builder/spi-builder-workspace/.dependencies/checkouts/SQLite.swift/Sources/SQLite/Typed/Query.swift (in target 'SQLite' from project 'SQLite.swift')
SwiftCompile normal arm64 /Users/admin/builder/spi-builder-workspace/.dependencies/checkouts/SQLite.swift/Sources/SQLite/Typed/Operators.swift (in target 'SQLite' from project 'SQLite.swift')
cd /Users/admin/builder/spi-builder-workspace/.swiftpm/xcode
SwiftCompile normal arm64 /Users/admin/builder/spi-builder-workspace/.dependencies/checkouts/SQLite.swift/Sources/SQLite/Typed/Query+with.swift (in target 'SQLite' from project 'SQLite.swift')
cd /Users/admin/builder/spi-builder-workspace/.swiftpm/xcode
SwiftCompile normal arm64 /Users/admin/builder/spi-builder-workspace/.dependencies/checkouts/SQLite.swift/Sources/SQLite/Typed/Query.swift (in target 'SQLite' from project 'SQLite.swift')
cd /Users/admin/builder/spi-builder-workspace/.swiftpm/xcode
SwiftDriverJobDiscovery normal arm64 Emitting module for BuildAnalyzerKit (in target 'BuildAnalyzerKit' from project 'BuildAnalyzer')
SwiftDriver\ Compilation\ Requirements BuildAnalyzerKit normal arm64 com.apple.xcode.tools.swift.compiler (in target 'BuildAnalyzerKit' from project 'BuildAnalyzer')
cd /Users/admin/builder/spi-builder-workspace/.swiftpm/xcode
builtin-Swift-Compilation-Requirements -- /Applications/Xcode-16.3.0.app/Contents/Developer/Toolchains/XcodeDefault.xctoolchain/usr/bin/swiftc -module-name BuildAnalyzerKit -Onone -enforce-exclusivity\=checked @/Users/admin/builder/spi-builder-workspace/.derivedData/Build/Intermediates.noindex/BuildAnalyzer.build/Debug-iphoneos/BuildAnalyzerKit.build/Objects-normal/arm64/BuildAnalyzerKit.SwiftFileList -DSWIFT_PACKAGE -DDEBUG -DXcode -enable-upcoming-feature BareSlashRegexLiterals -plugin-path /Applications/Xcode-16.3.0.app/Contents/Developer/Toolchains/XcodeDefault.xctoolchain/usr/lib/swift/host/plugins/testing -enable-experimental-feature DebugDescriptionMacro -sdk /Applications/Xcode-16.3.0.app/Contents/Developer/Platforms/iPhoneOS.platform/Developer/SDKs/iPhoneOS18.4.sdk -target arm64-apple-ios12.0 -g -module-cache-path /Users/admin/builder/spi-builder-workspace/.derivedData/ModuleCache.noindex -Xfrontend -serialize-debugging-options -profile-coverage-mapping -profile-generate -enable-testing -index-store-path /Users/admin/builder/spi-builder-workspace/.derivedData/Index.noindex/DataStore -swift-version 5 -I /Users/admin/builder/spi-builder-workspace/.derivedData/Build/Products/Debug-iphoneos -I /Applications/Xcode-16.3.0.app/Contents/Developer/Platforms/iPhoneOS.platform/Developer/usr/lib -F /Users/admin/builder/spi-builder-workspace/.derivedData/Build/Products/Debug-iphoneos/PackageFrameworks -F /Users/admin/builder/spi-builder-workspace/.derivedData/Build/Products/Debug-iphoneos -F /Applications/Xcode-16.3.0.app/Contents/Developer/Platforms/iPhoneOS.platform/Developer/Library/Frameworks -F /Applications/Xcode-16.3.0.app/Contents/Developer/Platforms/iPhoneOS.platform/Developer/SDKs/iPhoneOS18.4.sdk/Developer/Library/Frameworks -c -j10 -enable-batch-mode -incremental -Xcc -ivfsstatcache -Xcc /Users/admin/builder/spi-builder-workspace/.derivedData/SDKStatCaches.noindex/iphoneos18.4-22E235-339d34bc69d7fc736c3220795c36f340.sdkstatcache -output-file-map /Users/admin/builder/spi-builder-workspace/.derivedData/Build/Intermediates.noindex/BuildAnalyzer.build/Debug-iphoneos/BuildAnalyzerKit.build/Objects-normal/arm64/BuildAnalyzerKit-OutputFileMap.json -use-frontend-parseable-output -save-temps -no-color-diagnostics -serialize-diagnostics -emit-dependencies -emit-module -emit-module-path /Users/admin/builder/spi-builder-workspace/.derivedData/Build/Intermediates.noindex/BuildAnalyzer.build/Debug-iphoneos/BuildAnalyzerKit.build/Objects-normal/arm64/BuildAnalyzerKit.swiftmodule -validate-clang-modules-once -clang-build-session-file /Users/admin/builder/spi-builder-workspace/.derivedData/ModuleCache.noindex/Session.modulevalidation -package-name spi_builder_workspace -Xcc -I/Users/admin/builder/spi-builder-workspace/.derivedData/Build/Intermediates.noindex/BuildAnalyzer.build/Debug-iphoneos/BuildAnalyzerKit.build/swift-overrides.hmap -emit-const-values -Xfrontend -const-gather-protocols-file -Xfrontend /Users/admin/builder/spi-builder-workspace/.derivedData/Build/Intermediates.noindex/BuildAnalyzer.build/Debug-iphoneos/BuildAnalyzerKit.build/Objects-normal/arm64/BuildAnalyzerKit_const_extract_protocols.json -Xcc -I/Users/admin/builder/spi-builder-workspace/.derivedData/Build/Products/Debug-iphoneos/include -Xcc -I/Users/admin/builder/spi-builder-workspace/.derivedData/Build/Intermediates.noindex/BuildAnalyzer.build/Debug-iphoneos/BuildAnalyzerKit.build/DerivedSources-normal/arm64 -Xcc -I/Users/admin/builder/spi-builder-workspace/.derivedData/Build/Intermediates.noindex/BuildAnalyzer.build/Debug-iphoneos/BuildAnalyzerKit.build/DerivedSources/arm64 -Xcc -I/Users/admin/builder/spi-builder-workspace/.derivedData/Build/Intermediates.noindex/BuildAnalyzer.build/Debug-iphoneos/BuildAnalyzerKit.build/DerivedSources -Xcc -DSWIFT_PACKAGE -Xcc -DDEBUG\=1 -emit-objc-header -emit-objc-header-path /Users/admin/builder/spi-builder-workspace/.derivedData/Build/Intermediates.noindex/BuildAnalyzer.build/Debug-iphoneos/BuildAnalyzerKit.build/Objects-normal/arm64/BuildAnalyzerKit-Swift.h -working-directory /Users/admin/builder/spi-builder-workspace/.swiftpm/xcode -experimental-emit-module-separately -disable-cmo
SwiftDriverJobDiscovery normal arm64 Compiling SQLiteFeature.swift, SQLiteVersion.swift, Statement.swift, URIQueryParameter.swift (in target 'SQLite' from project 'SQLite.swift')
SwiftCompile normal arm64 Compiling\ Coding.swift,\ Collation.swift,\ CoreFunctions.swift /Users/admin/builder/spi-builder-workspace/.dependencies/checkouts/SQLite.swift/Sources/SQLite/Typed/Coding.swift /Users/admin/builder/spi-builder-workspace/.dependencies/checkouts/SQLite.swift/Sources/SQLite/Typed/Collation.swift /Users/admin/builder/spi-builder-workspace/.dependencies/checkouts/SQLite.swift/Sources/SQLite/Typed/CoreFunctions.swift (in target 'SQLite' from project 'SQLite.swift')
SwiftCompile normal arm64 /Users/admin/builder/spi-builder-workspace/.dependencies/checkouts/SQLite.swift/Sources/SQLite/Typed/Coding.swift (in target 'SQLite' from project 'SQLite.swift')
cd /Users/admin/builder/spi-builder-workspace/.swiftpm/xcode
SwiftCompile normal arm64 /Users/admin/builder/spi-builder-workspace/.dependencies/checkouts/SQLite.swift/Sources/SQLite/Typed/Collation.swift (in target 'SQLite' from project 'SQLite.swift')
cd /Users/admin/builder/spi-builder-workspace/.swiftpm/xcode
SwiftCompile normal arm64 /Users/admin/builder/spi-builder-workspace/.dependencies/checkouts/SQLite.swift/Sources/SQLite/Typed/CoreFunctions.swift (in target 'SQLite' from project 'SQLite.swift')
cd /Users/admin/builder/spi-builder-workspace/.swiftpm/xcode
SwiftMergeGeneratedHeaders /Users/admin/builder/spi-builder-workspace/.derivedData/Build/Intermediates.noindex/GeneratedModuleMaps-iphoneos/BuildAnalyzerKit-Swift.h /Users/admin/builder/spi-builder-workspace/.derivedData/Build/Intermediates.noindex/BuildAnalyzer.build/Debug-iphoneos/BuildAnalyzerKit.build/Objects-normal/arm64/BuildAnalyzerKit-Swift.h (in target 'BuildAnalyzerKit' from project 'BuildAnalyzer')
cd /Users/admin/builder/spi-builder-workspace
builtin-swiftHeaderTool -arch arm64 /Users/admin/builder/spi-builder-workspace/.derivedData/Build/Intermediates.noindex/BuildAnalyzer.build/Debug-iphoneos/BuildAnalyzerKit.build/Objects-normal/arm64/BuildAnalyzerKit-Swift.h -o /Users/admin/builder/spi-builder-workspace/.derivedData/Build/Intermediates.noindex/GeneratedModuleMaps-iphoneos/BuildAnalyzerKit-Swift.h
SwiftDriverJobDiscovery normal arm64 Compiling Random.swift, Shifts.swift, SquareRoot.swift, Strideable.swift, StringConversion.swift, Subtraction.swift, WordsAndBits.swift, ChaCha20.swift, Checksum.swift, Cipher.swift, Collection+Extension.swift (in target 'CryptoSwift' from project 'CryptoSwift')
Copy /Users/admin/builder/spi-builder-workspace/.derivedData/Build/Products/Debug-iphoneos/BuildAnalyzerKit.swiftmodule/arm64-apple-ios.swiftmodule /Users/admin/builder/spi-builder-workspace/.derivedData/Build/Intermediates.noindex/BuildAnalyzer.build/Debug-iphoneos/BuildAnalyzerKit.build/Objects-normal/arm64/BuildAnalyzerKit.swiftmodule (in target 'BuildAnalyzerKit' from project 'BuildAnalyzer')
cd /Users/admin/builder/spi-builder-workspace
builtin-copy -exclude .DS_Store -exclude CVS -exclude .svn -exclude .git -exclude .hg -resolve-src-symlinks -rename /Users/admin/builder/spi-builder-workspace/.derivedData/Build/Intermediates.noindex/BuildAnalyzer.build/Debug-iphoneos/BuildAnalyzerKit.build/Objects-normal/arm64/BuildAnalyzerKit.swiftmodule /Users/admin/builder/spi-builder-workspace/.derivedData/Build/Products/Debug-iphoneos/BuildAnalyzerKit.swiftmodule/arm64-apple-ios.swiftmodule
Copy /Users/admin/builder/spi-builder-workspace/.derivedData/Build/Products/Debug-iphoneos/BuildAnalyzerKit.swiftmodule/arm64-apple-ios.swiftdoc /Users/admin/builder/spi-builder-workspace/.derivedData/Build/Intermediates.noindex/BuildAnalyzer.build/Debug-iphoneos/BuildAnalyzerKit.build/Objects-normal/arm64/BuildAnalyzerKit.swiftdoc (in target 'BuildAnalyzerKit' from project 'BuildAnalyzer')
cd /Users/admin/builder/spi-builder-workspace
builtin-copy -exclude .DS_Store -exclude CVS -exclude .svn -exclude .git -exclude .hg -resolve-src-symlinks -rename /Users/admin/builder/spi-builder-workspace/.derivedData/Build/Intermediates.noindex/BuildAnalyzer.build/Debug-iphoneos/BuildAnalyzerKit.build/Objects-normal/arm64/BuildAnalyzerKit.swiftdoc /Users/admin/builder/spi-builder-workspace/.derivedData/Build/Products/Debug-iphoneos/BuildAnalyzerKit.swiftmodule/arm64-apple-ios.swiftdoc
Copy /Users/admin/builder/spi-builder-workspace/.derivedData/Build/Products/Debug-iphoneos/BuildAnalyzerKit.swiftmodule/arm64-apple-ios.abi.json /Users/admin/builder/spi-builder-workspace/.derivedData/Build/Intermediates.noindex/BuildAnalyzer.build/Debug-iphoneos/BuildAnalyzerKit.build/Objects-normal/arm64/BuildAnalyzerKit.abi.json (in target 'BuildAnalyzerKit' from project 'BuildAnalyzer')
cd /Users/admin/builder/spi-builder-workspace
builtin-copy -exclude .DS_Store -exclude CVS -exclude .svn -exclude .git -exclude .hg -resolve-src-symlinks -rename /Users/admin/builder/spi-builder-workspace/.derivedData/Build/Intermediates.noindex/BuildAnalyzer.build/Debug-iphoneos/BuildAnalyzerKit.build/Objects-normal/arm64/BuildAnalyzerKit.abi.json /Users/admin/builder/spi-builder-workspace/.derivedData/Build/Products/Debug-iphoneos/BuildAnalyzerKit.swiftmodule/arm64-apple-ios.abi.json
Copy /Users/admin/builder/spi-builder-workspace/.derivedData/Build/Products/Debug-iphoneos/BuildAnalyzerKit.swiftmodule/Project/arm64-apple-ios.swiftsourceinfo /Users/admin/builder/spi-builder-workspace/.derivedData/Build/Intermediates.noindex/BuildAnalyzer.build/Debug-iphoneos/BuildAnalyzerKit.build/Objects-normal/arm64/BuildAnalyzerKit.swiftsourceinfo (in target 'BuildAnalyzerKit' from project 'BuildAnalyzer')
cd /Users/admin/builder/spi-builder-workspace
builtin-copy -exclude .DS_Store -exclude CVS -exclude .svn -exclude .git -exclude .hg -resolve-src-symlinks -rename /Users/admin/builder/spi-builder-workspace/.derivedData/Build/Intermediates.noindex/BuildAnalyzer.build/Debug-iphoneos/BuildAnalyzerKit.build/Objects-normal/arm64/BuildAnalyzerKit.swiftsourceinfo /Users/admin/builder/spi-builder-workspace/.derivedData/Build/Products/Debug-iphoneos/BuildAnalyzerKit.swiftmodule/Project/arm64-apple-ios.swiftsourceinfo
SwiftDriver\ Compilation GraphKit normal arm64 com.apple.xcode.tools.swift.compiler (in target 'GraphKit' from project 'BuildAnalyzer')
cd /Users/admin/builder/spi-builder-workspace/.swiftpm/xcode
builtin-Swift-Compilation -- /Applications/Xcode-16.3.0.app/Contents/Developer/Toolchains/XcodeDefault.xctoolchain/usr/bin/swiftc -module-name GraphKit -Onone -enforce-exclusivity\=checked @/Users/admin/builder/spi-builder-workspace/.derivedData/Build/Intermediates.noindex/BuildAnalyzer.build/Debug-iphoneos/GraphKit.build/Objects-normal/arm64/GraphKit.SwiftFileList -DSWIFT_PACKAGE -DDEBUG -DXcode -plugin-path /Applications/Xcode-16.3.0.app/Contents/Developer/Toolchains/XcodeDefault.xctoolchain/usr/lib/swift/host/plugins/testing -enable-experimental-feature DebugDescriptionMacro -sdk /Applications/Xcode-16.3.0.app/Contents/Developer/Platforms/iPhoneOS.platform/Developer/SDKs/iPhoneOS18.4.sdk -target arm64-apple-ios12.0 -g -module-cache-path /Users/admin/builder/spi-builder-workspace/.derivedData/ModuleCache.noindex -Xfrontend -serialize-debugging-options -profile-coverage-mapping -profile-generate -enable-testing -index-store-path /Users/admin/builder/spi-builder-workspace/.derivedData/Index.noindex/DataStore -swift-version 5 -I /Users/admin/builder/spi-builder-workspace/.derivedData/Build/Products/Debug-iphoneos -I /Applications/Xcode-16.3.0.app/Contents/Developer/Platforms/iPhoneOS.platform/Developer/usr/lib -F /Users/admin/builder/spi-builder-workspace/.derivedData/Build/Products/Debug-iphoneos -F /Applications/Xcode-16.3.0.app/Contents/Developer/Platforms/iPhoneOS.platform/Developer/Library/Frameworks -F /Applications/Xcode-16.3.0.app/Contents/Developer/Platforms/iPhoneOS.platform/Developer/SDKs/iPhoneOS18.4.sdk/Developer/Library/Frameworks -parse-as-library -c -j10 -enable-batch-mode -incremental -Xcc -ivfsstatcache -Xcc /Users/admin/builder/spi-builder-workspace/.derivedData/SDKStatCaches.noindex/iphoneos18.4-22E235-339d34bc69d7fc736c3220795c36f340.sdkstatcache -output-file-map /Users/admin/builder/spi-builder-workspace/.derivedData/Build/Intermediates.noindex/BuildAnalyzer.build/Debug-iphoneos/GraphKit.build/Objects-normal/arm64/GraphKit-OutputFileMap.json -use-frontend-parseable-output -save-temps -no-color-diagnostics -serialize-diagnostics -emit-dependencies -emit-module -emit-module-path /Users/admin/builder/spi-builder-workspace/.derivedData/Build/Intermediates.noindex/BuildAnalyzer.build/Debug-iphoneos/GraphKit.build/Objects-normal/arm64/GraphKit.swiftmodule -validate-clang-modules-once -clang-build-session-file /Users/admin/builder/spi-builder-workspace/.derivedData/ModuleCache.noindex/Session.modulevalidation -package-name spi_builder_workspace -Xcc -I/Users/admin/builder/spi-builder-workspace/.derivedData/Build/Intermediates.noindex/BuildAnalyzer.build/Debug-iphoneos/GraphKit.build/swift-overrides.hmap -emit-const-values -Xfrontend -const-gather-protocols-file -Xfrontend /Users/admin/builder/spi-builder-workspace/.derivedData/Build/Intermediates.noindex/BuildAnalyzer.build/Debug-iphoneos/GraphKit.build/Objects-normal/arm64/GraphKit_const_extract_protocols.json -Xcc -I/Users/admin/builder/spi-builder-workspace/.derivedData/Build/Products/Debug-iphoneos/include -Xcc -I/Users/admin/builder/spi-builder-workspace/.derivedData/Build/Intermediates.noindex/BuildAnalyzer.build/Debug-iphoneos/GraphKit.build/DerivedSources-normal/arm64 -Xcc -I/Users/admin/builder/spi-builder-workspace/.derivedData/Build/Intermediates.noindex/BuildAnalyzer.build/Debug-iphoneos/GraphKit.build/DerivedSources/arm64 -Xcc -I/Users/admin/builder/spi-builder-workspace/.derivedData/Build/Intermediates.noindex/BuildAnalyzer.build/Debug-iphoneos/GraphKit.build/DerivedSources -Xcc -DSWIFT_PACKAGE -Xcc -DDEBUG\=1 -emit-objc-header -emit-objc-header-path /Users/admin/builder/spi-builder-workspace/.derivedData/Build/Intermediates.noindex/BuildAnalyzer.build/Debug-iphoneos/GraphKit.build/Objects-normal/arm64/GraphKit-Swift.h -working-directory /Users/admin/builder/spi-builder-workspace/.swiftpm/xcode -experimental-emit-module-separately -disable-cmo
SwiftCompile normal arm64 Compiling\ CompactMap.swift,\ Cryptor.swift,\ Cryptors.swift,\ Digest.swift,\ DigestType.swift,\ AES+Foundation.swift,\ Array+Foundation.swift,\ Blowfish+Foundation.swift,\ ChaCha20+Foundation.swift,\ Data+Extension.swift,\ HMAC+Foundation.swift /Users/admin/builder/spi-builder-workspace/.dependencies/checkouts/CryptoSwift/Sources/CryptoSwift/CompactMap.swift /Users/admin/builder/spi-builder-workspace/.dependencies/checkouts/CryptoSwift/Sources/CryptoSwift/Cryptor.swift /Users/admin/builder/spi-builder-workspace/.dependencies/checkouts/CryptoSwift/Sources/CryptoSwift/Cryptors.swift /Users/admin/builder/spi-builder-workspace/.dependencies/checkouts/CryptoSwift/Sources/CryptoSwift/Digest.swift /Users/admin/builder/spi-builder-workspace/.dependencies/checkouts/CryptoSwift/Sources/CryptoSwift/DigestType.swift /Users/admin/builder/spi-builder-workspace/.dependencies/checkouts/CryptoSwift/Sources/CryptoSwift/Foundation/AES+Foundation.swift /Users/admin/builder/spi-builder-workspace/.dependencies/checkouts/CryptoSwift/Sources/CryptoSwift/Foundation/Array+Foundation.swift /Users/admin/builder/spi-builder-workspace/.dependencies/checkouts/CryptoSwift/Sources/CryptoSwift/Foundation/Blowfish+Foundation.swift /Users/admin/builder/spi-builder-workspace/.dependencies/checkouts/CryptoSwift/Sources/CryptoSwift/Foundation/ChaCha20+Foundation.swift /Users/admin/builder/spi-builder-workspace/.dependencies/checkouts/CryptoSwift/Sources/CryptoSwift/Foundation/Data+Extension.swift /Users/admin/builder/spi-builder-workspace/.dependencies/checkouts/CryptoSwift/Sources/CryptoSwift/Foundation/HMAC+Foundation.swift (in target 'CryptoSwift' from project 'CryptoSwift')
SwiftCompile normal arm64 /Users/admin/builder/spi-builder-workspace/.dependencies/checkouts/CryptoSwift/Sources/CryptoSwift/CompactMap.swift (in target 'CryptoSwift' from project 'CryptoSwift')
cd /Users/admin/builder/spi-builder-workspace/.swiftpm/xcode
SwiftCompile normal arm64 /Users/admin/builder/spi-builder-workspace/.dependencies/checkouts/CryptoSwift/Sources/CryptoSwift/Cryptor.swift (in target 'CryptoSwift' from project 'CryptoSwift')
cd /Users/admin/builder/spi-builder-workspace/.swiftpm/xcode
SwiftCompile normal arm64 /Users/admin/builder/spi-builder-workspace/.dependencies/checkouts/CryptoSwift/Sources/CryptoSwift/Cryptors.swift (in target 'CryptoSwift' from project 'CryptoSwift')
cd /Users/admin/builder/spi-builder-workspace/.swiftpm/xcode
SwiftCompile normal arm64 /Users/admin/builder/spi-builder-workspace/.dependencies/checkouts/CryptoSwift/Sources/CryptoSwift/Digest.swift (in target 'CryptoSwift' from project 'CryptoSwift')
cd /Users/admin/builder/spi-builder-workspace/.swiftpm/xcode
SwiftCompile normal arm64 /Users/admin/builder/spi-builder-workspace/.dependencies/checkouts/CryptoSwift/Sources/CryptoSwift/DigestType.swift (in target 'CryptoSwift' from project 'CryptoSwift')
cd /Users/admin/builder/spi-builder-workspace/.swiftpm/xcode
SwiftCompile normal arm64 /Users/admin/builder/spi-builder-workspace/.dependencies/checkouts/CryptoSwift/Sources/CryptoSwift/Foundation/AES+Foundation.swift (in target 'CryptoSwift' from project 'CryptoSwift')
cd /Users/admin/builder/spi-builder-workspace/.swiftpm/xcode
SwiftCompile normal arm64 /Users/admin/builder/spi-builder-workspace/.dependencies/checkouts/CryptoSwift/Sources/CryptoSwift/Foundation/Array+Foundation.swift (in target 'CryptoSwift' from project 'CryptoSwift')
cd /Users/admin/builder/spi-builder-workspace/.swiftpm/xcode
SwiftCompile normal arm64 /Users/admin/builder/spi-builder-workspace/.dependencies/checkouts/CryptoSwift/Sources/CryptoSwift/Foundation/Blowfish+Foundation.swift (in target 'CryptoSwift' from project 'CryptoSwift')
cd /Users/admin/builder/spi-builder-workspace/.swiftpm/xcode
SwiftCompile normal arm64 /Users/admin/builder/spi-builder-workspace/.dependencies/checkouts/CryptoSwift/Sources/CryptoSwift/Foundation/ChaCha20+Foundation.swift (in target 'CryptoSwift' from project 'CryptoSwift')
cd /Users/admin/builder/spi-builder-workspace/.swiftpm/xcode
SwiftCompile normal arm64 /Users/admin/builder/spi-builder-workspace/.dependencies/checkouts/CryptoSwift/Sources/CryptoSwift/Foundation/Data+Extension.swift (in target 'CryptoSwift' from project 'CryptoSwift')
cd /Users/admin/builder/spi-builder-workspace/.swiftpm/xcode
SwiftCompile normal arm64 /Users/admin/builder/spi-builder-workspace/.dependencies/checkouts/CryptoSwift/Sources/CryptoSwift/Foundation/HMAC+Foundation.swift (in target 'CryptoSwift' from project 'CryptoSwift')
cd /Users/admin/builder/spi-builder-workspace/.swiftpm/xcode
SwiftCompile normal arm64 Compiling\ StreamEncryptor.swift,\ String+Extension.swift,\ UInt128.swift,\ UInt16+Extension.swift,\ UInt32+Extension.swift,\ UInt64+Extension.swift,\ UInt8+Extension.swift,\ Updatable.swift,\ Utils.swift,\ XChaCha20.swift,\ ZeroPadding.swift /Users/admin/builder/spi-builder-workspace/.dependencies/checkouts/CryptoSwift/Sources/CryptoSwift/StreamEncryptor.swift /Users/admin/builder/spi-builder-workspace/.dependencies/checkouts/CryptoSwift/Sources/CryptoSwift/String+Extension.swift /Users/admin/builder/spi-builder-workspace/.dependencies/checkouts/CryptoSwift/Sources/CryptoSwift/UInt128.swift /Users/admin/builder/spi-builder-workspace/.dependencies/checkouts/CryptoSwift/Sources/CryptoSwift/UInt16+Extension.swift /Users/admin/builder/spi-builder-workspace/.dependencies/checkouts/CryptoSwift/Sources/CryptoSwift/UInt32+Extension.swift /Users/admin/builder/spi-builder-workspace/.dependencies/checkouts/CryptoSwift/Sources/CryptoSwift/UInt64+Extension.swift /Users/admin/builder/spi-builder-workspace/.dependencies/checkouts/CryptoSwift/Sources/CryptoSwift/UInt8+Extension.swift /Users/admin/builder/spi-builder-workspace/.dependencies/checkouts/CryptoSwift/Sources/CryptoSwift/Updatable.swift /Users/admin/builder/spi-builder-workspace/.dependencies/checkouts/CryptoSwift/Sources/CryptoSwift/Utils.swift /Users/admin/builder/spi-builder-workspace/.dependencies/checkouts/CryptoSwift/Sources/CryptoSwift/XChaCha20.swift /Users/admin/builder/spi-builder-workspace/.dependencies/checkouts/CryptoSwift/Sources/CryptoSwift/ZeroPadding.swift (in target 'CryptoSwift' from project 'CryptoSwift')
SwiftCompile normal arm64 /Users/admin/builder/spi-builder-workspace/.dependencies/checkouts/CryptoSwift/Sources/CryptoSwift/StreamEncryptor.swift (in target 'CryptoSwift' from project 'CryptoSwift')
cd /Users/admin/builder/spi-builder-workspace/.swiftpm/xcode
SwiftCompile normal arm64 /Users/admin/builder/spi-builder-workspace/.dependencies/checkouts/CryptoSwift/Sources/CryptoSwift/String+Extension.swift (in target 'CryptoSwift' from project 'CryptoSwift')
cd /Users/admin/builder/spi-builder-workspace/.swiftpm/xcode
SwiftCompile normal arm64 /Users/admin/builder/spi-builder-workspace/.dependencies/checkouts/CryptoSwift/Sources/CryptoSwift/UInt128.swift (in target 'CryptoSwift' from project 'CryptoSwift')
cd /Users/admin/builder/spi-builder-workspace/.swiftpm/xcode
SwiftCompile normal arm64 /Users/admin/builder/spi-builder-workspace/.dependencies/checkouts/CryptoSwift/Sources/CryptoSwift/UInt16+Extension.swift (in target 'CryptoSwift' from project 'CryptoSwift')
cd /Users/admin/builder/spi-builder-workspace/.swiftpm/xcode
SwiftCompile normal arm64 /Users/admin/builder/spi-builder-workspace/.dependencies/checkouts/CryptoSwift/Sources/CryptoSwift/UInt32+Extension.swift (in target 'CryptoSwift' from project 'CryptoSwift')
cd /Users/admin/builder/spi-builder-workspace/.swiftpm/xcode
SwiftCompile normal arm64 /Users/admin/builder/spi-builder-workspace/.dependencies/checkouts/CryptoSwift/Sources/CryptoSwift/UInt64+Extension.swift (in target 'CryptoSwift' from project 'CryptoSwift')
cd /Users/admin/builder/spi-builder-workspace/.swiftpm/xcode
SwiftCompile normal arm64 /Users/admin/builder/spi-builder-workspace/.dependencies/checkouts/CryptoSwift/Sources/CryptoSwift/UInt8+Extension.swift (in target 'CryptoSwift' from project 'CryptoSwift')
cd /Users/admin/builder/spi-builder-workspace/.swiftpm/xcode
SwiftCompile normal arm64 /Users/admin/builder/spi-builder-workspace/.dependencies/checkouts/CryptoSwift/Sources/CryptoSwift/Updatable.swift (in target 'CryptoSwift' from project 'CryptoSwift')
cd /Users/admin/builder/spi-builder-workspace/.swiftpm/xcode
SwiftCompile normal arm64 /Users/admin/builder/spi-builder-workspace/.dependencies/checkouts/CryptoSwift/Sources/CryptoSwift/Utils.swift (in target 'CryptoSwift' from project 'CryptoSwift')
cd /Users/admin/builder/spi-builder-workspace/.swiftpm/xcode
SwiftCompile normal arm64 /Users/admin/builder/spi-builder-workspace/.dependencies/checkouts/CryptoSwift/Sources/CryptoSwift/XChaCha20.swift (in target 'CryptoSwift' from project 'CryptoSwift')
cd /Users/admin/builder/spi-builder-workspace/.swiftpm/xcode
SwiftCompile normal arm64 /Users/admin/builder/spi-builder-workspace/.dependencies/checkouts/CryptoSwift/Sources/CryptoSwift/ZeroPadding.swift (in target 'CryptoSwift' from project 'CryptoSwift')
cd /Users/admin/builder/spi-builder-workspace/.swiftpm/xcode
SwiftDriverJobDiscovery normal arm64 Compiling SchemaChanger.swift, SchemaDefinitions.swift, SchemaReader.swift, AggregateFunctions.swift (in target 'SQLite' from project 'SQLite.swift')
SwiftCompile normal arm64 Compiling\ BatchedCollection.swift,\ Bit.swift,\ BlockCipher.swift,\ BlockDecryptor.swift,\ BlockEncryptor.swift,\ BlockMode.swift,\ BlockModeOptions.swift,\ CBC.swift,\ CCM.swift,\ CFB.swift,\ CTR.swift,\ CipherModeWorker.swift /Users/admin/builder/spi-builder-workspace/.dependencies/checkouts/CryptoSwift/Sources/CryptoSwift/BatchedCollection.swift /Users/admin/builder/spi-builder-workspace/.dependencies/checkouts/CryptoSwift/Sources/CryptoSwift/Bit.swift /Users/admin/builder/spi-builder-workspace/.dependencies/checkouts/CryptoSwift/Sources/CryptoSwift/BlockCipher.swift /Users/admin/builder/spi-builder-workspace/.dependencies/checkouts/CryptoSwift/Sources/CryptoSwift/BlockDecryptor.swift /Users/admin/builder/spi-builder-workspace/.dependencies/checkouts/CryptoSwift/Sources/CryptoSwift/BlockEncryptor.swift /Users/admin/builder/spi-builder-workspace/.dependencies/checkouts/CryptoSwift/Sources/CryptoSwift/BlockMode/BlockMode.swift /Users/admin/builder/spi-builder-workspace/.dependencies/checkouts/CryptoSwift/Sources/CryptoSwift/BlockMode/BlockModeOptions.swift /Users/admin/builder/spi-builder-workspace/.dependencies/checkouts/CryptoSwift/Sources/CryptoSwift/BlockMode/CBC.swift /Users/admin/builder/spi-builder-workspace/.dependencies/checkouts/CryptoSwift/Sources/CryptoSwift/BlockMode/CCM.swift /Users/admin/builder/spi-builder-workspace/.dependencies/checkouts/CryptoSwift/Sources/CryptoSwift/BlockMode/CFB.swift /Users/admin/builder/spi-builder-workspace/.dependencies/checkouts/CryptoSwift/Sources/CryptoSwift/BlockMode/CTR.swift /Users/admin/builder/spi-builder-workspace/.dependencies/checkouts/CryptoSwift/Sources/CryptoSwift/BlockMode/CipherModeWorker.swift (in target 'CryptoSwift' from project 'CryptoSwift')
SwiftCompile normal arm64 /Users/admin/builder/spi-builder-workspace/.dependencies/checkouts/CryptoSwift/Sources/CryptoSwift/BatchedCollection.swift (in target 'CryptoSwift' from project 'CryptoSwift')
cd /Users/admin/builder/spi-builder-workspace/.swiftpm/xcode
SwiftCompile normal arm64 /Users/admin/builder/spi-builder-workspace/.dependencies/checkouts/CryptoSwift/Sources/CryptoSwift/Bit.swift (in target 'CryptoSwift' from project 'CryptoSwift')
cd /Users/admin/builder/spi-builder-workspace/.swiftpm/xcode
SwiftCompile normal arm64 /Users/admin/builder/spi-builder-workspace/.dependencies/checkouts/CryptoSwift/Sources/CryptoSwift/BlockCipher.swift (in target 'CryptoSwift' from project 'CryptoSwift')
cd /Users/admin/builder/spi-builder-workspace/.swiftpm/xcode
SwiftCompile normal arm64 /Users/admin/builder/spi-builder-workspace/.dependencies/checkouts/CryptoSwift/Sources/CryptoSwift/BlockDecryptor.swift (in target 'CryptoSwift' from project 'CryptoSwift')
cd /Users/admin/builder/spi-builder-workspace/.swiftpm/xcode
SwiftCompile normal arm64 /Users/admin/builder/spi-builder-workspace/.dependencies/checkouts/CryptoSwift/Sources/CryptoSwift/BlockEncryptor.swift (in target 'CryptoSwift' from project 'CryptoSwift')
cd /Users/admin/builder/spi-builder-workspace/.swiftpm/xcode
SwiftCompile normal arm64 /Users/admin/builder/spi-builder-workspace/.dependencies/checkouts/CryptoSwift/Sources/CryptoSwift/BlockMode/BlockMode.swift (in target 'CryptoSwift' from project 'CryptoSwift')
cd /Users/admin/builder/spi-builder-workspace/.swiftpm/xcode
SwiftCompile normal arm64 /Users/admin/builder/spi-builder-workspace/.dependencies/checkouts/CryptoSwift/Sources/CryptoSwift/BlockMode/BlockModeOptions.swift (in target 'CryptoSwift' from project 'CryptoSwift')
cd /Users/admin/builder/spi-builder-workspace/.swiftpm/xcode
SwiftCompile normal arm64 /Users/admin/builder/spi-builder-workspace/.dependencies/checkouts/CryptoSwift/Sources/CryptoSwift/BlockMode/CBC.swift (in target 'CryptoSwift' from project 'CryptoSwift')
cd /Users/admin/builder/spi-builder-workspace/.swiftpm/xcode
SwiftCompile normal arm64 /Users/admin/builder/spi-builder-workspace/.dependencies/checkouts/CryptoSwift/Sources/CryptoSwift/BlockMode/CCM.swift (in target 'CryptoSwift' from project 'CryptoSwift')
cd /Users/admin/builder/spi-builder-workspace/.swiftpm/xcode
SwiftCompile normal arm64 /Users/admin/builder/spi-builder-workspace/.dependencies/checkouts/CryptoSwift/Sources/CryptoSwift/BlockMode/CFB.swift (in target 'CryptoSwift' from project 'CryptoSwift')
cd /Users/admin/builder/spi-builder-workspace/.swiftpm/xcode
SwiftCompile normal arm64 /Users/admin/builder/spi-builder-workspace/.dependencies/checkouts/CryptoSwift/Sources/CryptoSwift/BlockMode/CTR.swift (in target 'CryptoSwift' from project 'CryptoSwift')
cd /Users/admin/builder/spi-builder-workspace/.swiftpm/xcode
SwiftCompile normal arm64 /Users/admin/builder/spi-builder-workspace/.dependencies/checkouts/CryptoSwift/Sources/CryptoSwift/BlockMode/CipherModeWorker.swift (in target 'CryptoSwift' from project 'CryptoSwift')
cd /Users/admin/builder/spi-builder-workspace/.swiftpm/xcode
SwiftDriverJobDiscovery normal arm64 Compiling CustomFunctions.swift, DateAndTimeFunctions.swift, Expression.swift (in target 'SQLite' from project 'SQLite.swift')
SwiftCompile normal arm64 Compiling\ BuildGraphNodeTimingSqlReader.swift /Users/admin/builder/spi-builder-workspace/Sources/BuildAnalyzerKit/Timing/BuildGraphNodeTimingSqlReader.swift (in target 'BuildAnalyzerKit' from project 'BuildAnalyzer')
SwiftCompile normal arm64 /Users/admin/builder/spi-builder-workspace/Sources/BuildAnalyzerKit/Timing/BuildGraphNodeTimingSqlReader.swift (in target 'BuildAnalyzerKit' from project 'BuildAnalyzer')
cd /Users/admin/builder/spi-builder-workspace/.swiftpm/xcode
SwiftDriverJobDiscovery normal arm64 Compiling Schema.swift, Setter.swift, WindowFunctions.swift (in target 'SQLite' from project 'SQLite.swift')
SwiftCompile normal arm64 Compiling\ BuildGraphProtocol+Expansion.swift /Users/admin/builder/spi-builder-workspace/Sources/BuildAnalyzerKit/Projection/BuildGraphProtocol+Expansion.swift (in target 'BuildAnalyzerKit' from project 'BuildAnalyzer')
SwiftCompile normal arm64 /Users/admin/builder/spi-builder-workspace/Sources/BuildAnalyzerKit/Projection/BuildGraphProtocol+Expansion.swift (in target 'BuildAnalyzerKit' from project 'BuildAnalyzer')
cd /Users/admin/builder/spi-builder-workspace/.swiftpm/xcode
SwiftDriverJobDiscovery normal arm64 Compiling Coding.swift, Collation.swift, CoreFunctions.swift (in target 'SQLite' from project 'SQLite.swift')
SwiftCompile normal arm64 Compiling\ BuildGraphNodeProjectionNode.swift /Users/admin/builder/spi-builder-workspace/Sources/BuildAnalyzerKit/Projection/BuildGraphNodeProjectionNode.swift (in target 'BuildAnalyzerKit' from project 'BuildAnalyzer')
SwiftCompile normal arm64 /Users/admin/builder/spi-builder-workspace/Sources/BuildAnalyzerKit/Projection/BuildGraphNodeProjectionNode.swift (in target 'BuildAnalyzerKit' from project 'BuildAnalyzer')
cd /Users/admin/builder/spi-builder-workspace/.swiftpm/xcode
SwiftDriverJobDiscovery normal arm64 Compiling BuildGraphNodeTimingSqlReader.swift (in target 'BuildAnalyzerKit' from project 'BuildAnalyzer')
SwiftCompile normal arm64 Compiling\ BuildGraphProjectionExpansion.swift /Users/admin/builder/spi-builder-workspace/Sources/BuildAnalyzerKit/Projection/BuildGraphProjectionExpansion.swift (in target 'BuildAnalyzerKit' from project 'BuildAnalyzer')
SwiftCompile normal arm64 /Users/admin/builder/spi-builder-workspace/Sources/BuildAnalyzerKit/Projection/BuildGraphProjectionExpansion.swift (in target 'BuildAnalyzerKit' from project 'BuildAnalyzer')
cd /Users/admin/builder/spi-builder-workspace/.swiftpm/xcode
SwiftDriverJobDiscovery normal arm64 Compiling CompactMap.swift, Cryptor.swift, Cryptors.swift, Digest.swift, DigestType.swift, AES+Foundation.swift, Array+Foundation.swift, Blowfish+Foundation.swift, ChaCha20+Foundation.swift, Data+Extension.swift, HMAC+Foundation.swift (in target 'CryptoSwift' from project 'CryptoSwift')
SwiftCompile normal arm64 Compiling\ BuildGraphProtocol.swift,\ BuildManifestParser.swift /Users/admin/builder/spi-builder-workspace/Sources/BuildAnalyzerKit/BuildGraphProtocol.swift /Users/admin/builder/spi-builder-workspace/Sources/BuildAnalyzerKit/BuildManifestParser.swift (in target 'BuildAnalyzerKit' from project 'BuildAnalyzer')
SwiftCompile normal arm64 /Users/admin/builder/spi-builder-workspace/Sources/BuildAnalyzerKit/BuildGraphProtocol.swift (in target 'BuildAnalyzerKit' from project 'BuildAnalyzer')
cd /Users/admin/builder/spi-builder-workspace/.swiftpm/xcode
SwiftCompile normal arm64 /Users/admin/builder/spi-builder-workspace/Sources/BuildAnalyzerKit/BuildManifestParser.swift (in target 'BuildAnalyzerKit' from project 'BuildAnalyzer')
cd /Users/admin/builder/spi-builder-workspace/.swiftpm/xcode
SwiftDriverJobDiscovery normal arm64 Emitting module for CryptoSwift (in target 'CryptoSwift' from project 'CryptoSwift')
SwiftDriver\ Compilation\ Requirements CryptoSwift normal arm64 com.apple.xcode.tools.swift.compiler (in target 'CryptoSwift' from project 'CryptoSwift')
cd /Users/admin/builder/spi-builder-workspace/.swiftpm/xcode
builtin-Swift-Compilation-Requirements -- /Applications/Xcode-16.3.0.app/Contents/Developer/Toolchains/XcodeDefault.xctoolchain/usr/bin/swiftc -module-name CryptoSwift -Onone -enforce-exclusivity\=checked @/Users/admin/builder/spi-builder-workspace/.derivedData/Build/Intermediates.noindex/CryptoSwift.build/Debug-iphoneos/CryptoSwift.build/Objects-normal/arm64/CryptoSwift.SwiftFileList -DSWIFT_PACKAGE -DDEBUG -DXcode -plugin-path /Applications/Xcode-16.3.0.app/Contents/Developer/Toolchains/XcodeDefault.xctoolchain/usr/lib/swift/host/plugins/testing -enable-experimental-feature DebugDescriptionMacro -sdk /Applications/Xcode-16.3.0.app/Contents/Developer/Platforms/iPhoneOS.platform/Developer/SDKs/iPhoneOS18.4.sdk -target arm64-apple-ios12.0 -g -module-cache-path /Users/admin/builder/spi-builder-workspace/.derivedData/ModuleCache.noindex -Xfrontend -serialize-debugging-options -profile-coverage-mapping -profile-generate -enable-testing -suppress-warnings -index-store-path /Users/admin/builder/spi-builder-workspace/.derivedData/Index.noindex/DataStore -swift-version 5 -I /Users/admin/builder/spi-builder-workspace/.derivedData/Build/Products/Debug-iphoneos -I /Applications/Xcode-16.3.0.app/Contents/Developer/Platforms/iPhoneOS.platform/Developer/usr/lib -F /Users/admin/builder/spi-builder-workspace/.derivedData/Build/Products/Debug-iphoneos -F /Applications/Xcode-16.3.0.app/Contents/Developer/Platforms/iPhoneOS.platform/Developer/Library/Frameworks -F /Applications/Xcode-16.3.0.app/Contents/Developer/Platforms/iPhoneOS.platform/Developer/SDKs/iPhoneOS18.4.sdk/Developer/Library/Frameworks -c -j10 -enable-batch-mode -incremental -Xcc -ivfsstatcache -Xcc /Users/admin/builder/spi-builder-workspace/.derivedData/SDKStatCaches.noindex/iphoneos18.4-22E235-339d34bc69d7fc736c3220795c36f340.sdkstatcache -output-file-map /Users/admin/builder/spi-builder-workspace/.derivedData/Build/Intermediates.noindex/CryptoSwift.build/Debug-iphoneos/CryptoSwift.build/Objects-normal/arm64/CryptoSwift-OutputFileMap.json -use-frontend-parseable-output -save-temps -no-color-diagnostics -serialize-diagnostics -emit-dependencies -emit-module -emit-module-path /Users/admin/builder/spi-builder-workspace/.derivedData/Build/Intermediates.noindex/CryptoSwift.build/Debug-iphoneos/CryptoSwift.build/Objects-normal/arm64/CryptoSwift.swiftmodule -validate-clang-modules-once -clang-build-session-file /Users/admin/builder/spi-builder-workspace/.derivedData/ModuleCache.noindex/Session.modulevalidation -Xcc -I/Users/admin/builder/spi-builder-workspace/.derivedData/Build/Intermediates.noindex/CryptoSwift.build/Debug-iphoneos/CryptoSwift.build/swift-overrides.hmap -emit-const-values -Xfrontend -const-gather-protocols-file -Xfrontend /Users/admin/builder/spi-builder-workspace/.derivedData/Build/Intermediates.noindex/CryptoSwift.build/Debug-iphoneos/CryptoSwift.build/Objects-normal/arm64/CryptoSwift_const_extract_protocols.json -Xcc -I/Users/admin/builder/spi-builder-workspace/.derivedData/Build/Products/Debug-iphoneos/include -Xcc -I/Users/admin/builder/spi-builder-workspace/.derivedData/Build/Intermediates.noindex/CryptoSwift.build/Debug-iphoneos/CryptoSwift.build/DerivedSources-normal/arm64 -Xcc -I/Users/admin/builder/spi-builder-workspace/.derivedData/Build/Intermediates.noindex/CryptoSwift.build/Debug-iphoneos/CryptoSwift.build/DerivedSources/arm64 -Xcc -I/Users/admin/builder/spi-builder-workspace/.derivedData/Build/Intermediates.noindex/CryptoSwift.build/Debug-iphoneos/CryptoSwift.build/DerivedSources -Xcc -DSWIFT_PACKAGE -Xcc -DDEBUG\=1 -emit-objc-header -emit-objc-header-path /Users/admin/builder/spi-builder-workspace/.derivedData/Build/Intermediates.noindex/CryptoSwift.build/Debug-iphoneos/CryptoSwift.build/Objects-normal/arm64/CryptoSwift-Swift.h -working-directory /Users/admin/builder/spi-builder-workspace/.swiftpm/xcode -experimental-emit-module-separately -disable-cmo
SwiftDriverJobDiscovery normal arm64 Compiling BuildGraphNodeProjectionNode.swift (in target 'BuildAnalyzerKit' from project 'BuildAnalyzer')
SwiftCompile normal arm64 Compiling\ BuildGraphProjection.swift /Users/admin/builder/spi-builder-workspace/Sources/BuildAnalyzerKit/Projection/BuildGraphProjection.swift (in target 'BuildAnalyzerKit' from project 'BuildAnalyzer')
SwiftCompile normal arm64 /Users/admin/builder/spi-builder-workspace/Sources/BuildAnalyzerKit/Projection/BuildGraphProjection.swift (in target 'BuildAnalyzerKit' from project 'BuildAnalyzer')
cd /Users/admin/builder/spi-builder-workspace/.swiftpm/xcode
Copy /Users/admin/builder/spi-builder-workspace/.derivedData/Build/Products/Debug-iphoneos/CryptoSwift.swiftmodule/arm64-apple-ios.swiftmodule /Users/admin/builder/spi-builder-workspace/.derivedData/Build/Intermediates.noindex/CryptoSwift.build/Debug-iphoneos/CryptoSwift.build/Objects-normal/arm64/CryptoSwift.swiftmodule (in target 'CryptoSwift' from project 'CryptoSwift')
cd /Users/admin/builder/spi-builder-workspace/.dependencies/checkouts/CryptoSwift
builtin-copy -exclude .DS_Store -exclude CVS -exclude .svn -exclude .git -exclude .hg -resolve-src-symlinks -rename /Users/admin/builder/spi-builder-workspace/.derivedData/Build/Intermediates.noindex/CryptoSwift.build/Debug-iphoneos/CryptoSwift.build/Objects-normal/arm64/CryptoSwift.swiftmodule /Users/admin/builder/spi-builder-workspace/.derivedData/Build/Products/Debug-iphoneos/CryptoSwift.swiftmodule/arm64-apple-ios.swiftmodule
SwiftDriverJobDiscovery normal arm64 Compiling BuildGraphProjectionExpansion.swift (in target 'BuildAnalyzerKit' from project 'BuildAnalyzer')
Copy /Users/admin/builder/spi-builder-workspace/.derivedData/Build/Products/Debug-iphoneos/CryptoSwift.swiftmodule/arm64-apple-ios.abi.json /Users/admin/builder/spi-builder-workspace/.derivedData/Build/Intermediates.noindex/CryptoSwift.build/Debug-iphoneos/CryptoSwift.build/Objects-normal/arm64/CryptoSwift.abi.json (in target 'CryptoSwift' from project 'CryptoSwift')
cd /Users/admin/builder/spi-builder-workspace/.dependencies/checkouts/CryptoSwift
builtin-copy -exclude .DS_Store -exclude CVS -exclude .svn -exclude .git -exclude .hg -resolve-src-symlinks -rename /Users/admin/builder/spi-builder-workspace/.derivedData/Build/Intermediates.noindex/CryptoSwift.build/Debug-iphoneos/CryptoSwift.build/Objects-normal/arm64/CryptoSwift.abi.json /Users/admin/builder/spi-builder-workspace/.derivedData/Build/Products/Debug-iphoneos/CryptoSwift.swiftmodule/arm64-apple-ios.abi.json
SwiftCompile normal arm64 Compiling\ Queue.swift /Users/admin/builder/spi-builder-workspace/Sources/BuildAnalyzerKit/DataStructure/Queue.swift (in target 'BuildAnalyzerKit' from project 'BuildAnalyzer')
SwiftCompile normal arm64 /Users/admin/builder/spi-builder-workspace/Sources/BuildAnalyzerKit/DataStructure/Queue.swift (in target 'BuildAnalyzerKit' from project 'BuildAnalyzer')
cd /Users/admin/builder/spi-builder-workspace/.swiftpm/xcode
SwiftCompile normal arm64 Compiling\ BuildGraphNodeTimingReader.swift /Users/admin/builder/spi-builder-workspace/Sources/BuildAnalyzerKit/Timing/BuildGraphNodeTimingReader.swift (in target 'BuildAnalyzerKit' from project 'BuildAnalyzer')
SwiftCompile normal arm64 /Users/admin/builder/spi-builder-workspace/Sources/BuildAnalyzerKit/Timing/BuildGraphNodeTimingReader.swift (in target 'BuildAnalyzerKit' from project 'BuildAnalyzer')
cd /Users/admin/builder/spi-builder-workspace/.swiftpm/xcode
SwiftDriverJobDiscovery normal arm64 Compiling ECB.swift, GCM.swift, OCB.swift, OFB.swift, PCBC.swift, Blowfish.swift, CBCMAC.swift, CMAC.swift, Addition.swift, BigInt.swift, BigUInt.swift, BitwiseOps.swift (in target 'CryptoSwift' from project 'CryptoSwift')
SwiftDriver XcodeHasher normal arm64 com.apple.xcode.tools.swift.compiler (in target 'XcodeHasher' from project 'BuildAnalyzer')
cd /Users/admin/builder/spi-builder-workspace/.swiftpm/xcode
builtin-SwiftDriver -- /Applications/Xcode-16.3.0.app/Contents/Developer/Toolchains/XcodeDefault.xctoolchain/usr/bin/swiftc -module-name XcodeHasher -Onone -enforce-exclusivity\=checked @/Users/admin/builder/spi-builder-workspace/.derivedData/Build/Intermediates.noindex/BuildAnalyzer.build/Debug-iphoneos/XcodeHasher.build/Objects-normal/arm64/XcodeHasher.SwiftFileList -DSWIFT_PACKAGE -DDEBUG -DXcode -plugin-path /Applications/Xcode-16.3.0.app/Contents/Developer/Toolchains/XcodeDefault.xctoolchain/usr/lib/swift/host/plugins/testing -enable-experimental-feature DebugDescriptionMacro -sdk /Applications/Xcode-16.3.0.app/Contents/Developer/Platforms/iPhoneOS.platform/Developer/SDKs/iPhoneOS18.4.sdk -target arm64-apple-ios12.0 -g -module-cache-path /Users/admin/builder/spi-builder-workspace/.derivedData/ModuleCache.noindex -Xfrontend -serialize-debugging-options -profile-coverage-mapping -profile-generate -enable-testing -index-store-path /Users/admin/builder/spi-builder-workspace/.derivedData/Index.noindex/DataStore -swift-version 5 -I /Users/admin/builder/spi-builder-workspace/.derivedData/Build/Products/Debug-iphoneos -I /Applications/Xcode-16.3.0.app/Contents/Developer/Platforms/iPhoneOS.platform/Developer/usr/lib -F /Users/admin/builder/spi-builder-workspace/.derivedData/Build/Products/Debug-iphoneos/PackageFrameworks -F /Users/admin/builder/spi-builder-workspace/.derivedData/Build/Products/Debug-iphoneos -F /Applications/Xcode-16.3.0.app/Contents/Developer/Platforms/iPhoneOS.platform/Developer/Library/Frameworks -F /Applications/Xcode-16.3.0.app/Contents/Developer/Platforms/iPhoneOS.platform/Developer/SDKs/iPhoneOS18.4.sdk/Developer/Library/Frameworks -parse-as-library -c -j10 -enable-batch-mode -incremental -Xcc -ivfsstatcache -Xcc /Users/admin/builder/spi-builder-workspace/.derivedData/SDKStatCaches.noindex/iphoneos18.4-22E235-339d34bc69d7fc736c3220795c36f340.sdkstatcache -output-file-map /Users/admin/builder/spi-builder-workspace/.derivedData/Build/Intermediates.noindex/BuildAnalyzer.build/Debug-iphoneos/XcodeHasher.build/Objects-normal/arm64/XcodeHasher-OutputFileMap.json -use-frontend-parseable-output -save-temps -no-color-diagnostics -serialize-diagnostics -emit-dependencies -emit-module -emit-module-path /Users/admin/builder/spi-builder-workspace/.derivedData/Build/Intermediates.noindex/BuildAnalyzer.build/Debug-iphoneos/XcodeHasher.build/Objects-normal/arm64/XcodeHasher.swiftmodule -validate-clang-modules-once -clang-build-session-file /Users/admin/builder/spi-builder-workspace/.derivedData/ModuleCache.noindex/Session.modulevalidation -package-name spi_builder_workspace -Xcc -I/Users/admin/builder/spi-builder-workspace/.derivedData/Build/Intermediates.noindex/BuildAnalyzer.build/Debug-iphoneos/XcodeHasher.build/swift-overrides.hmap -emit-const-values -Xfrontend -const-gather-protocols-file -Xfrontend /Users/admin/builder/spi-builder-workspace/.derivedData/Build/Intermediates.noindex/BuildAnalyzer.build/Debug-iphoneos/XcodeHasher.build/Objects-normal/arm64/XcodeHasher_const_extract_protocols.json -Xcc -I/Users/admin/builder/spi-builder-workspace/.derivedData/Build/Products/Debug-iphoneos/include -Xcc -I/Users/admin/builder/spi-builder-workspace/.derivedData/Build/Intermediates.noindex/BuildAnalyzer.build/Debug-iphoneos/XcodeHasher.build/DerivedSources-normal/arm64 -Xcc -I/Users/admin/builder/spi-builder-workspace/.derivedData/Build/Intermediates.noindex/BuildAnalyzer.build/Debug-iphoneos/XcodeHasher.build/DerivedSources/arm64 -Xcc -I/Users/admin/builder/spi-builder-workspace/.derivedData/Build/Intermediates.noindex/BuildAnalyzer.build/Debug-iphoneos/XcodeHasher.build/DerivedSources -Xcc -DSWIFT_PACKAGE -Xcc -DDEBUG\=1 -emit-objc-header -emit-objc-header-path /Users/admin/builder/spi-builder-workspace/.derivedData/Build/Intermediates.noindex/BuildAnalyzer.build/Debug-iphoneos/XcodeHasher.build/Objects-normal/arm64/XcodeHasher-Swift.h -working-directory /Users/admin/builder/spi-builder-workspace/.swiftpm/xcode -experimental-emit-module-separately -disable-cmo
SwiftDriverJobDiscovery normal arm64 Compiling BuildGraphProtocol+Expansion.swift (in target 'BuildAnalyzerKit' from project 'BuildAnalyzer')
SwiftCompile normal arm64 Compiling\ BuildGraphNode.swift,\ BuildGraphNodeKind.swift /Users/admin/builder/spi-builder-workspace/Sources/BuildAnalyzerKit/BuildGraphNode.swift /Users/admin/builder/spi-builder-workspace/Sources/BuildAnalyzerKit/BuildGraphNodeKind.swift (in target 'BuildAnalyzerKit' from project 'BuildAnalyzer')
Failed frontend command:
/Applications/Xcode-16.3.0.app/Contents/Developer/Toolchains/XcodeDefault.xctoolchain/usr/bin/swift-frontend -frontend -c /Users/admin/builder/spi-builder-workspace/Sources/BuildAnalyzerKit/BuildGraph.swift /Users/admin/builder/spi-builder-workspace/Sources/BuildAnalyzerKit/BuildGraphGenerator.swift -primary-file /Users/admin/builder/spi-builder-workspace/Sources/BuildAnalyzerKit/BuildGraphNode.swift -primary-file /Users/admin/builder/spi-builder-workspace/Sources/BuildAnalyzerKit/BuildGraphNodeKind.swift /Users/admin/builder/spi-builder-workspace/Sources/BuildAnalyzerKit/BuildGraphProtocol.swift /Users/admin/builder/spi-builder-workspace/Sources/BuildAnalyzerKit/BuildManifestParser.swift /Users/admin/builder/spi-builder-workspace/Sources/BuildAnalyzerKit/DataStructure/Queue.swift /Users/admin/builder/spi-builder-workspace/Sources/BuildAnalyzerKit/Projection/BuildGraphNodeProjectionNode.swift /Users/admin/builder/spi-builder-workspace/Sources/BuildAnalyzerKit/Projection/BuildGraphProjection.swift /Users/admin/builder/spi-builder-workspace/Sources/BuildAnalyzerKit/Projection/BuildGraphProjectionExpansion.swift /Users/admin/builder/spi-builder-workspace/Sources/BuildAnalyzerKit/Projection/BuildGraphProtocol+Expansion.swift /Users/admin/builder/spi-builder-workspace/Sources/BuildAnalyzerKit/Timing/BuildGraphNodeTimingReader.swift /Users/admin/builder/spi-builder-workspace/Sources/BuildAnalyzerKit/Timing/BuildGraphNodeTimingSqlReader.swift -emit-dependencies-path /Users/admin/builder/spi-builder-workspace/.derivedData/Build/Intermediates.noindex/BuildAnalyzer.build/Debug-iphoneos/BuildAnalyzerKit.build/Objects-normal/arm64/BuildGraphNode.d -emit-const-values-path /Users/admin/builder/spi-builder-workspace/.derivedData/Build/Intermediates.noindex/BuildAnalyzer.build/Debug-iphoneos/BuildAnalyzerKit.build/Objects-normal/arm64/BuildGraphNode.swiftconstvalues -emit-reference-dependencies-path /Users/admin/builder/spi-builder-workspace/.derivedData/Build/Intermediates.noindex/BuildAnalyzer.build/Debug-iphoneos/BuildAnalyzerKit.build/Objects-normal/arm64/BuildGraphNode.swiftdeps -serialize-diagnostics-path /Users/admin/builder/spi-builder-workspace/.derivedData/Build/Intermediates.noindex/BuildAnalyzer.build/Debug-iphoneos/BuildAnalyzerKit.build/Objects-normal/arm64/BuildGraphNode.dia -emit-dependencies-path /Users/admin/builder/spi-builder-workspace/.derivedData/Build/Intermediates.noindex/BuildAnalyzer.build/Debug-iphoneos/BuildAnalyzerKit.build/Objects-normal/arm64/BuildGraphNodeKind.d -emit-const-values-path /Users/admin/builder/spi-builder-workspace/.derivedData/Build/Intermediates.noindex/BuildAnalyzer.build/Debug-iphoneos/BuildAnalyzerKit.build/Objects-normal/arm64/BuildGraphNodeKind.swiftconstvalues -emit-reference-dependencies-path /Users/admin/builder/spi-builder-workspace/.derivedData/Build/Intermediates.noindex/BuildAnalyzer.build/Debug-iphoneos/BuildAnalyzerKit.build/Objects-normal/arm64/BuildGraphNodeKind.swiftdeps -serialize-diagnostics-path /Users/admin/builder/spi-builder-workspace/.derivedData/Build/Intermediates.noindex/BuildAnalyzer.build/Debug-iphoneos/BuildAnalyzerKit.build/Objects-normal/arm64/BuildGraphNodeKind.dia -target arm64-apple-ios12.0 -Xllvm -aarch64-use-tbi -enable-objc-interop -sdk /Applications/Xcode-16.3.0.app/Contents/Developer/Platforms/iPhoneOS.platform/Developer/SDKs/iPhoneOS18.4.sdk -I /Users/admin/builder/spi-builder-workspace/.derivedData/Build/Products/Debug-iphoneos -I /Applications/Xcode-16.3.0.app/Contents/Developer/Platforms/iPhoneOS.platform/Developer/usr/lib -F /Users/admin/builder/spi-builder-workspace/.derivedData/Build/Products/Debug-iphoneos/PackageFrameworks -F /Users/admin/builder/spi-builder-workspace/.derivedData/Build/Products/Debug-iphoneos -F /Applications/Xcode-16.3.0.app/Contents/Developer/Platforms/iPhoneOS.platform/Developer/Library/Frameworks -F /Applications/Xcode-16.3.0.app/Contents/Developer/Platforms/iPhoneOS.platform/Developer/SDKs/iPhoneOS18.4.sdk/Developer/Library/Frameworks -no-color-diagnostics -enable-testing -g -debug-info-format\=dwarf -dwarf-version\=4 -module-cache-path /Users/admin/builder/spi-builder-workspace/.derivedData/ModuleCache.noindex -profile-generate -profile-coverage-mapping -swift-version 5 -enforce-exclusivity\=checked -Onone -D SWIFT_PACKAGE -D DEBUG -D Xcode -serialize-debugging-options -const-gather-protocols-file /Users/admin/builder/spi-builder-workspace/.derivedData/Build/Intermediates.noindex/BuildAnalyzer.build/Debug-iphoneos/BuildAnalyzerKit.build/Objects-normal/arm64/BuildAnalyzerKit_const_extract_protocols.json -enable-upcoming-feature BareSlashRegexLiterals -enable-experimental-feature DebugDescriptionMacro -empty-abi-descriptor -plugin-path /Applications/Xcode-16.3.0.app/Contents/Developer/Toolchains/XcodeDefault.xctoolchain/usr/lib/swift/host/plugins/testing -validate-clang-modules-once -clang-build-session-file /Users/admin/builder/spi-builder-workspace/.derivedData/ModuleCache.noindex/Session.modulevalidation -Xcc -working-directory -Xcc /Users/admin/builder/spi-builder-workspace/.swiftpm/xcode -resource-dir /Applications/Xcode-16.3.0.app/Contents/Developer/Toolchains/XcodeDefault.xctoolchain/usr/lib/swift -enable-anonymous-context-mangled-names -file-compilation-dir /Users/admin/builder/spi-builder-workspace/.swiftpm/xcode -Xcc -ivfsstatcache -Xcc /Users/admin/builder/spi-builder-workspace/.derivedData/SDKStatCaches.noindex/iphoneos18.4-22E235-339d34bc69d7fc736c3220795c36f340.sdkstatcache -Xcc -I/Users/admin/builder/spi-builder-workspace/.derivedData/Build/Intermediates.noindex/BuildAnalyzer.build/Debug-iphoneos/BuildAnalyzerKit.build/swift-overrides.hmap -Xcc -I/Users/admin/builder/spi-builder-workspace/.derivedData/Build/Products/Debug-iphoneos/include -Xcc -I/Users/admin/builder/spi-builder-workspace/.derivedData/Build/Intermediates.noindex/BuildAnalyzer.build/Debug-iphoneos/BuildAnalyzerKit.build/DerivedSources-normal/arm64 -Xcc -I/Users/admin/builder/spi-builder-workspace/.derivedData/Build/Intermediates.noindex/BuildAnalyzer.build/Debug-iphoneos/BuildAnalyzerKit.build/DerivedSources/arm64 -Xcc -I/Users/admin/builder/spi-builder-workspace/.derivedData/Build/Intermediates.noindex/BuildAnalyzer.build/Debug-iphoneos/BuildAnalyzerKit.build/DerivedSources -Xcc -DSWIFT_PACKAGE -Xcc -DDEBUG\=1 -module-name BuildAnalyzerKit -package-name spi_builder_workspace -frontend-parseable-output -disable-clang-spi -target-sdk-version 18.4 -target-sdk-name iphoneos18.4 -external-plugin-path /Applications/Xcode-16.3.0.app/Contents/Developer/Platforms/iPhoneOS.platform/Developer/usr/lib/swift/host/plugins\#/Applications/Xcode-16.3.0.app/Contents/Developer/Platforms/iPhoneOS.platform/Developer/usr/bin/swift-plugin-server -external-plugin-path /Applications/Xcode-16.3.0.app/Contents/Developer/Platforms/iPhoneOS.platform/Developer/usr/local/lib/swift/host/plugins\#/Applications/Xcode-16.3.0.app/Contents/Developer/Platforms/iPhoneOS.platform/Developer/usr/bin/swift-plugin-server -in-process-plugin-server-path /Applications/Xcode-16.3.0.app/Contents/Developer/Toolchains/XcodeDefault.xctoolchain/usr/lib/swift/host/libSwiftInProcPluginServer.dylib -plugin-path /Applications/Xcode-16.3.0.app/Contents/Developer/Toolchains/XcodeDefault.xctoolchain/usr/lib/swift/host/plugins -plugin-path /Applications/Xcode-16.3.0.app/Contents/Developer/Toolchains/XcodeDefault.xctoolchain/usr/local/lib/swift/host/plugins -o /Users/admin/builder/spi-builder-workspace/.derivedData/Build/Intermediates.noindex/BuildAnalyzer.build/Debug-iphoneos/BuildAnalyzerKit.build/Objects-normal/arm64/BuildGraphNode.o -o /Users/admin/builder/spi-builder-workspace/.derivedData/Build/Intermediates.noindex/BuildAnalyzer.build/Debug-iphoneos/BuildAnalyzerKit.build/Objects-normal/arm64/BuildGraphNodeKind.o -index-unit-output-path /BuildAnalyzer.build/Debug-iphoneos/BuildAnalyzerKit.build/Objects-normal/arm64/BuildGraphNode.o -index-unit-output-path /BuildAnalyzer.build/Debug-iphoneos/BuildAnalyzerKit.build/Objects-normal/arm64/BuildGraphNodeKind.o -index-store-path /Users/admin/builder/spi-builder-workspace/.derivedData/Index.noindex/DataStore -index-system-modules
SwiftCompile normal arm64 /Users/admin/builder/spi-builder-workspace/Sources/BuildAnalyzerKit/BuildGraphNode.swift (in target 'BuildAnalyzerKit' from project 'BuildAnalyzer')
cd /Users/admin/builder/spi-builder-workspace/.swiftpm/xcode
SwiftCompile normal arm64 /Users/admin/builder/spi-builder-workspace/Sources/BuildAnalyzerKit/BuildGraphNodeKind.swift (in target 'BuildAnalyzerKit' from project 'BuildAnalyzer')
cd /Users/admin/builder/spi-builder-workspace/.swiftpm/xcode
/Users/admin/builder/spi-builder-workspace/Sources/BuildAnalyzerKit/BuildGraphNodeKind.swift:4:5: warning: 'public' modifier is redundant for enum declared in a public extension
public enum NodeType {
^~~~~~~
/Users/admin/builder/spi-builder-workspace/Sources/BuildAnalyzerKit/BuildGraphNodeKind.swift:132:1: warning: extension declares a conformance of imported type 'Array' to imported protocol 'Comparable'; this will not behave correctly if the owners of 'Swift' introduce this conformance in the future
extension Array<String>: Comparable {
^
/Users/admin/builder/spi-builder-workspace/Sources/BuildAnalyzerKit/BuildGraphNodeKind.swift:132:1: note: add '@retroactive' to silence this warning
extension Array<String>: Comparable {
^ ~~~~~~~~~~
@retroactive Comparable
/Users/admin/builder/spi-builder-workspace/Sources/BuildAnalyzerKit/BuildGraphNodeKind.swift:73:44: error: 'Regex' is only available in iOS 16.0 or newer
} else if let result = try /P(?<index>\d+):(?<some>.*):(?<configuration>[^:]*):Gate (?<gateName>.+)/.firstMatch(in: name) {
^
/Users/admin/builder/spi-builder-workspace/Sources/BuildAnalyzerKit/BuildGraphNodeKind.swift:73:44: note: add 'if #available' version check
} else if let result = try /P(?<index>\d+):(?<some>.*):(?<configuration>[^:]*):Gate (?<gateName>.+)/.firstMatch(in: name) {
^
/Users/admin/builder/spi-builder-workspace/Sources/BuildAnalyzerKit/BuildGraphNodeKind.swift:66:28: note: add @available attribute to enclosing static method
public static func generateKind(name: String) -> Kind {
^
/Users/admin/builder/spi-builder-workspace/Sources/BuildAnalyzerKit/BuildGraphNodeKind.swift:10:19: note: add @available attribute to enclosing enum
indirect enum Kind: Hashable, Comparable {
^
/Users/admin/builder/spi-builder-workspace/Sources/BuildAnalyzerKit/BuildGraphNodeKind.swift:73:118: error: 'firstMatch(in:)' is only available in iOS 16.0 or newer
} else if let result = try /P(?<index>\d+):(?<some>.*):(?<configuration>[^:]*):Gate (?<gateName>.+)/.firstMatch(in: name) {
^
/Users/admin/builder/spi-builder-workspace/Sources/BuildAnalyzerKit/BuildGraphNodeKind.swift:73:118: note: add 'if #available' version check
} else if let result = try /P(?<index>\d+):(?<some>.*):(?<configuration>[^:]*):Gate (?<gateName>.+)/.firstMatch(in: name) {
^
/Users/admin/builder/spi-builder-workspace/Sources/BuildAnalyzerKit/BuildGraphNodeKind.swift:66:28: note: add @available attribute to enclosing static method
public static func generateKind(name: String) -> Kind {
^
/Users/admin/builder/spi-builder-workspace/Sources/BuildAnalyzerKit/BuildGraphNodeKind.swift:10:19: note: add @available attribute to enclosing enum
indirect enum Kind: Hashable, Comparable {
^
/Users/admin/builder/spi-builder-workspace/Sources/BuildAnalyzerKit/BuildGraphNodeKind.swift:76:36: error: 'output' is only available in iOS 16.0 or newer
let o = result.output
^
/Users/admin/builder/spi-builder-workspace/Sources/BuildAnalyzerKit/BuildGraphNodeKind.swift:76:36: note: add 'if #available' version check
let o = result.output
^
/Users/admin/builder/spi-builder-workspace/Sources/BuildAnalyzerKit/BuildGraphNodeKind.swift:66:28: note: add @available attribute to enclosing static method
public static func generateKind(name: String) -> Kind {
^
/Users/admin/builder/spi-builder-workspace/Sources/BuildAnalyzerKit/BuildGraphNodeKind.swift:10:19: note: add @available attribute to enclosing enum
indirect enum Kind: Hashable, Comparable {
^
/Users/admin/builder/spi-builder-workspace/Sources/BuildAnalyzerKit/BuildGraphNodeKind.swift:80:44: error: 'Regex' is only available in iOS 16.0 or newer
} else if let result = try /P(?<index>\d+):(target-(?<target>[^-]+)-(?<some>.*))?:(?<configuration>[^:]*):(?<stepName>\S+)(?: (?<args>.+))?/.firstMatch(in: name) {
^
/Users/admin/builder/spi-builder-workspace/Sources/BuildAnalyzerKit/BuildGraphNodeKind.swift:80:44: note: add 'if #available' version check
} else if let result = try /P(?<index>\d+):(target-(?<target>[^-]+)-(?<some>.*))?:(?<configuration>[^:]*):(?<stepName>\S+)(?: (?<args>.+))?/.firstMatch(in: name) {
^
/Users/admin/builder/spi-builder-workspace/Sources/BuildAnalyzerKit/BuildGraphNodeKind.swift:66:28: note: add @available attribute to enclosing static method
public static func generateKind(name: String) -> Kind {
^
/Users/admin/builder/spi-builder-workspace/Sources/BuildAnalyzerKit/BuildGraphNodeKind.swift:10:19: note: add @available attribute to enclosing enum
indirect enum Kind: Hashable, Comparable {
^
/Users/admin/builder/spi-builder-workspace/Sources/BuildAnalyzerKit/BuildGraphNodeKind.swift:80:158: error: 'firstMatch(in:)' is only available in iOS 16.0 or newer
} else if let result = try /P(?<index>\d+):(target-(?<target>[^-]+)-(?<some>.*))?:(?<configuration>[^:]*):(?<stepName>\S+)(?: (?<args>.+))?/.firstMatch(in: name) {
^
/Users/admin/builder/spi-builder-workspace/Sources/BuildAnalyzerKit/BuildGraphNodeKind.swift:80:158: note: add 'if #available' version check
} else if let result = try /P(?<index>\d+):(target-(?<target>[^-]+)-(?<some>.*))?:(?<configuration>[^:]*):(?<stepName>\S+)(?: (?<args>.+))?/.firstMatch(in: name) {
^
/Users/admin/builder/spi-builder-workspace/Sources/BuildAnalyzerKit/BuildGraphNodeKind.swift:66:28: note: add @available attribute to enclosing static method
public static func generateKind(name: String) -> Kind {
^
/Users/admin/builder/spi-builder-workspace/Sources/BuildAnalyzerKit/BuildGraphNodeKind.swift:10:19: note: add @available attribute to enclosing enum
indirect enum Kind: Hashable, Comparable {
^
/Users/admin/builder/spi-builder-workspace/Sources/BuildAnalyzerKit/BuildGraphNodeKind.swift:84:36: error: 'output' is only available in iOS 16.0 or newer
let o = result.output
^
/Users/admin/builder/spi-builder-workspace/Sources/BuildAnalyzerKit/BuildGraphNodeKind.swift:84:36: note: add 'if #available' version check
let o = result.output
^
/Users/admin/builder/spi-builder-workspace/Sources/BuildAnalyzerKit/BuildGraphNodeKind.swift:66:28: note: add @available attribute to enclosing static method
public static func generateKind(name: String) -> Kind {
^
/Users/admin/builder/spi-builder-workspace/Sources/BuildAnalyzerKit/BuildGraphNodeKind.swift:10:19: note: add @available attribute to enclosing enum
indirect enum Kind: Hashable, Comparable {
^
/Users/admin/builder/spi-builder-workspace/Sources/BuildAnalyzerKit/BuildGraphNodeKind.swift:87:44: error: 'Regex' is only available in iOS 16.0 or newer
} else if let result = try /<TRIGGER: (?<stepName>[^-]+)[ \-](?<args>\/.+)>/.firstMatch(in: name) {
^
/Users/admin/builder/spi-builder-workspace/Sources/BuildAnalyzerKit/BuildGraphNodeKind.swift:87:44: note: add 'if #available' version check
} else if let result = try /<TRIGGER: (?<stepName>[^-]+)[ \-](?<args>\/.+)>/.firstMatch(in: name) {
^
/Users/admin/builder/spi-builder-workspace/Sources/BuildAnalyzerKit/BuildGraphNodeKind.swift:66:28: note: add @available attribute to enclosing static method
public static func generateKind(name: String) -> Kind {
^
/Users/admin/builder/spi-builder-workspace/Sources/BuildAnalyzerKit/BuildGraphNodeKind.swift:10:19: note: add @available attribute to enclosing enum
indirect enum Kind: Hashable, Comparable {
^
/Users/admin/builder/spi-builder-workspace/Sources/BuildAnalyzerKit/BuildGraphNodeKind.swift:87:94: error: 'firstMatch(in:)' is only available in iOS 16.0 or newer
} else if let result = try /<TRIGGER: (?<stepName>[^-]+)[ \-](?<args>\/.+)>/.firstMatch(in: name) {
^
/Users/admin/builder/spi-builder-workspace/Sources/BuildAnalyzerKit/BuildGraphNodeKind.swift:87:94: note: add 'if #available' version check
} else if let result = try /<TRIGGER: (?<stepName>[^-]+)[ \-](?<args>\/.+)>/.firstMatch(in: name) {
^
/Users/admin/builder/spi-builder-workspace/Sources/BuildAnalyzerKit/BuildGraphNodeKind.swift:66:28: note: add @available attribute to enclosing static method
public static func generateKind(name: String) -> Kind {
^
/Users/admin/builder/spi-builder-workspace/Sources/BuildAnalyzerKit/BuildGraphNodeKind.swift:10:19: note: add @available attribute to enclosing enum
indirect enum Kind: Hashable, Comparable {
^
/Users/admin/builder/spi-builder-workspace/Sources/BuildAnalyzerKit/BuildGraphNodeKind.swift:90:36: error: 'output' is only available in iOS 16.0 or newer
let o = result.output
^
/Users/admin/builder/spi-builder-workspace/Sources/BuildAnalyzerKit/BuildGraphNodeKind.swift:90:36: note: add 'if #available' version check
let o = result.output
^
/Users/admin/builder/spi-builder-workspace/Sources/BuildAnalyzerKit/BuildGraphNodeKind.swift:66:28: note: add @available attribute to enclosing static method
public static func generateKind(name: String) -> Kind {
^
/Users/admin/builder/spi-builder-workspace/Sources/BuildAnalyzerKit/BuildGraphNodeKind.swift:10:19: note: add @available attribute to enclosing enum
indirect enum Kind: Hashable, Comparable {
^
/Users/admin/builder/spi-builder-workspace/Sources/BuildAnalyzerKit/BuildGraphNodeKind.swift:92:44: error: 'Regex' is only available in iOS 16.0 or newer
} else if let result = try /<target-(?<targetName>[^-]+)-(?<hash>[0-9a-f]{64})--(?<stepName>.+)>/.firstMatch(in: name) {
^
/Users/admin/builder/spi-builder-workspace/Sources/BuildAnalyzerKit/BuildGraphNodeKind.swift:92:44: note: add 'if #available' version check
} else if let result = try /<target-(?<targetName>[^-]+)-(?<hash>[0-9a-f]{64})--(?<stepName>.+)>/.firstMatch(in: name) {
^
/Users/admin/builder/spi-builder-workspace/Sources/BuildAnalyzerKit/BuildGraphNodeKind.swift:66:28: note: add @available attribute to enclosing static method
public static func generateKind(name: String) -> Kind {
^
/Users/admin/builder/spi-builder-workspace/Sources/BuildAnalyzerKit/BuildGraphNodeKind.swift:10:19: note: add @available attribute to enclosing enum
indirect enum Kind: Hashable, Comparable {
^
/Users/admin/builder/spi-builder-workspace/Sources/BuildAnalyzerKit/BuildGraphNodeKind.swift:92:115: error: 'firstMatch(in:)' is only available in iOS 16.0 or newer
} else if let result = try /<target-(?<targetName>[^-]+)-(?<hash>[0-9a-f]{64})--(?<stepName>.+)>/.firstMatch(in: name) {
^
/Users/admin/builder/spi-builder-workspace/Sources/BuildAnalyzerKit/BuildGraphNodeKind.swift:92:115: note: add 'if #available' version check
} else if let result = try /<target-(?<targetName>[^-]+)-(?<hash>[0-9a-f]{64})--(?<stepName>.+)>/.firstMatch(in: name) {
^
/Users/admin/builder/spi-builder-workspace/Sources/BuildAnalyzerKit/BuildGraphNodeKind.swift:66:28: note: add @available attribute to enclosing static method
public static func generateKind(name: String) -> Kind {
^
/Users/admin/builder/spi-builder-workspace/Sources/BuildAnalyzerKit/BuildGraphNodeKind.swift:10:19: note: add @available attribute to enclosing enum
indirect enum Kind: Hashable, Comparable {
^
/Users/admin/builder/spi-builder-workspace/Sources/BuildAnalyzerKit/BuildGraphNodeKind.swift:94:36: error: 'output' is only available in iOS 16.0 or newer
let o = result.output
^
/Users/admin/builder/spi-builder-workspace/Sources/BuildAnalyzerKit/BuildGraphNodeKind.swift:94:36: note: add 'if #available' version check
let o = result.output
^
/Users/admin/builder/spi-builder-workspace/Sources/BuildAnalyzerKit/BuildGraphNodeKind.swift:66:28: note: add @available attribute to enclosing static method
public static func generateKind(name: String) -> Kind {
^
/Users/admin/builder/spi-builder-workspace/Sources/BuildAnalyzerKit/BuildGraphNodeKind.swift:10:19: note: add @available attribute to enclosing enum
indirect enum Kind: Hashable, Comparable {
^
/Users/admin/builder/spi-builder-workspace/Sources/BuildAnalyzerKit/BuildGraphNodeKind.swift:96:44: error: 'Regex' is only available in iOS 16.0 or newer
} else if let result = try /<target-(?<targetNameModule>[^-]+_)?(?<targetName>[^-]+)-PACKAGE-RESOURCE.*:(?<stepName>[^:]+)>/.firstMatch(in: name) {
^
/Users/admin/builder/spi-builder-workspace/Sources/BuildAnalyzerKit/BuildGraphNodeKind.swift:96:44: note: add 'if #available' version check
} else if let result = try /<target-(?<targetNameModule>[^-]+_)?(?<targetName>[^-]+)-PACKAGE-RESOURCE.*:(?<stepName>[^:]+)>/.firstMatch(in: name) {
^
/Users/admin/builder/spi-builder-workspace/Sources/BuildAnalyzerKit/BuildGraphNodeKind.swift:66:28: note: add @available attribute to enclosing static method
public static func generateKind(name: String) -> Kind {
^
/Users/admin/builder/spi-builder-workspace/Sources/BuildAnalyzerKit/BuildGraphNodeKind.swift:10:19: note: add @available attribute to enclosing enum
indirect enum Kind: Hashable, Comparable {
^
/Users/admin/builder/spi-builder-workspace/Sources/BuildAnalyzerKit/BuildGraphNodeKind.swift:96:142: error: 'firstMatch(in:)' is only available in iOS 16.0 or newer
} else if let result = try /<target-(?<targetNameModule>[^-]+_)?(?<targetName>[^-]+)-PACKAGE-RESOURCE.*:(?<stepName>[^:]+)>/.firstMatch(in: name) {
^
/Users/admin/builder/spi-builder-workspace/Sources/BuildAnalyzerKit/BuildGraphNodeKind.swift:96:142: note: add 'if #available' version check
} else if let result = try /<target-(?<targetNameModule>[^-]+_)?(?<targetName>[^-]+)-PACKAGE-RESOURCE.*:(?<stepName>[^:]+)>/.firstMatch(in: name) {
^
/Users/admin/builder/spi-builder-workspace/Sources/BuildAnalyzerKit/BuildGraphNodeKind.swift:66:28: note: add @available attribute to enclosing static method
public static func generateKind(name: String) -> Kind {
^
/Users/admin/builder/spi-builder-workspace/Sources/BuildAnalyzerKit/BuildGraphNodeKind.swift:10:19: note: add @available attribute to enclosing enum
indirect enum Kind: Hashable, Comparable {
^
/Users/admin/builder/spi-builder-workspace/Sources/BuildAnalyzerKit/BuildGraphNodeKind.swift:98:36: error: 'output' is only available in iOS 16.0 or newer
let o = result.output
^
/Users/admin/builder/spi-builder-workspace/Sources/BuildAnalyzerKit/BuildGraphNodeKind.swift:98:36: note: add 'if #available' version check
let o = result.output
^
/Users/admin/builder/spi-builder-workspace/Sources/BuildAnalyzerKit/BuildGraphNodeKind.swift:66:28: note: add @available attribute to enclosing static method
public static func generateKind(name: String) -> Kind {
^
/Users/admin/builder/spi-builder-workspace/Sources/BuildAnalyzerKit/BuildGraphNodeKind.swift:10:19: note: add @available attribute to enclosing enum
indirect enum Kind: Hashable, Comparable {
^
/Users/admin/builder/spi-builder-workspace/Sources/BuildAnalyzerKit/BuildGraphNodeKind.swift:100:44: error: 'Regex' is only available in iOS 16.0 or newer
} else if let result = try /<target-(?<targetName>[^-]+)-PACKAGE-PRODUCT:(?<target>[^-]+)-(?<configuration>[^-]+)-(?<platform>[^-]+)-(?<arch>[^-]+)-(?<stepName>.+)>/.firstMatch(in: name) {
^
/Users/admin/builder/spi-builder-workspace/Sources/BuildAnalyzerKit/BuildGraphNodeKind.swift:100:44: note: add 'if #available' version check
} else if let result = try /<target-(?<targetName>[^-]+)-PACKAGE-PRODUCT:(?<target>[^-]+)-(?<configuration>[^-]+)-(?<platform>[^-]+)-(?<arch>[^-]+)-(?<stepName>.+)>/.firstMatch(in: name) {
^
/Users/admin/builder/spi-builder-workspace/Sources/BuildAnalyzerKit/BuildGraphNodeKind.swift:66:28: note: add @available attribute to enclosing static method
public static func generateKind(name: String) -> Kind {
^
/Users/admin/builder/spi-builder-workspace/Sources/BuildAnalyzerKit/BuildGraphNodeKind.swift:10:19: note: add @available attribute to enclosing enum
indirect enum Kind: Hashable, Comparable {
^
/Users/admin/builder/spi-builder-workspace/Sources/BuildAnalyzerKit/BuildGraphNodeKind.swift:100:183: error: 'firstMatch(in:)' is only available in iOS 16.0 or newer
} else if let result = try /<target-(?<targetName>[^-]+)-PACKAGE-PRODUCT:(?<target>[^-]+)-(?<configuration>[^-]+)-(?<platform>[^-]+)-(?<arch>[^-]+)-(?<stepName>.+)>/.firstMatch(in: name) {
^
/Users/admin/builder/spi-builder-workspace/Sources/BuildAnalyzerKit/BuildGraphNodeKind.swift:100:183: note: add 'if #available' version check
} else if let result = try /<target-(?<targetName>[^-]+)-PACKAGE-PRODUCT:(?<target>[^-]+)-(?<configuration>[^-]+)-(?<platform>[^-]+)-(?<arch>[^-]+)-(?<stepName>.+)>/.firstMatch(in: name) {
^
/Users/admin/builder/spi-builder-workspace/Sources/BuildAnalyzerKit/BuildGraphNodeKind.swift:66:28: note: add @available attribute to enclosing static method
public static func generateKind(name: String) -> Kind {
^
/Users/admin/builder/spi-builder-workspace/Sources/BuildAnalyzerKit/BuildGraphNodeKind.swift:10:19: note: add @available attribute to enclosing enum
indirect enum Kind: Hashable, Comparable {
^
/Users/admin/builder/spi-builder-workspace/Sources/BuildAnalyzerKit/BuildGraphNodeKind.swift:102:36: error: 'output' is only available in iOS 16.0 or newer
let o = result.output
^
/Users/admin/builder/spi-builder-workspace/Sources/BuildAnalyzerKit/BuildGraphNodeKind.swift:102:36: note: add 'if #available' version check
let o = result.output
^
/Users/admin/builder/spi-builder-workspace/Sources/BuildAnalyzerKit/BuildGraphNodeKind.swift:66:28: note: add @available attribute to enclosing static method
public static func generateKind(name: String) -> Kind {
^
/Users/admin/builder/spi-builder-workspace/Sources/BuildAnalyzerKit/BuildGraphNodeKind.swift:10:19: note: add @available attribute to enclosing enum
indirect enum Kind: Hashable, Comparable {
^
/Users/admin/builder/spi-builder-workspace/Sources/BuildAnalyzerKit/BuildGraphNodeKind.swift:104:44: error: 'Regex' is only available in iOS 16.0 or newer
} else if let result = try /<target-(?<targetName>[^-]+)-PACKAGE-PRODUCT:(?<target>[^-]+)-SDKROOT:(?<platform>[^-]+):SDK_VARIANT:(?<arch>[^-]+)-(?<stepName>.+)>/.firstMatch(in: name) {
^
/Users/admin/builder/spi-builder-workspace/Sources/BuildAnalyzerKit/BuildGraphNodeKind.swift:104:44: note: add 'if #available' version check
} else if let result = try /<target-(?<targetName>[^-]+)-PACKAGE-PRODUCT:(?<target>[^-]+)-SDKROOT:(?<platform>[^-]+):SDK_VARIANT:(?<arch>[^-]+)-(?<stepName>.+)>/.firstMatch(in: name) {
^
/Users/admin/builder/spi-builder-workspace/Sources/BuildAnalyzerKit/BuildGraphNodeKind.swift:66:28: note: add @available attribute to enclosing static method
public static func generateKind(name: String) -> Kind {
^
/Users/admin/builder/spi-builder-workspace/Sources/BuildAnalyzerKit/BuildGraphNodeKind.swift:10:19: note: add @available attribute to enclosing enum
indirect enum Kind: Hashable, Comparable {
^
/Users/admin/builder/spi-builder-workspace/Sources/BuildAnalyzerKit/BuildGraphNodeKind.swift:104:179: error: 'firstMatch(in:)' is only available in iOS 16.0 or newer
} else if let result = try /<target-(?<targetName>[^-]+)-PACKAGE-PRODUCT:(?<target>[^-]+)-SDKROOT:(?<platform>[^-]+):SDK_VARIANT:(?<arch>[^-]+)-(?<stepName>.+)>/.firstMatch(in: name) {
^
/Users/admin/builder/spi-builder-workspace/Sources/BuildAnalyzerKit/BuildGraphNodeKind.swift:104:179: note: add 'if #available' version check
} else if let result = try /<target-(?<targetName>[^-]+)-PACKAGE-PRODUCT:(?<target>[^-]+)-SDKROOT:(?<platform>[^-]+):SDK_VARIANT:(?<arch>[^-]+)-(?<stepName>.+)>/.firstMatch(in: name) {
^
/Users/admin/builder/spi-builder-workspace/Sources/BuildAnalyzerKit/BuildGraphNodeKind.swift:66:28: note: add @available attribute to enclosing static method
public static func generateKind(name: String) -> Kind {
^
/Users/admin/builder/spi-builder-workspace/Sources/BuildAnalyzerKit/BuildGraphNodeKind.swift:10:19: note: add @available attribute to enclosing enum
indirect enum Kind: Hashable, Comparable {
^
/Users/admin/builder/spi-builder-workspace/Sources/BuildAnalyzerKit/BuildGraphNodeKind.swift:106:36: error: 'output' is only available in iOS 16.0 or newer
let o = result.output
^
/Users/admin/builder/spi-builder-workspace/Sources/BuildAnalyzerKit/BuildGraphNodeKind.swift:106:36: note: add 'if #available' version check
let o = result.output
^
/Users/admin/builder/spi-builder-workspace/Sources/BuildAnalyzerKit/BuildGraphNodeKind.swift:66:28: note: add @available attribute to enclosing static method
public static func generateKind(name: String) -> Kind {
^
/Users/admin/builder/spi-builder-workspace/Sources/BuildAnalyzerKit/BuildGraphNodeKind.swift:10:19: note: add @available attribute to enclosing enum
indirect enum Kind: Hashable, Comparable {
^
/Users/admin/builder/spi-builder-workspace/Sources/BuildAnalyzerKit/BuildGraphNodeKind.swift:108:44: error: 'Regex' is only available in iOS 16.0 or newer
} else if let result = try /<target-(?<targetName>[^-]+)-PACKAGE-TARGET:(?<target>[^-]+)-(?<configuration>[^-]+)-(?<platform>[^-]+)-(?<arch>[^-]+)-(?<stepName>.+)>/.firstMatch(in: name) {
^
/Users/admin/builder/spi-builder-workspace/Sources/BuildAnalyzerKit/BuildGraphNodeKind.swift:108:44: note: add 'if #available' version check
} else if let result = try /<target-(?<targetName>[^-]+)-PACKAGE-TARGET:(?<target>[^-]+)-(?<configuration>[^-]+)-(?<platform>[^-]+)-(?<arch>[^-]+)-(?<stepName>.+)>/.firstMatch(in: name) {
^
/Users/admin/builder/spi-builder-workspace/Sources/BuildAnalyzerKit/BuildGraphNodeKind.swift:66:28: note: add @available attribute to enclosing static method
public static func generateKind(name: String) -> Kind {
^
/Users/admin/builder/spi-builder-workspace/Sources/BuildAnalyzerKit/BuildGraphNodeKind.swift:10:19: note: add @available attribute to enclosing enum
indirect enum Kind: Hashable, Comparable {
^
/Users/admin/builder/spi-builder-workspace/Sources/BuildAnalyzerKit/BuildGraphNodeKind.swift:108:182: error: 'firstMatch(in:)' is only available in iOS 16.0 or newer
} else if let result = try /<target-(?<targetName>[^-]+)-PACKAGE-TARGET:(?<target>[^-]+)-(?<configuration>[^-]+)-(?<platform>[^-]+)-(?<arch>[^-]+)-(?<stepName>.+)>/.firstMatch(in: name) {
^
/Users/admin/builder/spi-builder-workspace/Sources/BuildAnalyzerKit/BuildGraphNodeKind.swift:108:182: note: add 'if #available' version check
} else if let result = try /<target-(?<targetName>[^-]+)-PACKAGE-TARGET:(?<target>[^-]+)-(?<configuration>[^-]+)-(?<platform>[^-]+)-(?<arch>[^-]+)-(?<stepName>.+)>/.firstMatch(in: name) {
^
/Users/admin/builder/spi-builder-workspace/Sources/BuildAnalyzerKit/BuildGraphNodeKind.swift:66:28: note: add @available attribute to enclosing static method
public static func generateKind(name: String) -> Kind {
^
/Users/admin/builder/spi-builder-workspace/Sources/BuildAnalyzerKit/BuildGraphNodeKind.swift:10:19: note: add @available attribute to enclosing enum
indirect enum Kind: Hashable, Comparable {
^
/Users/admin/builder/spi-builder-workspace/Sources/BuildAnalyzerKit/BuildGraphNodeKind.swift:110:36: error: 'output' is only available in iOS 16.0 or newer
let o = result.output
^
/Users/admin/builder/spi-builder-workspace/Sources/BuildAnalyzerKit/BuildGraphNodeKind.swift:110:36: note: add 'if #available' version check
let o = result.output
^
/Users/admin/builder/spi-builder-workspace/Sources/BuildAnalyzerKit/BuildGraphNodeKind.swift:66:28: note: add @available attribute to enclosing static method
public static func generateKind(name: String) -> Kind {
^
/Users/admin/builder/spi-builder-workspace/Sources/BuildAnalyzerKit/BuildGraphNodeKind.swift:10:19: note: add @available attribute to enclosing enum
indirect enum Kind: Hashable, Comparable {
^
/Users/admin/builder/spi-builder-workspace/Sources/BuildAnalyzerKit/BuildGraphNodeKind.swift:112:44: error: 'Regex' is only available in iOS 16.0 or newer
} else if let result = try /<target-(?<targetName>[^-]+)-PACKAGE-TARGET:(?<target>[^-]+)-SDKROOT:(?<platform>[^-]+):SDK_VARIANT:(?<arch>[^-]+)-(?<stepName>.+)>/.firstMatch(in: name) {
^
/Users/admin/builder/spi-builder-workspace/Sources/BuildAnalyzerKit/BuildGraphNodeKind.swift:112:44: note: add 'if #available' version check
} else if let result = try /<target-(?<targetName>[^-]+)-PACKAGE-TARGET:(?<target>[^-]+)-SDKROOT:(?<platform>[^-]+):SDK_VARIANT:(?<arch>[^-]+)-(?<stepName>.+)>/.firstMatch(in: name) {
^
/Users/admin/builder/spi-builder-workspace/Sources/BuildAnalyzerKit/BuildGraphNodeKind.swift:66:28: note: add @available attribute to enclosing static method
public static func generateKind(name: String) -> Kind {
^
/Users/admin/builder/spi-builder-workspace/Sources/BuildAnalyzerKit/BuildGraphNodeKind.swift:10:19: note: add @available attribute to enclosing enum
indirect enum Kind: Hashable, Comparable {
^
/Users/admin/builder/spi-builder-workspace/Sources/BuildAnalyzerKit/BuildGraphNodeKind.swift:112:178: error: 'firstMatch(in:)' is only available in iOS 16.0 or newer
} else if let result = try /<target-(?<targetName>[^-]+)-PACKAGE-TARGET:(?<target>[^-]+)-SDKROOT:(?<platform>[^-]+):SDK_VARIANT:(?<arch>[^-]+)-(?<stepName>.+)>/.firstMatch(in: name) {
^
/Users/admin/builder/spi-builder-workspace/Sources/BuildAnalyzerKit/BuildGraphNodeKind.swift:112:178: note: add 'if #available' version check
} else if let result = try /<target-(?<targetName>[^-]+)-PACKAGE-TARGET:(?<target>[^-]+)-SDKROOT:(?<platform>[^-]+):SDK_VARIANT:(?<arch>[^-]+)-(?<stepName>.+)>/.firstMatch(in: name) {
^
/Users/admin/builder/spi-builder-workspace/Sources/BuildAnalyzerKit/BuildGraphNodeKind.swift:66:28: note: add @available attribute to enclosing static method
public static func generateKind(name: String) -> Kind {
^
/Users/admin/builder/spi-builder-workspace/Sources/BuildAnalyzerKit/BuildGraphNodeKind.swift:10:19: note: add @available attribute to enclosing enum
indirect enum Kind: Hashable, Comparable {
^
/Users/admin/builder/spi-builder-workspace/Sources/BuildAnalyzerKit/BuildGraphNodeKind.swift:114:36: error: 'output' is only available in iOS 16.0 or newer
let o = result.output
^
/Users/admin/builder/spi-builder-workspace/Sources/BuildAnalyzerKit/BuildGraphNodeKind.swift:114:36: note: add 'if #available' version check
let o = result.output
^
/Users/admin/builder/spi-builder-workspace/Sources/BuildAnalyzerKit/BuildGraphNodeKind.swift:66:28: note: add @available attribute to enclosing static method
public static func generateKind(name: String) -> Kind {
^
/Users/admin/builder/spi-builder-workspace/Sources/BuildAnalyzerKit/BuildGraphNodeKind.swift:10:19: note: add @available attribute to enclosing enum
indirect enum Kind: Hashable, Comparable {
^
/Users/admin/builder/spi-builder-workspace/Sources/BuildAnalyzerKit/BuildGraphNodeKind.swift:116:44: error: 'Regex' is only available in iOS 16.0 or newer
} else if let result = try /<(?<stepName>[^-]+)[ \-](?<path>\/.+)>/.firstMatch(in: name) {
^
/Users/admin/builder/spi-builder-workspace/Sources/BuildAnalyzerKit/BuildGraphNodeKind.swift:116:44: note: add 'if #available' version check
} else if let result = try /<(?<stepName>[^-]+)[ \-](?<path>\/.+)>/.firstMatch(in: name) {
^
/Users/admin/builder/spi-builder-workspace/Sources/BuildAnalyzerKit/BuildGraphNodeKind.swift:66:28: note: add @available attribute to enclosing static method
public static func generateKind(name: String) -> Kind {
^
/Users/admin/builder/spi-builder-workspace/Sources/BuildAnalyzerKit/BuildGraphNodeKind.swift:10:19: note: add @available attribute to enclosing enum
indirect enum Kind: Hashable, Comparable {
^
/Users/admin/builder/spi-builder-workspace/Sources/BuildAnalyzerKit/BuildGraphNodeKind.swift:116:85: error: 'firstMatch(in:)' is only available in iOS 16.0 or newer
} else if let result = try /<(?<stepName>[^-]+)[ \-](?<path>\/.+)>/.firstMatch(in: name) {
^
/Users/admin/builder/spi-builder-workspace/Sources/BuildAnalyzerKit/BuildGraphNodeKind.swift:116:85: note: add 'if #available' version check
} else if let result = try /<(?<stepName>[^-]+)[ \-](?<path>\/.+)>/.firstMatch(in: name) {
^
/Users/admin/builder/spi-builder-workspace/Sources/BuildAnalyzerKit/BuildGraphNodeKind.swift:66:28: note: add @available attribute to enclosing static method
public static func generateKind(name: String) -> Kind {
^
/Users/admin/builder/spi-builder-workspace/Sources/BuildAnalyzerKit/BuildGraphNodeKind.swift:10:19: note: add @available attribute to enclosing enum
indirect enum Kind: Hashable, Comparable {
^
/Users/admin/builder/spi-builder-workspace/Sources/BuildAnalyzerKit/BuildGraphNodeKind.swift:119:36: error: 'output' is only available in iOS 16.0 or newer
let o = result.output
^
/Users/admin/builder/spi-builder-workspace/Sources/BuildAnalyzerKit/BuildGraphNodeKind.swift:119:36: note: add 'if #available' version check
let o = result.output
^
/Users/admin/builder/spi-builder-workspace/Sources/BuildAnalyzerKit/BuildGraphNodeKind.swift:66:28: note: add @available attribute to enclosing static method
public static func generateKind(name: String) -> Kind {
^
/Users/admin/builder/spi-builder-workspace/Sources/BuildAnalyzerKit/BuildGraphNodeKind.swift:10:19: note: add @available attribute to enclosing enum
indirect enum Kind: Hashable, Comparable {
^
SwiftDriverJobDiscovery normal arm64 Compiling resource_bundle_accessor.swift, AEAD.swift, AEADChaCha20Poly1305.swift, AEADXChaCha20Poly1305.swift, AES.Cryptors.swift, AES.swift, ASN1.swift, ASN1Decoder.swift, ASN1Encoder.swift, ASN1Scanner.swift, Array+Extension.swift, Authenticator.swift (in target 'CryptoSwift' from project 'CryptoSwift')
SwiftCompile normal arm64 Compiling\ BuildGraph.swift,\ BuildGraphGenerator.swift /Users/admin/builder/spi-builder-workspace/Sources/BuildAnalyzerKit/BuildGraph.swift /Users/admin/builder/spi-builder-workspace/Sources/BuildAnalyzerKit/BuildGraphGenerator.swift (in target 'BuildAnalyzerKit' from project 'BuildAnalyzer')
SwiftCompile normal arm64 /Users/admin/builder/spi-builder-workspace/Sources/BuildAnalyzerKit/BuildGraph.swift (in target 'BuildAnalyzerKit' from project 'BuildAnalyzer')
cd /Users/admin/builder/spi-builder-workspace/.swiftpm/xcode
SwiftCompile normal arm64 /Users/admin/builder/spi-builder-workspace/Sources/BuildAnalyzerKit/BuildGraphGenerator.swift (in target 'BuildAnalyzerKit' from project 'BuildAnalyzer')
cd /Users/admin/builder/spi-builder-workspace/.swiftpm/xcode
SwiftEmitModule normal arm64 Emitting\ module\ for\ XcodeHasher (in target 'XcodeHasher' from project 'BuildAnalyzer')
SwiftCompile normal arm64 /Users/admin/builder/spi-builder-workspace/Sources/XcodeHasher/XcodeHasher.swift (in target 'XcodeHasher' from project 'BuildAnalyzer')
cd /Users/admin/builder/spi-builder-workspace/.swiftpm/xcode
SwiftDriverJobDiscovery normal arm64 Compiling BuildGraphProjection.swift (in target 'BuildAnalyzerKit' from project 'BuildAnalyzer')
SwiftCompile normal arm64 Compiling\ XcodeHasher.swift /Users/admin/builder/spi-builder-workspace/Sources/XcodeHasher/XcodeHasher.swift (in target 'XcodeHasher' from project 'BuildAnalyzer')
SwiftCompile normal arm64 /Users/admin/builder/spi-builder-workspace/Sources/XcodeHasher/XcodeHasher.swift (in target 'XcodeHasher' from project 'BuildAnalyzer')
cd /Users/admin/builder/spi-builder-workspace/.swiftpm/xcode
SwiftDriverJobDiscovery normal arm64 Compiling Queue.swift (in target 'BuildAnalyzerKit' from project 'BuildAnalyzer')
SwiftDriverJobDiscovery normal arm64 Compiling BuildGraphProtocol.swift, BuildManifestParser.swift (in target 'BuildAnalyzerKit' from project 'BuildAnalyzer')
RegisterExecutionPolicyException /Users/admin/builder/spi-builder-workspace/.derivedData/Build/Products/Debug-iphoneos/GraphKit.o (in target 'GraphKit' from project 'BuildAnalyzer')
cd /Users/admin/builder/spi-builder-workspace
builtin-RegisterExecutionPolicyException /Users/admin/builder/spi-builder-workspace/.derivedData/Build/Products/Debug-iphoneos/GraphKit.o
SwiftDriverJobDiscovery normal arm64 Compiling BuildGraphNodeTimingReader.swift (in target 'BuildAnalyzerKit' from project 'BuildAnalyzer')
SwiftDriverJobDiscovery normal arm64 Emitting module for XcodeHasher (in target 'XcodeHasher' from project 'BuildAnalyzer')
SwiftDriver\ Compilation\ Requirements XcodeHasher normal arm64 com.apple.xcode.tools.swift.compiler (in target 'XcodeHasher' from project 'BuildAnalyzer')
cd /Users/admin/builder/spi-builder-workspace/.swiftpm/xcode
builtin-Swift-Compilation-Requirements -- /Applications/Xcode-16.3.0.app/Contents/Developer/Toolchains/XcodeDefault.xctoolchain/usr/bin/swiftc -module-name XcodeHasher -Onone -enforce-exclusivity\=checked @/Users/admin/builder/spi-builder-workspace/.derivedData/Build/Intermediates.noindex/BuildAnalyzer.build/Debug-iphoneos/XcodeHasher.build/Objects-normal/arm64/XcodeHasher.SwiftFileList -DSWIFT_PACKAGE -DDEBUG -DXcode -plugin-path /Applications/Xcode-16.3.0.app/Contents/Developer/Toolchains/XcodeDefault.xctoolchain/usr/lib/swift/host/plugins/testing -enable-experimental-feature DebugDescriptionMacro -sdk /Applications/Xcode-16.3.0.app/Contents/Developer/Platforms/iPhoneOS.platform/Developer/SDKs/iPhoneOS18.4.sdk -target arm64-apple-ios12.0 -g -module-cache-path /Users/admin/builder/spi-builder-workspace/.derivedData/ModuleCache.noindex -Xfrontend -serialize-debugging-options -profile-coverage-mapping -profile-generate -enable-testing -index-store-path /Users/admin/builder/spi-builder-workspace/.derivedData/Index.noindex/DataStore -swift-version 5 -I /Users/admin/builder/spi-builder-workspace/.derivedData/Build/Products/Debug-iphoneos -I /Applications/Xcode-16.3.0.app/Contents/Developer/Platforms/iPhoneOS.platform/Developer/usr/lib -F /Users/admin/builder/spi-builder-workspace/.derivedData/Build/Products/Debug-iphoneos/PackageFrameworks -F /Users/admin/builder/spi-builder-workspace/.derivedData/Build/Products/Debug-iphoneos -F /Applications/Xcode-16.3.0.app/Contents/Developer/Platforms/iPhoneOS.platform/Developer/Library/Frameworks -F /Applications/Xcode-16.3.0.app/Contents/Developer/Platforms/iPhoneOS.platform/Developer/SDKs/iPhoneOS18.4.sdk/Developer/Library/Frameworks -parse-as-library -c -j10 -enable-batch-mode -incremental -Xcc -ivfsstatcache -Xcc /Users/admin/builder/spi-builder-workspace/.derivedData/SDKStatCaches.noindex/iphoneos18.4-22E235-339d34bc69d7fc736c3220795c36f340.sdkstatcache -output-file-map /Users/admin/builder/spi-builder-workspace/.derivedData/Build/Intermediates.noindex/BuildAnalyzer.build/Debug-iphoneos/XcodeHasher.build/Objects-normal/arm64/XcodeHasher-OutputFileMap.json -use-frontend-parseable-output -save-temps -no-color-diagnostics -serialize-diagnostics -emit-dependencies -emit-module -emit-module-path /Users/admin/builder/spi-builder-workspace/.derivedData/Build/Intermediates.noindex/BuildAnalyzer.build/Debug-iphoneos/XcodeHasher.build/Objects-normal/arm64/XcodeHasher.swiftmodule -validate-clang-modules-once -clang-build-session-file /Users/admin/builder/spi-builder-workspace/.derivedData/ModuleCache.noindex/Session.modulevalidation -package-name spi_builder_workspace -Xcc -I/Users/admin/builder/spi-builder-workspace/.derivedData/Build/Intermediates.noindex/BuildAnalyzer.build/Debug-iphoneos/XcodeHasher.build/swift-overrides.hmap -emit-const-values -Xfrontend -const-gather-protocols-file -Xfrontend /Users/admin/builder/spi-builder-workspace/.derivedData/Build/Intermediates.noindex/BuildAnalyzer.build/Debug-iphoneos/XcodeHasher.build/Objects-normal/arm64/XcodeHasher_const_extract_protocols.json -Xcc -I/Users/admin/builder/spi-builder-workspace/.derivedData/Build/Products/Debug-iphoneos/include -Xcc -I/Users/admin/builder/spi-builder-workspace/.derivedData/Build/Intermediates.noindex/BuildAnalyzer.build/Debug-iphoneos/XcodeHasher.build/DerivedSources-normal/arm64 -Xcc -I/Users/admin/builder/spi-builder-workspace/.derivedData/Build/Intermediates.noindex/BuildAnalyzer.build/Debug-iphoneos/XcodeHasher.build/DerivedSources/arm64 -Xcc -I/Users/admin/builder/spi-builder-workspace/.derivedData/Build/Intermediates.noindex/BuildAnalyzer.build/Debug-iphoneos/XcodeHasher.build/DerivedSources -Xcc -DSWIFT_PACKAGE -Xcc -DDEBUG\=1 -emit-objc-header -emit-objc-header-path /Users/admin/builder/spi-builder-workspace/.derivedData/Build/Intermediates.noindex/BuildAnalyzer.build/Debug-iphoneos/XcodeHasher.build/Objects-normal/arm64/XcodeHasher-Swift.h -working-directory /Users/admin/builder/spi-builder-workspace/.swiftpm/xcode -experimental-emit-module-separately -disable-cmo
SwiftMergeGeneratedHeaders /Users/admin/builder/spi-builder-workspace/.derivedData/Build/Intermediates.noindex/GeneratedModuleMaps-iphoneos/XcodeHasher-Swift.h /Users/admin/builder/spi-builder-workspace/.derivedData/Build/Intermediates.noindex/BuildAnalyzer.build/Debug-iphoneos/XcodeHasher.build/Objects-normal/arm64/XcodeHasher-Swift.h (in target 'XcodeHasher' from project 'BuildAnalyzer')
cd /Users/admin/builder/spi-builder-workspace
builtin-swiftHeaderTool -arch arm64 /Users/admin/builder/spi-builder-workspace/.derivedData/Build/Intermediates.noindex/BuildAnalyzer.build/Debug-iphoneos/XcodeHasher.build/Objects-normal/arm64/XcodeHasher-Swift.h -o /Users/admin/builder/spi-builder-workspace/.derivedData/Build/Intermediates.noindex/GeneratedModuleMaps-iphoneos/XcodeHasher-Swift.h
Copy /Users/admin/builder/spi-builder-workspace/.derivedData/Build/Products/Debug-iphoneos/XcodeHasher.swiftmodule/arm64-apple-ios.swiftmodule /Users/admin/builder/spi-builder-workspace/.derivedData/Build/Intermediates.noindex/BuildAnalyzer.build/Debug-iphoneos/XcodeHasher.build/Objects-normal/arm64/XcodeHasher.swiftmodule (in target 'XcodeHasher' from project 'BuildAnalyzer')
cd /Users/admin/builder/spi-builder-workspace
builtin-copy -exclude .DS_Store -exclude CVS -exclude .svn -exclude .git -exclude .hg -resolve-src-symlinks -rename /Users/admin/builder/spi-builder-workspace/.derivedData/Build/Intermediates.noindex/BuildAnalyzer.build/Debug-iphoneos/XcodeHasher.build/Objects-normal/arm64/XcodeHasher.swiftmodule /Users/admin/builder/spi-builder-workspace/.derivedData/Build/Products/Debug-iphoneos/XcodeHasher.swiftmodule/arm64-apple-ios.swiftmodule
Copy /Users/admin/builder/spi-builder-workspace/.derivedData/Build/Products/Debug-iphoneos/XcodeHasher.swiftmodule/arm64-apple-ios.swiftdoc /Users/admin/builder/spi-builder-workspace/.derivedData/Build/Intermediates.noindex/BuildAnalyzer.build/Debug-iphoneos/XcodeHasher.build/Objects-normal/arm64/XcodeHasher.swiftdoc (in target 'XcodeHasher' from project 'BuildAnalyzer')
cd /Users/admin/builder/spi-builder-workspace
builtin-copy -exclude .DS_Store -exclude CVS -exclude .svn -exclude .git -exclude .hg -resolve-src-symlinks -rename /Users/admin/builder/spi-builder-workspace/.derivedData/Build/Intermediates.noindex/BuildAnalyzer.build/Debug-iphoneos/XcodeHasher.build/Objects-normal/arm64/XcodeHasher.swiftdoc /Users/admin/builder/spi-builder-workspace/.derivedData/Build/Products/Debug-iphoneos/XcodeHasher.swiftmodule/arm64-apple-ios.swiftdoc
Copy /Users/admin/builder/spi-builder-workspace/.derivedData/Build/Products/Debug-iphoneos/XcodeHasher.swiftmodule/arm64-apple-ios.abi.json /Users/admin/builder/spi-builder-workspace/.derivedData/Build/Intermediates.noindex/BuildAnalyzer.build/Debug-iphoneos/XcodeHasher.build/Objects-normal/arm64/XcodeHasher.abi.json (in target 'XcodeHasher' from project 'BuildAnalyzer')
cd /Users/admin/builder/spi-builder-workspace
builtin-copy -exclude .DS_Store -exclude CVS -exclude .svn -exclude .git -exclude .hg -resolve-src-symlinks -rename /Users/admin/builder/spi-builder-workspace/.derivedData/Build/Intermediates.noindex/BuildAnalyzer.build/Debug-iphoneos/XcodeHasher.build/Objects-normal/arm64/XcodeHasher.abi.json /Users/admin/builder/spi-builder-workspace/.derivedData/Build/Products/Debug-iphoneos/XcodeHasher.swiftmodule/arm64-apple-ios.abi.json
Copy /Users/admin/builder/spi-builder-workspace/.derivedData/Build/Products/Debug-iphoneos/XcodeHasher.swiftmodule/Project/arm64-apple-ios.swiftsourceinfo /Users/admin/builder/spi-builder-workspace/.derivedData/Build/Intermediates.noindex/BuildAnalyzer.build/Debug-iphoneos/XcodeHasher.build/Objects-normal/arm64/XcodeHasher.swiftsourceinfo (in target 'XcodeHasher' from project 'BuildAnalyzer')
cd /Users/admin/builder/spi-builder-workspace
builtin-copy -exclude .DS_Store -exclude CVS -exclude .svn -exclude .git -exclude .hg -resolve-src-symlinks -rename /Users/admin/builder/spi-builder-workspace/.derivedData/Build/Intermediates.noindex/BuildAnalyzer.build/Debug-iphoneos/XcodeHasher.build/Objects-normal/arm64/XcodeHasher.swiftsourceinfo /Users/admin/builder/spi-builder-workspace/.derivedData/Build/Products/Debug-iphoneos/XcodeHasher.swiftmodule/Project/arm64-apple-ios.swiftsourceinfo
SwiftDriverJobDiscovery normal arm64 Compiling BatchedCollection.swift, Bit.swift, BlockCipher.swift, BlockDecryptor.swift, BlockEncryptor.swift, BlockMode.swift, BlockModeOptions.swift, CBC.swift, CCM.swift, CFB.swift, CTR.swift, CipherModeWorker.swift (in target 'CryptoSwift' from project 'CryptoSwift')
** BUILD FAILED **
The following build commands failed:
SwiftCompile normal arm64 Compiling\ BuildGraphNode.swift,\ BuildGraphNodeKind.swift /Users/admin/builder/spi-builder-workspace/Sources/BuildAnalyzerKit/BuildGraphNode.swift /Users/admin/builder/spi-builder-workspace/Sources/BuildAnalyzerKit/BuildGraphNodeKind.swift (in target 'BuildAnalyzerKit' from project 'BuildAnalyzer')
SwiftCompile normal arm64 /Users/admin/builder/spi-builder-workspace/Sources/BuildAnalyzerKit/BuildGraphNodeKind.swift (in target 'BuildAnalyzerKit' from project 'BuildAnalyzer')
Building workspace spi-builder-workspace with scheme BuildAnalyzer-Package
(3 failures)
BUILD FAILURE 6.1 iOS