The Swift Package Index logo.Swift Package Index

Track the adoption of Swift 6 strict concurrency checks for data race safety. How many packages are Ready for Swift 6?

Build Information

Failed to build ggml, reference master (7b08f4), with Swift 5.10 for visionOS using Xcode 15.4 on 7 Mar 2025 23:25:36 UTC.

Build Command

env DEVELOPER_DIR=/Applications/Xcode-15.4.0.app xcrun xcodebuild -IDEClonedSourcePackagesDirPathOverride=$PWD/.dependencies -skipMacroValidation -skipPackagePluginValidation -derivedDataPath $PWD/.derivedData build -scheme ggml -destination generic/platform=xrOS

Build Log

========================================
RunAll
========================================
Builder version: 4.60.1
Interrupt handler set up.
========================================
Checkout
========================================
Clone URL: https://github.com/ggml-org/ggml.git
Reference: master
Initialized empty Git repository in /Users/admin/builder/spi-builder-workspace/.git/
From https://github.com/ggml-org/ggml
 * branch            master     -> FETCH_HEAD
 * [new branch]      master     -> origin/master
HEAD is now at 7b08f4c sync : llama.cpp
Submodule path 'src/ggml-kompute/kompute': checked out '4565194ed7c32d1d2efa32ceab4d3c6cae006306'
Submodule 'kompute' (https://github.com/nomic-ai/kompute.git) registered for path 'src/ggml-kompute/kompute'
Cloning into '/Users/admin/builder/spi-builder-workspace/src/ggml-kompute/kompute'...
Cloned https://github.com/ggml-org/ggml.git
Revision (git rev-parse @):
7b08f4cd9e32781e769a52cf0dcaeb2c556632c3
SUCCESS checkout https://github.com/ggml-org/ggml.git at master
========================================
Build
========================================
Selected platform:         visionOS
Swift version:             5.10
Building package at path:  $PWD
https://github.com/ggml-org/ggml.git
Command line invocation:
    /Applications/Xcode-15.4.0.app/Contents/Developer/usr/bin/xcodebuild -IDEClonedSourcePackagesDirPathOverride=/Users/admin/builder/spi-builder-workspace/.dependencies -resolvePackageDependencies
User defaults from command line:
    IDEClonedSourcePackagesDirPathOverride = /Users/admin/builder/spi-builder-workspace/.dependencies
    IDEPackageSupportUseBuiltinSCM = YES
Resolve Package Graph
Invalid Source '/Users/admin/builder/spi-builder-workspace/src/ggml-metal.m': File not found.Invalid Resource 'src/ggml-metal.metal': File not found.
Resolved source packages:
  ggml: /Users/admin/builder/spi-builder-workspace
resolved source packages: ggml
{
  "cxx_language_standard" : "c++11",
  "dependencies" : [
  ],
  "manifest_display_name" : "ggml",
  "name" : "ggml",
  "path" : "/Users/admin/builder/spi-builder-workspace",
  "platforms" : [
    {
      "name" : "macos",
      "version" : "12.0"
    },
    {
      "name" : "ios",
      "version" : "14.0"
    },
    {
      "name" : "watchos",
      "version" : "4.0"
    },
    {
      "name" : "tvos",
      "version" : "14.0"
    }
  ],
  "products" : [
    {
      "name" : "ggml",
      "targets" : [
        "ggml"
      ],
      "type" : {
        "library" : [
          "automatic"
        ]
      }
    }
  ],
  "targets" : [
    {
      "c99name" : "ggml",
      "module_type" : "ClangTarget",
      "name" : "ggml",
      "path" : ".",
      "product_memberships" : [
        "ggml"
      ],
      "sources" : [
        "src/ggml-alloc.c",
        "src/ggml-backend.cpp",
        "src/ggml-quants.c",
        "src/ggml.c"
      ],
      "type" : "library"
    }
  ],
  "tools_version" : "5.5"
}
warning: 'spi-builder-workspace': Invalid Source '/Users/admin/builder/spi-builder-workspace/src/ggml-metal.m': File not found.
warning: 'spi-builder-workspace': Invalid Resource 'src/ggml-metal.metal': File not found.
{
  "workspace" : {
    "name" : "spi-builder-workspace",
    "schemes" : [
      "ggml"
    ]
  }
}
Running build ...
env DEVELOPER_DIR=/Applications/Xcode-15.4.0.app xcrun xcodebuild -IDEClonedSourcePackagesDirPathOverride=$PWD/.dependencies -skipMacroValidation -skipPackagePluginValidation -derivedDataPath $PWD/.derivedData build -scheme ggml -destination generic/platform=xrOS
Command line invocation:
    /Applications/Xcode-15.4.0.app/Contents/Developer/usr/bin/xcodebuild -IDEClonedSourcePackagesDirPathOverride=/Users/admin/builder/spi-builder-workspace/.dependencies -skipMacroValidation -skipPackagePluginValidation -derivedDataPath /Users/admin/builder/spi-builder-workspace/.derivedData build -scheme ggml -destination generic/platform=xrOS
User defaults from command line:
    IDEClonedSourcePackagesDirPathOverride = /Users/admin/builder/spi-builder-workspace/.dependencies
    IDEDerivedDataPathOverride = /Users/admin/builder/spi-builder-workspace/.derivedData
    IDEPackageSupportUseBuiltinSCM = YES
Resolve Package Graph
Invalid Source '/Users/admin/builder/spi-builder-workspace/src/ggml-metal.m': File not found.Invalid Resource 'src/ggml-metal.metal': File not found.
Resolved source packages:
  ggml: /Users/admin/builder/spi-builder-workspace
Prepare packages
ComputeTargetDependencyGraph
note: Building targets in dependency order
note: Target dependency graph (3 targets)
    Target 'ggml' in project 'ggml'
        ➜ Explicit dependency on target 'ggml' in project 'ggml'
        ➜ Explicit dependency on target 'ggml_ggml' in project 'ggml'
    Target 'ggml' in project 'ggml'
        ➜ Explicit dependency on target 'ggml_ggml' in project 'ggml'
    Target 'ggml_ggml' in project 'ggml' (no dependencies)
GatherProvisioningInputs
CreateBuildDescription
ExecuteExternalTool /Applications/Xcode-15.4.0.app/Contents/Developer/Toolchains/XcodeDefault.xctoolchain/usr/bin/clang -v -E -dM -isysroot /Applications/Xcode-15.4.0.app/Contents/Developer/Platforms/XROS.platform/Developer/SDKs/XROS1.2.sdk -x c -c /dev/null
ExecuteExternalTool /Applications/Xcode-15.4.0.app/Contents/Developer/Toolchains/XcodeDefault.xctoolchain/usr/bin/clang -v -E -dM -arch arm64 -isysroot /Applications/Xcode-15.4.0.app/Contents/Developer/Platforms/XROS.platform/Developer/SDKs/XROS1.2.sdk -x objective-c -c /dev/null
ExecuteExternalTool /Applications/Xcode-15.4.0.app/Contents/Developer/Toolchains/XcodeDefault.xctoolchain/usr/bin/clang -v -E -dM -arch arm64 -isysroot /Applications/Xcode-15.4.0.app/Contents/Developer/Platforms/XROS.platform/Developer/SDKs/XROS1.2.sdk -x c -c /dev/null
ExecuteExternalTool /Applications/Xcode-15.4.0.app/Contents/Developer/Toolchains/XcodeDefault.xctoolchain/usr/bin/clang -v -E -dM -arch arm64 -isysroot /Applications/Xcode-15.4.0.app/Contents/Developer/Platforms/XROS.platform/Developer/SDKs/XROS1.2.sdk -x c++ -c /dev/null
ExecuteExternalTool /Applications/Xcode-15.4.0.app/Contents/Developer/Toolchains/XcodeDefault.xctoolchain/usr/bin/ld -version_details
Build description signature: 08e79a8d96f4b71188978c7e5fc59519
Build description path: /Users/admin/builder/spi-builder-workspace/.derivedData/Build/Intermediates.noindex/XCBuildData/08e79a8d96f4b71188978c7e5fc59519.xcbuilddata
CreateBuildDirectory /Users/admin/builder/spi-builder-workspace/.derivedData/Build/Products
    cd /Users/admin/builder/spi-builder-workspace/.swiftpm/xcode
    builtin-create-build-directory /Users/admin/builder/spi-builder-workspace/.derivedData/Build/Products
CreateBuildDirectory /Users/admin/builder/spi-builder-workspace/.derivedData/Build/Intermediates.noindex
    cd /Users/admin/builder/spi-builder-workspace/.swiftpm/xcode
    builtin-create-build-directory /Users/admin/builder/spi-builder-workspace/.derivedData/Build/Intermediates.noindex
ClangStatCache /Applications/Xcode-15.4.0.app/Contents/Developer/Toolchains/XcodeDefault.xctoolchain/usr/bin/clang-stat-cache /Applications/Xcode-15.4.0.app/Contents/Developer/Platforms/XROS.platform/Developer/SDKs/XROS1.2.sdk /Users/admin/builder/spi-builder-workspace/.derivedData/SDKStatCaches.noindex/xros1.2-21O5565d-70e6a4b4e6ce75e0f2056db95c07d51a.sdkstatcache
    cd /Users/admin/builder/spi-builder-workspace/.swiftpm/xcode
    /Applications/Xcode-15.4.0.app/Contents/Developer/Toolchains/XcodeDefault.xctoolchain/usr/bin/clang-stat-cache /Applications/Xcode-15.4.0.app/Contents/Developer/Platforms/XROS.platform/Developer/SDKs/XROS1.2.sdk -o /Users/admin/builder/spi-builder-workspace/.derivedData/SDKStatCaches.noindex/xros1.2-21O5565d-70e6a4b4e6ce75e0f2056db95c07d51a.sdkstatcache
CreateBuildDirectory /Users/admin/builder/spi-builder-workspace/.derivedData/Build/Products/Debug-xros
    cd /Users/admin/builder/spi-builder-workspace/.swiftpm/xcode
    builtin-create-build-directory /Users/admin/builder/spi-builder-workspace/.derivedData/Build/Products/Debug-xros
CreateBuildDirectory /Users/admin/builder/spi-builder-workspace/.derivedData/Build/Intermediates.noindex/EagerLinkingTBDs/Debug-xros
    cd /Users/admin/builder/spi-builder-workspace/.swiftpm/xcode
    builtin-create-build-directory /Users/admin/builder/spi-builder-workspace/.derivedData/Build/Intermediates.noindex/EagerLinkingTBDs/Debug-xros
CreateBuildDirectory /Users/admin/builder/spi-builder-workspace/.derivedData/Build/Products/Debug-xros/PackageFrameworks
    cd /Users/admin/builder/spi-builder-workspace/.swiftpm/xcode
    builtin-create-build-directory /Users/admin/builder/spi-builder-workspace/.derivedData/Build/Products/Debug-xros/PackageFrameworks
MkDir /Users/admin/builder/spi-builder-workspace/.derivedData/Build/Products/Debug-xros/ggml_ggml.bundle (in target 'ggml_ggml' from project 'ggml')
    cd /Users/admin/builder/spi-builder-workspace
    /bin/mkdir -p /Users/admin/builder/spi-builder-workspace/.derivedData/Build/Products/Debug-xros/ggml_ggml.bundle
WriteAuxiliaryFile /Users/admin/builder/spi-builder-workspace/.derivedData/Build/Intermediates.noindex/ggml.build/Debug-xros/ggml_ggml.build/empty-ggml_ggml.plist (in target 'ggml_ggml' from project 'ggml')
    cd /Users/admin/builder/spi-builder-workspace
    write-file /Users/admin/builder/spi-builder-workspace/.derivedData/Build/Intermediates.noindex/ggml.build/Debug-xros/ggml_ggml.build/empty-ggml_ggml.plist
CompileMetalFile /Users/admin/builder/spi-builder-workspace/src/ggml-metal/ggml-metal.metal (in target 'ggml_ggml' from project 'ggml')
    cd /Users/admin/builder/spi-builder-workspace
    /Applications/Xcode-15.4.0.app/Contents/Developer/Toolchains/XcodeDefault.xctoolchain/usr/bin/metal -c -target air64-apple-xros1.0 -I/Users/admin/builder/spi-builder-workspace/.derivedData/Build/Products/Debug-xros/include -F/Users/admin/builder/spi-builder-workspace/.derivedData/Build/Products/Debug-xros -isysroot /Applications/Xcode-15.4.0.app/Contents/Developer/Platforms/XROS.platform/Developer/SDKs/XROS1.2.sdk -ffast-math -serialize-diagnostics /Users/admin/builder/spi-builder-workspace/.derivedData/Build/Intermediates.noindex/ggml.build/Debug-xros/ggml_ggml.build/Metal/ggml-metal.dia -o /Users/admin/builder/spi-builder-workspace/.derivedData/Build/Intermediates.noindex/ggml.build/Debug-xros/ggml_ggml.build/Metal/ggml-metal.air -MMD -MT dependencies -MF /Users/admin/builder/spi-builder-workspace/.derivedData/Build/Intermediates.noindex/ggml.build/Debug-xros/ggml_ggml.build/Metal/ggml-metal.dat /Users/admin/builder/spi-builder-workspace/src/ggml-metal/ggml-metal.metal
/Users/admin/builder/spi-builder-workspace/src/ggml-metal/ggml-metal.metal:6:10: fatal error: 'ggml-common.h' file not found
#include "ggml-common.h"
         ^~~~~~~~~~~~~~~
1 error generated.
WriteAuxiliaryFile /Users/admin/builder/spi-builder-workspace/.derivedData/Build/Intermediates.noindex/ggml.build/Debug-xros/ggml.build/Objects-normal/arm64/82b82416624d2658e5098eb0a28c15c5-common-args.resp (in target 'ggml' from project 'ggml')
    cd /Users/admin/builder/spi-builder-workspace
    write-file /Users/admin/builder/spi-builder-workspace/.derivedData/Build/Intermediates.noindex/ggml.build/Debug-xros/ggml.build/Objects-normal/arm64/82b82416624d2658e5098eb0a28c15c5-common-args.resp
-target arm64-apple-xros1.0 '-std=c++11' -fmodules -gmodules '-fmodules-cache-path=/Users/admin/builder/spi-builder-workspace/.derivedData/ModuleCache.noindex' '-fmodule-name=ggml' -fpascal-strings -O0 -DSWIFT_PACKAGE '-DDEBUG=1' -DGGML_USE_ACCELERATE -DGGML_USE_METAL -isysroot /Applications/Xcode-15.4.0.app/Contents/Developer/Platforms/XROS.platform/Developer/SDKs/XROS1.2.sdk -g -fvisibility-inlines-hidden -I/Users/admin/builder/spi-builder-workspace/.derivedData/Build/Products/Debug-xros/include -I/Users/admin/builder/spi-builder-workspace/spm-headers -I/Users/admin/builder/spi-builder-workspace/.derivedData/Build/Intermediates.noindex/ggml.build/Debug-xros/ggml.build/DerivedSources-normal/arm64 -I/Users/admin/builder/spi-builder-workspace/.derivedData/Build/Intermediates.noindex/ggml.build/Debug-xros/ggml.build/DerivedSources/arm64 -I/Users/admin/builder/spi-builder-workspace/.derivedData/Build/Intermediates.noindex/ggml.build/Debug-xros/ggml.build/DerivedSources -F/Users/admin/builder/spi-builder-workspace/.derivedData/Build/Products/Debug-xros -iframework /Applications/Xcode-15.4.0.app/Contents/Developer/Platforms/XROS.platform/Developer/Library/Frameworks -iframework /Applications/Xcode-15.4.0.app/Contents/Developer/Platforms/XROS.platform/Developer/SDKs/XROS1.2.sdk/Developer/Library/Frameworks -DXcode -O3 -DNDEBUG -fno-objc-arc
WriteAuxiliaryFile /Users/admin/builder/spi-builder-workspace/.derivedData/Build/Intermediates.noindex/ggml.build/Debug-xros/ggml.build/Objects-normal/arm64/7187679823f38a2a940e0043cdf9d637-common-args.resp (in target 'ggml' from project 'ggml')
    cd /Users/admin/builder/spi-builder-workspace
    write-file /Users/admin/builder/spi-builder-workspace/.derivedData/Build/Intermediates.noindex/ggml.build/Debug-xros/ggml.build/Objects-normal/arm64/7187679823f38a2a940e0043cdf9d637-common-args.resp
-target arm64-apple-xros1.0 -fmodules -gmodules '-fmodules-cache-path=/Users/admin/builder/spi-builder-workspace/.derivedData/ModuleCache.noindex' '-fmodule-name=ggml' -fpascal-strings -O0 -DSWIFT_PACKAGE '-DDEBUG=1' -DGGML_USE_ACCELERATE -DGGML_USE_METAL -isysroot /Applications/Xcode-15.4.0.app/Contents/Developer/Platforms/XROS.platform/Developer/SDKs/XROS1.2.sdk -g -I/Users/admin/builder/spi-builder-workspace/.derivedData/Build/Products/Debug-xros/include -I/Users/admin/builder/spi-builder-workspace/spm-headers -I/Users/admin/builder/spi-builder-workspace/.derivedData/Build/Intermediates.noindex/ggml.build/Debug-xros/ggml.build/DerivedSources-normal/arm64 -I/Users/admin/builder/spi-builder-workspace/.derivedData/Build/Intermediates.noindex/ggml.build/Debug-xros/ggml.build/DerivedSources/arm64 -I/Users/admin/builder/spi-builder-workspace/.derivedData/Build/Intermediates.noindex/ggml.build/Debug-xros/ggml.build/DerivedSources -F/Users/admin/builder/spi-builder-workspace/.derivedData/Build/Products/Debug-xros -iframework /Applications/Xcode-15.4.0.app/Contents/Developer/Platforms/XROS.platform/Developer/Library/Frameworks -iframework /Applications/Xcode-15.4.0.app/Contents/Developer/Platforms/XROS.platform/Developer/SDKs/XROS1.2.sdk/Developer/Library/Frameworks -DXcode -O3 -DNDEBUG -fno-objc-arc
WriteAuxiliaryFile /Users/admin/builder/spi-builder-workspace/.derivedData/Build/Intermediates.noindex/ggml.build/Debug-xros/ggml.build/Objects-normal/arm64/e6072d4f65d7061329687fe24e3d63a7-common-args.resp (in target 'ggml' from project 'ggml')
    cd /Users/admin/builder/spi-builder-workspace
    write-file /Users/admin/builder/spi-builder-workspace/.derivedData/Build/Intermediates.noindex/ggml.build/Debug-xros/ggml.build/Objects-normal/arm64/e6072d4f65d7061329687fe24e3d63a7-common-args.resp
-target arm64-apple-xros1.0 -fobjc-arc -fmodules -gmodules '-fmodules-cache-path=/Users/admin/builder/spi-builder-workspace/.derivedData/ModuleCache.noindex' '-fmodule-name=ggml' -fpascal-strings -O0 -DSWIFT_PACKAGE '-DDEBUG=1' -DGGML_USE_ACCELERATE -DGGML_USE_METAL '-DOBJC_OLD_DISPATCH_PROTOTYPES=1' -isysroot /Applications/Xcode-15.4.0.app/Contents/Developer/Platforms/XROS.platform/Developer/SDKs/XROS1.2.sdk -g -I/Users/admin/builder/spi-builder-workspace/.derivedData/Build/Products/Debug-xros/include -I/Users/admin/builder/spi-builder-workspace/spm-headers -I/Users/admin/builder/spi-builder-workspace/.derivedData/Build/Intermediates.noindex/ggml.build/Debug-xros/ggml.build/DerivedSources-normal/arm64 -I/Users/admin/builder/spi-builder-workspace/.derivedData/Build/Intermediates.noindex/ggml.build/Debug-xros/ggml.build/DerivedSources/arm64 -I/Users/admin/builder/spi-builder-workspace/.derivedData/Build/Intermediates.noindex/ggml.build/Debug-xros/ggml.build/DerivedSources -F/Users/admin/builder/spi-builder-workspace/.derivedData/Build/Products/Debug-xros -iframework /Applications/Xcode-15.4.0.app/Contents/Developer/Platforms/XROS.platform/Developer/Library/Frameworks -iframework /Applications/Xcode-15.4.0.app/Contents/Developer/Platforms/XROS.platform/Developer/SDKs/XROS1.2.sdk/Developer/Library/Frameworks -DXcode -O3 -DNDEBUG -fno-objc-arc
WriteAuxiliaryFile /Users/admin/builder/spi-builder-workspace/.derivedData/Build/Intermediates.noindex/ggml.build/Debug-xros/ggml.build/DerivedSources/resource_bundle_accessor.h (in target 'ggml' from project 'ggml')
    cd /Users/admin/builder/spi-builder-workspace
    write-file /Users/admin/builder/spi-builder-workspace/.derivedData/Build/Intermediates.noindex/ggml.build/Debug-xros/ggml.build/DerivedSources/resource_bundle_accessor.h
WriteAuxiliaryFile /Users/admin/builder/spi-builder-workspace/.derivedData/Build/Intermediates.noindex/ggml.build/Debug-xros/ggml.build/DerivedSources/resource_bundle_accessor.m (in target 'ggml' from project 'ggml')
    cd /Users/admin/builder/spi-builder-workspace
    write-file /Users/admin/builder/spi-builder-workspace/.derivedData/Build/Intermediates.noindex/ggml.build/Debug-xros/ggml.build/DerivedSources/resource_bundle_accessor.m
ProcessInfoPlistFile /Users/admin/builder/spi-builder-workspace/.derivedData/Build/Products/Debug-xros/ggml_ggml.bundle/Info.plist /Users/admin/builder/spi-builder-workspace/.derivedData/Build/Intermediates.noindex/ggml.build/Debug-xros/ggml_ggml.build/empty-ggml_ggml.plist (in target 'ggml_ggml' from project 'ggml')
    cd /Users/admin/builder/spi-builder-workspace
    builtin-infoPlistUtility /Users/admin/builder/spi-builder-workspace/.derivedData/Build/Intermediates.noindex/ggml.build/Debug-xros/ggml_ggml.build/empty-ggml_ggml.plist -producttype com.apple.product-type.bundle -expandbuildsettings -format binary -platform xros -o /Users/admin/builder/spi-builder-workspace/.derivedData/Build/Products/Debug-xros/ggml_ggml.bundle/Info.plist
CompileC /Users/admin/builder/spi-builder-workspace/.derivedData/Build/Intermediates.noindex/ggml.build/Debug-xros/ggml.build/Objects-normal/arm64/ggml-quants.o /Users/admin/builder/spi-builder-workspace/src/ggml-quants.c normal arm64 c com.apple.compilers.llvm.clang.1_0.compiler (in target 'ggml' from project 'ggml')
    cd /Users/admin/builder/spi-builder-workspace
    /Applications/Xcode-15.4.0.app/Contents/Developer/Toolchains/XcodeDefault.xctoolchain/usr/bin/clang -x c -ivfsstatcache /Users/admin/builder/spi-builder-workspace/.derivedData/SDKStatCaches.noindex/xros1.2-21O5565d-70e6a4b4e6ce75e0f2056db95c07d51a.sdkstatcache -fmessage-length\=0 -fdiagnostics-show-note-include-stack -fmacro-backtrace-limit\=0 -fno-color-diagnostics -fmodules-prune-interval\=86400 -fmodules-prune-after\=345600 -fbuild-session-file\=/Users/admin/builder/spi-builder-workspace/.derivedData/ModuleCache.noindex/Session.modulevalidation -fmodules-validate-once-per-build-session -Wnon-modular-include-in-framework-module -Werror\=non-modular-include-in-framework-module -Wno-trigraphs -Wno-missing-field-initializers -Wno-missing-prototypes -Wno-return-type -Wno-missing-braces -Wparentheses -Wswitch -Wno-unused-function -Wno-unused-label -Wno-unused-parameter -Wno-unused-variable -Wunused-value -Wno-empty-body -Wno-uninitialized -Wno-unknown-pragmas -Wno-shadow -Wno-four-char-constants -Wno-conversion -Wno-constant-conversion -Wno-int-conversion -Wno-bool-conversion -Wno-enum-conversion -Wno-float-conversion -Wno-non-literal-null-conversion -Wno-objc-literal-conversion -Wshorten-64-to-32 -Wpointer-sign -Wno-newline-eof -Wno-implicit-fallthrough -fstrict-aliasing -Wdeprecated-declarations -Wno-sign-conversion -Wno-infinite-recursion -Wno-comma -Wno-block-capture-autoreleasing -Wno-strict-prototypes -Wno-semicolon-before-method-body -index-store-path /Users/admin/builder/spi-builder-workspace/.derivedData/Index.noindex/DataStore -Wno-shorten-64-to-32 @/Users/admin/builder/spi-builder-workspace/.derivedData/Build/Intermediates.noindex/ggml.build/Debug-xros/ggml.build/Objects-normal/arm64/7187679823f38a2a940e0043cdf9d637-common-args.resp -MMD -MT dependencies -MF /Users/admin/builder/spi-builder-workspace/.derivedData/Build/Intermediates.noindex/ggml.build/Debug-xros/ggml.build/Objects-normal/arm64/ggml-quants.d --serialize-diagnostics /Users/admin/builder/spi-builder-workspace/.derivedData/Build/Intermediates.noindex/ggml.build/Debug-xros/ggml.build/Objects-normal/arm64/ggml-quants.dia -c /Users/admin/builder/spi-builder-workspace/src/ggml-quants.c -o /Users/admin/builder/spi-builder-workspace/.derivedData/Build/Intermediates.noindex/ggml.build/Debug-xros/ggml.build/Objects-normal/arm64/ggml-quants.o -index-unit-output-path /ggml.build/Debug-xros/ggml.build/Objects-normal/arm64/ggml-quants.o
CompileC /Users/admin/builder/spi-builder-workspace/.derivedData/Build/Intermediates.noindex/ggml.build/Debug-xros/ggml.build/Objects-normal/arm64/resource_bundle_accessor.o /Users/admin/builder/spi-builder-workspace/.derivedData/Build/Intermediates.noindex/ggml.build/Debug-xros/ggml.build/DerivedSources/resource_bundle_accessor.m normal arm64 objective-c com.apple.compilers.llvm.clang.1_0.compiler (in target 'ggml' from project 'ggml')
    cd /Users/admin/builder/spi-builder-workspace
    /Applications/Xcode-15.4.0.app/Contents/Developer/Toolchains/XcodeDefault.xctoolchain/usr/bin/clang -x objective-c -ivfsstatcache /Users/admin/builder/spi-builder-workspace/.derivedData/SDKStatCaches.noindex/xros1.2-21O5565d-70e6a4b4e6ce75e0f2056db95c07d51a.sdkstatcache -fmessage-length\=0 -fdiagnostics-show-note-include-stack -fmacro-backtrace-limit\=0 -fno-color-diagnostics -fmodules-prune-interval\=86400 -fmodules-prune-after\=345600 -fbuild-session-file\=/Users/admin/builder/spi-builder-workspace/.derivedData/ModuleCache.noindex/Session.modulevalidation -fmodules-validate-once-per-build-session -Wnon-modular-include-in-framework-module -Werror\=non-modular-include-in-framework-module -Wno-trigraphs -Wno-missing-field-initializers -Wno-missing-prototypes -Wno-return-type -Wno-implicit-atomic-properties -Wno-objc-interface-ivars -Wno-arc-repeated-use-of-weak -Wno-missing-braces -Wparentheses -Wswitch -Wno-unused-function -Wno-unused-label -Wno-unused-parameter -Wno-unused-variable -Wunused-value -Wno-empty-body -Wno-uninitialized -Wno-unknown-pragmas -Wno-shadow -Wno-four-char-constants -Wno-conversion -Wno-constant-conversion -Wno-int-conversion -Wno-bool-conversion -Wno-enum-conversion -Wno-float-conversion -Wno-non-literal-null-conversion -Wno-objc-literal-conversion -Wshorten-64-to-32 -Wpointer-sign -Wno-newline-eof -Wno-selector -Wno-strict-selector-match -Wno-undeclared-selector -Wno-deprecated-implementations -Wno-implicit-fallthrough -fstrict-aliasing -Wprotocol -Wdeprecated-declarations -Wno-sign-conversion -Wno-infinite-recursion -Wno-comma -Wno-block-capture-autoreleasing -Wno-strict-prototypes -Wno-semicolon-before-method-body -index-store-path /Users/admin/builder/spi-builder-workspace/.derivedData/Index.noindex/DataStore -Wno-shorten-64-to-32 @/Users/admin/builder/spi-builder-workspace/.derivedData/Build/Intermediates.noindex/ggml.build/Debug-xros/ggml.build/Objects-normal/arm64/e6072d4f65d7061329687fe24e3d63a7-common-args.resp -include /Users/admin/builder/spi-builder-workspace/.derivedData/Build/Intermediates.noindex/ggml.build/Debug-xros/ggml.build/DerivedSources/resource_bundle_accessor.h -MMD -MT dependencies -MF /Users/admin/builder/spi-builder-workspace/.derivedData/Build/Intermediates.noindex/ggml.build/Debug-xros/ggml.build/Objects-normal/arm64/resource_bundle_accessor.d --serialize-diagnostics /Users/admin/builder/spi-builder-workspace/.derivedData/Build/Intermediates.noindex/ggml.build/Debug-xros/ggml.build/Objects-normal/arm64/resource_bundle_accessor.dia -c /Users/admin/builder/spi-builder-workspace/.derivedData/Build/Intermediates.noindex/ggml.build/Debug-xros/ggml.build/DerivedSources/resource_bundle_accessor.m -o /Users/admin/builder/spi-builder-workspace/.derivedData/Build/Intermediates.noindex/ggml.build/Debug-xros/ggml.build/Objects-normal/arm64/resource_bundle_accessor.o -index-unit-output-path /ggml.build/Debug-xros/ggml.build/Objects-normal/arm64/resource_bundle_accessor.o
CompileC /Users/admin/builder/spi-builder-workspace/.derivedData/Build/Intermediates.noindex/ggml.build/Debug-xros/ggml.build/Objects-normal/arm64/ggml.o /Users/admin/builder/spi-builder-workspace/src/ggml.c normal arm64 c com.apple.compilers.llvm.clang.1_0.compiler (in target 'ggml' from project 'ggml')
    cd /Users/admin/builder/spi-builder-workspace
    /Applications/Xcode-15.4.0.app/Contents/Developer/Toolchains/XcodeDefault.xctoolchain/usr/bin/clang -x c -ivfsstatcache /Users/admin/builder/spi-builder-workspace/.derivedData/SDKStatCaches.noindex/xros1.2-21O5565d-70e6a4b4e6ce75e0f2056db95c07d51a.sdkstatcache -fmessage-length\=0 -fdiagnostics-show-note-include-stack -fmacro-backtrace-limit\=0 -fno-color-diagnostics -fmodules-prune-interval\=86400 -fmodules-prune-after\=345600 -fbuild-session-file\=/Users/admin/builder/spi-builder-workspace/.derivedData/ModuleCache.noindex/Session.modulevalidation -fmodules-validate-once-per-build-session -Wnon-modular-include-in-framework-module -Werror\=non-modular-include-in-framework-module -Wno-trigraphs -Wno-missing-field-initializers -Wno-missing-prototypes -Wno-return-type -Wno-missing-braces -Wparentheses -Wswitch -Wno-unused-function -Wno-unused-label -Wno-unused-parameter -Wno-unused-variable -Wunused-value -Wno-empty-body -Wno-uninitialized -Wno-unknown-pragmas -Wno-shadow -Wno-four-char-constants -Wno-conversion -Wno-constant-conversion -Wno-int-conversion -Wno-bool-conversion -Wno-enum-conversion -Wno-float-conversion -Wno-non-literal-null-conversion -Wno-objc-literal-conversion -Wshorten-64-to-32 -Wpointer-sign -Wno-newline-eof -Wno-implicit-fallthrough -fstrict-aliasing -Wdeprecated-declarations -Wno-sign-conversion -Wno-infinite-recursion -Wno-comma -Wno-block-capture-autoreleasing -Wno-strict-prototypes -Wno-semicolon-before-method-body -index-store-path /Users/admin/builder/spi-builder-workspace/.derivedData/Index.noindex/DataStore -Wno-shorten-64-to-32 @/Users/admin/builder/spi-builder-workspace/.derivedData/Build/Intermediates.noindex/ggml.build/Debug-xros/ggml.build/Objects-normal/arm64/7187679823f38a2a940e0043cdf9d637-common-args.resp -MMD -MT dependencies -MF /Users/admin/builder/spi-builder-workspace/.derivedData/Build/Intermediates.noindex/ggml.build/Debug-xros/ggml.build/Objects-normal/arm64/ggml.d --serialize-diagnostics /Users/admin/builder/spi-builder-workspace/.derivedData/Build/Intermediates.noindex/ggml.build/Debug-xros/ggml.build/Objects-normal/arm64/ggml.dia -c /Users/admin/builder/spi-builder-workspace/src/ggml.c -o /Users/admin/builder/spi-builder-workspace/.derivedData/Build/Intermediates.noindex/ggml.build/Debug-xros/ggml.build/Objects-normal/arm64/ggml.o -index-unit-output-path /ggml.build/Debug-xros/ggml.build/Objects-normal/arm64/ggml.o
CompileC /Users/admin/builder/spi-builder-workspace/.derivedData/Build/Intermediates.noindex/ggml.build/Debug-xros/ggml.build/Objects-normal/arm64/ggml-backend.o /Users/admin/builder/spi-builder-workspace/src/ggml-backend.cpp normal arm64 c++ com.apple.compilers.llvm.clang.1_0.compiler (in target 'ggml' from project 'ggml')
    cd /Users/admin/builder/spi-builder-workspace
    /Applications/Xcode-15.4.0.app/Contents/Developer/Toolchains/XcodeDefault.xctoolchain/usr/bin/clang -x c++ -ivfsstatcache /Users/admin/builder/spi-builder-workspace/.derivedData/SDKStatCaches.noindex/xros1.2-21O5565d-70e6a4b4e6ce75e0f2056db95c07d51a.sdkstatcache -fmessage-length\=0 -fdiagnostics-show-note-include-stack -fmacro-backtrace-limit\=0 -fno-color-diagnostics -fmodules-prune-interval\=86400 -fmodules-prune-after\=345600 -fbuild-session-file\=/Users/admin/builder/spi-builder-workspace/.derivedData/ModuleCache.noindex/Session.modulevalidation -fmodules-validate-once-per-build-session -Wnon-modular-include-in-framework-module -Werror\=non-modular-include-in-framework-module -Wno-trigraphs -Wno-missing-field-initializers -Wno-missing-prototypes -Wno-return-type -Wno-non-virtual-dtor -Wno-overloaded-virtual -Wno-exit-time-destructors -Wno-missing-braces -Wparentheses -Wswitch -Wno-unused-function -Wno-unused-label -Wno-unused-parameter -Wno-unused-variable -Wunused-value -Wno-empty-body -Wno-uninitialized -Wno-unknown-pragmas -Wno-shadow -Wno-four-char-constants -Wno-conversion -Wno-constant-conversion -Wno-int-conversion -Wno-bool-conversion -Wno-enum-conversion -Wno-float-conversion -Wno-non-literal-null-conversion -Wno-objc-literal-conversion -Wshorten-64-to-32 -Wno-newline-eof -Wno-c++11-extensions -Wno-implicit-fallthrough -fstrict-aliasing -Wdeprecated-declarations -Winvalid-offsetof -Wno-sign-conversion -Wno-infinite-recursion -Wno-move -Wno-comma -Wno-block-capture-autoreleasing -Wno-strict-prototypes -Wno-range-loop-analysis -Wno-semicolon-before-method-body -index-store-path /Users/admin/builder/spi-builder-workspace/.derivedData/Index.noindex/DataStore -Wno-shorten-64-to-32 @/Users/admin/builder/spi-builder-workspace/.derivedData/Build/Intermediates.noindex/ggml.build/Debug-xros/ggml.build/Objects-normal/arm64/82b82416624d2658e5098eb0a28c15c5-common-args.resp -MMD -MT dependencies -MF /Users/admin/builder/spi-builder-workspace/.derivedData/Build/Intermediates.noindex/ggml.build/Debug-xros/ggml.build/Objects-normal/arm64/ggml-backend.d --serialize-diagnostics /Users/admin/builder/spi-builder-workspace/.derivedData/Build/Intermediates.noindex/ggml.build/Debug-xros/ggml.build/Objects-normal/arm64/ggml-backend.dia -c /Users/admin/builder/spi-builder-workspace/src/ggml-backend.cpp -o /Users/admin/builder/spi-builder-workspace/.derivedData/Build/Intermediates.noindex/ggml.build/Debug-xros/ggml.build/Objects-normal/arm64/ggml-backend.o -index-unit-output-path /ggml.build/Debug-xros/ggml.build/Objects-normal/arm64/ggml-backend.o
CompileC /Users/admin/builder/spi-builder-workspace/.derivedData/Build/Intermediates.noindex/ggml.build/Debug-xros/ggml.build/Objects-normal/arm64/ggml-alloc.o /Users/admin/builder/spi-builder-workspace/src/ggml-alloc.c normal arm64 c com.apple.compilers.llvm.clang.1_0.compiler (in target 'ggml' from project 'ggml')
    cd /Users/admin/builder/spi-builder-workspace
    /Applications/Xcode-15.4.0.app/Contents/Developer/Toolchains/XcodeDefault.xctoolchain/usr/bin/clang -x c -ivfsstatcache /Users/admin/builder/spi-builder-workspace/.derivedData/SDKStatCaches.noindex/xros1.2-21O5565d-70e6a4b4e6ce75e0f2056db95c07d51a.sdkstatcache -fmessage-length\=0 -fdiagnostics-show-note-include-stack -fmacro-backtrace-limit\=0 -fno-color-diagnostics -fmodules-prune-interval\=86400 -fmodules-prune-after\=345600 -fbuild-session-file\=/Users/admin/builder/spi-builder-workspace/.derivedData/ModuleCache.noindex/Session.modulevalidation -fmodules-validate-once-per-build-session -Wnon-modular-include-in-framework-module -Werror\=non-modular-include-in-framework-module -Wno-trigraphs -Wno-missing-field-initializers -Wno-missing-prototypes -Wno-return-type -Wno-missing-braces -Wparentheses -Wswitch -Wno-unused-function -Wno-unused-label -Wno-unused-parameter -Wno-unused-variable -Wunused-value -Wno-empty-body -Wno-uninitialized -Wno-unknown-pragmas -Wno-shadow -Wno-four-char-constants -Wno-conversion -Wno-constant-conversion -Wno-int-conversion -Wno-bool-conversion -Wno-enum-conversion -Wno-float-conversion -Wno-non-literal-null-conversion -Wno-objc-literal-conversion -Wshorten-64-to-32 -Wpointer-sign -Wno-newline-eof -Wno-implicit-fallthrough -fstrict-aliasing -Wdeprecated-declarations -Wno-sign-conversion -Wno-infinite-recursion -Wno-comma -Wno-block-capture-autoreleasing -Wno-strict-prototypes -Wno-semicolon-before-method-body -index-store-path /Users/admin/builder/spi-builder-workspace/.derivedData/Index.noindex/DataStore -Wno-shorten-64-to-32 @/Users/admin/builder/spi-builder-workspace/.derivedData/Build/Intermediates.noindex/ggml.build/Debug-xros/ggml.build/Objects-normal/arm64/7187679823f38a2a940e0043cdf9d637-common-args.resp -MMD -MT dependencies -MF /Users/admin/builder/spi-builder-workspace/.derivedData/Build/Intermediates.noindex/ggml.build/Debug-xros/ggml.build/Objects-normal/arm64/ggml-alloc.d --serialize-diagnostics /Users/admin/builder/spi-builder-workspace/.derivedData/Build/Intermediates.noindex/ggml.build/Debug-xros/ggml.build/Objects-normal/arm64/ggml-alloc.dia -c /Users/admin/builder/spi-builder-workspace/src/ggml-alloc.c -o /Users/admin/builder/spi-builder-workspace/.derivedData/Build/Intermediates.noindex/ggml.build/Debug-xros/ggml.build/Objects-normal/arm64/ggml-alloc.o -index-unit-output-path /ggml.build/Debug-xros/ggml.build/Objects-normal/arm64/ggml-alloc.o
** BUILD FAILED **
The following build commands failed:
	CompileMetalFile /Users/admin/builder/spi-builder-workspace/src/ggml-metal/ggml-metal.metal (in target 'ggml_ggml' from project 'ggml')
(1 failure)
Command line invocation:
    /Applications/Xcode-15.4.0.app/Contents/Developer/usr/bin/xcodebuild -IDEClonedSourcePackagesDirPathOverride=/Users/admin/builder/spi-builder-workspace/.dependencies -resolvePackageDependencies
User defaults from command line:
    IDEClonedSourcePackagesDirPathOverride = /Users/admin/builder/spi-builder-workspace/.dependencies
    IDEPackageSupportUseBuiltinSCM = YES
Resolve Package Graph
Invalid Source '/Users/admin/builder/spi-builder-workspace/src/ggml-metal.m': File not found.Invalid Resource 'src/ggml-metal.metal': File not found.
Resolved source packages:
  ggml: /Users/admin/builder/spi-builder-workspace
resolved source packages: ggml
{
  "cxx_language_standard" : "c++11",
  "dependencies" : [
  ],
  "manifest_display_name" : "ggml",
  "name" : "ggml",
  "path" : "/Users/admin/builder/spi-builder-workspace",
  "platforms" : [
    {
      "name" : "macos",
      "version" : "12.0"
    },
    {
      "name" : "ios",
      "version" : "14.0"
    },
    {
      "name" : "watchos",
      "version" : "4.0"
    },
    {
      "name" : "tvos",
      "version" : "14.0"
    }
  ],
  "products" : [
    {
      "name" : "ggml",
      "targets" : [
        "ggml"
      ],
      "type" : {
        "library" : [
          "automatic"
        ]
      }
    }
  ],
  "targets" : [
    {
      "c99name" : "ggml",
      "module_type" : "ClangTarget",
      "name" : "ggml",
      "path" : ".",
      "product_memberships" : [
        "ggml"
      ],
      "sources" : [
        "src/ggml-alloc.c",
        "src/ggml-backend.cpp",
        "src/ggml-quants.c",
        "src/ggml.c"
      ],
      "type" : "library"
    }
  ],
  "tools_version" : "5.5"
}
warning: 'spi-builder-workspace': Invalid Source '/Users/admin/builder/spi-builder-workspace/src/ggml-metal.m': File not found.
warning: 'spi-builder-workspace': Invalid Resource 'src/ggml-metal.metal': File not found.
{
  "workspace" : {
    "name" : "spi-builder-workspace",
    "schemes" : [
      "ggml"
    ]
  }
}
Running build ...
env DEVELOPER_DIR=/Applications/Xcode-15.4.0.app xcrun xcodebuild -IDEClonedSourcePackagesDirPathOverride=$PWD/.dependencies -skipMacroValidation -skipPackagePluginValidation -derivedDataPath $PWD/.derivedData build -scheme ggml -destination generic/platform=xrOS
Command line invocation:
    /Applications/Xcode-15.4.0.app/Contents/Developer/usr/bin/xcodebuild -IDEClonedSourcePackagesDirPathOverride=/Users/admin/builder/spi-builder-workspace/.dependencies -skipMacroValidation -skipPackagePluginValidation -derivedDataPath /Users/admin/builder/spi-builder-workspace/.derivedData build -scheme ggml -destination generic/platform=xrOS
User defaults from command line:
    IDEClonedSourcePackagesDirPathOverride = /Users/admin/builder/spi-builder-workspace/.dependencies
    IDEDerivedDataPathOverride = /Users/admin/builder/spi-builder-workspace/.derivedData
    IDEPackageSupportUseBuiltinSCM = YES
Resolve Package Graph
Invalid Source '/Users/admin/builder/spi-builder-workspace/src/ggml-metal.m': File not found.Invalid Resource 'src/ggml-metal.metal': File not found.
Resolved source packages:
  ggml: /Users/admin/builder/spi-builder-workspace
Prepare packages
ComputeTargetDependencyGraph
note: Building targets in dependency order
note: Target dependency graph (3 targets)
    Target 'ggml' in project 'ggml'
        ➜ Explicit dependency on target 'ggml' in project 'ggml'
        ➜ Explicit dependency on target 'ggml_ggml' in project 'ggml'
    Target 'ggml' in project 'ggml'
        ➜ Explicit dependency on target 'ggml_ggml' in project 'ggml'
    Target 'ggml_ggml' in project 'ggml' (no dependencies)
GatherProvisioningInputs
CreateBuildDescription
ClangStatCache /Applications/Xcode-15.4.0.app/Contents/Developer/Toolchains/XcodeDefault.xctoolchain/usr/bin/clang-stat-cache /Applications/Xcode-15.4.0.app/Contents/Developer/Platforms/XROS.platform/Developer/SDKs/XROS1.2.sdk /Users/admin/builder/spi-builder-workspace/.derivedData/SDKStatCaches.noindex/xros1.2-21O5565d-70e6a4b4e6ce75e0f2056db95c07d51a.sdkstatcache
    cd /Users/admin/builder/spi-builder-workspace/.swiftpm/xcode
    /Applications/Xcode-15.4.0.app/Contents/Developer/Toolchains/XcodeDefault.xctoolchain/usr/bin/clang-stat-cache /Applications/Xcode-15.4.0.app/Contents/Developer/Platforms/XROS.platform/Developer/SDKs/XROS1.2.sdk -o /Users/admin/builder/spi-builder-workspace/.derivedData/SDKStatCaches.noindex/xros1.2-21O5565d-70e6a4b4e6ce75e0f2056db95c07d51a.sdkstatcache
CompileMetalFile /Users/admin/builder/spi-builder-workspace/src/ggml-metal/ggml-metal.metal (in target 'ggml_ggml' from project 'ggml')
    cd /Users/admin/builder/spi-builder-workspace
    /Applications/Xcode-15.4.0.app/Contents/Developer/Toolchains/XcodeDefault.xctoolchain/usr/bin/metal -c -target air64-apple-xros1.0 -I/Users/admin/builder/spi-builder-workspace/.derivedData/Build/Products/Debug-xros/include -F/Users/admin/builder/spi-builder-workspace/.derivedData/Build/Products/Debug-xros -isysroot /Applications/Xcode-15.4.0.app/Contents/Developer/Platforms/XROS.platform/Developer/SDKs/XROS1.2.sdk -ffast-math -serialize-diagnostics /Users/admin/builder/spi-builder-workspace/.derivedData/Build/Intermediates.noindex/ggml.build/Debug-xros/ggml_ggml.build/Metal/ggml-metal.dia -o /Users/admin/builder/spi-builder-workspace/.derivedData/Build/Intermediates.noindex/ggml.build/Debug-xros/ggml_ggml.build/Metal/ggml-metal.air -MMD -MT dependencies -MF /Users/admin/builder/spi-builder-workspace/.derivedData/Build/Intermediates.noindex/ggml.build/Debug-xros/ggml_ggml.build/Metal/ggml-metal.dat /Users/admin/builder/spi-builder-workspace/src/ggml-metal/ggml-metal.metal
/Users/admin/builder/spi-builder-workspace/src/ggml-metal/ggml-metal.metal:6:10: fatal error: 'ggml-common.h' file not found
#include "ggml-common.h"
         ^~~~~~~~~~~~~~~
1 error generated.
** BUILD FAILED **
The following build commands failed:
	CompileMetalFile /Users/admin/builder/spi-builder-workspace/src/ggml-metal/ggml-metal.metal (in target 'ggml_ggml' from project 'ggml')
(1 failure)
BUILD FAILURE 5.10 visionOS