The Swift Package Index logo.Swift Package Index

Track the adoption of Swift 6 strict concurrency checks for data race safety. How many packages are Ready for Swift 6?

Build Information

Failed to build Prefire, reference 4.1.0 (a83c9f), with Swift 6.0 for watchOS using Xcode 16.2 on 2 May 2025 15:05:27 UTC.

Build Command

env DEVELOPER_DIR=/Applications/Xcode-16.2.0.app xcrun xcodebuild -IDEClonedSourcePackagesDirPathOverride=$PWD/.dependencies -skipMacroValidation -skipPackagePluginValidation -derivedDataPath $PWD/.derivedData build -scheme Prefire -destination generic/platform=watchOS

Build Log

public struct ViewControllerRepresentable<WrappedViewController: UIViewController>: UIViewControllerRepresentable {
                                                                                    ^~~~~~~~~~~~~~~~~~~~~~~~~~~~~
SwiftEmitModule normal arm64 Emitting\ module\ for\ Prefire (in target 'Prefire' from project 'Prefire')
    cd /Users/admin/builder/spi-builder-workspace/.swiftpm/xcode
    builtin-swiftTaskExecution -- /Applications/Xcode-16.2.0.app/Contents/Developer/Toolchains/XcodeDefault.xctoolchain/usr/bin/swift-frontend -frontend -emit-module -experimental-skip-non-inlinable-function-bodies-without-types /Users/admin/builder/spi-builder-workspace/Sources/Prefire/Playbook/LoadingTimeModifier.swift /Users/admin/builder/spi-builder-workspace/Sources/Prefire/Playbook/PlaybookView.swift /Users/admin/builder/spi-builder-workspace/Sources/Prefire/Playbook/Scale.swift /Users/admin/builder/spi-builder-workspace/Sources/Prefire/Playbook/TransformIf.swift /Users/admin/builder/spi-builder-workspace/Sources/Prefire/Preview/PreferenceKeys.swift /Users/admin/builder/spi-builder-workspace/Sources/Prefire/Preview/PrefireProvider.swift /Users/admin/builder/spi-builder-workspace/Sources/Prefire/Preview/PrefireSnapshot.swift /Users/admin/builder/spi-builder-workspace/Sources/Prefire/Preview/PreviewLayout+Equatable.swift /Users/admin/builder/spi-builder-workspace/Sources/Prefire/Preview/PreviewModel.swift /Users/admin/builder/spi-builder-workspace/Sources/Prefire/Preview/UIKitRepresentable.swift /Users/admin/builder/spi-builder-workspace/Sources/Prefire/Preview/View+Prefire.swift -target arm64-apple-watchos7.0 -Xllvm -aarch64-use-tbi -enable-objc-interop -stack-check -sdk /Applications/Xcode-16.2.0.app/Contents/Developer/Platforms/WatchOS.platform/Developer/SDKs/WatchOS11.2.sdk -I /Users/admin/builder/spi-builder-workspace/.derivedData/Build/Products/Debug-watchos -I /Applications/Xcode-16.2.0.app/Contents/Developer/Platforms/WatchOS.platform/Developer/usr/lib -F /Users/admin/builder/spi-builder-workspace/.derivedData/Build/Products/Debug-watchos -F /Applications/Xcode-16.2.0.app/Contents/Developer/Platforms/WatchOS.platform/Developer/Library/Frameworks -F /Applications/Xcode-16.2.0.app/Contents/Developer/Platforms/WatchOS.platform/Developer/SDKs/WatchOS11.2.sdk/Developer/Library/Frameworks -no-color-diagnostics -enable-testing -g -debug-info-format\=dwarf -dwarf-version\=4 -module-cache-path /Users/admin/builder/spi-builder-workspace/.derivedData/ModuleCache.noindex -swift-version 6 -enforce-exclusivity\=checked -Onone -D SWIFT_PACKAGE -D DEBUG -D Xcode -serialize-debugging-options -const-gather-protocols-file /Users/admin/builder/spi-builder-workspace/.derivedData/Build/Intermediates.noindex/Prefire.build/Debug-watchos/Prefire.build/Objects-normal/arm64/Prefire_const_extract_protocols.json -enable-experimental-feature DebugDescriptionMacro -enable-experimental-feature OpaqueTypeErasure -empty-abi-descriptor -plugin-path /Applications/Xcode-16.2.0.app/Contents/Developer/Toolchains/XcodeDefault.xctoolchain/usr/lib/swift/host/plugins/testing -validate-clang-modules-once -clang-build-session-file /Users/admin/builder/spi-builder-workspace/.derivedData/ModuleCache.noindex/Session.modulevalidation -Xcc -working-directory -Xcc /Users/admin/builder/spi-builder-workspace/.swiftpm/xcode -resource-dir /Applications/Xcode-16.2.0.app/Contents/Developer/Toolchains/XcodeDefault.xctoolchain/usr/lib/swift -enable-anonymous-context-mangled-names -file-compilation-dir /Users/admin/builder/spi-builder-workspace/.swiftpm/xcode -Xcc -D_LIBCPP_HARDENING_MODE\=_LIBCPP_HARDENING_MODE_DEBUG -Xcc -ivfsstatcache -Xcc /Users/admin/builder/spi-builder-workspace/.derivedData/SDKStatCaches.noindex/watchos11.2-22S97-8cb5c683f5e64b0ecfc74e8d0065fbf6.sdkstatcache -Xcc -I/Users/admin/builder/spi-builder-workspace/.derivedData/Build/Intermediates.noindex/Prefire.build/Debug-watchos/Prefire.build/swift-overrides.hmap -Xcc -I/Users/admin/builder/spi-builder-workspace/.derivedData/Build/Products/Debug-watchos/include -Xcc -I/Users/admin/builder/spi-builder-workspace/.derivedData/Build/Intermediates.noindex/Prefire.build/Debug-watchos/Prefire.build/DerivedSources-normal/arm64 -Xcc -I/Users/admin/builder/spi-builder-workspace/.derivedData/Build/Intermediates.noindex/Prefire.build/Debug-watchos/Prefire.build/DerivedSources/arm64 -Xcc -I/Users/admin/builder/spi-builder-workspace/.derivedData/Build/Intermediates.noindex/Prefire.build/Debug-watchos/Prefire.build/DerivedSources -Xcc -DSWIFT_PACKAGE -Xcc -DDEBUG\=1 -module-name Prefire -package-name spi_builder_workspace -frontend-parseable-output -disable-clang-spi -target-sdk-version 11.2 -target-sdk-name watchos11.2 -external-plugin-path /Applications/Xcode-16.2.0.app/Contents/Developer/Platforms/WatchOS.platform/Developer/usr/lib/swift/host/plugins\#/Applications/Xcode-16.2.0.app/Contents/Developer/Platforms/WatchOS.platform/Developer/usr/bin/swift-plugin-server -external-plugin-path /Applications/Xcode-16.2.0.app/Contents/Developer/Platforms/WatchOS.platform/Developer/usr/local/lib/swift/host/plugins\#/Applications/Xcode-16.2.0.app/Contents/Developer/Platforms/WatchOS.platform/Developer/usr/bin/swift-plugin-server -plugin-path /Applications/Xcode-16.2.0.app/Contents/Developer/Toolchains/XcodeDefault.xctoolchain/usr/lib/swift/host/plugins -plugin-path /Applications/Xcode-16.2.0.app/Contents/Developer/Toolchains/XcodeDefault.xctoolchain/usr/local/lib/swift/host/plugins -emit-module-doc-path /Users/admin/builder/spi-builder-workspace/.derivedData/Build/Intermediates.noindex/Prefire.build/Debug-watchos/Prefire.build/Objects-normal/arm64/Prefire.swiftdoc -emit-module-source-info-path /Users/admin/builder/spi-builder-workspace/.derivedData/Build/Intermediates.noindex/Prefire.build/Debug-watchos/Prefire.build/Objects-normal/arm64/Prefire.swiftsourceinfo -emit-objc-header-path /Users/admin/builder/spi-builder-workspace/.derivedData/Build/Intermediates.noindex/Prefire.build/Debug-watchos/Prefire.build/Objects-normal/arm64/Prefire-Swift.h -serialize-diagnostics-path /Users/admin/builder/spi-builder-workspace/.derivedData/Build/Intermediates.noindex/Prefire.build/Debug-watchos/Prefire.build/Objects-normal/arm64/Prefire-master-emit-module.dia -emit-dependencies-path /Users/admin/builder/spi-builder-workspace/.derivedData/Build/Intermediates.noindex/Prefire.build/Debug-watchos/Prefire.build/Objects-normal/arm64/Prefire-master-emit-module.d -o /Users/admin/builder/spi-builder-workspace/.derivedData/Build/Intermediates.noindex/Prefire.build/Debug-watchos/Prefire.build/Objects-normal/arm64/Prefire.swiftmodule -emit-abi-descriptor-path /Users/admin/builder/spi-builder-workspace/.derivedData/Build/Intermediates.noindex/Prefire.build/Debug-watchos/Prefire.build/Objects-normal/arm64/Prefire.abi.json
Command SwiftEmitModule failed with a nonzero exit code
** BUILD FAILED **
The following build commands failed:
	SwiftEmitModule normal arm64_32 Emitting\ module\ for\ Prefire (in target 'Prefire' from project 'Prefire')
	EmitSwiftModule normal arm64_32 (in target 'Prefire' from project 'Prefire')
	SwiftEmitModule normal armv7k Emitting\ module\ for\ Prefire (in target 'Prefire' from project 'Prefire')
	EmitSwiftModule normal armv7k (in target 'Prefire' from project 'Prefire')
	SwiftEmitModule normal arm64 Emitting\ module\ for\ Prefire (in target 'Prefire' from project 'Prefire')
	Building workspace spi-builder-workspace with scheme Prefire
(6 failures)
Command line invocation:
    /Applications/Xcode-16.2.0.app/Contents/Developer/usr/bin/xcodebuild -IDEClonedSourcePackagesDirPathOverride=/Users/admin/builder/spi-builder-workspace/.dependencies -resolvePackageDependencies
User defaults from command line:
    IDEClonedSourcePackagesDirPathOverride = /Users/admin/builder/spi-builder-workspace/.dependencies
    IDEPackageSupportUseBuiltinSCM = YES
Resolve Package Graph
Resolved source packages:
  Prefire: /Users/admin/builder/spi-builder-workspace
resolved source packages: Prefire
{
  "dependencies" : [
  ],
  "manifest_display_name" : "Prefire",
  "name" : "Prefire",
  "path" : "/Users/admin/builder/spi-builder-workspace",
  "platforms" : [
    {
      "name" : "ios",
      "version" : "14.0"
    }
  ],
  "products" : [
    {
      "name" : "Prefire",
      "targets" : [
        "Prefire"
      ],
      "type" : {
        "library" : [
          "automatic"
        ]
      }
    },
    {
      "name" : "PrefirePlaybookPlugin",
      "targets" : [
        "PrefirePlaybookPlugin"
      ],
      "type" : {
        "plugin" : null
      }
    },
    {
      "name" : "PrefireTestsPlugin",
      "targets" : [
        "PrefireTestsPlugin"
      ],
      "type" : {
        "plugin" : null
      }
    }
  ],
  "targets" : [
    {
      "c99name" : "PrefireTestsPlugin",
      "module_type" : "PluginTarget",
      "name" : "PrefireTestsPlugin",
      "path" : "Plugins/PrefireTestsPlugin",
      "plugin_capability" : {
        "type" : "buildTool"
      },
      "product_memberships" : [
        "PrefireTestsPlugin"
      ],
      "sources" : [
        "Plugin.swift",
        "TestedTargetFinder.swift"
      ],
      "target_dependencies" : [
        "PrefireBinary",
        "PrefireSourcery"
      ],
      "type" : "plugin"
    },
    {
      "c99name" : "PrefireSourcery",
      "module_type" : "BinaryTarget",
      "name" : "PrefireSourcery",
      "path" : "PrefireExecutable/Binaries/PrefireSourcery.artifactbundle",
      "product_memberships" : [
        "PrefirePlaybookPlugin",
        "PrefireTestsPlugin"
      ],
      "sources" : [
      ],
      "type" : "binary"
    },
    {
      "c99name" : "PrefirePlaybookPlugin",
      "module_type" : "PluginTarget",
      "name" : "PrefirePlaybookPlugin",
      "path" : "Plugins/PrefirePlaybookPlugin",
      "plugin_capability" : {
        "type" : "buildTool"
      },
      "product_memberships" : [
        "PrefirePlaybookPlugin"
      ],
      "sources" : [
        "Plugin.swift"
      ],
      "target_dependencies" : [
        "PrefireBinary",
        "PrefireSourcery"
      ],
      "type" : "plugin"
    },
    {
      "c99name" : "PrefireBinary",
      "module_type" : "BinaryTarget",
      "name" : "PrefireBinary",
      "path" : "Binaries/PrefireBinary.artifactbundle",
      "product_memberships" : [
        "PrefirePlaybookPlugin",
        "PrefireTestsPlugin"
      ],
      "sources" : [
      ],
      "type" : "binary"
    },
    {
      "c99name" : "Prefire",
      "module_type" : "SwiftTarget",
      "name" : "Prefire",
      "path" : "Sources/Prefire",
      "product_memberships" : [
        "Prefire"
      ],
      "sources" : [
        "Playbook/LoadingTimeModifier.swift",
        "Playbook/PlaybookView.swift",
        "Playbook/Scale.swift",
        "Playbook/TransformIf.swift",
        "Preview/PreferenceKeys.swift",
        "Preview/PrefireProvider.swift",
        "Preview/PrefireSnapshot.swift",
        "Preview/PreviewLayout+Equatable.swift",
        "Preview/PreviewModel.swift",
        "Preview/UIKitRepresentable.swift",
        "Preview/View+Prefire.swift"
      ],
      "type" : "library"
    }
  ],
  "tools_version" : "6.0"
}
{
  "workspace" : {
    "name" : "spi-builder-workspace",
    "schemes" : [
      "Prefire"
    ]
  }
}
Running build ...
env DEVELOPER_DIR=/Applications/Xcode-16.2.0.app xcrun xcodebuild -IDEClonedSourcePackagesDirPathOverride=$PWD/.dependencies -skipMacroValidation -skipPackagePluginValidation -derivedDataPath $PWD/.derivedData build -scheme Prefire -destination generic/platform=watchOS
Command line invocation:
    /Applications/Xcode-16.2.0.app/Contents/Developer/usr/bin/xcodebuild -IDEClonedSourcePackagesDirPathOverride=/Users/admin/builder/spi-builder-workspace/.dependencies -skipMacroValidation -skipPackagePluginValidation -derivedDataPath /Users/admin/builder/spi-builder-workspace/.derivedData build -scheme Prefire -destination generic/platform=watchOS
User defaults from command line:
    IDEClonedSourcePackagesDirPathOverride = /Users/admin/builder/spi-builder-workspace/.dependencies
    IDEDerivedDataPathOverride = /Users/admin/builder/spi-builder-workspace/.derivedData
    IDEPackageSupportUseBuiltinSCM = YES
Resolve Package Graph
Resolved source packages:
  Prefire: /Users/admin/builder/spi-builder-workspace
Prepare packages
Compile plug-in “PrefireTestsPlugin” in package “spi-builder-workspace”
[debug]: Compiling plugin to executable at /Users/admin/builder/spi-builder-workspace/.dependencies/plugins/PrefireTestsPlugin
[debug]: Using compiler /Applications/Xcode-16.2.0.app/Contents/Developer/Toolchains/XcodeDefault.xctoolchain/usr/bin/swiftc
[debug]: Plugin compilation output directory '/Users/admin/builder/spi-builder-workspace/.dependencies/plugins'
[debug]: Computed hash of plugin compilation inputs: aea0061b4ba4e960d9366800cf068e876c676c74bd64e752a08b3808082ca2b6
/Applications/Xcode-16.2.0.app/Contents/Developer/Toolchains/XcodeDefault.xctoolchain/usr/bin/swiftc -L /Applications/Xcode-16.2.0.app/Contents/SharedFrameworks/SwiftPM.framework/SharedSupport/PluginAPI -lPackagePlugin -Xlinker -rpath -Xlinker /Applications/Xcode-16.2.0.app/Contents/SharedFrameworks/SwiftPM.framework/SharedSupport/PluginAPI -target arm64-apple-macos13.0 -sdk /Applications/Xcode-16.2.0.app/Contents/Developer/Platforms/MacOSX.platform/Developer/SDKs/MacOSX15.2.sdk -g -swift-version 6 -package-description-version 6.0.0 -I /Applications/Xcode-16.2.0.app/Contents/SharedFrameworks/SwiftPM.framework/SharedSupport/PluginAPI -sdk /Applications/Xcode-16.2.0.app/Contents/Developer/Platforms/MacOSX.platform/Developer/SDKs/MacOSX15.2.sdk -parse-as-library -Xfrontend -serialize-diagnostics-path -Xfrontend /Users/admin/builder/spi-builder-workspace/.dependencies/plugins/PrefirePlaybookPlugin.dia /Users/admin/builder/spi-builder-workspace/Plugins/PrefirePlaybookPlugin/Plugin.swift -o /Users/admin/builder/spi-builder-workspace/.dependencies/plugins/PrefirePlaybookPlugin
[debug]: Compiling plugin to executable at /Users/admin/builder/spi-builder-workspace/.dependencies/plugins/PrefirePlaybookPlugin
[debug]: Using compiler /Applications/Xcode-16.2.0.app/Contents/Developer/Toolchains/XcodeDefault.xctoolchain/usr/bin/swiftc
[debug]: Plugin compilation output directory '/Users/admin/builder/spi-builder-workspace/.dependencies/plugins'
[debug]: Computed hash of plugin compilation inputs: 9f128d824d5c9efb5ad27d4e324c0d2571296cfe5542a2d809232c46a6eb31ac
Process build tool plug-in results
ComputeTargetDependencyGraph
note: Building targets in dependency order
note: Target dependency graph (2 targets)
    Target 'Prefire' in project 'Prefire'
        ➜ Explicit dependency on target 'Prefire' in project 'Prefire'
    Target 'Prefire' in project 'Prefire' (no dependencies)
GatherProvisioningInputs
CreateBuildDescription
ClangStatCache /Applications/Xcode-16.2.0.app/Contents/Developer/Toolchains/XcodeDefault.xctoolchain/usr/bin/clang-stat-cache /Applications/Xcode-16.2.0.app/Contents/Developer/Platforms/WatchOS.platform/Developer/SDKs/WatchOS11.2.sdk /Users/admin/builder/spi-builder-workspace/.derivedData/SDKStatCaches.noindex/watchos11.2-22S97-8cb5c683f5e64b0ecfc74e8d0065fbf6.sdkstatcache
    cd /Users/admin/builder/spi-builder-workspace/.swiftpm/xcode
    /Applications/Xcode-16.2.0.app/Contents/Developer/Toolchains/XcodeDefault.xctoolchain/usr/bin/clang-stat-cache /Applications/Xcode-16.2.0.app/Contents/Developer/Platforms/WatchOS.platform/Developer/SDKs/WatchOS11.2.sdk -o /Users/admin/builder/spi-builder-workspace/.derivedData/SDKStatCaches.noindex/watchos11.2-22S97-8cb5c683f5e64b0ecfc74e8d0065fbf6.sdkstatcache
SwiftDriver Prefire normal armv7k com.apple.xcode.tools.swift.compiler (in target 'Prefire' from project 'Prefire')
    cd /Users/admin/builder/spi-builder-workspace/.swiftpm/xcode
    builtin-SwiftDriver -- /Applications/Xcode-16.2.0.app/Contents/Developer/Toolchains/XcodeDefault.xctoolchain/usr/bin/swiftc -module-name Prefire -Onone -enforce-exclusivity\=checked @/Users/admin/builder/spi-builder-workspace/.derivedData/Build/Intermediates.noindex/Prefire.build/Debug-watchos/Prefire.build/Objects-normal/armv7k/Prefire.SwiftFileList -DSWIFT_PACKAGE -DDEBUG -DXcode -plugin-path /Applications/Xcode-16.2.0.app/Contents/Developer/Toolchains/XcodeDefault.xctoolchain/usr/lib/swift/host/plugins/testing -enable-experimental-feature DebugDescriptionMacro -sdk /Applications/Xcode-16.2.0.app/Contents/Developer/Platforms/WatchOS.platform/Developer/SDKs/WatchOS11.2.sdk -target armv7k-apple-watchos7.0 -g -module-cache-path /Users/admin/builder/spi-builder-workspace/.derivedData/ModuleCache.noindex -Xfrontend -serialize-debugging-options -enable-testing -index-store-path /Users/admin/builder/spi-builder-workspace/.derivedData/Index.noindex/DataStore -enable-experimental-feature OpaqueTypeErasure -Xcc -D_LIBCPP_HARDENING_MODE\=_LIBCPP_HARDENING_MODE_DEBUG -swift-version 6 -I /Users/admin/builder/spi-builder-workspace/.derivedData/Build/Products/Debug-watchos -I /Applications/Xcode-16.2.0.app/Contents/Developer/Platforms/WatchOS.platform/Developer/usr/lib -F /Users/admin/builder/spi-builder-workspace/.derivedData/Build/Products/Debug-watchos -F /Applications/Xcode-16.2.0.app/Contents/Developer/Platforms/WatchOS.platform/Developer/Library/Frameworks -F /Applications/Xcode-16.2.0.app/Contents/Developer/Platforms/WatchOS.platform/Developer/SDKs/WatchOS11.2.sdk/Developer/Library/Frameworks -c -j10 -enable-batch-mode -incremental -Xcc -ivfsstatcache -Xcc /Users/admin/builder/spi-builder-workspace/.derivedData/SDKStatCaches.noindex/watchos11.2-22S97-8cb5c683f5e64b0ecfc74e8d0065fbf6.sdkstatcache -output-file-map /Users/admin/builder/spi-builder-workspace/.derivedData/Build/Intermediates.noindex/Prefire.build/Debug-watchos/Prefire.build/Objects-normal/armv7k/Prefire-OutputFileMap.json -use-frontend-parseable-output -save-temps -no-color-diagnostics -serialize-diagnostics -emit-dependencies -emit-module -emit-module-path /Users/admin/builder/spi-builder-workspace/.derivedData/Build/Intermediates.noindex/Prefire.build/Debug-watchos/Prefire.build/Objects-normal/armv7k/Prefire.swiftmodule -validate-clang-modules-once -clang-build-session-file /Users/admin/builder/spi-builder-workspace/.derivedData/ModuleCache.noindex/Session.modulevalidation -package-name spi_builder_workspace -Xcc -I/Users/admin/builder/spi-builder-workspace/.derivedData/Build/Intermediates.noindex/Prefire.build/Debug-watchos/Prefire.build/swift-overrides.hmap -emit-const-values -Xfrontend -const-gather-protocols-file -Xfrontend /Users/admin/builder/spi-builder-workspace/.derivedData/Build/Intermediates.noindex/Prefire.build/Debug-watchos/Prefire.build/Objects-normal/armv7k/Prefire_const_extract_protocols.json -Xcc -I/Users/admin/builder/spi-builder-workspace/.derivedData/Build/Products/Debug-watchos/include -Xcc -I/Users/admin/builder/spi-builder-workspace/.derivedData/Build/Intermediates.noindex/Prefire.build/Debug-watchos/Prefire.build/DerivedSources-normal/armv7k -Xcc -I/Users/admin/builder/spi-builder-workspace/.derivedData/Build/Intermediates.noindex/Prefire.build/Debug-watchos/Prefire.build/DerivedSources/armv7k -Xcc -I/Users/admin/builder/spi-builder-workspace/.derivedData/Build/Intermediates.noindex/Prefire.build/Debug-watchos/Prefire.build/DerivedSources -Xcc -DSWIFT_PACKAGE -Xcc -DDEBUG\=1 -emit-objc-header -emit-objc-header-path /Users/admin/builder/spi-builder-workspace/.derivedData/Build/Intermediates.noindex/Prefire.build/Debug-watchos/Prefire.build/Objects-normal/armv7k/Prefire-Swift.h -working-directory /Users/admin/builder/spi-builder-workspace/.swiftpm/xcode -experimental-emit-module-separately -disable-cmo
SwiftDriver Prefire normal arm64_32 com.apple.xcode.tools.swift.compiler (in target 'Prefire' from project 'Prefire')
    cd /Users/admin/builder/spi-builder-workspace/.swiftpm/xcode
    builtin-SwiftDriver -- /Applications/Xcode-16.2.0.app/Contents/Developer/Toolchains/XcodeDefault.xctoolchain/usr/bin/swiftc -module-name Prefire -Onone -enforce-exclusivity\=checked @/Users/admin/builder/spi-builder-workspace/.derivedData/Build/Intermediates.noindex/Prefire.build/Debug-watchos/Prefire.build/Objects-normal/arm64_32/Prefire.SwiftFileList -DSWIFT_PACKAGE -DDEBUG -DXcode -plugin-path /Applications/Xcode-16.2.0.app/Contents/Developer/Toolchains/XcodeDefault.xctoolchain/usr/lib/swift/host/plugins/testing -enable-experimental-feature DebugDescriptionMacro -sdk /Applications/Xcode-16.2.0.app/Contents/Developer/Platforms/WatchOS.platform/Developer/SDKs/WatchOS11.2.sdk -target arm64_32-apple-watchos7.0 -g -module-cache-path /Users/admin/builder/spi-builder-workspace/.derivedData/ModuleCache.noindex -Xfrontend -serialize-debugging-options -enable-testing -index-store-path /Users/admin/builder/spi-builder-workspace/.derivedData/Index.noindex/DataStore -enable-experimental-feature OpaqueTypeErasure -Xcc -D_LIBCPP_HARDENING_MODE\=_LIBCPP_HARDENING_MODE_DEBUG -swift-version 6 -I /Users/admin/builder/spi-builder-workspace/.derivedData/Build/Products/Debug-watchos -I /Applications/Xcode-16.2.0.app/Contents/Developer/Platforms/WatchOS.platform/Developer/usr/lib -F /Users/admin/builder/spi-builder-workspace/.derivedData/Build/Products/Debug-watchos -F /Applications/Xcode-16.2.0.app/Contents/Developer/Platforms/WatchOS.platform/Developer/Library/Frameworks -F /Applications/Xcode-16.2.0.app/Contents/Developer/Platforms/WatchOS.platform/Developer/SDKs/WatchOS11.2.sdk/Developer/Library/Frameworks -c -j10 -enable-batch-mode -incremental -Xcc -ivfsstatcache -Xcc /Users/admin/builder/spi-builder-workspace/.derivedData/SDKStatCaches.noindex/watchos11.2-22S97-8cb5c683f5e64b0ecfc74e8d0065fbf6.sdkstatcache -output-file-map /Users/admin/builder/spi-builder-workspace/.derivedData/Build/Intermediates.noindex/Prefire.build/Debug-watchos/Prefire.build/Objects-normal/arm64_32/Prefire-OutputFileMap.json -use-frontend-parseable-output -save-temps -no-color-diagnostics -serialize-diagnostics -emit-dependencies -emit-module -emit-module-path /Users/admin/builder/spi-builder-workspace/.derivedData/Build/Intermediates.noindex/Prefire.build/Debug-watchos/Prefire.build/Objects-normal/arm64_32/Prefire.swiftmodule -validate-clang-modules-once -clang-build-session-file /Users/admin/builder/spi-builder-workspace/.derivedData/ModuleCache.noindex/Session.modulevalidation -package-name spi_builder_workspace -Xcc -I/Users/admin/builder/spi-builder-workspace/.derivedData/Build/Intermediates.noindex/Prefire.build/Debug-watchos/Prefire.build/swift-overrides.hmap -emit-const-values -Xfrontend -const-gather-protocols-file -Xfrontend /Users/admin/builder/spi-builder-workspace/.derivedData/Build/Intermediates.noindex/Prefire.build/Debug-watchos/Prefire.build/Objects-normal/arm64_32/Prefire_const_extract_protocols.json -Xcc -I/Users/admin/builder/spi-builder-workspace/.derivedData/Build/Products/Debug-watchos/include -Xcc -I/Users/admin/builder/spi-builder-workspace/.derivedData/Build/Intermediates.noindex/Prefire.build/Debug-watchos/Prefire.build/DerivedSources-normal/arm64_32 -Xcc -I/Users/admin/builder/spi-builder-workspace/.derivedData/Build/Intermediates.noindex/Prefire.build/Debug-watchos/Prefire.build/DerivedSources/arm64_32 -Xcc -I/Users/admin/builder/spi-builder-workspace/.derivedData/Build/Intermediates.noindex/Prefire.build/Debug-watchos/Prefire.build/DerivedSources -Xcc -DSWIFT_PACKAGE -Xcc -DDEBUG\=1 -emit-objc-header -emit-objc-header-path /Users/admin/builder/spi-builder-workspace/.derivedData/Build/Intermediates.noindex/Prefire.build/Debug-watchos/Prefire.build/Objects-normal/arm64_32/Prefire-Swift.h -working-directory /Users/admin/builder/spi-builder-workspace/.swiftpm/xcode -experimental-emit-module-separately -disable-cmo
SwiftDriver Prefire normal arm64 com.apple.xcode.tools.swift.compiler (in target 'Prefire' from project 'Prefire')
    cd /Users/admin/builder/spi-builder-workspace/.swiftpm/xcode
    builtin-SwiftDriver -- /Applications/Xcode-16.2.0.app/Contents/Developer/Toolchains/XcodeDefault.xctoolchain/usr/bin/swiftc -module-name Prefire -Onone -enforce-exclusivity\=checked @/Users/admin/builder/spi-builder-workspace/.derivedData/Build/Intermediates.noindex/Prefire.build/Debug-watchos/Prefire.build/Objects-normal/arm64/Prefire.SwiftFileList -DSWIFT_PACKAGE -DDEBUG -DXcode -plugin-path /Applications/Xcode-16.2.0.app/Contents/Developer/Toolchains/XcodeDefault.xctoolchain/usr/lib/swift/host/plugins/testing -enable-experimental-feature DebugDescriptionMacro -sdk /Applications/Xcode-16.2.0.app/Contents/Developer/Platforms/WatchOS.platform/Developer/SDKs/WatchOS11.2.sdk -target arm64-apple-watchos7.0 -g -module-cache-path /Users/admin/builder/spi-builder-workspace/.derivedData/ModuleCache.noindex -Xfrontend -serialize-debugging-options -enable-testing -index-store-path /Users/admin/builder/spi-builder-workspace/.derivedData/Index.noindex/DataStore -enable-experimental-feature OpaqueTypeErasure -Xcc -D_LIBCPP_HARDENING_MODE\=_LIBCPP_HARDENING_MODE_DEBUG -swift-version 6 -I /Users/admin/builder/spi-builder-workspace/.derivedData/Build/Products/Debug-watchos -I /Applications/Xcode-16.2.0.app/Contents/Developer/Platforms/WatchOS.platform/Developer/usr/lib -F /Users/admin/builder/spi-builder-workspace/.derivedData/Build/Products/Debug-watchos -F /Applications/Xcode-16.2.0.app/Contents/Developer/Platforms/WatchOS.platform/Developer/Library/Frameworks -F /Applications/Xcode-16.2.0.app/Contents/Developer/Platforms/WatchOS.platform/Developer/SDKs/WatchOS11.2.sdk/Developer/Library/Frameworks -c -j10 -enable-batch-mode -incremental -Xcc -ivfsstatcache -Xcc /Users/admin/builder/spi-builder-workspace/.derivedData/SDKStatCaches.noindex/watchos11.2-22S97-8cb5c683f5e64b0ecfc74e8d0065fbf6.sdkstatcache -output-file-map /Users/admin/builder/spi-builder-workspace/.derivedData/Build/Intermediates.noindex/Prefire.build/Debug-watchos/Prefire.build/Objects-normal/arm64/Prefire-OutputFileMap.json -use-frontend-parseable-output -save-temps -no-color-diagnostics -serialize-diagnostics -emit-dependencies -emit-module -emit-module-path /Users/admin/builder/spi-builder-workspace/.derivedData/Build/Intermediates.noindex/Prefire.build/Debug-watchos/Prefire.build/Objects-normal/arm64/Prefire.swiftmodule -validate-clang-modules-once -clang-build-session-file /Users/admin/builder/spi-builder-workspace/.derivedData/ModuleCache.noindex/Session.modulevalidation -package-name spi_builder_workspace -Xcc -I/Users/admin/builder/spi-builder-workspace/.derivedData/Build/Intermediates.noindex/Prefire.build/Debug-watchos/Prefire.build/swift-overrides.hmap -emit-const-values -Xfrontend -const-gather-protocols-file -Xfrontend /Users/admin/builder/spi-builder-workspace/.derivedData/Build/Intermediates.noindex/Prefire.build/Debug-watchos/Prefire.build/Objects-normal/arm64/Prefire_const_extract_protocols.json -Xcc -I/Users/admin/builder/spi-builder-workspace/.derivedData/Build/Products/Debug-watchos/include -Xcc -I/Users/admin/builder/spi-builder-workspace/.derivedData/Build/Intermediates.noindex/Prefire.build/Debug-watchos/Prefire.build/DerivedSources-normal/arm64 -Xcc -I/Users/admin/builder/spi-builder-workspace/.derivedData/Build/Intermediates.noindex/Prefire.build/Debug-watchos/Prefire.build/DerivedSources/arm64 -Xcc -I/Users/admin/builder/spi-builder-workspace/.derivedData/Build/Intermediates.noindex/Prefire.build/Debug-watchos/Prefire.build/DerivedSources -Xcc -DSWIFT_PACKAGE -Xcc -DDEBUG\=1 -emit-objc-header -emit-objc-header-path /Users/admin/builder/spi-builder-workspace/.derivedData/Build/Intermediates.noindex/Prefire.build/Debug-watchos/Prefire.build/Objects-normal/arm64/Prefire-Swift.h -working-directory /Users/admin/builder/spi-builder-workspace/.swiftpm/xcode -experimental-emit-module-separately -disable-cmo
SwiftCompile normal arm64_32 Compiling\ PrefireSnapshot.swift /Users/admin/builder/spi-builder-workspace/Sources/Prefire/Preview/PrefireSnapshot.swift (in target 'Prefire' from project 'Prefire')
    cd /Users/admin/builder/spi-builder-workspace/.swiftpm/xcode
    builtin-swiftTaskExecution -- /Applications/Xcode-16.2.0.app/Contents/Developer/Toolchains/XcodeDefault.xctoolchain/usr/bin/swift-frontend -frontend -c /Users/admin/builder/spi-builder-workspace/Sources/Prefire/Playbook/LoadingTimeModifier.swift /Users/admin/builder/spi-builder-workspace/Sources/Prefire/Playbook/PlaybookView.swift /Users/admin/builder/spi-builder-workspace/Sources/Prefire/Playbook/Scale.swift /Users/admin/builder/spi-builder-workspace/Sources/Prefire/Playbook/TransformIf.swift /Users/admin/builder/spi-builder-workspace/Sources/Prefire/Preview/PreferenceKeys.swift /Users/admin/builder/spi-builder-workspace/Sources/Prefire/Preview/PrefireProvider.swift -primary-file /Users/admin/builder/spi-builder-workspace/Sources/Prefire/Preview/PrefireSnapshot.swift /Users/admin/builder/spi-builder-workspace/Sources/Prefire/Preview/PreviewLayout+Equatable.swift /Users/admin/builder/spi-builder-workspace/Sources/Prefire/Preview/PreviewModel.swift /Users/admin/builder/spi-builder-workspace/Sources/Prefire/Preview/UIKitRepresentable.swift /Users/admin/builder/spi-builder-workspace/Sources/Prefire/Preview/View+Prefire.swift -emit-dependencies-path /Users/admin/builder/spi-builder-workspace/.derivedData/Build/Intermediates.noindex/Prefire.build/Debug-watchos/Prefire.build/Objects-normal/arm64_32/PrefireSnapshot.d -emit-const-values-path /Users/admin/builder/spi-builder-workspace/.derivedData/Build/Intermediates.noindex/Prefire.build/Debug-watchos/Prefire.build/Objects-normal/arm64_32/PrefireSnapshot.swiftconstvalues -emit-reference-dependencies-path /Users/admin/builder/spi-builder-workspace/.derivedData/Build/Intermediates.noindex/Prefire.build/Debug-watchos/Prefire.build/Objects-normal/arm64_32/PrefireSnapshot.swiftdeps -serialize-diagnostics-path /Users/admin/builder/spi-builder-workspace/.derivedData/Build/Intermediates.noindex/Prefire.build/Debug-watchos/Prefire.build/Objects-normal/arm64_32/PrefireSnapshot.dia -target arm64_32-apple-watchos7.0 -enable-objc-interop -sdk /Applications/Xcode-16.2.0.app/Contents/Developer/Platforms/WatchOS.platform/Developer/SDKs/WatchOS11.2.sdk -I /Users/admin/builder/spi-builder-workspace/.derivedData/Build/Products/Debug-watchos -I /Applications/Xcode-16.2.0.app/Contents/Developer/Platforms/WatchOS.platform/Developer/usr/lib -F /Users/admin/builder/spi-builder-workspace/.derivedData/Build/Products/Debug-watchos -F /Applications/Xcode-16.2.0.app/Contents/Developer/Platforms/WatchOS.platform/Developer/Library/Frameworks -F /Applications/Xcode-16.2.0.app/Contents/Developer/Platforms/WatchOS.platform/Developer/SDKs/WatchOS11.2.sdk/Developer/Library/Frameworks -no-color-diagnostics -enable-testing -g -debug-info-format\=dwarf -dwarf-version\=4 -module-cache-path /Users/admin/builder/spi-builder-workspace/.derivedData/ModuleCache.noindex -swift-version 6 -enforce-exclusivity\=checked -Onone -D SWIFT_PACKAGE -D DEBUG -D Xcode -serialize-debugging-options -const-gather-protocols-file /Users/admin/builder/spi-builder-workspace/.derivedData/Build/Intermediates.noindex/Prefire.build/Debug-watchos/Prefire.build/Objects-normal/arm64_32/Prefire_const_extract_protocols.json -enable-experimental-feature DebugDescriptionMacro -enable-experimental-feature OpaqueTypeErasure -empty-abi-descriptor -plugin-path /Applications/Xcode-16.2.0.app/Contents/Developer/Toolchains/XcodeDefault.xctoolchain/usr/lib/swift/host/plugins/testing -validate-clang-modules-once -clang-build-session-file /Users/admin/builder/spi-builder-workspace/.derivedData/ModuleCache.noindex/Session.modulevalidation -Xcc -working-directory -Xcc /Users/admin/builder/spi-builder-workspace/.swiftpm/xcode -resource-dir /Applications/Xcode-16.2.0.app/Contents/Developer/Toolchains/XcodeDefault.xctoolchain/usr/lib/swift -enable-anonymous-context-mangled-names -file-compilation-dir /Users/admin/builder/spi-builder-workspace/.swiftpm/xcode -Xcc -D_LIBCPP_HARDENING_MODE\=_LIBCPP_HARDENING_MODE_DEBUG -Xcc -ivfsstatcache -Xcc /Users/admin/builder/spi-builder-workspace/.derivedData/SDKStatCaches.noindex/watchos11.2-22S97-8cb5c683f5e64b0ecfc74e8d0065fbf6.sdkstatcache -Xcc -I/Users/admin/builder/spi-builder-workspace/.derivedData/Build/Intermediates.noindex/Prefire.build/Debug-watchos/Prefire.build/swift-overrides.hmap -Xcc -I/Users/admin/builder/spi-builder-workspace/.derivedData/Build/Products/Debug-watchos/include -Xcc -I/Users/admin/builder/spi-builder-workspace/.derivedData/Build/Intermediates.noindex/Prefire.build/Debug-watchos/Prefire.build/DerivedSources-normal/arm64_32 -Xcc -I/Users/admin/builder/spi-builder-workspace/.derivedData/Build/Intermediates.noindex/Prefire.build/Debug-watchos/Prefire.build/DerivedSources/arm64_32 -Xcc -I/Users/admin/builder/spi-builder-workspace/.derivedData/Build/Intermediates.noindex/Prefire.build/Debug-watchos/Prefire.build/DerivedSources -Xcc -DSWIFT_PACKAGE -Xcc -DDEBUG\=1 -module-name Prefire -package-name spi_builder_workspace -frontend-parseable-output -disable-clang-spi -target-sdk-version 11.2 -target-sdk-name watchos11.2 -external-plugin-path /Applications/Xcode-16.2.0.app/Contents/Developer/Platforms/WatchOS.platform/Developer/usr/lib/swift/host/plugins\#/Applications/Xcode-16.2.0.app/Contents/Developer/Platforms/WatchOS.platform/Developer/usr/bin/swift-plugin-server -external-plugin-path /Applications/Xcode-16.2.0.app/Contents/Developer/Platforms/WatchOS.platform/Developer/usr/local/lib/swift/host/plugins\#/Applications/Xcode-16.2.0.app/Contents/Developer/Platforms/WatchOS.platform/Developer/usr/bin/swift-plugin-server -plugin-path /Applications/Xcode-16.2.0.app/Contents/Developer/Toolchains/XcodeDefault.xctoolchain/usr/lib/swift/host/plugins -plugin-path /Applications/Xcode-16.2.0.app/Contents/Developer/Toolchains/XcodeDefault.xctoolchain/usr/local/lib/swift/host/plugins -o /Users/admin/builder/spi-builder-workspace/.derivedData/Build/Intermediates.noindex/Prefire.build/Debug-watchos/Prefire.build/Objects-normal/arm64_32/PrefireSnapshot.o -index-unit-output-path /Prefire.build/Debug-watchos/Prefire.build/Objects-normal/arm64_32/PrefireSnapshot.o -index-store-path /Users/admin/builder/spi-builder-workspace/.derivedData/Index.noindex/DataStore -index-system-modules
SwiftCompile normal arm64_32 /Users/admin/builder/spi-builder-workspace/Sources/Prefire/Preview/PrefireSnapshot.swift (in target 'Prefire' from project 'Prefire')
    cd /Users/admin/builder/spi-builder-workspace/.swiftpm/xcode
    /Applications/Xcode-16.2.0.app/Contents/Developer/Toolchains/XcodeDefault.xctoolchain/usr/bin/swift-frontend -c /Users/admin/builder/spi-builder-workspace/Sources/Prefire/Playbook/LoadingTimeModifier.swift /Users/admin/builder/spi-builder-workspace/Sources/Prefire/Playbook/PlaybookView.swift /Users/admin/builder/spi-builder-workspace/Sources/Prefire/Playbook/Scale.swift /Users/admin/builder/spi-builder-workspace/Sources/Prefire/Playbook/TransformIf.swift /Users/admin/builder/spi-builder-workspace/Sources/Prefire/Preview/PreferenceKeys.swift /Users/admin/builder/spi-builder-workspace/Sources/Prefire/Preview/PrefireProvider.swift -primary-file /Users/admin/builder/spi-builder-workspace/Sources/Prefire/Preview/PrefireSnapshot.swift /Users/admin/builder/spi-builder-workspace/Sources/Prefire/Preview/PreviewLayout+Equatable.swift /Users/admin/builder/spi-builder-workspace/Sources/Prefire/Preview/PreviewModel.swift /Users/admin/builder/spi-builder-workspace/Sources/Prefire/Preview/UIKitRepresentable.swift /Users/admin/builder/spi-builder-workspace/Sources/Prefire/Preview/View+Prefire.swift -emit-dependencies-path /Users/admin/builder/spi-builder-workspace/.derivedData/Build/Intermediates.noindex/Prefire.build/Debug-watchos/Prefire.build/Objects-normal/arm64_32/PrefireSnapshot.d -emit-const-values-path /Users/admin/builder/spi-builder-workspace/.derivedData/Build/Intermediates.noindex/Prefire.build/Debug-watchos/Prefire.build/Objects-normal/arm64_32/PrefireSnapshot.swiftconstvalues -emit-reference-dependencies-path /Users/admin/builder/spi-builder-workspace/.derivedData/Build/Intermediates.noindex/Prefire.build/Debug-watchos/Prefire.build/Objects-normal/arm64_32/PrefireSnapshot.swiftdeps -serialize-diagnostics-path /Users/admin/builder/spi-builder-workspace/.derivedData/Build/Intermediates.noindex/Prefire.build/Debug-watchos/Prefire.build/Objects-normal/arm64_32/PrefireSnapshot.dia -target arm64_32-apple-watchos7.0 -enable-objc-interop -sdk /Applications/Xcode-16.2.0.app/Contents/Developer/Platforms/WatchOS.platform/Developer/SDKs/WatchOS11.2.sdk -I /Users/admin/builder/spi-builder-workspace/.derivedData/Build/Products/Debug-watchos -I /Applications/Xcode-16.2.0.app/Contents/Developer/Platforms/WatchOS.platform/Developer/usr/lib -F /Users/admin/builder/spi-builder-workspace/.derivedData/Build/Products/Debug-watchos -F /Applications/Xcode-16.2.0.app/Contents/Developer/Platforms/WatchOS.platform/Developer/Library/Frameworks -F /Applications/Xcode-16.2.0.app/Contents/Developer/Platforms/WatchOS.platform/Developer/SDKs/WatchOS11.2.sdk/Developer/Library/Frameworks -no-color-diagnostics -enable-testing -g -debug-info-format\=dwarf -dwarf-version\=4 -module-cache-path /Users/admin/builder/spi-builder-workspace/.derivedData/ModuleCache.noindex -swift-version 6 -enforce-exclusivity\=checked -Onone -D SWIFT_PACKAGE -D DEBUG -D Xcode -serialize-debugging-options -const-gather-protocols-file /Users/admin/builder/spi-builder-workspace/.derivedData/Build/Intermediates.noindex/Prefire.build/Debug-watchos/Prefire.build/Objects-normal/arm64_32/Prefire_const_extract_protocols.json -enable-experimental-feature DebugDescriptionMacro -enable-experimental-feature OpaqueTypeErasure -empty-abi-descriptor -plugin-path /Applications/Xcode-16.2.0.app/Contents/Developer/Toolchains/XcodeDefault.xctoolchain/usr/lib/swift/host/plugins/testing -validate-clang-modules-once -clang-build-session-file /Users/admin/builder/spi-builder-workspace/.derivedData/ModuleCache.noindex/Session.modulevalidation -Xcc -working-directory -Xcc /Users/admin/builder/spi-builder-workspace/.swiftpm/xcode -resource-dir /Applications/Xcode-16.2.0.app/Contents/Developer/Toolchains/XcodeDefault.xctoolchain/usr/lib/swift -enable-anonymous-context-mangled-names -file-compilation-dir /Users/admin/builder/spi-builder-workspace/.swiftpm/xcode -Xcc -D_LIBCPP_HARDENING_MODE\=_LIBCPP_HARDENING_MODE_DEBUG -Xcc -ivfsstatcache -Xcc /Users/admin/builder/spi-builder-workspace/.derivedData/SDKStatCaches.noindex/watchos11.2-22S97-8cb5c683f5e64b0ecfc74e8d0065fbf6.sdkstatcache -Xcc -I/Users/admin/builder/spi-builder-workspace/.derivedData/Build/Intermediates.noindex/Prefire.build/Debug-watchos/Prefire.build/swift-overrides.hmap -Xcc -I/Users/admin/builder/spi-builder-workspace/.derivedData/Build/Products/Debug-watchos/include -Xcc -I/Users/admin/builder/spi-builder-workspace/.derivedData/Build/Intermediates.noindex/Prefire.build/Debug-watchos/Prefire.build/DerivedSources-normal/arm64_32 -Xcc -I/Users/admin/builder/spi-builder-workspace/.derivedData/Build/Intermediates.noindex/Prefire.build/Debug-watchos/Prefire.build/DerivedSources/arm64_32 -Xcc -I/Users/admin/builder/spi-builder-workspace/.derivedData/Build/Intermediates.noindex/Prefire.build/Debug-watchos/Prefire.build/DerivedSources -Xcc -DSWIFT_PACKAGE -Xcc -DDEBUG\=1 -module-name Prefire -package-name spi_builder_workspace -frontend-parseable-output -disable-clang-spi -target-sdk-version 11.2 -target-sdk-name watchos11.2 -external-plugin-path /Applications/Xcode-16.2.0.app/Contents/Developer/Platforms/WatchOS.platform/Developer/usr/lib/swift/host/plugins\#/Applications/Xcode-16.2.0.app/Contents/Developer/Platforms/WatchOS.platform/Developer/usr/bin/swift-plugin-server -external-plugin-path /Applications/Xcode-16.2.0.app/Contents/Developer/Platforms/WatchOS.platform/Developer/usr/local/lib/swift/host/plugins\#/Applications/Xcode-16.2.0.app/Contents/Developer/Platforms/WatchOS.platform/Developer/usr/bin/swift-plugin-server -plugin-path /Applications/Xcode-16.2.0.app/Contents/Developer/Toolchains/XcodeDefault.xctoolchain/usr/lib/swift/host/plugins -plugin-path /Applications/Xcode-16.2.0.app/Contents/Developer/Toolchains/XcodeDefault.xctoolchain/usr/local/lib/swift/host/plugins -o /Users/admin/builder/spi-builder-workspace/.derivedData/Build/Intermediates.noindex/Prefire.build/Debug-watchos/Prefire.build/Objects-normal/arm64_32/PrefireSnapshot.o -index-unit-output-path /Prefire.build/Debug-watchos/Prefire.build/Objects-normal/arm64_32/PrefireSnapshot.o -index-store-path /Users/admin/builder/spi-builder-workspace/.derivedData/Index.noindex/DataStore -index-system-modules
SwiftCompile normal arm64_32 Compiling\ View+Prefire.swift /Users/admin/builder/spi-builder-workspace/Sources/Prefire/Preview/View+Prefire.swift (in target 'Prefire' from project 'Prefire')
    cd /Users/admin/builder/spi-builder-workspace/.swiftpm/xcode
    builtin-swiftTaskExecution -- /Applications/Xcode-16.2.0.app/Contents/Developer/Toolchains/XcodeDefault.xctoolchain/usr/bin/swift-frontend -frontend -c /Users/admin/builder/spi-builder-workspace/Sources/Prefire/Playbook/LoadingTimeModifier.swift /Users/admin/builder/spi-builder-workspace/Sources/Prefire/Playbook/PlaybookView.swift /Users/admin/builder/spi-builder-workspace/Sources/Prefire/Playbook/Scale.swift /Users/admin/builder/spi-builder-workspace/Sources/Prefire/Playbook/TransformIf.swift /Users/admin/builder/spi-builder-workspace/Sources/Prefire/Preview/PreferenceKeys.swift /Users/admin/builder/spi-builder-workspace/Sources/Prefire/Preview/PrefireProvider.swift /Users/admin/builder/spi-builder-workspace/Sources/Prefire/Preview/PrefireSnapshot.swift /Users/admin/builder/spi-builder-workspace/Sources/Prefire/Preview/PreviewLayout+Equatable.swift /Users/admin/builder/spi-builder-workspace/Sources/Prefire/Preview/PreviewModel.swift /Users/admin/builder/spi-builder-workspace/Sources/Prefire/Preview/UIKitRepresentable.swift -primary-file /Users/admin/builder/spi-builder-workspace/Sources/Prefire/Preview/View+Prefire.swift -emit-dependencies-path /Users/admin/builder/spi-builder-workspace/.derivedData/Build/Intermediates.noindex/Prefire.build/Debug-watchos/Prefire.build/Objects-normal/arm64_32/View+Prefire.d -emit-const-values-path /Users/admin/builder/spi-builder-workspace/.derivedData/Build/Intermediates.noindex/Prefire.build/Debug-watchos/Prefire.build/Objects-normal/arm64_32/View+Prefire.swiftconstvalues -emit-reference-dependencies-path /Users/admin/builder/spi-builder-workspace/.derivedData/Build/Intermediates.noindex/Prefire.build/Debug-watchos/Prefire.build/Objects-normal/arm64_32/View+Prefire.swiftdeps -serialize-diagnostics-path /Users/admin/builder/spi-builder-workspace/.derivedData/Build/Intermediates.noindex/Prefire.build/Debug-watchos/Prefire.build/Objects-normal/arm64_32/View+Prefire.dia -target arm64_32-apple-watchos7.0 -enable-objc-interop -sdk /Applications/Xcode-16.2.0.app/Contents/Developer/Platforms/WatchOS.platform/Developer/SDKs/WatchOS11.2.sdk -I /Users/admin/builder/spi-builder-workspace/.derivedData/Build/Products/Debug-watchos -I /Applications/Xcode-16.2.0.app/Contents/Developer/Platforms/WatchOS.platform/Developer/usr/lib -F /Users/admin/builder/spi-builder-workspace/.derivedData/Build/Products/Debug-watchos -F /Applications/Xcode-16.2.0.app/Contents/Developer/Platforms/WatchOS.platform/Developer/Library/Frameworks -F /Applications/Xcode-16.2.0.app/Contents/Developer/Platforms/WatchOS.platform/Developer/SDKs/WatchOS11.2.sdk/Developer/Library/Frameworks -no-color-diagnostics -enable-testing -g -debug-info-format\=dwarf -dwarf-version\=4 -module-cache-path /Users/admin/builder/spi-builder-workspace/.derivedData/ModuleCache.noindex -swift-version 6 -enforce-exclusivity\=checked -Onone -D SWIFT_PACKAGE -D DEBUG -D Xcode -serialize-debugging-options -const-gather-protocols-file /Users/admin/builder/spi-builder-workspace/.derivedData/Build/Intermediates.noindex/Prefire.build/Debug-watchos/Prefire.build/Objects-normal/arm64_32/Prefire_const_extract_protocols.json -enable-experimental-feature DebugDescriptionMacro -enable-experimental-feature OpaqueTypeErasure -empty-abi-descriptor -plugin-path /Applications/Xcode-16.2.0.app/Contents/Developer/Toolchains/XcodeDefault.xctoolchain/usr/lib/swift/host/plugins/testing -validate-clang-modules-once -clang-build-session-file /Users/admin/builder/spi-builder-workspace/.derivedData/ModuleCache.noindex/Session.modulevalidation -Xcc -working-directory -Xcc /Users/admin/builder/spi-builder-workspace/.swiftpm/xcode -resource-dir /Applications/Xcode-16.2.0.app/Contents/Developer/Toolchains/XcodeDefault.xctoolchain/usr/lib/swift -enable-anonymous-context-mangled-names -file-compilation-dir /Users/admin/builder/spi-builder-workspace/.swiftpm/xcode -Xcc -D_LIBCPP_HARDENING_MODE\=_LIBCPP_HARDENING_MODE_DEBUG -Xcc -ivfsstatcache -Xcc /Users/admin/builder/spi-builder-workspace/.derivedData/SDKStatCaches.noindex/watchos11.2-22S97-8cb5c683f5e64b0ecfc74e8d0065fbf6.sdkstatcache -Xcc -I/Users/admin/builder/spi-builder-workspace/.derivedData/Build/Intermediates.noindex/Prefire.build/Debug-watchos/Prefire.build/swift-overrides.hmap -Xcc -I/Users/admin/builder/spi-builder-workspace/.derivedData/Build/Products/Debug-watchos/include -Xcc -I/Users/admin/builder/spi-builder-workspace/.derivedData/Build/Intermediates.noindex/Prefire.build/Debug-watchos/Prefire.build/DerivedSources-normal/arm64_32 -Xcc -I/Users/admin/builder/spi-builder-workspace/.derivedData/Build/Intermediates.noindex/Prefire.build/Debug-watchos/Prefire.build/DerivedSources/arm64_32 -Xcc -I/Users/admin/builder/spi-builder-workspace/.derivedData/Build/Intermediates.noindex/Prefire.build/Debug-watchos/Prefire.build/DerivedSources -Xcc -DSWIFT_PACKAGE -Xcc -DDEBUG\=1 -module-name Prefire -package-name spi_builder_workspace -frontend-parseable-output -disable-clang-spi -target-sdk-version 11.2 -target-sdk-name watchos11.2 -external-plugin-path /Applications/Xcode-16.2.0.app/Contents/Developer/Platforms/WatchOS.platform/Developer/usr/lib/swift/host/plugins\#/Applications/Xcode-16.2.0.app/Contents/Developer/Platforms/WatchOS.platform/Developer/usr/bin/swift-plugin-server -external-plugin-path /Applications/Xcode-16.2.0.app/Contents/Developer/Platforms/WatchOS.platform/Developer/usr/local/lib/swift/host/plugins\#/Applications/Xcode-16.2.0.app/Contents/Developer/Platforms/WatchOS.platform/Developer/usr/bin/swift-plugin-server -plugin-path /Applications/Xcode-16.2.0.app/Contents/Developer/Toolchains/XcodeDefault.xctoolchain/usr/lib/swift/host/plugins -plugin-path /Applications/Xcode-16.2.0.app/Contents/Developer/Toolchains/XcodeDefault.xctoolchain/usr/local/lib/swift/host/plugins -o /Users/admin/builder/spi-builder-workspace/.derivedData/Build/Intermediates.noindex/Prefire.build/Debug-watchos/Prefire.build/Objects-normal/arm64_32/View+Prefire.o -index-unit-output-path /Prefire.build/Debug-watchos/Prefire.build/Objects-normal/arm64_32/View+Prefire.o -index-store-path /Users/admin/builder/spi-builder-workspace/.derivedData/Index.noindex/DataStore -index-system-modules
SwiftCompile normal arm64_32 /Users/admin/builder/spi-builder-workspace/Sources/Prefire/Preview/View+Prefire.swift (in target 'Prefire' from project 'Prefire')
    cd /Users/admin/builder/spi-builder-workspace/.swiftpm/xcode
    /Applications/Xcode-16.2.0.app/Contents/Developer/Toolchains/XcodeDefault.xctoolchain/usr/bin/swift-frontend -c /Users/admin/builder/spi-builder-workspace/Sources/Prefire/Playbook/LoadingTimeModifier.swift /Users/admin/builder/spi-builder-workspace/Sources/Prefire/Playbook/PlaybookView.swift /Users/admin/builder/spi-builder-workspace/Sources/Prefire/Playbook/Scale.swift /Users/admin/builder/spi-builder-workspace/Sources/Prefire/Playbook/TransformIf.swift /Users/admin/builder/spi-builder-workspace/Sources/Prefire/Preview/PreferenceKeys.swift /Users/admin/builder/spi-builder-workspace/Sources/Prefire/Preview/PrefireProvider.swift /Users/admin/builder/spi-builder-workspace/Sources/Prefire/Preview/PrefireSnapshot.swift /Users/admin/builder/spi-builder-workspace/Sources/Prefire/Preview/PreviewLayout+Equatable.swift /Users/admin/builder/spi-builder-workspace/Sources/Prefire/Preview/PreviewModel.swift /Users/admin/builder/spi-builder-workspace/Sources/Prefire/Preview/UIKitRepresentable.swift -primary-file /Users/admin/builder/spi-builder-workspace/Sources/Prefire/Preview/View+Prefire.swift -emit-dependencies-path /Users/admin/builder/spi-builder-workspace/.derivedData/Build/Intermediates.noindex/Prefire.build/Debug-watchos/Prefire.build/Objects-normal/arm64_32/View+Prefire.d -emit-const-values-path /Users/admin/builder/spi-builder-workspace/.derivedData/Build/Intermediates.noindex/Prefire.build/Debug-watchos/Prefire.build/Objects-normal/arm64_32/View+Prefire.swiftconstvalues -emit-reference-dependencies-path /Users/admin/builder/spi-builder-workspace/.derivedData/Build/Intermediates.noindex/Prefire.build/Debug-watchos/Prefire.build/Objects-normal/arm64_32/View+Prefire.swiftdeps -serialize-diagnostics-path /Users/admin/builder/spi-builder-workspace/.derivedData/Build/Intermediates.noindex/Prefire.build/Debug-watchos/Prefire.build/Objects-normal/arm64_32/View+Prefire.dia -target arm64_32-apple-watchos7.0 -enable-objc-interop -sdk /Applications/Xcode-16.2.0.app/Contents/Developer/Platforms/WatchOS.platform/Developer/SDKs/WatchOS11.2.sdk -I /Users/admin/builder/spi-builder-workspace/.derivedData/Build/Products/Debug-watchos -I /Applications/Xcode-16.2.0.app/Contents/Developer/Platforms/WatchOS.platform/Developer/usr/lib -F /Users/admin/builder/spi-builder-workspace/.derivedData/Build/Products/Debug-watchos -F /Applications/Xcode-16.2.0.app/Contents/Developer/Platforms/WatchOS.platform/Developer/Library/Frameworks -F /Applications/Xcode-16.2.0.app/Contents/Developer/Platforms/WatchOS.platform/Developer/SDKs/WatchOS11.2.sdk/Developer/Library/Frameworks -no-color-diagnostics -enable-testing -g -debug-info-format\=dwarf -dwarf-version\=4 -module-cache-path /Users/admin/builder/spi-builder-workspace/.derivedData/ModuleCache.noindex -swift-version 6 -enforce-exclusivity\=checked -Onone -D SWIFT_PACKAGE -D DEBUG -D Xcode -serialize-debugging-options -const-gather-protocols-file /Users/admin/builder/spi-builder-workspace/.derivedData/Build/Intermediates.noindex/Prefire.build/Debug-watchos/Prefire.build/Objects-normal/arm64_32/Prefire_const_extract_protocols.json -enable-experimental-feature DebugDescriptionMacro -enable-experimental-feature OpaqueTypeErasure -empty-abi-descriptor -plugin-path /Applications/Xcode-16.2.0.app/Contents/Developer/Toolchains/XcodeDefault.xctoolchain/usr/lib/swift/host/plugins/testing -validate-clang-modules-once -clang-build-session-file /Users/admin/builder/spi-builder-workspace/.derivedData/ModuleCache.noindex/Session.modulevalidation -Xcc -working-directory -Xcc /Users/admin/builder/spi-builder-workspace/.swiftpm/xcode -resource-dir /Applications/Xcode-16.2.0.app/Contents/Developer/Toolchains/XcodeDefault.xctoolchain/usr/lib/swift -enable-anonymous-context-mangled-names -file-compilation-dir /Users/admin/builder/spi-builder-workspace/.swiftpm/xcode -Xcc -D_LIBCPP_HARDENING_MODE\=_LIBCPP_HARDENING_MODE_DEBUG -Xcc -ivfsstatcache -Xcc /Users/admin/builder/spi-builder-workspace/.derivedData/SDKStatCaches.noindex/watchos11.2-22S97-8cb5c683f5e64b0ecfc74e8d0065fbf6.sdkstatcache -Xcc -I/Users/admin/builder/spi-builder-workspace/.derivedData/Build/Intermediates.noindex/Prefire.build/Debug-watchos/Prefire.build/swift-overrides.hmap -Xcc -I/Users/admin/builder/spi-builder-workspace/.derivedData/Build/Products/Debug-watchos/include -Xcc -I/Users/admin/builder/spi-builder-workspace/.derivedData/Build/Intermediates.noindex/Prefire.build/Debug-watchos/Prefire.build/DerivedSources-normal/arm64_32 -Xcc -I/Users/admin/builder/spi-builder-workspace/.derivedData/Build/Intermediates.noindex/Prefire.build/Debug-watchos/Prefire.build/DerivedSources/arm64_32 -Xcc -I/Users/admin/builder/spi-builder-workspace/.derivedData/Build/Intermediates.noindex/Prefire.build/Debug-watchos/Prefire.build/DerivedSources -Xcc -DSWIFT_PACKAGE -Xcc -DDEBUG\=1 -module-name Prefire -package-name spi_builder_workspace -frontend-parseable-output -disable-clang-spi -target-sdk-version 11.2 -target-sdk-name watchos11.2 -external-plugin-path /Applications/Xcode-16.2.0.app/Contents/Developer/Platforms/WatchOS.platform/Developer/usr/lib/swift/host/plugins\#/Applications/Xcode-16.2.0.app/Contents/Developer/Platforms/WatchOS.platform/Developer/usr/bin/swift-plugin-server -external-plugin-path /Applications/Xcode-16.2.0.app/Contents/Developer/Platforms/WatchOS.platform/Developer/usr/local/lib/swift/host/plugins\#/Applications/Xcode-16.2.0.app/Contents/Developer/Platforms/WatchOS.platform/Developer/usr/bin/swift-plugin-server -plugin-path /Applications/Xcode-16.2.0.app/Contents/Developer/Toolchains/XcodeDefault.xctoolchain/usr/lib/swift/host/plugins -plugin-path /Applications/Xcode-16.2.0.app/Contents/Developer/Toolchains/XcodeDefault.xctoolchain/usr/local/lib/swift/host/plugins -o /Users/admin/builder/spi-builder-workspace/.derivedData/Build/Intermediates.noindex/Prefire.build/Debug-watchos/Prefire.build/Objects-normal/arm64_32/View+Prefire.o -index-unit-output-path /Prefire.build/Debug-watchos/Prefire.build/Objects-normal/arm64_32/View+Prefire.o -index-store-path /Users/admin/builder/spi-builder-workspace/.derivedData/Index.noindex/DataStore -index-system-modules
SwiftCompile normal arm64_32 Compiling\ UIKitRepresentable.swift /Users/admin/builder/spi-builder-workspace/Sources/Prefire/Preview/UIKitRepresentable.swift (in target 'Prefire' from project 'Prefire')
    cd /Users/admin/builder/spi-builder-workspace/.swiftpm/xcode
    builtin-swiftTaskExecution -- /Applications/Xcode-16.2.0.app/Contents/Developer/Toolchains/XcodeDefault.xctoolchain/usr/bin/swift-frontend -frontend -c /Users/admin/builder/spi-builder-workspace/Sources/Prefire/Playbook/LoadingTimeModifier.swift /Users/admin/builder/spi-builder-workspace/Sources/Prefire/Playbook/PlaybookView.swift /Users/admin/builder/spi-builder-workspace/Sources/Prefire/Playbook/Scale.swift /Users/admin/builder/spi-builder-workspace/Sources/Prefire/Playbook/TransformIf.swift /Users/admin/builder/spi-builder-workspace/Sources/Prefire/Preview/PreferenceKeys.swift /Users/admin/builder/spi-builder-workspace/Sources/Prefire/Preview/PrefireProvider.swift /Users/admin/builder/spi-builder-workspace/Sources/Prefire/Preview/PrefireSnapshot.swift /Users/admin/builder/spi-builder-workspace/Sources/Prefire/Preview/PreviewLayout+Equatable.swift /Users/admin/builder/spi-builder-workspace/Sources/Prefire/Preview/PreviewModel.swift -primary-file /Users/admin/builder/spi-builder-workspace/Sources/Prefire/Preview/UIKitRepresentable.swift /Users/admin/builder/spi-builder-workspace/Sources/Prefire/Preview/View+Prefire.swift -emit-dependencies-path /Users/admin/builder/spi-builder-workspace/.derivedData/Build/Intermediates.noindex/Prefire.build/Debug-watchos/Prefire.build/Objects-normal/arm64_32/UIKitRepresentable.d -emit-const-values-path /Users/admin/builder/spi-builder-workspace/.derivedData/Build/Intermediates.noindex/Prefire.build/Debug-watchos/Prefire.build/Objects-normal/arm64_32/UIKitRepresentable.swiftconstvalues -emit-reference-dependencies-path /Users/admin/builder/spi-builder-workspace/.derivedData/Build/Intermediates.noindex/Prefire.build/Debug-watchos/Prefire.build/Objects-normal/arm64_32/UIKitRepresentable.swiftdeps -serialize-diagnostics-path /Users/admin/builder/spi-builder-workspace/.derivedData/Build/Intermediates.noindex/Prefire.build/Debug-watchos/Prefire.build/Objects-normal/arm64_32/UIKitRepresentable.dia -target arm64_32-apple-watchos7.0 -enable-objc-interop -sdk /Applications/Xcode-16.2.0.app/Contents/Developer/Platforms/WatchOS.platform/Developer/SDKs/WatchOS11.2.sdk -I /Users/admin/builder/spi-builder-workspace/.derivedData/Build/Products/Debug-watchos -I /Applications/Xcode-16.2.0.app/Contents/Developer/Platforms/WatchOS.platform/Developer/usr/lib -F /Users/admin/builder/spi-builder-workspace/.derivedData/Build/Products/Debug-watchos -F /Applications/Xcode-16.2.0.app/Contents/Developer/Platforms/WatchOS.platform/Developer/Library/Frameworks -F /Applications/Xcode-16.2.0.app/Contents/Developer/Platforms/WatchOS.platform/Developer/SDKs/WatchOS11.2.sdk/Developer/Library/Frameworks -no-color-diagnostics -enable-testing -g -debug-info-format\=dwarf -dwarf-version\=4 -module-cache-path /Users/admin/builder/spi-builder-workspace/.derivedData/ModuleCache.noindex -swift-version 6 -enforce-exclusivity\=checked -Onone -D SWIFT_PACKAGE -D DEBUG -D Xcode -serialize-debugging-options -const-gather-protocols-file /Users/admin/builder/spi-builder-workspace/.derivedData/Build/Intermediates.noindex/Prefire.build/Debug-watchos/Prefire.build/Objects-normal/arm64_32/Prefire_const_extract_protocols.json -enable-experimental-feature DebugDescriptionMacro -enable-experimental-feature OpaqueTypeErasure -empty-abi-descriptor -plugin-path /Applications/Xcode-16.2.0.app/Contents/Developer/Toolchains/XcodeDefault.xctoolchain/usr/lib/swift/host/plugins/testing -validate-clang-modules-once -clang-build-session-file /Users/admin/builder/spi-builder-workspace/.derivedData/ModuleCache.noindex/Session.modulevalidation -Xcc -working-directory -Xcc /Users/admin/builder/spi-builder-workspace/.swiftpm/xcode -resource-dir /Applications/Xcode-16.2.0.app/Contents/Developer/Toolchains/XcodeDefault.xctoolchain/usr/lib/swift -enable-anonymous-context-mangled-names -file-compilation-dir /Users/admin/builder/spi-builder-workspace/.swiftpm/xcode -Xcc -D_LIBCPP_HARDENING_MODE\=_LIBCPP_HARDENING_MODE_DEBUG -Xcc -ivfsstatcache -Xcc /Users/admin/builder/spi-builder-workspace/.derivedData/SDKStatCaches.noindex/watchos11.2-22S97-8cb5c683f5e64b0ecfc74e8d0065fbf6.sdkstatcache -Xcc -I/Users/admin/builder/spi-builder-workspace/.derivedData/Build/Intermediates.noindex/Prefire.build/Debug-watchos/Prefire.build/swift-overrides.hmap -Xcc -I/Users/admin/builder/spi-builder-workspace/.derivedData/Build/Products/Debug-watchos/include -Xcc -I/Users/admin/builder/spi-builder-workspace/.derivedData/Build/Intermediates.noindex/Prefire.build/Debug-watchos/Prefire.build/DerivedSources-normal/arm64_32 -Xcc -I/Users/admin/builder/spi-builder-workspace/.derivedData/Build/Intermediates.noindex/Prefire.build/Debug-watchos/Prefire.build/DerivedSources/arm64_32 -Xcc -I/Users/admin/builder/spi-builder-workspace/.derivedData/Build/Intermediates.noindex/Prefire.build/Debug-watchos/Prefire.build/DerivedSources -Xcc -DSWIFT_PACKAGE -Xcc -DDEBUG\=1 -module-name Prefire -package-name spi_builder_workspace -frontend-parseable-output -disable-clang-spi -target-sdk-version 11.2 -target-sdk-name watchos11.2 -external-plugin-path /Applications/Xcode-16.2.0.app/Contents/Developer/Platforms/WatchOS.platform/Developer/usr/lib/swift/host/plugins\#/Applications/Xcode-16.2.0.app/Contents/Developer/Platforms/WatchOS.platform/Developer/usr/bin/swift-plugin-server -external-plugin-path /Applications/Xcode-16.2.0.app/Contents/Developer/Platforms/WatchOS.platform/Developer/usr/local/lib/swift/host/plugins\#/Applications/Xcode-16.2.0.app/Contents/Developer/Platforms/WatchOS.platform/Developer/usr/bin/swift-plugin-server -plugin-path /Applications/Xcode-16.2.0.app/Contents/Developer/Toolchains/XcodeDefault.xctoolchain/usr/lib/swift/host/plugins -plugin-path /Applications/Xcode-16.2.0.app/Contents/Developer/Toolchains/XcodeDefault.xctoolchain/usr/local/lib/swift/host/plugins -o /Users/admin/builder/spi-builder-workspace/.derivedData/Build/Intermediates.noindex/Prefire.build/Debug-watchos/Prefire.build/Objects-normal/arm64_32/UIKitRepresentable.o -index-unit-output-path /Prefire.build/Debug-watchos/Prefire.build/Objects-normal/arm64_32/UIKitRepresentable.o -index-store-path /Users/admin/builder/spi-builder-workspace/.derivedData/Index.noindex/DataStore -index-system-modules
SwiftCompile normal arm64_32 /Users/admin/builder/spi-builder-workspace/Sources/Prefire/Preview/UIKitRepresentable.swift (in target 'Prefire' from project 'Prefire')
    cd /Users/admin/builder/spi-builder-workspace/.swiftpm/xcode
    /Applications/Xcode-16.2.0.app/Contents/Developer/Toolchains/XcodeDefault.xctoolchain/usr/bin/swift-frontend -c /Users/admin/builder/spi-builder-workspace/Sources/Prefire/Playbook/LoadingTimeModifier.swift /Users/admin/builder/spi-builder-workspace/Sources/Prefire/Playbook/PlaybookView.swift /Users/admin/builder/spi-builder-workspace/Sources/Prefire/Playbook/Scale.swift /Users/admin/builder/spi-builder-workspace/Sources/Prefire/Playbook/TransformIf.swift /Users/admin/builder/spi-builder-workspace/Sources/Prefire/Preview/PreferenceKeys.swift /Users/admin/builder/spi-builder-workspace/Sources/Prefire/Preview/PrefireProvider.swift /Users/admin/builder/spi-builder-workspace/Sources/Prefire/Preview/PrefireSnapshot.swift /Users/admin/builder/spi-builder-workspace/Sources/Prefire/Preview/PreviewLayout+Equatable.swift /Users/admin/builder/spi-builder-workspace/Sources/Prefire/Preview/PreviewModel.swift -primary-file /Users/admin/builder/spi-builder-workspace/Sources/Prefire/Preview/UIKitRepresentable.swift /Users/admin/builder/spi-builder-workspace/Sources/Prefire/Preview/View+Prefire.swift -emit-dependencies-path /Users/admin/builder/spi-builder-workspace/.derivedData/Build/Intermediates.noindex/Prefire.build/Debug-watchos/Prefire.build/Objects-normal/arm64_32/UIKitRepresentable.d -emit-const-values-path /Users/admin/builder/spi-builder-workspace/.derivedData/Build/Intermediates.noindex/Prefire.build/Debug-watchos/Prefire.build/Objects-normal/arm64_32/UIKitRepresentable.swiftconstvalues -emit-reference-dependencies-path /Users/admin/builder/spi-builder-workspace/.derivedData/Build/Intermediates.noindex/Prefire.build/Debug-watchos/Prefire.build/Objects-normal/arm64_32/UIKitRepresentable.swiftdeps -serialize-diagnostics-path /Users/admin/builder/spi-builder-workspace/.derivedData/Build/Intermediates.noindex/Prefire.build/Debug-watchos/Prefire.build/Objects-normal/arm64_32/UIKitRepresentable.dia -target arm64_32-apple-watchos7.0 -enable-objc-interop -sdk /Applications/Xcode-16.2.0.app/Contents/Developer/Platforms/WatchOS.platform/Developer/SDKs/WatchOS11.2.sdk -I /Users/admin/builder/spi-builder-workspace/.derivedData/Build/Products/Debug-watchos -I /Applications/Xcode-16.2.0.app/Contents/Developer/Platforms/WatchOS.platform/Developer/usr/lib -F /Users/admin/builder/spi-builder-workspace/.derivedData/Build/Products/Debug-watchos -F /Applications/Xcode-16.2.0.app/Contents/Developer/Platforms/WatchOS.platform/Developer/Library/Frameworks -F /Applications/Xcode-16.2.0.app/Contents/Developer/Platforms/WatchOS.platform/Developer/SDKs/WatchOS11.2.sdk/Developer/Library/Frameworks -no-color-diagnostics -enable-testing -g -debug-info-format\=dwarf -dwarf-version\=4 -module-cache-path /Users/admin/builder/spi-builder-workspace/.derivedData/ModuleCache.noindex -swift-version 6 -enforce-exclusivity\=checked -Onone -D SWIFT_PACKAGE -D DEBUG -D Xcode -serialize-debugging-options -const-gather-protocols-file /Users/admin/builder/spi-builder-workspace/.derivedData/Build/Intermediates.noindex/Prefire.build/Debug-watchos/Prefire.build/Objects-normal/arm64_32/Prefire_const_extract_protocols.json -enable-experimental-feature DebugDescriptionMacro -enable-experimental-feature OpaqueTypeErasure -empty-abi-descriptor -plugin-path /Applications/Xcode-16.2.0.app/Contents/Developer/Toolchains/XcodeDefault.xctoolchain/usr/lib/swift/host/plugins/testing -validate-clang-modules-once -clang-build-session-file /Users/admin/builder/spi-builder-workspace/.derivedData/ModuleCache.noindex/Session.modulevalidation -Xcc -working-directory -Xcc /Users/admin/builder/spi-builder-workspace/.swiftpm/xcode -resource-dir /Applications/Xcode-16.2.0.app/Contents/Developer/Toolchains/XcodeDefault.xctoolchain/usr/lib/swift -enable-anonymous-context-mangled-names -file-compilation-dir /Users/admin/builder/spi-builder-workspace/.swiftpm/xcode -Xcc -D_LIBCPP_HARDENING_MODE\=_LIBCPP_HARDENING_MODE_DEBUG -Xcc -ivfsstatcache -Xcc /Users/admin/builder/spi-builder-workspace/.derivedData/SDKStatCaches.noindex/watchos11.2-22S97-8cb5c683f5e64b0ecfc74e8d0065fbf6.sdkstatcache -Xcc -I/Users/admin/builder/spi-builder-workspace/.derivedData/Build/Intermediates.noindex/Prefire.build/Debug-watchos/Prefire.build/swift-overrides.hmap -Xcc -I/Users/admin/builder/spi-builder-workspace/.derivedData/Build/Products/Debug-watchos/include -Xcc -I/Users/admin/builder/spi-builder-workspace/.derivedData/Build/Intermediates.noindex/Prefire.build/Debug-watchos/Prefire.build/DerivedSources-normal/arm64_32 -Xcc -I/Users/admin/builder/spi-builder-workspace/.derivedData/Build/Intermediates.noindex/Prefire.build/Debug-watchos/Prefire.build/DerivedSources/arm64_32 -Xcc -I/Users/admin/builder/spi-builder-workspace/.derivedData/Build/Intermediates.noindex/Prefire.build/Debug-watchos/Prefire.build/DerivedSources -Xcc -DSWIFT_PACKAGE -Xcc -DDEBUG\=1 -module-name Prefire -package-name spi_builder_workspace -frontend-parseable-output -disable-clang-spi -target-sdk-version 11.2 -target-sdk-name watchos11.2 -external-plugin-path /Applications/Xcode-16.2.0.app/Contents/Developer/Platforms/WatchOS.platform/Developer/usr/lib/swift/host/plugins\#/Applications/Xcode-16.2.0.app/Contents/Developer/Platforms/WatchOS.platform/Developer/usr/bin/swift-plugin-server -external-plugin-path /Applications/Xcode-16.2.0.app/Contents/Developer/Platforms/WatchOS.platform/Developer/usr/local/lib/swift/host/plugins\#/Applications/Xcode-16.2.0.app/Contents/Developer/Platforms/WatchOS.platform/Developer/usr/bin/swift-plugin-server -plugin-path /Applications/Xcode-16.2.0.app/Contents/Developer/Toolchains/XcodeDefault.xctoolchain/usr/lib/swift/host/plugins -plugin-path /Applications/Xcode-16.2.0.app/Contents/Developer/Toolchains/XcodeDefault.xctoolchain/usr/local/lib/swift/host/plugins -o /Users/admin/builder/spi-builder-workspace/.derivedData/Build/Intermediates.noindex/Prefire.build/Debug-watchos/Prefire.build/Objects-normal/arm64_32/UIKitRepresentable.o -index-unit-output-path /Prefire.build/Debug-watchos/Prefire.build/Objects-normal/arm64_32/UIKitRepresentable.o -index-store-path /Users/admin/builder/spi-builder-workspace/.derivedData/Index.noindex/DataStore -index-system-modules
SwiftCompile normal arm64_32 Compiling\ PreviewModel.swift /Users/admin/builder/spi-builder-workspace/Sources/Prefire/Preview/PreviewModel.swift (in target 'Prefire' from project 'Prefire')
    cd /Users/admin/builder/spi-builder-workspace/.swiftpm/xcode
    builtin-swiftTaskExecution -- /Applications/Xcode-16.2.0.app/Contents/Developer/Toolchains/XcodeDefault.xctoolchain/usr/bin/swift-frontend -frontend -c /Users/admin/builder/spi-builder-workspace/Sources/Prefire/Playbook/LoadingTimeModifier.swift /Users/admin/builder/spi-builder-workspace/Sources/Prefire/Playbook/PlaybookView.swift /Users/admin/builder/spi-builder-workspace/Sources/Prefire/Playbook/Scale.swift /Users/admin/builder/spi-builder-workspace/Sources/Prefire/Playbook/TransformIf.swift /Users/admin/builder/spi-builder-workspace/Sources/Prefire/Preview/PreferenceKeys.swift /Users/admin/builder/spi-builder-workspace/Sources/Prefire/Preview/PrefireProvider.swift /Users/admin/builder/spi-builder-workspace/Sources/Prefire/Preview/PrefireSnapshot.swift /Users/admin/builder/spi-builder-workspace/Sources/Prefire/Preview/PreviewLayout+Equatable.swift -primary-file /Users/admin/builder/spi-builder-workspace/Sources/Prefire/Preview/PreviewModel.swift /Users/admin/builder/spi-builder-workspace/Sources/Prefire/Preview/UIKitRepresentable.swift /Users/admin/builder/spi-builder-workspace/Sources/Prefire/Preview/View+Prefire.swift -emit-dependencies-path /Users/admin/builder/spi-builder-workspace/.derivedData/Build/Intermediates.noindex/Prefire.build/Debug-watchos/Prefire.build/Objects-normal/arm64_32/PreviewModel.d -emit-const-values-path /Users/admin/builder/spi-builder-workspace/.derivedData/Build/Intermediates.noindex/Prefire.build/Debug-watchos/Prefire.build/Objects-normal/arm64_32/PreviewModel.swiftconstvalues -emit-reference-dependencies-path /Users/admin/builder/spi-builder-workspace/.derivedData/Build/Intermediates.noindex/Prefire.build/Debug-watchos/Prefire.build/Objects-normal/arm64_32/PreviewModel.swiftdeps -serialize-diagnostics-path /Users/admin/builder/spi-builder-workspace/.derivedData/Build/Intermediates.noindex/Prefire.build/Debug-watchos/Prefire.build/Objects-normal/arm64_32/PreviewModel.dia -target arm64_32-apple-watchos7.0 -enable-objc-interop -sdk /Applications/Xcode-16.2.0.app/Contents/Developer/Platforms/WatchOS.platform/Developer/SDKs/WatchOS11.2.sdk -I /Users/admin/builder/spi-builder-workspace/.derivedData/Build/Products/Debug-watchos -I /Applications/Xcode-16.2.0.app/Contents/Developer/Platforms/WatchOS.platform/Developer/usr/lib -F /Users/admin/builder/spi-builder-workspace/.derivedData/Build/Products/Debug-watchos -F /Applications/Xcode-16.2.0.app/Contents/Developer/Platforms/WatchOS.platform/Developer/Library/Frameworks -F /Applications/Xcode-16.2.0.app/Contents/Developer/Platforms/WatchOS.platform/Developer/SDKs/WatchOS11.2.sdk/Developer/Library/Frameworks -no-color-diagnostics -enable-testing -g -debug-info-format\=dwarf -dwarf-version\=4 -module-cache-path /Users/admin/builder/spi-builder-workspace/.derivedData/ModuleCache.noindex -swift-version 6 -enforce-exclusivity\=checked -Onone -D SWIFT_PACKAGE -D DEBUG -D Xcode -serialize-debugging-options -const-gather-protocols-file /Users/admin/builder/spi-builder-workspace/.derivedData/Build/Intermediates.noindex/Prefire.build/Debug-watchos/Prefire.build/Objects-normal/arm64_32/Prefire_const_extract_protocols.json -enable-experimental-feature DebugDescriptionMacro -enable-experimental-feature OpaqueTypeErasure -empty-abi-descriptor -plugin-path /Applications/Xcode-16.2.0.app/Contents/Developer/Toolchains/XcodeDefault.xctoolchain/usr/lib/swift/host/plugins/testing -validate-clang-modules-once -clang-build-session-file /Users/admin/builder/spi-builder-workspace/.derivedData/ModuleCache.noindex/Session.modulevalidation -Xcc -working-directory -Xcc /Users/admin/builder/spi-builder-workspace/.swiftpm/xcode -resource-dir /Applications/Xcode-16.2.0.app/Contents/Developer/Toolchains/XcodeDefault.xctoolchain/usr/lib/swift -enable-anonymous-context-mangled-names -file-compilation-dir /Users/admin/builder/spi-builder-workspace/.swiftpm/xcode -Xcc -D_LIBCPP_HARDENING_MODE\=_LIBCPP_HARDENING_MODE_DEBUG -Xcc -ivfsstatcache -Xcc /Users/admin/builder/spi-builder-workspace/.derivedData/SDKStatCaches.noindex/watchos11.2-22S97-8cb5c683f5e64b0ecfc74e8d0065fbf6.sdkstatcache -Xcc -I/Users/admin/builder/spi-builder-workspace/.derivedData/Build/Intermediates.noindex/Prefire.build/Debug-watchos/Prefire.build/swift-overrides.hmap -Xcc -I/Users/admin/builder/spi-builder-workspace/.derivedData/Build/Products/Debug-watchos/include -Xcc -I/Users/admin/builder/spi-builder-workspace/.derivedData/Build/Intermediates.noindex/Prefire.build/Debug-watchos/Prefire.build/DerivedSources-normal/arm64_32 -Xcc -I/Users/admin/builder/spi-builder-workspace/.derivedData/Build/Intermediates.noindex/Prefire.build/Debug-watchos/Prefire.build/DerivedSources/arm64_32 -Xcc -I/Users/admin/builder/spi-builder-workspace/.derivedData/Build/Intermediates.noindex/Prefire.build/Debug-watchos/Prefire.build/DerivedSources -Xcc -DSWIFT_PACKAGE -Xcc -DDEBUG\=1 -module-name Prefire -package-name spi_builder_workspace -frontend-parseable-output -disable-clang-spi -target-sdk-version 11.2 -target-sdk-name watchos11.2 -external-plugin-path /Applications/Xcode-16.2.0.app/Contents/Developer/Platforms/WatchOS.platform/Developer/usr/lib/swift/host/plugins\#/Applications/Xcode-16.2.0.app/Contents/Developer/Platforms/WatchOS.platform/Developer/usr/bin/swift-plugin-server -external-plugin-path /Applications/Xcode-16.2.0.app/Contents/Developer/Platforms/WatchOS.platform/Developer/usr/local/lib/swift/host/plugins\#/Applications/Xcode-16.2.0.app/Contents/Developer/Platforms/WatchOS.platform/Developer/usr/bin/swift-plugin-server -plugin-path /Applications/Xcode-16.2.0.app/Contents/Developer/Toolchains/XcodeDefault.xctoolchain/usr/lib/swift/host/plugins -plugin-path /Applications/Xcode-16.2.0.app/Contents/Developer/Toolchains/XcodeDefault.xctoolchain/usr/local/lib/swift/host/plugins -o /Users/admin/builder/spi-builder-workspace/.derivedData/Build/Intermediates.noindex/Prefire.build/Debug-watchos/Prefire.build/Objects-normal/arm64_32/PreviewModel.o -index-unit-output-path /Prefire.build/Debug-watchos/Prefire.build/Objects-normal/arm64_32/PreviewModel.o -index-store-path /Users/admin/builder/spi-builder-workspace/.derivedData/Index.noindex/DataStore -index-system-modules
SwiftCompile normal arm64_32 /Users/admin/builder/spi-builder-workspace/Sources/Prefire/Preview/PreviewModel.swift (in target 'Prefire' from project 'Prefire')
    cd /Users/admin/builder/spi-builder-workspace/.swiftpm/xcode
    /Applications/Xcode-16.2.0.app/Contents/Developer/Toolchains/XcodeDefault.xctoolchain/usr/bin/swift-frontend -c /Users/admin/builder/spi-builder-workspace/Sources/Prefire/Playbook/LoadingTimeModifier.swift /Users/admin/builder/spi-builder-workspace/Sources/Prefire/Playbook/PlaybookView.swift /Users/admin/builder/spi-builder-workspace/Sources/Prefire/Playbook/Scale.swift /Users/admin/builder/spi-builder-workspace/Sources/Prefire/Playbook/TransformIf.swift /Users/admin/builder/spi-builder-workspace/Sources/Prefire/Preview/PreferenceKeys.swift /Users/admin/builder/spi-builder-workspace/Sources/Prefire/Preview/PrefireProvider.swift /Users/admin/builder/spi-builder-workspace/Sources/Prefire/Preview/PrefireSnapshot.swift /Users/admin/builder/spi-builder-workspace/Sources/Prefire/Preview/PreviewLayout+Equatable.swift -primary-file /Users/admin/builder/spi-builder-workspace/Sources/Prefire/Preview/PreviewModel.swift /Users/admin/builder/spi-builder-workspace/Sources/Prefire/Preview/UIKitRepresentable.swift /Users/admin/builder/spi-builder-workspace/Sources/Prefire/Preview/View+Prefire.swift -emit-dependencies-path /Users/admin/builder/spi-builder-workspace/.derivedData/Build/Intermediates.noindex/Prefire.build/Debug-watchos/Prefire.build/Objects-normal/arm64_32/PreviewModel.d -emit-const-values-path /Users/admin/builder/spi-builder-workspace/.derivedData/Build/Intermediates.noindex/Prefire.build/Debug-watchos/Prefire.build/Objects-normal/arm64_32/PreviewModel.swiftconstvalues -emit-reference-dependencies-path /Users/admin/builder/spi-builder-workspace/.derivedData/Build/Intermediates.noindex/Prefire.build/Debug-watchos/Prefire.build/Objects-normal/arm64_32/PreviewModel.swiftdeps -serialize-diagnostics-path /Users/admin/builder/spi-builder-workspace/.derivedData/Build/Intermediates.noindex/Prefire.build/Debug-watchos/Prefire.build/Objects-normal/arm64_32/PreviewModel.dia -target arm64_32-apple-watchos7.0 -enable-objc-interop -sdk /Applications/Xcode-16.2.0.app/Contents/Developer/Platforms/WatchOS.platform/Developer/SDKs/WatchOS11.2.sdk -I /Users/admin/builder/spi-builder-workspace/.derivedData/Build/Products/Debug-watchos -I /Applications/Xcode-16.2.0.app/Contents/Developer/Platforms/WatchOS.platform/Developer/usr/lib -F /Users/admin/builder/spi-builder-workspace/.derivedData/Build/Products/Debug-watchos -F /Applications/Xcode-16.2.0.app/Contents/Developer/Platforms/WatchOS.platform/Developer/Library/Frameworks -F /Applications/Xcode-16.2.0.app/Contents/Developer/Platforms/WatchOS.platform/Developer/SDKs/WatchOS11.2.sdk/Developer/Library/Frameworks -no-color-diagnostics -enable-testing -g -debug-info-format\=dwarf -dwarf-version\=4 -module-cache-path /Users/admin/builder/spi-builder-workspace/.derivedData/ModuleCache.noindex -swift-version 6 -enforce-exclusivity\=checked -Onone -D SWIFT_PACKAGE -D DEBUG -D Xcode -serialize-debugging-options -const-gather-protocols-file /Users/admin/builder/spi-builder-workspace/.derivedData/Build/Intermediates.noindex/Prefire.build/Debug-watchos/Prefire.build/Objects-normal/arm64_32/Prefire_const_extract_protocols.json -enable-experimental-feature DebugDescriptionMacro -enable-experimental-feature OpaqueTypeErasure -empty-abi-descriptor -plugin-path /Applications/Xcode-16.2.0.app/Contents/Developer/Toolchains/XcodeDefault.xctoolchain/usr/lib/swift/host/plugins/testing -validate-clang-modules-once -clang-build-session-file /Users/admin/builder/spi-builder-workspace/.derivedData/ModuleCache.noindex/Session.modulevalidation -Xcc -working-directory -Xcc /Users/admin/builder/spi-builder-workspace/.swiftpm/xcode -resource-dir /Applications/Xcode-16.2.0.app/Contents/Developer/Toolchains/XcodeDefault.xctoolchain/usr/lib/swift -enable-anonymous-context-mangled-names -file-compilation-dir /Users/admin/builder/spi-builder-workspace/.swiftpm/xcode -Xcc -D_LIBCPP_HARDENING_MODE\=_LIBCPP_HARDENING_MODE_DEBUG -Xcc -ivfsstatcache -Xcc /Users/admin/builder/spi-builder-workspace/.derivedData/SDKStatCaches.noindex/watchos11.2-22S97-8cb5c683f5e64b0ecfc74e8d0065fbf6.sdkstatcache -Xcc -I/Users/admin/builder/spi-builder-workspace/.derivedData/Build/Intermediates.noindex/Prefire.build/Debug-watchos/Prefire.build/swift-overrides.hmap -Xcc -I/Users/admin/builder/spi-builder-workspace/.derivedData/Build/Products/Debug-watchos/include -Xcc -I/Users/admin/builder/spi-builder-workspace/.derivedData/Build/Intermediates.noindex/Prefire.build/Debug-watchos/Prefire.build/DerivedSources-normal/arm64_32 -Xcc -I/Users/admin/builder/spi-builder-workspace/.derivedData/Build/Intermediates.noindex/Prefire.build/Debug-watchos/Prefire.build/DerivedSources/arm64_32 -Xcc -I/Users/admin/builder/spi-builder-workspace/.derivedData/Build/Intermediates.noindex/Prefire.build/Debug-watchos/Prefire.build/DerivedSources -Xcc -DSWIFT_PACKAGE -Xcc -DDEBUG\=1 -module-name Prefire -package-name spi_builder_workspace -frontend-parseable-output -disable-clang-spi -target-sdk-version 11.2 -target-sdk-name watchos11.2 -external-plugin-path /Applications/Xcode-16.2.0.app/Contents/Developer/Platforms/WatchOS.platform/Developer/usr/lib/swift/host/plugins\#/Applications/Xcode-16.2.0.app/Contents/Developer/Platforms/WatchOS.platform/Developer/usr/bin/swift-plugin-server -external-plugin-path /Applications/Xcode-16.2.0.app/Contents/Developer/Platforms/WatchOS.platform/Developer/usr/local/lib/swift/host/plugins\#/Applications/Xcode-16.2.0.app/Contents/Developer/Platforms/WatchOS.platform/Developer/usr/bin/swift-plugin-server -plugin-path /Applications/Xcode-16.2.0.app/Contents/Developer/Toolchains/XcodeDefault.xctoolchain/usr/lib/swift/host/plugins -plugin-path /Applications/Xcode-16.2.0.app/Contents/Developer/Toolchains/XcodeDefault.xctoolchain/usr/local/lib/swift/host/plugins -o /Users/admin/builder/spi-builder-workspace/.derivedData/Build/Intermediates.noindex/Prefire.build/Debug-watchos/Prefire.build/Objects-normal/arm64_32/PreviewModel.o -index-unit-output-path /Prefire.build/Debug-watchos/Prefire.build/Objects-normal/arm64_32/PreviewModel.o -index-store-path /Users/admin/builder/spi-builder-workspace/.derivedData/Index.noindex/DataStore -index-system-modules
SwiftEmitModule normal armv7k Emitting\ module\ for\ Prefire (in target 'Prefire' from project 'Prefire')
    cd /Users/admin/builder/spi-builder-workspace/.swiftpm/xcode
    builtin-swiftTaskExecution -- /Applications/Xcode-16.2.0.app/Contents/Developer/Toolchains/XcodeDefault.xctoolchain/usr/bin/swift-frontend -frontend -emit-module -experimental-skip-non-inlinable-function-bodies-without-types /Users/admin/builder/spi-builder-workspace/Sources/Prefire/Playbook/LoadingTimeModifier.swift /Users/admin/builder/spi-builder-workspace/Sources/Prefire/Playbook/PlaybookView.swift /Users/admin/builder/spi-builder-workspace/Sources/Prefire/Playbook/Scale.swift /Users/admin/builder/spi-builder-workspace/Sources/Prefire/Playbook/TransformIf.swift /Users/admin/builder/spi-builder-workspace/Sources/Prefire/Preview/PreferenceKeys.swift /Users/admin/builder/spi-builder-workspace/Sources/Prefire/Preview/PrefireProvider.swift /Users/admin/builder/spi-builder-workspace/Sources/Prefire/Preview/PrefireSnapshot.swift /Users/admin/builder/spi-builder-workspace/Sources/Prefire/Preview/PreviewLayout+Equatable.swift /Users/admin/builder/spi-builder-workspace/Sources/Prefire/Preview/PreviewModel.swift /Users/admin/builder/spi-builder-workspace/Sources/Prefire/Preview/UIKitRepresentable.swift /Users/admin/builder/spi-builder-workspace/Sources/Prefire/Preview/View+Prefire.swift -target armv7k-apple-watchos7.0 -enable-objc-interop -stack-check -sdk /Applications/Xcode-16.2.0.app/Contents/Developer/Platforms/WatchOS.platform/Developer/SDKs/WatchOS11.2.sdk -I /Users/admin/builder/spi-builder-workspace/.derivedData/Build/Products/Debug-watchos -I /Applications/Xcode-16.2.0.app/Contents/Developer/Platforms/WatchOS.platform/Developer/usr/lib -F /Users/admin/builder/spi-builder-workspace/.derivedData/Build/Products/Debug-watchos -F /Applications/Xcode-16.2.0.app/Contents/Developer/Platforms/WatchOS.platform/Developer/Library/Frameworks -F /Applications/Xcode-16.2.0.app/Contents/Developer/Platforms/WatchOS.platform/Developer/SDKs/WatchOS11.2.sdk/Developer/Library/Frameworks -no-color-diagnostics -enable-testing -g -debug-info-format\=dwarf -dwarf-version\=4 -module-cache-path /Users/admin/builder/spi-builder-workspace/.derivedData/ModuleCache.noindex -swift-version 6 -enforce-exclusivity\=checked -Onone -D SWIFT_PACKAGE -D DEBUG -D Xcode -serialize-debugging-options -const-gather-protocols-file /Users/admin/builder/spi-builder-workspace/.derivedData/Build/Intermediates.noindex/Prefire.build/Debug-watchos/Prefire.build/Objects-normal/armv7k/Prefire_const_extract_protocols.json -enable-experimental-feature DebugDescriptionMacro -enable-experimental-feature OpaqueTypeErasure -empty-abi-descriptor -plugin-path /Applications/Xcode-16.2.0.app/Contents/Developer/Toolchains/XcodeDefault.xctoolchain/usr/lib/swift/host/plugins/testing -validate-clang-modules-once -clang-build-session-file /Users/admin/builder/spi-builder-workspace/.derivedData/ModuleCache.noindex/Session.modulevalidation -Xcc -working-directory -Xcc /Users/admin/builder/spi-builder-workspace/.swiftpm/xcode -resource-dir /Applications/Xcode-16.2.0.app/Contents/Developer/Toolchains/XcodeDefault.xctoolchain/usr/lib/swift -enable-anonymous-context-mangled-names -file-compilation-dir /Users/admin/builder/spi-builder-workspace/.swiftpm/xcode -Xcc -D_LIBCPP_HARDENING_MODE\=_LIBCPP_HARDENING_MODE_DEBUG -Xcc -ivfsstatcache -Xcc /Users/admin/builder/spi-builder-workspace/.derivedData/SDKStatCaches.noindex/watchos11.2-22S97-8cb5c683f5e64b0ecfc74e8d0065fbf6.sdkstatcache -Xcc -I/Users/admin/builder/spi-builder-workspace/.derivedData/Build/Intermediates.noindex/Prefire.build/Debug-watchos/Prefire.build/swift-overrides.hmap -Xcc -I/Users/admin/builder/spi-builder-workspace/.derivedData/Build/Products/Debug-watchos/include -Xcc -I/Users/admin/builder/spi-builder-workspace/.derivedData/Build/Intermediates.noindex/Prefire.build/Debug-watchos/Prefire.build/DerivedSources-normal/armv7k -Xcc -I/Users/admin/builder/spi-builder-workspace/.derivedData/Build/Intermediates.noindex/Prefire.build/Debug-watchos/Prefire.build/DerivedSources/armv7k -Xcc -I/Users/admin/builder/spi-builder-workspace/.derivedData/Build/Intermediates.noindex/Prefire.build/Debug-watchos/Prefire.build/DerivedSources -Xcc -DSWIFT_PACKAGE -Xcc -DDEBUG\=1 -module-name Prefire -package-name spi_builder_workspace -frontend-parseable-output -disable-clang-spi -target-sdk-version 11.2 -target-sdk-name watchos11.2 -external-plugin-path /Applications/Xcode-16.2.0.app/Contents/Developer/Platforms/WatchOS.platform/Developer/usr/lib/swift/host/plugins\#/Applications/Xcode-16.2.0.app/Contents/Developer/Platforms/WatchOS.platform/Developer/usr/bin/swift-plugin-server -external-plugin-path /Applications/Xcode-16.2.0.app/Contents/Developer/Platforms/WatchOS.platform/Developer/usr/local/lib/swift/host/plugins\#/Applications/Xcode-16.2.0.app/Contents/Developer/Platforms/WatchOS.platform/Developer/usr/bin/swift-plugin-server -plugin-path /Applications/Xcode-16.2.0.app/Contents/Developer/Toolchains/XcodeDefault.xctoolchain/usr/lib/swift/host/plugins -plugin-path /Applications/Xcode-16.2.0.app/Contents/Developer/Toolchains/XcodeDefault.xctoolchain/usr/local/lib/swift/host/plugins -emit-module-doc-path /Users/admin/builder/spi-builder-workspace/.derivedData/Build/Intermediates.noindex/Prefire.build/Debug-watchos/Prefire.build/Objects-normal/armv7k/Prefire.swiftdoc -emit-module-source-info-path /Users/admin/builder/spi-builder-workspace/.derivedData/Build/Intermediates.noindex/Prefire.build/Debug-watchos/Prefire.build/Objects-normal/armv7k/Prefire.swiftsourceinfo -emit-objc-header-path /Users/admin/builder/spi-builder-workspace/.derivedData/Build/Intermediates.noindex/Prefire.build/Debug-watchos/Prefire.build/Objects-normal/armv7k/Prefire-Swift.h -serialize-diagnostics-path /Users/admin/builder/spi-builder-workspace/.derivedData/Build/Intermediates.noindex/Prefire.build/Debug-watchos/Prefire.build/Objects-normal/armv7k/Prefire-master-emit-module.dia -emit-dependencies-path /Users/admin/builder/spi-builder-workspace/.derivedData/Build/Intermediates.noindex/Prefire.build/Debug-watchos/Prefire.build/Objects-normal/armv7k/Prefire-master-emit-module.d -o /Users/admin/builder/spi-builder-workspace/.derivedData/Build/Intermediates.noindex/Prefire.build/Debug-watchos/Prefire.build/Objects-normal/armv7k/Prefire.swiftmodule -emit-abi-descriptor-path /Users/admin/builder/spi-builder-workspace/.derivedData/Build/Intermediates.noindex/Prefire.build/Debug-watchos/Prefire.build/Objects-normal/armv7k/Prefire.abi.json
EmitSwiftModule normal armv7k (in target 'Prefire' from project 'Prefire')
    cd /Users/admin/builder/spi-builder-workspace/.swiftpm/xcode
    /Applications/Xcode-16.2.0.app/Contents/Developer/Toolchains/XcodeDefault.xctoolchain/usr/bin/swift-frontend -emit-module -experimental-skip-non-inlinable-function-bodies-without-types /Users/admin/builder/spi-builder-workspace/Sources/Prefire/Playbook/LoadingTimeModifier.swift /Users/admin/builder/spi-builder-workspace/Sources/Prefire/Playbook/PlaybookView.swift /Users/admin/builder/spi-builder-workspace/Sources/Prefire/Playbook/Scale.swift /Users/admin/builder/spi-builder-workspace/Sources/Prefire/Playbook/TransformIf.swift /Users/admin/builder/spi-builder-workspace/Sources/Prefire/Preview/PreferenceKeys.swift /Users/admin/builder/spi-builder-workspace/Sources/Prefire/Preview/PrefireProvider.swift /Users/admin/builder/spi-builder-workspace/Sources/Prefire/Preview/PrefireSnapshot.swift /Users/admin/builder/spi-builder-workspace/Sources/Prefire/Preview/PreviewLayout+Equatable.swift /Users/admin/builder/spi-builder-workspace/Sources/Prefire/Preview/PreviewModel.swift /Users/admin/builder/spi-builder-workspace/Sources/Prefire/Preview/UIKitRepresentable.swift /Users/admin/builder/spi-builder-workspace/Sources/Prefire/Preview/View+Prefire.swift -target armv7k-apple-watchos7.0 -enable-objc-interop -stack-check -sdk /Applications/Xcode-16.2.0.app/Contents/Developer/Platforms/WatchOS.platform/Developer/SDKs/WatchOS11.2.sdk -I /Users/admin/builder/spi-builder-workspace/.derivedData/Build/Products/Debug-watchos -I /Applications/Xcode-16.2.0.app/Contents/Developer/Platforms/WatchOS.platform/Developer/usr/lib -F /Users/admin/builder/spi-builder-workspace/.derivedData/Build/Products/Debug-watchos -F /Applications/Xcode-16.2.0.app/Contents/Developer/Platforms/WatchOS.platform/Developer/Library/Frameworks -F /Applications/Xcode-16.2.0.app/Contents/Developer/Platforms/WatchOS.platform/Developer/SDKs/WatchOS11.2.sdk/Developer/Library/Frameworks -no-color-diagnostics -enable-testing -g -debug-info-format\=dwarf -dwarf-version\=4 -module-cache-path /Users/admin/builder/spi-builder-workspace/.derivedData/ModuleCache.noindex -swift-version 6 -enforce-exclusivity\=checked -Onone -D SWIFT_PACKAGE -D DEBUG -D Xcode -serialize-debugging-options -const-gather-protocols-file /Users/admin/builder/spi-builder-workspace/.derivedData/Build/Intermediates.noindex/Prefire.build/Debug-watchos/Prefire.build/Objects-normal/armv7k/Prefire_const_extract_protocols.json -enable-experimental-feature DebugDescriptionMacro -enable-experimental-feature OpaqueTypeErasure -empty-abi-descriptor -plugin-path /Applications/Xcode-16.2.0.app/Contents/Developer/Toolchains/XcodeDefault.xctoolchain/usr/lib/swift/host/plugins/testing -validate-clang-modules-once -clang-build-session-file /Users/admin/builder/spi-builder-workspace/.derivedData/ModuleCache.noindex/Session.modulevalidation -Xcc -working-directory -Xcc /Users/admin/builder/spi-builder-workspace/.swiftpm/xcode -resource-dir /Applications/Xcode-16.2.0.app/Contents/Developer/Toolchains/XcodeDefault.xctoolchain/usr/lib/swift -enable-anonymous-context-mangled-names -file-compilation-dir /Users/admin/builder/spi-builder-workspace/.swiftpm/xcode -Xcc -D_LIBCPP_HARDENING_MODE\=_LIBCPP_HARDENING_MODE_DEBUG -Xcc -ivfsstatcache -Xcc /Users/admin/builder/spi-builder-workspace/.derivedData/SDKStatCaches.noindex/watchos11.2-22S97-8cb5c683f5e64b0ecfc74e8d0065fbf6.sdkstatcache -Xcc -I/Users/admin/builder/spi-builder-workspace/.derivedData/Build/Intermediates.noindex/Prefire.build/Debug-watchos/Prefire.build/swift-overrides.hmap -Xcc -I/Users/admin/builder/spi-builder-workspace/.derivedData/Build/Products/Debug-watchos/include -Xcc -I/Users/admin/builder/spi-builder-workspace/.derivedData/Build/Intermediates.noindex/Prefire.build/Debug-watchos/Prefire.build/DerivedSources-normal/armv7k -Xcc -I/Users/admin/builder/spi-builder-workspace/.derivedData/Build/Intermediates.noindex/Prefire.build/Debug-watchos/Prefire.build/DerivedSources/armv7k -Xcc -I/Users/admin/builder/spi-builder-workspace/.derivedData/Build/Intermediates.noindex/Prefire.build/Debug-watchos/Prefire.build/DerivedSources -Xcc -DSWIFT_PACKAGE -Xcc -DDEBUG\=1 -module-name Prefire -package-name spi_builder_workspace -frontend-parseable-output -disable-clang-spi -target-sdk-version 11.2 -target-sdk-name watchos11.2 -external-plugin-path /Applications/Xcode-16.2.0.app/Contents/Developer/Platforms/WatchOS.platform/Developer/usr/lib/swift/host/plugins\#/Applications/Xcode-16.2.0.app/Contents/Developer/Platforms/WatchOS.platform/Developer/usr/bin/swift-plugin-server -external-plugin-path /Applications/Xcode-16.2.0.app/Contents/Developer/Platforms/WatchOS.platform/Developer/usr/local/lib/swift/host/plugins\#/Applications/Xcode-16.2.0.app/Contents/Developer/Platforms/WatchOS.platform/Developer/usr/bin/swift-plugin-server -plugin-path /Applications/Xcode-16.2.0.app/Contents/Developer/Toolchains/XcodeDefault.xctoolchain/usr/lib/swift/host/plugins -plugin-path /Applications/Xcode-16.2.0.app/Contents/Developer/Toolchains/XcodeDefault.xctoolchain/usr/local/lib/swift/host/plugins -emit-module-doc-path /Users/admin/builder/spi-builder-workspace/.derivedData/Build/Intermediates.noindex/Prefire.build/Debug-watchos/Prefire.build/Objects-normal/armv7k/Prefire.swiftdoc -emit-module-source-info-path /Users/admin/builder/spi-builder-workspace/.derivedData/Build/Intermediates.noindex/Prefire.build/Debug-watchos/Prefire.build/Objects-normal/armv7k/Prefire.swiftsourceinfo -emit-objc-header-path /Users/admin/builder/spi-builder-workspace/.derivedData/Build/Intermediates.noindex/Prefire.build/Debug-watchos/Prefire.build/Objects-normal/armv7k/Prefire-Swift.h -serialize-diagnostics-path /Users/admin/builder/spi-builder-workspace/.derivedData/Build/Intermediates.noindex/Prefire.build/Debug-watchos/Prefire.build/Objects-normal/armv7k/Prefire-master-emit-module.dia -emit-dependencies-path /Users/admin/builder/spi-builder-workspace/.derivedData/Build/Intermediates.noindex/Prefire.build/Debug-watchos/Prefire.build/Objects-normal/armv7k/Prefire-master-emit-module.d -o /Users/admin/builder/spi-builder-workspace/.derivedData/Build/Intermediates.noindex/Prefire.build/Debug-watchos/Prefire.build/Objects-normal/armv7k/Prefire.swiftmodule -emit-abi-descriptor-path /Users/admin/builder/spi-builder-workspace/.derivedData/Build/Intermediates.noindex/Prefire.build/Debug-watchos/Prefire.build/Objects-normal/armv7k/Prefire.abi.json
/Users/admin/builder/spi-builder-workspace/Sources/Prefire/Playbook/PlaybookView.swift:7:42: error: cannot find 'UIScreen' in scope
    @MainActor static let screenHeight = UIScreen.main.bounds.height
                                         ^~~~~~~~
/Users/admin/builder/spi-builder-workspace/Sources/Prefire/Playbook/PlaybookView.swift:8:41: error: cannot find 'UIScreen' in scope
    @MainActor static let screenWidth = UIScreen.main.bounds.width
                                        ^~~~~~~~
/Users/admin/builder/spi-builder-workspace/Sources/Prefire/Preview/PrefireSnapshot.swift:7:24: error: 'UITraitCollection' is unavailable: This Objective-C class has only been forward-declared; import its owning module to use it
    public var traits: UITraitCollection
                       ^~~~~~~~~~~~~~~~~
UIKit.UITraitCollection:2:14: note: 'UITraitCollection' has been explicitly marked unavailable here
public class UITraitCollection {
             ^
/Users/admin/builder/spi-builder-workspace/Sources/Prefire/Preview/PrefireSnapshot.swift:9:70: error: 'UITraitCollection' is unavailable: This Objective-C class has only been forward-declared; import its owning module to use it
    public init(safeArea: UIEdgeInsets, size: CGSize? = nil, traits: UITraitCollection) {
                                                                     ^~~~~~~~~~~~~~~~~
UIKit.UITraitCollection:2:14: note: 'UITraitCollection' has been explicitly marked unavailable here
public class UITraitCollection {
             ^
/Users/admin/builder/spi-builder-workspace/Sources/Prefire/Preview/PrefireSnapshot.swift:21:24: error: 'UITraitCollection' is unavailable: This Objective-C class has only been forward-declared; import its owning module to use it
    public var traits: UITraitCollection = .init()
                       ^~~~~~~~~~~~~~~~~
UIKit.UITraitCollection:2:14: note: 'UITraitCollection' has been explicitly marked unavailable here
public class UITraitCollection {
             ^
/Users/admin/builder/spi-builder-workspace/Sources/Prefire/Preview/PrefireSnapshot.swift:21:45: error: member 'init()' in 'UITraitCollection' produces result of type 'NSObject', but context expects 'UITraitCollection'
    public var traits: UITraitCollection = .init()
                                            ^
/Users/admin/builder/spi-builder-workspace/Sources/Prefire/Preview/PrefireSnapshot.swift:42:94: error: 'UITraitCollection' is unavailable: This Objective-C class has only been forward-declared; import its owning module to use it
    public init(_ view: Content, name: String, isScreen: Bool, device: DeviceConfig, traits: UITraitCollection = .init()) {
                                                                                             ^~~~~~~~~~~~~~~~~
UIKit.UITraitCollection:2:14: note: 'UITraitCollection' has been explicitly marked unavailable here
public class UITraitCollection {
             ^
/Users/admin/builder/spi-builder-workspace/Sources/Prefire/Preview/PrefireSnapshot.swift:42:115: error: member 'init()' in 'UITraitCollection' produces result of type 'NSObject', but context expects 'UITraitCollection'
    public init(_ view: Content, name: String, isScreen: Bool, device: DeviceConfig, traits: UITraitCollection = .init()) {
                                                                                                                  ^
/Users/admin/builder/spi-builder-workspace/Sources/Prefire/Preview/PrefireSnapshot.swift:50:12: error: no type for 'Content' can satisfy both 'Content == ViewRepresentable<UIView>' and 'Content : View'
    public init(_ view: UIView, name: String, isScreen: Bool, device: DeviceConfig, traits: UITraitCollection = .init()) where Content == ViewRepresentable<UIView> {
           ^
/Users/admin/builder/spi-builder-workspace/Sources/Prefire/Preview/PrefireSnapshot.swift:50:157: error: 'UIView' is unavailable: This Objective-C class has only been forward-declared; import its owning module to use it
    public init(_ view: UIView, name: String, isScreen: Bool, device: DeviceConfig, traits: UITraitCollection = .init()) where Content == ViewRepresentable<UIView> {
                                                                                                                                                            ^~~~~~
UIKit.UIView:2:14: note: 'UIView' has been explicitly marked unavailable here
public class UIView {
             ^
/Users/admin/builder/spi-builder-workspace/Sources/Prefire/Preview/PrefireSnapshot.swift:50:25: error: 'UIView' is unavailable: This Objective-C class has only been forward-declared; import its owning module to use it
    public init(_ view: UIView, name: String, isScreen: Bool, device: DeviceConfig, traits: UITraitCollection = .init()) where Content == ViewRepresentable<UIView> {
                        ^~~~~~
UIKit.UIView:2:14: note: 'UIView' has been explicitly marked unavailable here
public class UIView {
             ^
/Users/admin/builder/spi-builder-workspace/Sources/Prefire/Preview/PrefireSnapshot.swift:50:93: error: 'UITraitCollection' is unavailable: This Objective-C class has only been forward-declared; import its owning module to use it
    public init(_ view: UIView, name: String, isScreen: Bool, device: DeviceConfig, traits: UITraitCollection = .init()) where Content == ViewRepresentable<UIView> {
                                                                                            ^~~~~~~~~~~~~~~~~
UIKit.UITraitCollection:2:14: note: 'UITraitCollection' has been explicitly marked unavailable here
public class UITraitCollection {
             ^
/Users/admin/builder/spi-builder-workspace/Sources/Prefire/Preview/PrefireSnapshot.swift:50:114: error: member 'init()' in 'UITraitCollection' produces result of type 'NSObject', but context expects 'UITraitCollection'
    public init(_ view: UIView, name: String, isScreen: Bool, device: DeviceConfig, traits: UITraitCollection = .init()) where Content == ViewRepresentable<UIView> {
                                                                                                                 ^
/Users/admin/builder/spi-builder-workspace/Sources/Prefire/Preview/PrefireSnapshot.swift:58:35: error: cannot find type 'UIViewController' in scope
    public init(_ viewController: UIViewController, name: String, isScreen: Bool, device: DeviceConfig, traits: UITraitCollection = .init()) where Content == ViewControllerRepresentable<UIViewController> {
                                  ^~~~~~~~~~~~~~~~
/Users/admin/builder/spi-builder-workspace/Sources/Prefire/Preview/PrefireSnapshot.swift:58:187: error: cannot find type 'UIViewController' in scope
    public init(_ viewController: UIViewController, name: String, isScreen: Bool, device: DeviceConfig, traits: UITraitCollection = .init()) where Content == ViewControllerRepresentable<UIViewController> {
                                                                                                                                                                                          ^~~~~~~~~~~~~~~~
/Users/admin/builder/spi-builder-workspace/Sources/Prefire/Preview/PrefireSnapshot.swift:58:113: error: 'UITraitCollection' is unavailable: This Objective-C class has only been forward-declared; import its owning module to use it
    public init(_ viewController: UIViewController, name: String, isScreen: Bool, device: DeviceConfig, traits: UITraitCollection = .init()) where Content == ViewControllerRepresentable<UIViewController> {
                                                                                                                ^~~~~~~~~~~~~~~~~
UIKit.UITraitCollection:2:14: note: 'UITraitCollection' has been explicitly marked unavailable here
public class UITraitCollection {
             ^
/Users/admin/builder/spi-builder-workspace/Sources/Prefire/Preview/PrefireSnapshot.swift:58:134: error: member 'init()' in 'UITraitCollection' produces result of type 'NSObject', but context expects 'UITraitCollection'
    public init(_ viewController: UIViewController, name: String, isScreen: Bool, device: DeviceConfig, traits: UITraitCollection = .init()) where Content == ViewControllerRepresentable<UIViewController> {
                                                                                                                                     ^
/Users/admin/builder/spi-builder-workspace/Sources/Prefire/Preview/PreviewModel.swift:77:34: error: 'UIView' is unavailable: This Objective-C class has only been forward-declared; import its owning module to use it
        content: @escaping () -> UIView,
                                 ^~~~~~
UIKit.UIView:2:14: note: 'UIView' has been explicitly marked unavailable here
public class UIView {
             ^
/Users/admin/builder/spi-builder-workspace/Sources/Prefire/Preview/PreviewModel.swift:88:34: error: cannot find type 'UIViewController' in scope
        content: @escaping () -> UIViewController,
                                 ^~~~~~~~~~~~~~~~
/Users/admin/builder/spi-builder-workspace/Sources/Prefire/Preview/PreviewModel.swift:88:18: error: @escaping attribute only applies to function types
        content: @escaping () -> UIViewController,
                 ^~~~~~~~~~

/Users/admin/builder/spi-builder-workspace/Sources/Prefire/Preview/UIKitRepresentable.swift:11:37: error: cannot find type 'Context' in scope
    public func makeUIView(context: Context) -> WrappedView {
                                    ^~~~~~~
/Users/admin/builder/spi-builder-workspace/Sources/Prefire/Preview/UIKitRepresentable.swift:17:62: error: cannot find type 'Context' in scope
    public func updateUIView(_ uiView: WrappedView, context: Context) { }
                                                             ^~~~~~~
/Users/admin/builder/spi-builder-workspace/Sources/Prefire/Preview/UIKitRepresentable.swift:4:55: error: cannot find type 'UIViewRepresentable' in scope
public struct ViewRepresentable<WrappedView: UIView>: UIViewRepresentable {
                                                      ^~~~~~~~~~~~~~~~~~~
/Users/admin/builder/spi-builder-workspace/Sources/Prefire/Preview/UIKitRepresentable.swift:4:46: error: 'UIView' is unavailable: This Objective-C class has only been forward-declared; import its owning module to use it
public struct ViewRepresentable<WrappedView: UIView>: UIViewRepresentable {
                                             ^~~~~~
UIKit.UIView:2:14: note: 'UIView' has been explicitly marked unavailable here
public class UIView {
             ^
/Users/admin/builder/spi-builder-workspace/Sources/Prefire/Preview/UIKitRepresentable.swift:20:66: error: cannot find type 'UIViewController' in scope
public struct ViewControllerRepresentable<WrappedViewController: UIViewController>: UIViewControllerRepresentable {
                                                                 ^~~~~~~~~~~~~~~~
/Users/admin/builder/spi-builder-workspace/Sources/Prefire/Preview/UIKitRepresentable.swift:27:47: error: cannot find type 'Context' in scope
    public func makeUIViewController(context: Context) -> WrappedViewController {
                                              ^~~~~~~
/Users/admin/builder/spi-builder-workspace/Sources/Prefire/Preview/UIKitRepresentable.swift:31:92: error: cannot find type 'Context' in scope
    public func updateUIViewController(_ uiViewController: WrappedViewController, context: Context) { }
                                                                                           ^~~~~~~
/Users/admin/builder/spi-builder-workspace/Sources/Prefire/Preview/UIKitRepresentable.swift:20:85: error: cannot find type 'UIViewControllerRepresentable' in scope
public struct ViewControllerRepresentable<WrappedViewController: UIViewController>: UIViewControllerRepresentable {
                                                                                    ^~~~~~~~~~~~~~~~~~~~~~~~~~~~~
SwiftEmitModule normal arm64 Emitting\ module\ for\ Prefire (in target 'Prefire' from project 'Prefire')
    cd /Users/admin/builder/spi-builder-workspace/.swiftpm/xcode
    builtin-swiftTaskExecution -- /Applications/Xcode-16.2.0.app/Contents/Developer/Toolchains/XcodeDefault.xctoolchain/usr/bin/swift-frontend -frontend -emit-module -experimental-skip-non-inlinable-function-bodies-without-types /Users/admin/builder/spi-builder-workspace/Sources/Prefire/Playbook/LoadingTimeModifier.swift /Users/admin/builder/spi-builder-workspace/Sources/Prefire/Playbook/PlaybookView.swift /Users/admin/builder/spi-builder-workspace/Sources/Prefire/Playbook/Scale.swift /Users/admin/builder/spi-builder-workspace/Sources/Prefire/Playbook/TransformIf.swift /Users/admin/builder/spi-builder-workspace/Sources/Prefire/Preview/PreferenceKeys.swift /Users/admin/builder/spi-builder-workspace/Sources/Prefire/Preview/PrefireProvider.swift /Users/admin/builder/spi-builder-workspace/Sources/Prefire/Preview/PrefireSnapshot.swift /Users/admin/builder/spi-builder-workspace/Sources/Prefire/Preview/PreviewLayout+Equatable.swift /Users/admin/builder/spi-builder-workspace/Sources/Prefire/Preview/PreviewModel.swift /Users/admin/builder/spi-builder-workspace/Sources/Prefire/Preview/UIKitRepresentable.swift /Users/admin/builder/spi-builder-workspace/Sources/Prefire/Preview/View+Prefire.swift -target arm64-apple-watchos7.0 -Xllvm -aarch64-use-tbi -enable-objc-interop -stack-check -sdk /Applications/Xcode-16.2.0.app/Contents/Developer/Platforms/WatchOS.platform/Developer/SDKs/WatchOS11.2.sdk -I /Users/admin/builder/spi-builder-workspace/.derivedData/Build/Products/Debug-watchos -I /Applications/Xcode-16.2.0.app/Contents/Developer/Platforms/WatchOS.platform/Developer/usr/lib -F /Users/admin/builder/spi-builder-workspace/.derivedData/Build/Products/Debug-watchos -F /Applications/Xcode-16.2.0.app/Contents/Developer/Platforms/WatchOS.platform/Developer/Library/Frameworks -F /Applications/Xcode-16.2.0.app/Contents/Developer/Platforms/WatchOS.platform/Developer/SDKs/WatchOS11.2.sdk/Developer/Library/Frameworks -no-color-diagnostics -enable-testing -g -debug-info-format\=dwarf -dwarf-version\=4 -module-cache-path /Users/admin/builder/spi-builder-workspace/.derivedData/ModuleCache.noindex -swift-version 6 -enforce-exclusivity\=checked -Onone -D SWIFT_PACKAGE -D DEBUG -D Xcode -serialize-debugging-options -const-gather-protocols-file /Users/admin/builder/spi-builder-workspace/.derivedData/Build/Intermediates.noindex/Prefire.build/Debug-watchos/Prefire.build/Objects-normal/arm64/Prefire_const_extract_protocols.json -enable-experimental-feature DebugDescriptionMacro -enable-experimental-feature OpaqueTypeErasure -empty-abi-descriptor -plugin-path /Applications/Xcode-16.2.0.app/Contents/Developer/Toolchains/XcodeDefault.xctoolchain/usr/lib/swift/host/plugins/testing -validate-clang-modules-once -clang-build-session-file /Users/admin/builder/spi-builder-workspace/.derivedData/ModuleCache.noindex/Session.modulevalidation -Xcc -working-directory -Xcc /Users/admin/builder/spi-builder-workspace/.swiftpm/xcode -resource-dir /Applications/Xcode-16.2.0.app/Contents/Developer/Toolchains/XcodeDefault.xctoolchain/usr/lib/swift -enable-anonymous-context-mangled-names -file-compilation-dir /Users/admin/builder/spi-builder-workspace/.swiftpm/xcode -Xcc -D_LIBCPP_HARDENING_MODE\=_LIBCPP_HARDENING_MODE_DEBUG -Xcc -ivfsstatcache -Xcc /Users/admin/builder/spi-builder-workspace/.derivedData/SDKStatCaches.noindex/watchos11.2-22S97-8cb5c683f5e64b0ecfc74e8d0065fbf6.sdkstatcache -Xcc -I/Users/admin/builder/spi-builder-workspace/.derivedData/Build/Intermediates.noindex/Prefire.build/Debug-watchos/Prefire.build/swift-overrides.hmap -Xcc -I/Users/admin/builder/spi-builder-workspace/.derivedData/Build/Products/Debug-watchos/include -Xcc -I/Users/admin/builder/spi-builder-workspace/.derivedData/Build/Intermediates.noindex/Prefire.build/Debug-watchos/Prefire.build/DerivedSources-normal/arm64 -Xcc -I/Users/admin/builder/spi-builder-workspace/.derivedData/Build/Intermediates.noindex/Prefire.build/Debug-watchos/Prefire.build/DerivedSources/arm64 -Xcc -I/Users/admin/builder/spi-builder-workspace/.derivedData/Build/Intermediates.noindex/Prefire.build/Debug-watchos/Prefire.build/DerivedSources -Xcc -DSWIFT_PACKAGE -Xcc -DDEBUG\=1 -module-name Prefire -package-name spi_builder_workspace -frontend-parseable-output -disable-clang-spi -target-sdk-version 11.2 -target-sdk-name watchos11.2 -external-plugin-path /Applications/Xcode-16.2.0.app/Contents/Developer/Platforms/WatchOS.platform/Developer/usr/lib/swift/host/plugins\#/Applications/Xcode-16.2.0.app/Contents/Developer/Platforms/WatchOS.platform/Developer/usr/bin/swift-plugin-server -external-plugin-path /Applications/Xcode-16.2.0.app/Contents/Developer/Platforms/WatchOS.platform/Developer/usr/local/lib/swift/host/plugins\#/Applications/Xcode-16.2.0.app/Contents/Developer/Platforms/WatchOS.platform/Developer/usr/bin/swift-plugin-server -plugin-path /Applications/Xcode-16.2.0.app/Contents/Developer/Toolchains/XcodeDefault.xctoolchain/usr/lib/swift/host/plugins -plugin-path /Applications/Xcode-16.2.0.app/Contents/Developer/Toolchains/XcodeDefault.xctoolchain/usr/local/lib/swift/host/plugins -emit-module-doc-path /Users/admin/builder/spi-builder-workspace/.derivedData/Build/Intermediates.noindex/Prefire.build/Debug-watchos/Prefire.build/Objects-normal/arm64/Prefire.swiftdoc -emit-module-source-info-path /Users/admin/builder/spi-builder-workspace/.derivedData/Build/Intermediates.noindex/Prefire.build/Debug-watchos/Prefire.build/Objects-normal/arm64/Prefire.swiftsourceinfo -emit-objc-header-path /Users/admin/builder/spi-builder-workspace/.derivedData/Build/Intermediates.noindex/Prefire.build/Debug-watchos/Prefire.build/Objects-normal/arm64/Prefire-Swift.h -serialize-diagnostics-path /Users/admin/builder/spi-builder-workspace/.derivedData/Build/Intermediates.noindex/Prefire.build/Debug-watchos/Prefire.build/Objects-normal/arm64/Prefire-master-emit-module.dia -emit-dependencies-path /Users/admin/builder/spi-builder-workspace/.derivedData/Build/Intermediates.noindex/Prefire.build/Debug-watchos/Prefire.build/Objects-normal/arm64/Prefire-master-emit-module.d -o /Users/admin/builder/spi-builder-workspace/.derivedData/Build/Intermediates.noindex/Prefire.build/Debug-watchos/Prefire.build/Objects-normal/arm64/Prefire.swiftmodule -emit-abi-descriptor-path /Users/admin/builder/spi-builder-workspace/.derivedData/Build/Intermediates.noindex/Prefire.build/Debug-watchos/Prefire.build/Objects-normal/arm64/Prefire.abi.json
EmitSwiftModule normal arm64 (in target 'Prefire' from project 'Prefire')
    cd /Users/admin/builder/spi-builder-workspace/.swiftpm/xcode
    /Applications/Xcode-16.2.0.app/Contents/Developer/Toolchains/XcodeDefault.xctoolchain/usr/bin/swift-frontend -emit-module -experimental-skip-non-inlinable-function-bodies-without-types /Users/admin/builder/spi-builder-workspace/Sources/Prefire/Playbook/LoadingTimeModifier.swift /Users/admin/builder/spi-builder-workspace/Sources/Prefire/Playbook/PlaybookView.swift /Users/admin/builder/spi-builder-workspace/Sources/Prefire/Playbook/Scale.swift /Users/admin/builder/spi-builder-workspace/Sources/Prefire/Playbook/TransformIf.swift /Users/admin/builder/spi-builder-workspace/Sources/Prefire/Preview/PreferenceKeys.swift /Users/admin/builder/spi-builder-workspace/Sources/Prefire/Preview/PrefireProvider.swift /Users/admin/builder/spi-builder-workspace/Sources/Prefire/Preview/PrefireSnapshot.swift /Users/admin/builder/spi-builder-workspace/Sources/Prefire/Preview/PreviewLayout+Equatable.swift /Users/admin/builder/spi-builder-workspace/Sources/Prefire/Preview/PreviewModel.swift /Users/admin/builder/spi-builder-workspace/Sources/Prefire/Preview/UIKitRepresentable.swift /Users/admin/builder/spi-builder-workspace/Sources/Prefire/Preview/View+Prefire.swift -target arm64-apple-watchos7.0 -Xllvm -aarch64-use-tbi -enable-objc-interop -stack-check -sdk /Applications/Xcode-16.2.0.app/Contents/Developer/Platforms/WatchOS.platform/Developer/SDKs/WatchOS11.2.sdk -I /Users/admin/builder/spi-builder-workspace/.derivedData/Build/Products/Debug-watchos -I /Applications/Xcode-16.2.0.app/Contents/Developer/Platforms/WatchOS.platform/Developer/usr/lib -F /Users/admin/builder/spi-builder-workspace/.derivedData/Build/Products/Debug-watchos -F /Applications/Xcode-16.2.0.app/Contents/Developer/Platforms/WatchOS.platform/Developer/Library/Frameworks -F /Applications/Xcode-16.2.0.app/Contents/Developer/Platforms/WatchOS.platform/Developer/SDKs/WatchOS11.2.sdk/Developer/Library/Frameworks -no-color-diagnostics -enable-testing -g -debug-info-format\=dwarf -dwarf-version\=4 -module-cache-path /Users/admin/builder/spi-builder-workspace/.derivedData/ModuleCache.noindex -swift-version 6 -enforce-exclusivity\=checked -Onone -D SWIFT_PACKAGE -D DEBUG -D Xcode -serialize-debugging-options -const-gather-protocols-file /Users/admin/builder/spi-builder-workspace/.derivedData/Build/Intermediates.noindex/Prefire.build/Debug-watchos/Prefire.build/Objects-normal/arm64/Prefire_const_extract_protocols.json -enable-experimental-feature DebugDescriptionMacro -enable-experimental-feature OpaqueTypeErasure -empty-abi-descriptor -plugin-path /Applications/Xcode-16.2.0.app/Contents/Developer/Toolchains/XcodeDefault.xctoolchain/usr/lib/swift/host/plugins/testing -validate-clang-modules-once -clang-build-session-file /Users/admin/builder/spi-builder-workspace/.derivedData/ModuleCache.noindex/Session.modulevalidation -Xcc -working-directory -Xcc /Users/admin/builder/spi-builder-workspace/.swiftpm/xcode -resource-dir /Applications/Xcode-16.2.0.app/Contents/Developer/Toolchains/XcodeDefault.xctoolchain/usr/lib/swift -enable-anonymous-context-mangled-names -file-compilation-dir /Users/admin/builder/spi-builder-workspace/.swiftpm/xcode -Xcc -D_LIBCPP_HARDENING_MODE\=_LIBCPP_HARDENING_MODE_DEBUG -Xcc -ivfsstatcache -Xcc /Users/admin/builder/spi-builder-workspace/.derivedData/SDKStatCaches.noindex/watchos11.2-22S97-8cb5c683f5e64b0ecfc74e8d0065fbf6.sdkstatcache -Xcc -I/Users/admin/builder/spi-builder-workspace/.derivedData/Build/Intermediates.noindex/Prefire.build/Debug-watchos/Prefire.build/swift-overrides.hmap -Xcc -I/Users/admin/builder/spi-builder-workspace/.derivedData/Build/Products/Debug-watchos/include -Xcc -I/Users/admin/builder/spi-builder-workspace/.derivedData/Build/Intermediates.noindex/Prefire.build/Debug-watchos/Prefire.build/DerivedSources-normal/arm64 -Xcc -I/Users/admin/builder/spi-builder-workspace/.derivedData/Build/Intermediates.noindex/Prefire.build/Debug-watchos/Prefire.build/DerivedSources/arm64 -Xcc -I/Users/admin/builder/spi-builder-workspace/.derivedData/Build/Intermediates.noindex/Prefire.build/Debug-watchos/Prefire.build/DerivedSources -Xcc -DSWIFT_PACKAGE -Xcc -DDEBUG\=1 -module-name Prefire -package-name spi_builder_workspace -frontend-parseable-output -disable-clang-spi -target-sdk-version 11.2 -target-sdk-name watchos11.2 -external-plugin-path /Applications/Xcode-16.2.0.app/Contents/Developer/Platforms/WatchOS.platform/Developer/usr/lib/swift/host/plugins\#/Applications/Xcode-16.2.0.app/Contents/Developer/Platforms/WatchOS.platform/Developer/usr/bin/swift-plugin-server -external-plugin-path /Applications/Xcode-16.2.0.app/Contents/Developer/Platforms/WatchOS.platform/Developer/usr/local/lib/swift/host/plugins\#/Applications/Xcode-16.2.0.app/Contents/Developer/Platforms/WatchOS.platform/Developer/usr/bin/swift-plugin-server -plugin-path /Applications/Xcode-16.2.0.app/Contents/Developer/Toolchains/XcodeDefault.xctoolchain/usr/lib/swift/host/plugins -plugin-path /Applications/Xcode-16.2.0.app/Contents/Developer/Toolchains/XcodeDefault.xctoolchain/usr/local/lib/swift/host/plugins -emit-module-doc-path /Users/admin/builder/spi-builder-workspace/.derivedData/Build/Intermediates.noindex/Prefire.build/Debug-watchos/Prefire.build/Objects-normal/arm64/Prefire.swiftdoc -emit-module-source-info-path /Users/admin/builder/spi-builder-workspace/.derivedData/Build/Intermediates.noindex/Prefire.build/Debug-watchos/Prefire.build/Objects-normal/arm64/Prefire.swiftsourceinfo -emit-objc-header-path /Users/admin/builder/spi-builder-workspace/.derivedData/Build/Intermediates.noindex/Prefire.build/Debug-watchos/Prefire.build/Objects-normal/arm64/Prefire-Swift.h -serialize-diagnostics-path /Users/admin/builder/spi-builder-workspace/.derivedData/Build/Intermediates.noindex/Prefire.build/Debug-watchos/Prefire.build/Objects-normal/arm64/Prefire-master-emit-module.dia -emit-dependencies-path /Users/admin/builder/spi-builder-workspace/.derivedData/Build/Intermediates.noindex/Prefire.build/Debug-watchos/Prefire.build/Objects-normal/arm64/Prefire-master-emit-module.d -o /Users/admin/builder/spi-builder-workspace/.derivedData/Build/Intermediates.noindex/Prefire.build/Debug-watchos/Prefire.build/Objects-normal/arm64/Prefire.swiftmodule -emit-abi-descriptor-path /Users/admin/builder/spi-builder-workspace/.derivedData/Build/Intermediates.noindex/Prefire.build/Debug-watchos/Prefire.build/Objects-normal/arm64/Prefire.abi.json
/Users/admin/builder/spi-builder-workspace/Sources/Prefire/Playbook/PlaybookView.swift:7:42: error: cannot find 'UIScreen' in scope
    @MainActor static let screenHeight = UIScreen.main.bounds.height
                                         ^~~~~~~~
/Users/admin/builder/spi-builder-workspace/Sources/Prefire/Playbook/PlaybookView.swift:8:41: error: cannot find 'UIScreen' in scope
    @MainActor static let screenWidth = UIScreen.main.bounds.width
                                        ^~~~~~~~
/Users/admin/builder/spi-builder-workspace/Sources/Prefire/Preview/PrefireSnapshot.swift:7:24: error: 'UITraitCollection' is unavailable: This Objective-C class has only been forward-declared; import its owning module to use it
    public var traits: UITraitCollection
                       ^~~~~~~~~~~~~~~~~
UIKit.UITraitCollection:2:14: note: 'UITraitCollection' has been explicitly marked unavailable here
public class UITraitCollection {
             ^
/Users/admin/builder/spi-builder-workspace/Sources/Prefire/Preview/PrefireSnapshot.swift:9:70: error: 'UITraitCollection' is unavailable: This Objective-C class has only been forward-declared; import its owning module to use it
    public init(safeArea: UIEdgeInsets, size: CGSize? = nil, traits: UITraitCollection) {
                                                                     ^~~~~~~~~~~~~~~~~
UIKit.UITraitCollection:2:14: note: 'UITraitCollection' has been explicitly marked unavailable here
public class UITraitCollection {
             ^
/Users/admin/builder/spi-builder-workspace/Sources/Prefire/Preview/PrefireSnapshot.swift:21:24: error: 'UITraitCollection' is unavailable: This Objective-C class has only been forward-declared; import its owning module to use it
    public var traits: UITraitCollection = .init()
                       ^~~~~~~~~~~~~~~~~
UIKit.UITraitCollection:2:14: note: 'UITraitCollection' has been explicitly marked unavailable here
public class UITraitCollection {
             ^
/Users/admin/builder/spi-builder-workspace/Sources/Prefire/Preview/PrefireSnapshot.swift:21:45: error: member 'init()' in 'UITraitCollection' produces result of type 'NSObject', but context expects 'UITraitCollection'
    public var traits: UITraitCollection = .init()
                                            ^
/Users/admin/builder/spi-builder-workspace/Sources/Prefire/Preview/PrefireSnapshot.swift:42:94: error: 'UITraitCollection' is unavailable: This Objective-C class has only been forward-declared; import its owning module to use it
    public init(_ view: Content, name: String, isScreen: Bool, device: DeviceConfig, traits: UITraitCollection = .init()) {
                                                                                             ^~~~~~~~~~~~~~~~~
UIKit.UITraitCollection:2:14: note: 'UITraitCollection' has been explicitly marked unavailable here
public class UITraitCollection {
             ^
/Users/admin/builder/spi-builder-workspace/Sources/Prefire/Preview/PrefireSnapshot.swift:42:115: error: member 'init()' in 'UITraitCollection' produces result of type 'NSObject', but context expects 'UITraitCollection'
    public init(_ view: Content, name: String, isScreen: Bool, device: DeviceConfig, traits: UITraitCollection = .init()) {
                                                                                                                  ^
/Users/admin/builder/spi-builder-workspace/Sources/Prefire/Preview/PrefireSnapshot.swift:50:12: error: no type for 'Content' can satisfy both 'Content == ViewRepresentable<UIView>' and 'Content : View'
    public init(_ view: UIView, name: String, isScreen: Bool, device: DeviceConfig, traits: UITraitCollection = .init()) where Content == ViewRepresentable<UIView> {
           ^
/Users/admin/builder/spi-builder-workspace/Sources/Prefire/Preview/PrefireSnapshot.swift:50:157: error: 'UIView' is unavailable: This Objective-C class has only been forward-declared; import its owning module to use it
    public init(_ view: UIView, name: String, isScreen: Bool, device: DeviceConfig, traits: UITraitCollection = .init()) where Content == ViewRepresentable<UIView> {
                                                                                                                                                            ^~~~~~
UIKit.UIView:2:14: note: 'UIView' has been explicitly marked unavailable here
public class UIView {
             ^
/Users/admin/builder/spi-builder-workspace/Sources/Prefire/Preview/PrefireSnapshot.swift:50:25: error: 'UIView' is unavailable: This Objective-C class has only been forward-declared; import its owning module to use it
    public init(_ view: UIView, name: String, isScreen: Bool, device: DeviceConfig, traits: UITraitCollection = .init()) where Content == ViewRepresentable<UIView> {
                        ^~~~~~
UIKit.UIView:2:14: note: 'UIView' has been explicitly marked unavailable here
public class UIView {
             ^
/Users/admin/builder/spi-builder-workspace/Sources/Prefire/Preview/PrefireSnapshot.swift:50:93: error: 'UITraitCollection' is unavailable: This Objective-C class has only been forward-declared; import its owning module to use it
    public init(_ view: UIView, name: String, isScreen: Bool, device: DeviceConfig, traits: UITraitCollection = .init()) where Content == ViewRepresentable<UIView> {
                                                                                            ^~~~~~~~~~~~~~~~~
UIKit.UITraitCollection:2:14: note: 'UITraitCollection' has been explicitly marked unavailable here
public class UITraitCollection {
             ^
/Users/admin/builder/spi-builder-workspace/Sources/Prefire/Preview/PrefireSnapshot.swift:50:114: error: member 'init()' in 'UITraitCollection' produces result of type 'NSObject', but context expects 'UITraitCollection'
    public init(_ view: UIView, name: String, isScreen: Bool, device: DeviceConfig, traits: UITraitCollection = .init()) where Content == ViewRepresentable<UIView> {
                                                                                                                 ^
/Users/admin/builder/spi-builder-workspace/Sources/Prefire/Preview/PrefireSnapshot.swift:58:35: error: cannot find type 'UIViewController' in scope
    public init(_ viewController: UIViewController, name: String, isScreen: Bool, device: DeviceConfig, traits: UITraitCollection = .init()) where Content == ViewControllerRepresentable<UIViewController> {
                                  ^~~~~~~~~~~~~~~~
/Users/admin/builder/spi-builder-workspace/Sources/Prefire/Preview/PrefireSnapshot.swift:58:187: error: cannot find type 'UIViewController' in scope
    public init(_ viewController: UIViewController, name: String, isScreen: Bool, device: DeviceConfig, traits: UITraitCollection = .init()) where Content == ViewControllerRepresentable<UIViewController> {
                                                                                                                                                                                          ^~~~~~~~~~~~~~~~
/Users/admin/builder/spi-builder-workspace/Sources/Prefire/Preview/PrefireSnapshot.swift:58:113: error: 'UITraitCollection' is unavailable: This Objective-C class has only been forward-declared; import its owning module to use it
    public init(_ viewController: UIViewController, name: String, isScreen: Bool, device: DeviceConfig, traits: UITraitCollection = .init()) where Content == ViewControllerRepresentable<UIViewController> {
                                                                                                                ^~~~~~~~~~~~~~~~~
UIKit.UITraitCollection:2:14: note: 'UITraitCollection' has been explicitly marked unavailable here
public class UITraitCollection {
             ^
/Users/admin/builder/spi-builder-workspace/Sources/Prefire/Preview/PrefireSnapshot.swift:58:134: error: member 'init()' in 'UITraitCollection' produces result of type 'NSObject', but context expects 'UITraitCollection'
    public init(_ viewController: UIViewController, name: String, isScreen: Bool, device: DeviceConfig, traits: UITraitCollection = .init()) where Content == ViewControllerRepresentable<UIViewController> {
                                                                                                                                     ^
/Users/admin/builder/spi-builder-workspace/Sources/Prefire/Preview/PreviewModel.swift:77:34: error: 'UIView' is unavailable: This Objective-C class has only been forward-declared; import its owning module to use it
        content: @escaping () -> UIView,
                                 ^~~~~~
UIKit.UIView:2:14: note: 'UIView' has been explicitly marked unavailable here
public class UIView {
             ^
/Users/admin/builder/spi-builder-workspace/Sources/Prefire/Preview/PreviewModel.swift:88:34: error: cannot find type 'UIViewController' in scope
        content: @escaping () -> UIViewController,
                                 ^~~~~~~~~~~~~~~~
/Users/admin/builder/spi-builder-workspace/Sources/Prefire/Preview/PreviewModel.swift:88:18: error: @escaping attribute only applies to function types
        content: @escaping () -> UIViewController,
                 ^~~~~~~~~~

/Users/admin/builder/spi-builder-workspace/Sources/Prefire/Preview/UIKitRepresentable.swift:11:37: error: cannot find type 'Context' in scope
    public func makeUIView(context: Context) -> WrappedView {
                                    ^~~~~~~
/Users/admin/builder/spi-builder-workspace/Sources/Prefire/Preview/UIKitRepresentable.swift:17:62: error: cannot find type 'Context' in scope
    public func updateUIView(_ uiView: WrappedView, context: Context) { }
                                                             ^~~~~~~
/Users/admin/builder/spi-builder-workspace/Sources/Prefire/Preview/UIKitRepresentable.swift:4:55: error: cannot find type 'UIViewRepresentable' in scope
public struct ViewRepresentable<WrappedView: UIView>: UIViewRepresentable {
                                                      ^~~~~~~~~~~~~~~~~~~
/Users/admin/builder/spi-builder-workspace/Sources/Prefire/Preview/UIKitRepresentable.swift:4:46: error: 'UIView' is unavailable: This Objective-C class has only been forward-declared; import its owning module to use it
public struct ViewRepresentable<WrappedView: UIView>: UIViewRepresentable {
                                             ^~~~~~
UIKit.UIView:2:14: note: 'UIView' has been explicitly marked unavailable here
public class UIView {
             ^
/Users/admin/builder/spi-builder-workspace/Sources/Prefire/Preview/UIKitRepresentable.swift:20:66: error: cannot find type 'UIViewController' in scope
public struct ViewControllerRepresentable<WrappedViewController: UIViewController>: UIViewControllerRepresentable {
                                                                 ^~~~~~~~~~~~~~~~
/Users/admin/builder/spi-builder-workspace/Sources/Prefire/Preview/UIKitRepresentable.swift:27:47: error: cannot find type 'Context' in scope
    public func makeUIViewController(context: Context) -> WrappedViewController {
                                              ^~~~~~~
/Users/admin/builder/spi-builder-workspace/Sources/Prefire/Preview/UIKitRepresentable.swift:31:92: error: cannot find type 'Context' in scope
    public func updateUIViewController(_ uiViewController: WrappedViewController, context: Context) { }
                                                                                           ^~~~~~~
/Users/admin/builder/spi-builder-workspace/Sources/Prefire/Preview/UIKitRepresentable.swift:20:85: error: cannot find type 'UIViewControllerRepresentable' in scope
public struct ViewControllerRepresentable<WrappedViewController: UIViewController>: UIViewControllerRepresentable {
                                                                                    ^~~~~~~~~~~~~~~~~~~~~~~~~~~~~
SwiftCompile normal arm64 Compiling\ Scale.swift /Users/admin/builder/spi-builder-workspace/Sources/Prefire/Playbook/Scale.swift (in target 'Prefire' from project 'Prefire')
    cd /Users/admin/builder/spi-builder-workspace/.swiftpm/xcode
    builtin-swiftTaskExecution -- /Applications/Xcode-16.2.0.app/Contents/Developer/Toolchains/XcodeDefault.xctoolchain/usr/bin/swift-frontend -frontend -c /Users/admin/builder/spi-builder-workspace/Sources/Prefire/Playbook/LoadingTimeModifier.swift /Users/admin/builder/spi-builder-workspace/Sources/Prefire/Playbook/PlaybookView.swift -primary-file /Users/admin/builder/spi-builder-workspace/Sources/Prefire/Playbook/Scale.swift /Users/admin/builder/spi-builder-workspace/Sources/Prefire/Playbook/TransformIf.swift /Users/admin/builder/spi-builder-workspace/Sources/Prefire/Preview/PreferenceKeys.swift /Users/admin/builder/spi-builder-workspace/Sources/Prefire/Preview/PrefireProvider.swift /Users/admin/builder/spi-builder-workspace/Sources/Prefire/Preview/PrefireSnapshot.swift /Users/admin/builder/spi-builder-workspace/Sources/Prefire/Preview/PreviewLayout+Equatable.swift /Users/admin/builder/spi-builder-workspace/Sources/Prefire/Preview/PreviewModel.swift /Users/admin/builder/spi-builder-workspace/Sources/Prefire/Preview/UIKitRepresentable.swift /Users/admin/builder/spi-builder-workspace/Sources/Prefire/Preview/View+Prefire.swift -emit-dependencies-path /Users/admin/builder/spi-builder-workspace/.derivedData/Build/Intermediates.noindex/Prefire.build/Debug-watchos/Prefire.build/Objects-normal/arm64/Scale.d -emit-const-values-path /Users/admin/builder/spi-builder-workspace/.derivedData/Build/Intermediates.noindex/Prefire.build/Debug-watchos/Prefire.build/Objects-normal/arm64/Scale.swiftconstvalues -emit-reference-dependencies-path /Users/admin/builder/spi-builder-workspace/.derivedData/Build/Intermediates.noindex/Prefire.build/Debug-watchos/Prefire.build/Objects-normal/arm64/Scale.swiftdeps -serialize-diagnostics-path /Users/admin/builder/spi-builder-workspace/.derivedData/Build/Intermediates.noindex/Prefire.build/Debug-watchos/Prefire.build/Objects-normal/arm64/Scale.dia -target arm64-apple-watchos7.0 -Xllvm -aarch64-use-tbi -enable-objc-interop -stack-check -sdk /Applications/Xcode-16.2.0.app/Contents/Developer/Platforms/WatchOS.platform/Developer/SDKs/WatchOS11.2.sdk -I /Users/admin/builder/spi-builder-workspace/.derivedData/Build/Products/Debug-watchos -I /Applications/Xcode-16.2.0.app/Contents/Developer/Platforms/WatchOS.platform/Developer/usr/lib -F /Users/admin/builder/spi-builder-workspace/.derivedData/Build/Products/Debug-watchos -F /Applications/Xcode-16.2.0.app/Contents/Developer/Platforms/WatchOS.platform/Developer/Library/Frameworks -F /Applications/Xcode-16.2.0.app/Contents/Developer/Platforms/WatchOS.platform/Developer/SDKs/WatchOS11.2.sdk/Developer/Library/Frameworks -no-color-diagnostics -enable-testing -g -debug-info-format\=dwarf -dwarf-version\=4 -module-cache-path /Users/admin/builder/spi-builder-workspace/.derivedData/ModuleCache.noindex -swift-version 6 -enforce-exclusivity\=checked -Onone -D SWIFT_PACKAGE -D DEBUG -D Xcode -serialize-debugging-options -const-gather-protocols-file /Users/admin/builder/spi-builder-workspace/.derivedData/Build/Intermediates.noindex/Prefire.build/Debug-watchos/Prefire.build/Objects-normal/arm64/Prefire_const_extract_protocols.json -enable-experimental-feature DebugDescriptionMacro -enable-experimental-feature OpaqueTypeErasure -empty-abi-descriptor -plugin-path /Applications/Xcode-16.2.0.app/Contents/Developer/Toolchains/XcodeDefault.xctoolchain/usr/lib/swift/host/plugins/testing -validate-clang-modules-once -clang-build-session-file /Users/admin/builder/spi-builder-workspace/.derivedData/ModuleCache.noindex/Session.modulevalidation -Xcc -working-directory -Xcc /Users/admin/builder/spi-builder-workspace/.swiftpm/xcode -resource-dir /Applications/Xcode-16.2.0.app/Contents/Developer/Toolchains/XcodeDefault.xctoolchain/usr/lib/swift -enable-anonymous-context-mangled-names -file-compilation-dir /Users/admin/builder/spi-builder-workspace/.swiftpm/xcode -Xcc -D_LIBCPP_HARDENING_MODE\=_LIBCPP_HARDENING_MODE_DEBUG -Xcc -ivfsstatcache -Xcc /Users/admin/builder/spi-builder-workspace/.derivedData/SDKStatCaches.noindex/watchos11.2-22S97-8cb5c683f5e64b0ecfc74e8d0065fbf6.sdkstatcache -Xcc -I/Users/admin/builder/spi-builder-workspace/.derivedData/Build/Intermediates.noindex/Prefire.build/Debug-watchos/Prefire.build/swift-overrides.hmap -Xcc -I/Users/admin/builder/spi-builder-workspace/.derivedData/Build/Products/Debug-watchos/include -Xcc -I/Users/admin/builder/spi-builder-workspace/.derivedData/Build/Intermediates.noindex/Prefire.build/Debug-watchos/Prefire.build/DerivedSources-normal/arm64 -Xcc -I/Users/admin/builder/spi-builder-workspace/.derivedData/Build/Intermediates.noindex/Prefire.build/Debug-watchos/Prefire.build/DerivedSources/arm64 -Xcc -I/Users/admin/builder/spi-builder-workspace/.derivedData/Build/Intermediates.noindex/Prefire.build/Debug-watchos/Prefire.build/DerivedSources -Xcc -DSWIFT_PACKAGE -Xcc -DDEBUG\=1 -module-name Prefire -package-name spi_builder_workspace -frontend-parseable-output -disable-clang-spi -target-sdk-version 11.2 -target-sdk-name watchos11.2 -external-plugin-path /Applications/Xcode-16.2.0.app/Contents/Developer/Platforms/WatchOS.platform/Developer/usr/lib/swift/host/plugins\#/Applications/Xcode-16.2.0.app/Contents/Developer/Platforms/WatchOS.platform/Developer/usr/bin/swift-plugin-server -external-plugin-path /Applications/Xcode-16.2.0.app/Contents/Developer/Platforms/WatchOS.platform/Developer/usr/local/lib/swift/host/plugins\#/Applications/Xcode-16.2.0.app/Contents/Developer/Platforms/WatchOS.platform/Developer/usr/bin/swift-plugin-server -plugin-path /Applications/Xcode-16.2.0.app/Contents/Developer/Toolchains/XcodeDefault.xctoolchain/usr/lib/swift/host/plugins -plugin-path /Applications/Xcode-16.2.0.app/Contents/Developer/Toolchains/XcodeDefault.xctoolchain/usr/local/lib/swift/host/plugins -o /Users/admin/builder/spi-builder-workspace/.derivedData/Build/Intermediates.noindex/Prefire.build/Debug-watchos/Prefire.build/Objects-normal/arm64/Scale.o -index-unit-output-path /Prefire.build/Debug-watchos/Prefire.build/Objects-normal/arm64/Scale.o -index-store-path /Users/admin/builder/spi-builder-workspace/.derivedData/Index.noindex/DataStore -index-system-modules
SwiftCompile normal arm64 /Users/admin/builder/spi-builder-workspace/Sources/Prefire/Playbook/Scale.swift (in target 'Prefire' from project 'Prefire')
    cd /Users/admin/builder/spi-builder-workspace/.swiftpm/xcode
    /Applications/Xcode-16.2.0.app/Contents/Developer/Toolchains/XcodeDefault.xctoolchain/usr/bin/swift-frontend -c /Users/admin/builder/spi-builder-workspace/Sources/Prefire/Playbook/LoadingTimeModifier.swift /Users/admin/builder/spi-builder-workspace/Sources/Prefire/Playbook/PlaybookView.swift -primary-file /Users/admin/builder/spi-builder-workspace/Sources/Prefire/Playbook/Scale.swift /Users/admin/builder/spi-builder-workspace/Sources/Prefire/Playbook/TransformIf.swift /Users/admin/builder/spi-builder-workspace/Sources/Prefire/Preview/PreferenceKeys.swift /Users/admin/builder/spi-builder-workspace/Sources/Prefire/Preview/PrefireProvider.swift /Users/admin/builder/spi-builder-workspace/Sources/Prefire/Preview/PrefireSnapshot.swift /Users/admin/builder/spi-builder-workspace/Sources/Prefire/Preview/PreviewLayout+Equatable.swift /Users/admin/builder/spi-builder-workspace/Sources/Prefire/Preview/PreviewModel.swift /Users/admin/builder/spi-builder-workspace/Sources/Prefire/Preview/UIKitRepresentable.swift /Users/admin/builder/spi-builder-workspace/Sources/Prefire/Preview/View+Prefire.swift -emit-dependencies-path /Users/admin/builder/spi-builder-workspace/.derivedData/Build/Intermediates.noindex/Prefire.build/Debug-watchos/Prefire.build/Objects-normal/arm64/Scale.d -emit-const-values-path /Users/admin/builder/spi-builder-workspace/.derivedData/Build/Intermediates.noindex/Prefire.build/Debug-watchos/Prefire.build/Objects-normal/arm64/Scale.swiftconstvalues -emit-reference-dependencies-path /Users/admin/builder/spi-builder-workspace/.derivedData/Build/Intermediates.noindex/Prefire.build/Debug-watchos/Prefire.build/Objects-normal/arm64/Scale.swiftdeps -serialize-diagnostics-path /Users/admin/builder/spi-builder-workspace/.derivedData/Build/Intermediates.noindex/Prefire.build/Debug-watchos/Prefire.build/Objects-normal/arm64/Scale.dia -target arm64-apple-watchos7.0 -Xllvm -aarch64-use-tbi -enable-objc-interop -stack-check -sdk /Applications/Xcode-16.2.0.app/Contents/Developer/Platforms/WatchOS.platform/Developer/SDKs/WatchOS11.2.sdk -I /Users/admin/builder/spi-builder-workspace/.derivedData/Build/Products/Debug-watchos -I /Applications/Xcode-16.2.0.app/Contents/Developer/Platforms/WatchOS.platform/Developer/usr/lib -F /Users/admin/builder/spi-builder-workspace/.derivedData/Build/Products/Debug-watchos -F /Applications/Xcode-16.2.0.app/Contents/Developer/Platforms/WatchOS.platform/Developer/Library/Frameworks -F /Applications/Xcode-16.2.0.app/Contents/Developer/Platforms/WatchOS.platform/Developer/SDKs/WatchOS11.2.sdk/Developer/Library/Frameworks -no-color-diagnostics -enable-testing -g -debug-info-format\=dwarf -dwarf-version\=4 -module-cache-path /Users/admin/builder/spi-builder-workspace/.derivedData/ModuleCache.noindex -swift-version 6 -enforce-exclusivity\=checked -Onone -D SWIFT_PACKAGE -D DEBUG -D Xcode -serialize-debugging-options -const-gather-protocols-file /Users/admin/builder/spi-builder-workspace/.derivedData/Build/Intermediates.noindex/Prefire.build/Debug-watchos/Prefire.build/Objects-normal/arm64/Prefire_const_extract_protocols.json -enable-experimental-feature DebugDescriptionMacro -enable-experimental-feature OpaqueTypeErasure -empty-abi-descriptor -plugin-path /Applications/Xcode-16.2.0.app/Contents/Developer/Toolchains/XcodeDefault.xctoolchain/usr/lib/swift/host/plugins/testing -validate-clang-modules-once -clang-build-session-file /Users/admin/builder/spi-builder-workspace/.derivedData/ModuleCache.noindex/Session.modulevalidation -Xcc -working-directory -Xcc /Users/admin/builder/spi-builder-workspace/.swiftpm/xcode -resource-dir /Applications/Xcode-16.2.0.app/Contents/Developer/Toolchains/XcodeDefault.xctoolchain/usr/lib/swift -enable-anonymous-context-mangled-names -file-compilation-dir /Users/admin/builder/spi-builder-workspace/.swiftpm/xcode -Xcc -D_LIBCPP_HARDENING_MODE\=_LIBCPP_HARDENING_MODE_DEBUG -Xcc -ivfsstatcache -Xcc /Users/admin/builder/spi-builder-workspace/.derivedData/SDKStatCaches.noindex/watchos11.2-22S97-8cb5c683f5e64b0ecfc74e8d0065fbf6.sdkstatcache -Xcc -I/Users/admin/builder/spi-builder-workspace/.derivedData/Build/Intermediates.noindex/Prefire.build/Debug-watchos/Prefire.build/swift-overrides.hmap -Xcc -I/Users/admin/builder/spi-builder-workspace/.derivedData/Build/Products/Debug-watchos/include -Xcc -I/Users/admin/builder/spi-builder-workspace/.derivedData/Build/Intermediates.noindex/Prefire.build/Debug-watchos/Prefire.build/DerivedSources-normal/arm64 -Xcc -I/Users/admin/builder/spi-builder-workspace/.derivedData/Build/Intermediates.noindex/Prefire.build/Debug-watchos/Prefire.build/DerivedSources/arm64 -Xcc -I/Users/admin/builder/spi-builder-workspace/.derivedData/Build/Intermediates.noindex/Prefire.build/Debug-watchos/Prefire.build/DerivedSources -Xcc -DSWIFT_PACKAGE -Xcc -DDEBUG\=1 -module-name Prefire -package-name spi_builder_workspace -frontend-parseable-output -disable-clang-spi -target-sdk-version 11.2 -target-sdk-name watchos11.2 -external-plugin-path /Applications/Xcode-16.2.0.app/Contents/Developer/Platforms/WatchOS.platform/Developer/usr/lib/swift/host/plugins\#/Applications/Xcode-16.2.0.app/Contents/Developer/Platforms/WatchOS.platform/Developer/usr/bin/swift-plugin-server -external-plugin-path /Applications/Xcode-16.2.0.app/Contents/Developer/Platforms/WatchOS.platform/Developer/usr/local/lib/swift/host/plugins\#/Applications/Xcode-16.2.0.app/Contents/Developer/Platforms/WatchOS.platform/Developer/usr/bin/swift-plugin-server -plugin-path /Applications/Xcode-16.2.0.app/Contents/Developer/Toolchains/XcodeDefault.xctoolchain/usr/lib/swift/host/plugins -plugin-path /Applications/Xcode-16.2.0.app/Contents/Developer/Toolchains/XcodeDefault.xctoolchain/usr/local/lib/swift/host/plugins -o /Users/admin/builder/spi-builder-workspace/.derivedData/Build/Intermediates.noindex/Prefire.build/Debug-watchos/Prefire.build/Objects-normal/arm64/Scale.o -index-unit-output-path /Prefire.build/Debug-watchos/Prefire.build/Objects-normal/arm64/Scale.o -index-store-path /Users/admin/builder/spi-builder-workspace/.derivedData/Index.noindex/DataStore -index-system-modules
SwiftEmitModule normal arm64_32 Emitting\ module\ for\ Prefire (in target 'Prefire' from project 'Prefire')
    cd /Users/admin/builder/spi-builder-workspace/.swiftpm/xcode
    builtin-swiftTaskExecution -- /Applications/Xcode-16.2.0.app/Contents/Developer/Toolchains/XcodeDefault.xctoolchain/usr/bin/swift-frontend -frontend -emit-module -experimental-skip-non-inlinable-function-bodies-without-types /Users/admin/builder/spi-builder-workspace/Sources/Prefire/Playbook/LoadingTimeModifier.swift /Users/admin/builder/spi-builder-workspace/Sources/Prefire/Playbook/PlaybookView.swift /Users/admin/builder/spi-builder-workspace/Sources/Prefire/Playbook/Scale.swift /Users/admin/builder/spi-builder-workspace/Sources/Prefire/Playbook/TransformIf.swift /Users/admin/builder/spi-builder-workspace/Sources/Prefire/Preview/PreferenceKeys.swift /Users/admin/builder/spi-builder-workspace/Sources/Prefire/Preview/PrefireProvider.swift /Users/admin/builder/spi-builder-workspace/Sources/Prefire/Preview/PrefireSnapshot.swift /Users/admin/builder/spi-builder-workspace/Sources/Prefire/Preview/PreviewLayout+Equatable.swift /Users/admin/builder/spi-builder-workspace/Sources/Prefire/Preview/PreviewModel.swift /Users/admin/builder/spi-builder-workspace/Sources/Prefire/Preview/UIKitRepresentable.swift /Users/admin/builder/spi-builder-workspace/Sources/Prefire/Preview/View+Prefire.swift -target arm64_32-apple-watchos7.0 -enable-objc-interop -sdk /Applications/Xcode-16.2.0.app/Contents/Developer/Platforms/WatchOS.platform/Developer/SDKs/WatchOS11.2.sdk -I /Users/admin/builder/spi-builder-workspace/.derivedData/Build/Products/Debug-watchos -I /Applications/Xcode-16.2.0.app/Contents/Developer/Platforms/WatchOS.platform/Developer/usr/lib -F /Users/admin/builder/spi-builder-workspace/.derivedData/Build/Products/Debug-watchos -F /Applications/Xcode-16.2.0.app/Contents/Developer/Platforms/WatchOS.platform/Developer/Library/Frameworks -F /Applications/Xcode-16.2.0.app/Contents/Developer/Platforms/WatchOS.platform/Developer/SDKs/WatchOS11.2.sdk/Developer/Library/Frameworks -no-color-diagnostics -enable-testing -g -debug-info-format\=dwarf -dwarf-version\=4 -module-cache-path /Users/admin/builder/spi-builder-workspace/.derivedData/ModuleCache.noindex -swift-version 6 -enforce-exclusivity\=checked -Onone -D SWIFT_PACKAGE -D DEBUG -D Xcode -serialize-debugging-options -const-gather-protocols-file /Users/admin/builder/spi-builder-workspace/.derivedData/Build/Intermediates.noindex/Prefire.build/Debug-watchos/Prefire.build/Objects-normal/arm64_32/Prefire_const_extract_protocols.json -enable-experimental-feature DebugDescriptionMacro -enable-experimental-feature OpaqueTypeErasure -empty-abi-descriptor -plugin-path /Applications/Xcode-16.2.0.app/Contents/Developer/Toolchains/XcodeDefault.xctoolchain/usr/lib/swift/host/plugins/testing -validate-clang-modules-once -clang-build-session-file /Users/admin/builder/spi-builder-workspace/.derivedData/ModuleCache.noindex/Session.modulevalidation -Xcc -working-directory -Xcc /Users/admin/builder/spi-builder-workspace/.swiftpm/xcode -resource-dir /Applications/Xcode-16.2.0.app/Contents/Developer/Toolchains/XcodeDefault.xctoolchain/usr/lib/swift -enable-anonymous-context-mangled-names -file-compilation-dir /Users/admin/builder/spi-builder-workspace/.swiftpm/xcode -Xcc -D_LIBCPP_HARDENING_MODE\=_LIBCPP_HARDENING_MODE_DEBUG -Xcc -ivfsstatcache -Xcc /Users/admin/builder/spi-builder-workspace/.derivedData/SDKStatCaches.noindex/watchos11.2-22S97-8cb5c683f5e64b0ecfc74e8d0065fbf6.sdkstatcache -Xcc -I/Users/admin/builder/spi-builder-workspace/.derivedData/Build/Intermediates.noindex/Prefire.build/Debug-watchos/Prefire.build/swift-overrides.hmap -Xcc -I/Users/admin/builder/spi-builder-workspace/.derivedData/Build/Products/Debug-watchos/include -Xcc -I/Users/admin/builder/spi-builder-workspace/.derivedData/Build/Intermediates.noindex/Prefire.build/Debug-watchos/Prefire.build/DerivedSources-normal/arm64_32 -Xcc -I/Users/admin/builder/spi-builder-workspace/.derivedData/Build/Intermediates.noindex/Prefire.build/Debug-watchos/Prefire.build/DerivedSources/arm64_32 -Xcc -I/Users/admin/builder/spi-builder-workspace/.derivedData/Build/Intermediates.noindex/Prefire.build/Debug-watchos/Prefire.build/DerivedSources -Xcc -DSWIFT_PACKAGE -Xcc -DDEBUG\=1 -module-name Prefire -package-name spi_builder_workspace -frontend-parseable-output -disable-clang-spi -target-sdk-version 11.2 -target-sdk-name watchos11.2 -external-plugin-path /Applications/Xcode-16.2.0.app/Contents/Developer/Platforms/WatchOS.platform/Developer/usr/lib/swift/host/plugins\#/Applications/Xcode-16.2.0.app/Contents/Developer/Platforms/WatchOS.platform/Developer/usr/bin/swift-plugin-server -external-plugin-path /Applications/Xcode-16.2.0.app/Contents/Developer/Platforms/WatchOS.platform/Developer/usr/local/lib/swift/host/plugins\#/Applications/Xcode-16.2.0.app/Contents/Developer/Platforms/WatchOS.platform/Developer/usr/bin/swift-plugin-server -plugin-path /Applications/Xcode-16.2.0.app/Contents/Developer/Toolchains/XcodeDefault.xctoolchain/usr/lib/swift/host/plugins -plugin-path /Applications/Xcode-16.2.0.app/Contents/Developer/Toolchains/XcodeDefault.xctoolchain/usr/local/lib/swift/host/plugins -emit-module-doc-path /Users/admin/builder/spi-builder-workspace/.derivedData/Build/Intermediates.noindex/Prefire.build/Debug-watchos/Prefire.build/Objects-normal/arm64_32/Prefire.swiftdoc -emit-module-source-info-path /Users/admin/builder/spi-builder-workspace/.derivedData/Build/Intermediates.noindex/Prefire.build/Debug-watchos/Prefire.build/Objects-normal/arm64_32/Prefire.swiftsourceinfo -emit-objc-header-path /Users/admin/builder/spi-builder-workspace/.derivedData/Build/Intermediates.noindex/Prefire.build/Debug-watchos/Prefire.build/Objects-normal/arm64_32/Prefire-Swift.h -serialize-diagnostics-path /Users/admin/builder/spi-builder-workspace/.derivedData/Build/Intermediates.noindex/Prefire.build/Debug-watchos/Prefire.build/Objects-normal/arm64_32/Prefire-master-emit-module.dia -emit-dependencies-path /Users/admin/builder/spi-builder-workspace/.derivedData/Build/Intermediates.noindex/Prefire.build/Debug-watchos/Prefire.build/Objects-normal/arm64_32/Prefire-master-emit-module.d -o /Users/admin/builder/spi-builder-workspace/.derivedData/Build/Intermediates.noindex/Prefire.build/Debug-watchos/Prefire.build/Objects-normal/arm64_32/Prefire.swiftmodule -emit-abi-descriptor-path /Users/admin/builder/spi-builder-workspace/.derivedData/Build/Intermediates.noindex/Prefire.build/Debug-watchos/Prefire.build/Objects-normal/arm64_32/Prefire.abi.json
EmitSwiftModule normal arm64_32 (in target 'Prefire' from project 'Prefire')
    cd /Users/admin/builder/spi-builder-workspace/.swiftpm/xcode
    /Applications/Xcode-16.2.0.app/Contents/Developer/Toolchains/XcodeDefault.xctoolchain/usr/bin/swift-frontend -emit-module -experimental-skip-non-inlinable-function-bodies-without-types /Users/admin/builder/spi-builder-workspace/Sources/Prefire/Playbook/LoadingTimeModifier.swift /Users/admin/builder/spi-builder-workspace/Sources/Prefire/Playbook/PlaybookView.swift /Users/admin/builder/spi-builder-workspace/Sources/Prefire/Playbook/Scale.swift /Users/admin/builder/spi-builder-workspace/Sources/Prefire/Playbook/TransformIf.swift /Users/admin/builder/spi-builder-workspace/Sources/Prefire/Preview/PreferenceKeys.swift /Users/admin/builder/spi-builder-workspace/Sources/Prefire/Preview/PrefireProvider.swift /Users/admin/builder/spi-builder-workspace/Sources/Prefire/Preview/PrefireSnapshot.swift /Users/admin/builder/spi-builder-workspace/Sources/Prefire/Preview/PreviewLayout+Equatable.swift /Users/admin/builder/spi-builder-workspace/Sources/Prefire/Preview/PreviewModel.swift /Users/admin/builder/spi-builder-workspace/Sources/Prefire/Preview/UIKitRepresentable.swift /Users/admin/builder/spi-builder-workspace/Sources/Prefire/Preview/View+Prefire.swift -target arm64_32-apple-watchos7.0 -enable-objc-interop -sdk /Applications/Xcode-16.2.0.app/Contents/Developer/Platforms/WatchOS.platform/Developer/SDKs/WatchOS11.2.sdk -I /Users/admin/builder/spi-builder-workspace/.derivedData/Build/Products/Debug-watchos -I /Applications/Xcode-16.2.0.app/Contents/Developer/Platforms/WatchOS.platform/Developer/usr/lib -F /Users/admin/builder/spi-builder-workspace/.derivedData/Build/Products/Debug-watchos -F /Applications/Xcode-16.2.0.app/Contents/Developer/Platforms/WatchOS.platform/Developer/Library/Frameworks -F /Applications/Xcode-16.2.0.app/Contents/Developer/Platforms/WatchOS.platform/Developer/SDKs/WatchOS11.2.sdk/Developer/Library/Frameworks -no-color-diagnostics -enable-testing -g -debug-info-format\=dwarf -dwarf-version\=4 -module-cache-path /Users/admin/builder/spi-builder-workspace/.derivedData/ModuleCache.noindex -swift-version 6 -enforce-exclusivity\=checked -Onone -D SWIFT_PACKAGE -D DEBUG -D Xcode -serialize-debugging-options -const-gather-protocols-file /Users/admin/builder/spi-builder-workspace/.derivedData/Build/Intermediates.noindex/Prefire.build/Debug-watchos/Prefire.build/Objects-normal/arm64_32/Prefire_const_extract_protocols.json -enable-experimental-feature DebugDescriptionMacro -enable-experimental-feature OpaqueTypeErasure -empty-abi-descriptor -plugin-path /Applications/Xcode-16.2.0.app/Contents/Developer/Toolchains/XcodeDefault.xctoolchain/usr/lib/swift/host/plugins/testing -validate-clang-modules-once -clang-build-session-file /Users/admin/builder/spi-builder-workspace/.derivedData/ModuleCache.noindex/Session.modulevalidation -Xcc -working-directory -Xcc /Users/admin/builder/spi-builder-workspace/.swiftpm/xcode -resource-dir /Applications/Xcode-16.2.0.app/Contents/Developer/Toolchains/XcodeDefault.xctoolchain/usr/lib/swift -enable-anonymous-context-mangled-names -file-compilation-dir /Users/admin/builder/spi-builder-workspace/.swiftpm/xcode -Xcc -D_LIBCPP_HARDENING_MODE\=_LIBCPP_HARDENING_MODE_DEBUG -Xcc -ivfsstatcache -Xcc /Users/admin/builder/spi-builder-workspace/.derivedData/SDKStatCaches.noindex/watchos11.2-22S97-8cb5c683f5e64b0ecfc74e8d0065fbf6.sdkstatcache -Xcc -I/Users/admin/builder/spi-builder-workspace/.derivedData/Build/Intermediates.noindex/Prefire.build/Debug-watchos/Prefire.build/swift-overrides.hmap -Xcc -I/Users/admin/builder/spi-builder-workspace/.derivedData/Build/Products/Debug-watchos/include -Xcc -I/Users/admin/builder/spi-builder-workspace/.derivedData/Build/Intermediates.noindex/Prefire.build/Debug-watchos/Prefire.build/DerivedSources-normal/arm64_32 -Xcc -I/Users/admin/builder/spi-builder-workspace/.derivedData/Build/Intermediates.noindex/Prefire.build/Debug-watchos/Prefire.build/DerivedSources/arm64_32 -Xcc -I/Users/admin/builder/spi-builder-workspace/.derivedData/Build/Intermediates.noindex/Prefire.build/Debug-watchos/Prefire.build/DerivedSources -Xcc -DSWIFT_PACKAGE -Xcc -DDEBUG\=1 -module-name Prefire -package-name spi_builder_workspace -frontend-parseable-output -disable-clang-spi -target-sdk-version 11.2 -target-sdk-name watchos11.2 -external-plugin-path /Applications/Xcode-16.2.0.app/Contents/Developer/Platforms/WatchOS.platform/Developer/usr/lib/swift/host/plugins\#/Applications/Xcode-16.2.0.app/Contents/Developer/Platforms/WatchOS.platform/Developer/usr/bin/swift-plugin-server -external-plugin-path /Applications/Xcode-16.2.0.app/Contents/Developer/Platforms/WatchOS.platform/Developer/usr/local/lib/swift/host/plugins\#/Applications/Xcode-16.2.0.app/Contents/Developer/Platforms/WatchOS.platform/Developer/usr/bin/swift-plugin-server -plugin-path /Applications/Xcode-16.2.0.app/Contents/Developer/Toolchains/XcodeDefault.xctoolchain/usr/lib/swift/host/plugins -plugin-path /Applications/Xcode-16.2.0.app/Contents/Developer/Toolchains/XcodeDefault.xctoolchain/usr/local/lib/swift/host/plugins -emit-module-doc-path /Users/admin/builder/spi-builder-workspace/.derivedData/Build/Intermediates.noindex/Prefire.build/Debug-watchos/Prefire.build/Objects-normal/arm64_32/Prefire.swiftdoc -emit-module-source-info-path /Users/admin/builder/spi-builder-workspace/.derivedData/Build/Intermediates.noindex/Prefire.build/Debug-watchos/Prefire.build/Objects-normal/arm64_32/Prefire.swiftsourceinfo -emit-objc-header-path /Users/admin/builder/spi-builder-workspace/.derivedData/Build/Intermediates.noindex/Prefire.build/Debug-watchos/Prefire.build/Objects-normal/arm64_32/Prefire-Swift.h -serialize-diagnostics-path /Users/admin/builder/spi-builder-workspace/.derivedData/Build/Intermediates.noindex/Prefire.build/Debug-watchos/Prefire.build/Objects-normal/arm64_32/Prefire-master-emit-module.dia -emit-dependencies-path /Users/admin/builder/spi-builder-workspace/.derivedData/Build/Intermediates.noindex/Prefire.build/Debug-watchos/Prefire.build/Objects-normal/arm64_32/Prefire-master-emit-module.d -o /Users/admin/builder/spi-builder-workspace/.derivedData/Build/Intermediates.noindex/Prefire.build/Debug-watchos/Prefire.build/Objects-normal/arm64_32/Prefire.swiftmodule -emit-abi-descriptor-path /Users/admin/builder/spi-builder-workspace/.derivedData/Build/Intermediates.noindex/Prefire.build/Debug-watchos/Prefire.build/Objects-normal/arm64_32/Prefire.abi.json
/Users/admin/builder/spi-builder-workspace/Sources/Prefire/Playbook/PlaybookView.swift:7:42: error: cannot find 'UIScreen' in scope
    @MainActor static let screenHeight = UIScreen.main.bounds.height
                                         ^~~~~~~~
/Users/admin/builder/spi-builder-workspace/Sources/Prefire/Playbook/PlaybookView.swift:8:41: error: cannot find 'UIScreen' in scope
    @MainActor static let screenWidth = UIScreen.main.bounds.width
                                        ^~~~~~~~
/Users/admin/builder/spi-builder-workspace/Sources/Prefire/Preview/PrefireSnapshot.swift:7:24: error: 'UITraitCollection' is unavailable: This Objective-C class has only been forward-declared; import its owning module to use it
    public var traits: UITraitCollection
                       ^~~~~~~~~~~~~~~~~
UIKit.UITraitCollection:2:14: note: 'UITraitCollection' has been explicitly marked unavailable here
public class UITraitCollection {
             ^
/Users/admin/builder/spi-builder-workspace/Sources/Prefire/Preview/PrefireSnapshot.swift:9:70: error: 'UITraitCollection' is unavailable: This Objective-C class has only been forward-declared; import its owning module to use it
    public init(safeArea: UIEdgeInsets, size: CGSize? = nil, traits: UITraitCollection) {
                                                                     ^~~~~~~~~~~~~~~~~
UIKit.UITraitCollection:2:14: note: 'UITraitCollection' has been explicitly marked unavailable here
public class UITraitCollection {
             ^
/Users/admin/builder/spi-builder-workspace/Sources/Prefire/Preview/PrefireSnapshot.swift:21:24: error: 'UITraitCollection' is unavailable: This Objective-C class has only been forward-declared; import its owning module to use it
    public var traits: UITraitCollection = .init()
                       ^~~~~~~~~~~~~~~~~
UIKit.UITraitCollection:2:14: note: 'UITraitCollection' has been explicitly marked unavailable here
public class UITraitCollection {
             ^
/Users/admin/builder/spi-builder-workspace/Sources/Prefire/Preview/PrefireSnapshot.swift:21:45: error: member 'init()' in 'UITraitCollection' produces result of type 'NSObject', but context expects 'UITraitCollection'
    public var traits: UITraitCollection = .init()
                                            ^
/Users/admin/builder/spi-builder-workspace/Sources/Prefire/Preview/PrefireSnapshot.swift:42:94: error: 'UITraitCollection' is unavailable: This Objective-C class has only been forward-declared; import its owning module to use it
    public init(_ view: Content, name: String, isScreen: Bool, device: DeviceConfig, traits: UITraitCollection = .init()) {
                                                                                             ^~~~~~~~~~~~~~~~~
UIKit.UITraitCollection:2:14: note: 'UITraitCollection' has been explicitly marked unavailable here
public class UITraitCollection {
             ^
/Users/admin/builder/spi-builder-workspace/Sources/Prefire/Preview/PrefireSnapshot.swift:42:115: error: member 'init()' in 'UITraitCollection' produces result of type 'NSObject', but context expects 'UITraitCollection'
    public init(_ view: Content, name: String, isScreen: Bool, device: DeviceConfig, traits: UITraitCollection = .init()) {
                                                                                                                  ^
/Users/admin/builder/spi-builder-workspace/Sources/Prefire/Preview/PrefireSnapshot.swift:50:12: error: no type for 'Content' can satisfy both 'Content == ViewRepresentable<UIView>' and 'Content : View'
    public init(_ view: UIView, name: String, isScreen: Bool, device: DeviceConfig, traits: UITraitCollection = .init()) where Content == ViewRepresentable<UIView> {
           ^
/Users/admin/builder/spi-builder-workspace/Sources/Prefire/Preview/PrefireSnapshot.swift:50:157: error: 'UIView' is unavailable: This Objective-C class has only been forward-declared; import its owning module to use it
    public init(_ view: UIView, name: String, isScreen: Bool, device: DeviceConfig, traits: UITraitCollection = .init()) where Content == ViewRepresentable<UIView> {
                                                                                                                                                            ^~~~~~
UIKit.UIView:2:14: note: 'UIView' has been explicitly marked unavailable here
public class UIView {
             ^
/Users/admin/builder/spi-builder-workspace/Sources/Prefire/Preview/PrefireSnapshot.swift:50:25: error: 'UIView' is unavailable: This Objective-C class has only been forward-declared; import its owning module to use it
    public init(_ view: UIView, name: String, isScreen: Bool, device: DeviceConfig, traits: UITraitCollection = .init()) where Content == ViewRepresentable<UIView> {
                        ^~~~~~
UIKit.UIView:2:14: note: 'UIView' has been explicitly marked unavailable here
public class UIView {
             ^
/Users/admin/builder/spi-builder-workspace/Sources/Prefire/Preview/PrefireSnapshot.swift:50:93: error: 'UITraitCollection' is unavailable: This Objective-C class has only been forward-declared; import its owning module to use it
    public init(_ view: UIView, name: String, isScreen: Bool, device: DeviceConfig, traits: UITraitCollection = .init()) where Content == ViewRepresentable<UIView> {
                                                                                            ^~~~~~~~~~~~~~~~~
UIKit.UITraitCollection:2:14: note: 'UITraitCollection' has been explicitly marked unavailable here
public class UITraitCollection {
             ^
/Users/admin/builder/spi-builder-workspace/Sources/Prefire/Preview/PrefireSnapshot.swift:50:114: error: member 'init()' in 'UITraitCollection' produces result of type 'NSObject', but context expects 'UITraitCollection'
    public init(_ view: UIView, name: String, isScreen: Bool, device: DeviceConfig, traits: UITraitCollection = .init()) where Content == ViewRepresentable<UIView> {
                                                                                                                 ^
/Users/admin/builder/spi-builder-workspace/Sources/Prefire/Preview/PrefireSnapshot.swift:58:35: error: cannot find type 'UIViewController' in scope
    public init(_ viewController: UIViewController, name: String, isScreen: Bool, device: DeviceConfig, traits: UITraitCollection = .init()) where Content == ViewControllerRepresentable<UIViewController> {
                                  ^~~~~~~~~~~~~~~~
/Users/admin/builder/spi-builder-workspace/Sources/Prefire/Preview/PrefireSnapshot.swift:58:187: error: cannot find type 'UIViewController' in scope
    public init(_ viewController: UIViewController, name: String, isScreen: Bool, device: DeviceConfig, traits: UITraitCollection = .init()) where Content == ViewControllerRepresentable<UIViewController> {
                                                                                                                                                                                          ^~~~~~~~~~~~~~~~
/Users/admin/builder/spi-builder-workspace/Sources/Prefire/Preview/PrefireSnapshot.swift:58:113: error: 'UITraitCollection' is unavailable: This Objective-C class has only been forward-declared; import its owning module to use it
    public init(_ viewController: UIViewController, name: String, isScreen: Bool, device: DeviceConfig, traits: UITraitCollection = .init()) where Content == ViewControllerRepresentable<UIViewController> {
                                                                                                                ^~~~~~~~~~~~~~~~~
UIKit.UITraitCollection:2:14: note: 'UITraitCollection' has been explicitly marked unavailable here
public class UITraitCollection {
             ^
/Users/admin/builder/spi-builder-workspace/Sources/Prefire/Preview/PrefireSnapshot.swift:58:134: error: member 'init()' in 'UITraitCollection' produces result of type 'NSObject', but context expects 'UITraitCollection'
    public init(_ viewController: UIViewController, name: String, isScreen: Bool, device: DeviceConfig, traits: UITraitCollection = .init()) where Content == ViewControllerRepresentable<UIViewController> {
                                                                                                                                     ^
/Users/admin/builder/spi-builder-workspace/Sources/Prefire/Preview/PreviewModel.swift:77:34: error: 'UIView' is unavailable: This Objective-C class has only been forward-declared; import its owning module to use it
        content: @escaping () -> UIView,
                                 ^~~~~~
UIKit.UIView:2:14: note: 'UIView' has been explicitly marked unavailable here
public class UIView {
             ^
/Users/admin/builder/spi-builder-workspace/Sources/Prefire/Preview/PreviewModel.swift:88:34: error: cannot find type 'UIViewController' in scope
        content: @escaping () -> UIViewController,
                                 ^~~~~~~~~~~~~~~~
/Users/admin/builder/spi-builder-workspace/Sources/Prefire/Preview/PreviewModel.swift:88:18: error: @escaping attribute only applies to function types
        content: @escaping () -> UIViewController,
                 ^~~~~~~~~~

/Users/admin/builder/spi-builder-workspace/Sources/Prefire/Preview/UIKitRepresentable.swift:11:37: error: cannot find type 'Context' in scope
    public func makeUIView(context: Context) -> WrappedView {
                                    ^~~~~~~
/Users/admin/builder/spi-builder-workspace/Sources/Prefire/Preview/UIKitRepresentable.swift:17:62: error: cannot find type 'Context' in scope
    public func updateUIView(_ uiView: WrappedView, context: Context) { }
                                                             ^~~~~~~
/Users/admin/builder/spi-builder-workspace/Sources/Prefire/Preview/UIKitRepresentable.swift:4:55: error: cannot find type 'UIViewRepresentable' in scope
public struct ViewRepresentable<WrappedView: UIView>: UIViewRepresentable {
                                                      ^~~~~~~~~~~~~~~~~~~
/Users/admin/builder/spi-builder-workspace/Sources/Prefire/Preview/UIKitRepresentable.swift:4:46: error: 'UIView' is unavailable: This Objective-C class has only been forward-declared; import its owning module to use it
public struct ViewRepresentable<WrappedView: UIView>: UIViewRepresentable {
                                             ^~~~~~
UIKit.UIView:2:14: note: 'UIView' has been explicitly marked unavailable here
public class UIView {
             ^
/Users/admin/builder/spi-builder-workspace/Sources/Prefire/Preview/UIKitRepresentable.swift:20:66: error: cannot find type 'UIViewController' in scope
public struct ViewControllerRepresentable<WrappedViewController: UIViewController>: UIViewControllerRepresentable {
                                                                 ^~~~~~~~~~~~~~~~
/Users/admin/builder/spi-builder-workspace/Sources/Prefire/Preview/UIKitRepresentable.swift:27:47: error: cannot find type 'Context' in scope
    public func makeUIViewController(context: Context) -> WrappedViewController {
                                              ^~~~~~~
/Users/admin/builder/spi-builder-workspace/Sources/Prefire/Preview/UIKitRepresentable.swift:31:92: error: cannot find type 'Context' in scope
    public func updateUIViewController(_ uiViewController: WrappedViewController, context: Context) { }
                                                                                           ^~~~~~~
/Users/admin/builder/spi-builder-workspace/Sources/Prefire/Preview/UIKitRepresentable.swift:20:85: error: cannot find type 'UIViewControllerRepresentable' in scope
public struct ViewControllerRepresentable<WrappedViewController: UIViewController>: UIViewControllerRepresentable {
                                                                                    ^~~~~~~~~~~~~~~~~~~~~~~~~~~~~
SwiftCompile normal arm64 Compiling\ View+Prefire.swift /Users/admin/builder/spi-builder-workspace/Sources/Prefire/Preview/View+Prefire.swift (in target 'Prefire' from project 'Prefire')
    cd /Users/admin/builder/spi-builder-workspace/.swiftpm/xcode
    builtin-swiftTaskExecution -- /Applications/Xcode-16.2.0.app/Contents/Developer/Toolchains/XcodeDefault.xctoolchain/usr/bin/swift-frontend -frontend -c /Users/admin/builder/spi-builder-workspace/Sources/Prefire/Playbook/LoadingTimeModifier.swift /Users/admin/builder/spi-builder-workspace/Sources/Prefire/Playbook/PlaybookView.swift /Users/admin/builder/spi-builder-workspace/Sources/Prefire/Playbook/Scale.swift /Users/admin/builder/spi-builder-workspace/Sources/Prefire/Playbook/TransformIf.swift /Users/admin/builder/spi-builder-workspace/Sources/Prefire/Preview/PreferenceKeys.swift /Users/admin/builder/spi-builder-workspace/Sources/Prefire/Preview/PrefireProvider.swift /Users/admin/builder/spi-builder-workspace/Sources/Prefire/Preview/PrefireSnapshot.swift /Users/admin/builder/spi-builder-workspace/Sources/Prefire/Preview/PreviewLayout+Equatable.swift /Users/admin/builder/spi-builder-workspace/Sources/Prefire/Preview/PreviewModel.swift /Users/admin/builder/spi-builder-workspace/Sources/Prefire/Preview/UIKitRepresentable.swift -primary-file /Users/admin/builder/spi-builder-workspace/Sources/Prefire/Preview/View+Prefire.swift -emit-dependencies-path /Users/admin/builder/spi-builder-workspace/.derivedData/Build/Intermediates.noindex/Prefire.build/Debug-watchos/Prefire.build/Objects-normal/arm64/View+Prefire.d -emit-const-values-path /Users/admin/builder/spi-builder-workspace/.derivedData/Build/Intermediates.noindex/Prefire.build/Debug-watchos/Prefire.build/Objects-normal/arm64/View+Prefire.swiftconstvalues -emit-reference-dependencies-path /Users/admin/builder/spi-builder-workspace/.derivedData/Build/Intermediates.noindex/Prefire.build/Debug-watchos/Prefire.build/Objects-normal/arm64/View+Prefire.swiftdeps -serialize-diagnostics-path /Users/admin/builder/spi-builder-workspace/.derivedData/Build/Intermediates.noindex/Prefire.build/Debug-watchos/Prefire.build/Objects-normal/arm64/View+Prefire.dia -target arm64-apple-watchos7.0 -Xllvm -aarch64-use-tbi -enable-objc-interop -stack-check -sdk /Applications/Xcode-16.2.0.app/Contents/Developer/Platforms/WatchOS.platform/Developer/SDKs/WatchOS11.2.sdk -I /Users/admin/builder/spi-builder-workspace/.derivedData/Build/Products/Debug-watchos -I /Applications/Xcode-16.2.0.app/Contents/Developer/Platforms/WatchOS.platform/Developer/usr/lib -F /Users/admin/builder/spi-builder-workspace/.derivedData/Build/Products/Debug-watchos -F /Applications/Xcode-16.2.0.app/Contents/Developer/Platforms/WatchOS.platform/Developer/Library/Frameworks -F /Applications/Xcode-16.2.0.app/Contents/Developer/Platforms/WatchOS.platform/Developer/SDKs/WatchOS11.2.sdk/Developer/Library/Frameworks -no-color-diagnostics -enable-testing -g -debug-info-format\=dwarf -dwarf-version\=4 -module-cache-path /Users/admin/builder/spi-builder-workspace/.derivedData/ModuleCache.noindex -swift-version 6 -enforce-exclusivity\=checked -Onone -D SWIFT_PACKAGE -D DEBUG -D Xcode -serialize-debugging-options -const-gather-protocols-file /Users/admin/builder/spi-builder-workspace/.derivedData/Build/Intermediates.noindex/Prefire.build/Debug-watchos/Prefire.build/Objects-normal/arm64/Prefire_const_extract_protocols.json -enable-experimental-feature DebugDescriptionMacro -enable-experimental-feature OpaqueTypeErasure -empty-abi-descriptor -plugin-path /Applications/Xcode-16.2.0.app/Contents/Developer/Toolchains/XcodeDefault.xctoolchain/usr/lib/swift/host/plugins/testing -validate-clang-modules-once -clang-build-session-file /Users/admin/builder/spi-builder-workspace/.derivedData/ModuleCache.noindex/Session.modulevalidation -Xcc -working-directory -Xcc /Users/admin/builder/spi-builder-workspace/.swiftpm/xcode -resource-dir /Applications/Xcode-16.2.0.app/Contents/Developer/Toolchains/XcodeDefault.xctoolchain/usr/lib/swift -enable-anonymous-context-mangled-names -file-compilation-dir /Users/admin/builder/spi-builder-workspace/.swiftpm/xcode -Xcc -D_LIBCPP_HARDENING_MODE\=_LIBCPP_HARDENING_MODE_DEBUG -Xcc -ivfsstatcache -Xcc /Users/admin/builder/spi-builder-workspace/.derivedData/SDKStatCaches.noindex/watchos11.2-22S97-8cb5c683f5e64b0ecfc74e8d0065fbf6.sdkstatcache -Xcc -I/Users/admin/builder/spi-builder-workspace/.derivedData/Build/Intermediates.noindex/Prefire.build/Debug-watchos/Prefire.build/swift-overrides.hmap -Xcc -I/Users/admin/builder/spi-builder-workspace/.derivedData/Build/Products/Debug-watchos/include -Xcc -I/Users/admin/builder/spi-builder-workspace/.derivedData/Build/Intermediates.noindex/Prefire.build/Debug-watchos/Prefire.build/DerivedSources-normal/arm64 -Xcc -I/Users/admin/builder/spi-builder-workspace/.derivedData/Build/Intermediates.noindex/Prefire.build/Debug-watchos/Prefire.build/DerivedSources/arm64 -Xcc -I/Users/admin/builder/spi-builder-workspace/.derivedData/Build/Intermediates.noindex/Prefire.build/Debug-watchos/Prefire.build/DerivedSources -Xcc -DSWIFT_PACKAGE -Xcc -DDEBUG\=1 -module-name Prefire -package-name spi_builder_workspace -frontend-parseable-output -disable-clang-spi -target-sdk-version 11.2 -target-sdk-name watchos11.2 -external-plugin-path /Applications/Xcode-16.2.0.app/Contents/Developer/Platforms/WatchOS.platform/Developer/usr/lib/swift/host/plugins\#/Applications/Xcode-16.2.0.app/Contents/Developer/Platforms/WatchOS.platform/Developer/usr/bin/swift-plugin-server -external-plugin-path /Applications/Xcode-16.2.0.app/Contents/Developer/Platforms/WatchOS.platform/Developer/usr/local/lib/swift/host/plugins\#/Applications/Xcode-16.2.0.app/Contents/Developer/Platforms/WatchOS.platform/Developer/usr/bin/swift-plugin-server -plugin-path /Applications/Xcode-16.2.0.app/Contents/Developer/Toolchains/XcodeDefault.xctoolchain/usr/lib/swift/host/plugins -plugin-path /Applications/Xcode-16.2.0.app/Contents/Developer/Toolchains/XcodeDefault.xctoolchain/usr/local/lib/swift/host/plugins -o /Users/admin/builder/spi-builder-workspace/.derivedData/Build/Intermediates.noindex/Prefire.build/Debug-watchos/Prefire.build/Objects-normal/arm64/View+Prefire.o -index-unit-output-path /Prefire.build/Debug-watchos/Prefire.build/Objects-normal/arm64/View+Prefire.o -index-store-path /Users/admin/builder/spi-builder-workspace/.derivedData/Index.noindex/DataStore -index-system-modules
SwiftCompile normal arm64 /Users/admin/builder/spi-builder-workspace/Sources/Prefire/Preview/View+Prefire.swift (in target 'Prefire' from project 'Prefire')
    cd /Users/admin/builder/spi-builder-workspace/.swiftpm/xcode
    /Applications/Xcode-16.2.0.app/Contents/Developer/Toolchains/XcodeDefault.xctoolchain/usr/bin/swift-frontend -c /Users/admin/builder/spi-builder-workspace/Sources/Prefire/Playbook/LoadingTimeModifier.swift /Users/admin/builder/spi-builder-workspace/Sources/Prefire/Playbook/PlaybookView.swift /Users/admin/builder/spi-builder-workspace/Sources/Prefire/Playbook/Scale.swift /Users/admin/builder/spi-builder-workspace/Sources/Prefire/Playbook/TransformIf.swift /Users/admin/builder/spi-builder-workspace/Sources/Prefire/Preview/PreferenceKeys.swift /Users/admin/builder/spi-builder-workspace/Sources/Prefire/Preview/PrefireProvider.swift /Users/admin/builder/spi-builder-workspace/Sources/Prefire/Preview/PrefireSnapshot.swift /Users/admin/builder/spi-builder-workspace/Sources/Prefire/Preview/PreviewLayout+Equatable.swift /Users/admin/builder/spi-builder-workspace/Sources/Prefire/Preview/PreviewModel.swift /Users/admin/builder/spi-builder-workspace/Sources/Prefire/Preview/UIKitRepresentable.swift -primary-file /Users/admin/builder/spi-builder-workspace/Sources/Prefire/Preview/View+Prefire.swift -emit-dependencies-path /Users/admin/builder/spi-builder-workspace/.derivedData/Build/Intermediates.noindex/Prefire.build/Debug-watchos/Prefire.build/Objects-normal/arm64/View+Prefire.d -emit-const-values-path /Users/admin/builder/spi-builder-workspace/.derivedData/Build/Intermediates.noindex/Prefire.build/Debug-watchos/Prefire.build/Objects-normal/arm64/View+Prefire.swiftconstvalues -emit-reference-dependencies-path /Users/admin/builder/spi-builder-workspace/.derivedData/Build/Intermediates.noindex/Prefire.build/Debug-watchos/Prefire.build/Objects-normal/arm64/View+Prefire.swiftdeps -serialize-diagnostics-path /Users/admin/builder/spi-builder-workspace/.derivedData/Build/Intermediates.noindex/Prefire.build/Debug-watchos/Prefire.build/Objects-normal/arm64/View+Prefire.dia -target arm64-apple-watchos7.0 -Xllvm -aarch64-use-tbi -enable-objc-interop -stack-check -sdk /Applications/Xcode-16.2.0.app/Contents/Developer/Platforms/WatchOS.platform/Developer/SDKs/WatchOS11.2.sdk -I /Users/admin/builder/spi-builder-workspace/.derivedData/Build/Products/Debug-watchos -I /Applications/Xcode-16.2.0.app/Contents/Developer/Platforms/WatchOS.platform/Developer/usr/lib -F /Users/admin/builder/spi-builder-workspace/.derivedData/Build/Products/Debug-watchos -F /Applications/Xcode-16.2.0.app/Contents/Developer/Platforms/WatchOS.platform/Developer/Library/Frameworks -F /Applications/Xcode-16.2.0.app/Contents/Developer/Platforms/WatchOS.platform/Developer/SDKs/WatchOS11.2.sdk/Developer/Library/Frameworks -no-color-diagnostics -enable-testing -g -debug-info-format\=dwarf -dwarf-version\=4 -module-cache-path /Users/admin/builder/spi-builder-workspace/.derivedData/ModuleCache.noindex -swift-version 6 -enforce-exclusivity\=checked -Onone -D SWIFT_PACKAGE -D DEBUG -D Xcode -serialize-debugging-options -const-gather-protocols-file /Users/admin/builder/spi-builder-workspace/.derivedData/Build/Intermediates.noindex/Prefire.build/Debug-watchos/Prefire.build/Objects-normal/arm64/Prefire_const_extract_protocols.json -enable-experimental-feature DebugDescriptionMacro -enable-experimental-feature OpaqueTypeErasure -empty-abi-descriptor -plugin-path /Applications/Xcode-16.2.0.app/Contents/Developer/Toolchains/XcodeDefault.xctoolchain/usr/lib/swift/host/plugins/testing -validate-clang-modules-once -clang-build-session-file /Users/admin/builder/spi-builder-workspace/.derivedData/ModuleCache.noindex/Session.modulevalidation -Xcc -working-directory -Xcc /Users/admin/builder/spi-builder-workspace/.swiftpm/xcode -resource-dir /Applications/Xcode-16.2.0.app/Contents/Developer/Toolchains/XcodeDefault.xctoolchain/usr/lib/swift -enable-anonymous-context-mangled-names -file-compilation-dir /Users/admin/builder/spi-builder-workspace/.swiftpm/xcode -Xcc -D_LIBCPP_HARDENING_MODE\=_LIBCPP_HARDENING_MODE_DEBUG -Xcc -ivfsstatcache -Xcc /Users/admin/builder/spi-builder-workspace/.derivedData/SDKStatCaches.noindex/watchos11.2-22S97-8cb5c683f5e64b0ecfc74e8d0065fbf6.sdkstatcache -Xcc -I/Users/admin/builder/spi-builder-workspace/.derivedData/Build/Intermediates.noindex/Prefire.build/Debug-watchos/Prefire.build/swift-overrides.hmap -Xcc -I/Users/admin/builder/spi-builder-workspace/.derivedData/Build/Products/Debug-watchos/include -Xcc -I/Users/admin/builder/spi-builder-workspace/.derivedData/Build/Intermediates.noindex/Prefire.build/Debug-watchos/Prefire.build/DerivedSources-normal/arm64 -Xcc -I/Users/admin/builder/spi-builder-workspace/.derivedData/Build/Intermediates.noindex/Prefire.build/Debug-watchos/Prefire.build/DerivedSources/arm64 -Xcc -I/Users/admin/builder/spi-builder-workspace/.derivedData/Build/Intermediates.noindex/Prefire.build/Debug-watchos/Prefire.build/DerivedSources -Xcc -DSWIFT_PACKAGE -Xcc -DDEBUG\=1 -module-name Prefire -package-name spi_builder_workspace -frontend-parseable-output -disable-clang-spi -target-sdk-version 11.2 -target-sdk-name watchos11.2 -external-plugin-path /Applications/Xcode-16.2.0.app/Contents/Developer/Platforms/WatchOS.platform/Developer/usr/lib/swift/host/plugins\#/Applications/Xcode-16.2.0.app/Contents/Developer/Platforms/WatchOS.platform/Developer/usr/bin/swift-plugin-server -external-plugin-path /Applications/Xcode-16.2.0.app/Contents/Developer/Platforms/WatchOS.platform/Developer/usr/local/lib/swift/host/plugins\#/Applications/Xcode-16.2.0.app/Contents/Developer/Platforms/WatchOS.platform/Developer/usr/bin/swift-plugin-server -plugin-path /Applications/Xcode-16.2.0.app/Contents/Developer/Toolchains/XcodeDefault.xctoolchain/usr/lib/swift/host/plugins -plugin-path /Applications/Xcode-16.2.0.app/Contents/Developer/Toolchains/XcodeDefault.xctoolchain/usr/local/lib/swift/host/plugins -o /Users/admin/builder/spi-builder-workspace/.derivedData/Build/Intermediates.noindex/Prefire.build/Debug-watchos/Prefire.build/Objects-normal/arm64/View+Prefire.o -index-unit-output-path /Prefire.build/Debug-watchos/Prefire.build/Objects-normal/arm64/View+Prefire.o -index-store-path /Users/admin/builder/spi-builder-workspace/.derivedData/Index.noindex/DataStore -index-system-modules
SwiftCompile normal armv7k Compiling\ PreviewLayout+Equatable.swift /Users/admin/builder/spi-builder-workspace/Sources/Prefire/Preview/PreviewLayout+Equatable.swift (in target 'Prefire' from project 'Prefire')
    cd /Users/admin/builder/spi-builder-workspace/.swiftpm/xcode
    builtin-swiftTaskExecution -- /Applications/Xcode-16.2.0.app/Contents/Developer/Toolchains/XcodeDefault.xctoolchain/usr/bin/swift-frontend -frontend -c /Users/admin/builder/spi-builder-workspace/Sources/Prefire/Playbook/LoadingTimeModifier.swift /Users/admin/builder/spi-builder-workspace/Sources/Prefire/Playbook/PlaybookView.swift /Users/admin/builder/spi-builder-workspace/Sources/Prefire/Playbook/Scale.swift /Users/admin/builder/spi-builder-workspace/Sources/Prefire/Playbook/TransformIf.swift /Users/admin/builder/spi-builder-workspace/Sources/Prefire/Preview/PreferenceKeys.swift /Users/admin/builder/spi-builder-workspace/Sources/Prefire/Preview/PrefireProvider.swift /Users/admin/builder/spi-builder-workspace/Sources/Prefire/Preview/PrefireSnapshot.swift -primary-file /Users/admin/builder/spi-builder-workspace/Sources/Prefire/Preview/PreviewLayout+Equatable.swift /Users/admin/builder/spi-builder-workspace/Sources/Prefire/Preview/PreviewModel.swift /Users/admin/builder/spi-builder-workspace/Sources/Prefire/Preview/UIKitRepresentable.swift /Users/admin/builder/spi-builder-workspace/Sources/Prefire/Preview/View+Prefire.swift -emit-dependencies-path /Users/admin/builder/spi-builder-workspace/.derivedData/Build/Intermediates.noindex/Prefire.build/Debug-watchos/Prefire.build/Objects-normal/armv7k/PreviewLayout+Equatable.d -emit-const-values-path /Users/admin/builder/spi-builder-workspace/.derivedData/Build/Intermediates.noindex/Prefire.build/Debug-watchos/Prefire.build/Objects-normal/armv7k/PreviewLayout+Equatable.swiftconstvalues -emit-reference-dependencies-path /Users/admin/builder/spi-builder-workspace/.derivedData/Build/Intermediates.noindex/Prefire.build/Debug-watchos/Prefire.build/Objects-normal/armv7k/PreviewLayout+Equatable.swiftdeps -serialize-diagnostics-path /Users/admin/builder/spi-builder-workspace/.derivedData/Build/Intermediates.noindex/Prefire.build/Debug-watchos/Prefire.build/Objects-normal/armv7k/PreviewLayout+Equatable.dia -target armv7k-apple-watchos7.0 -enable-objc-interop -stack-check -sdk /Applications/Xcode-16.2.0.app/Contents/Developer/Platforms/WatchOS.platform/Developer/SDKs/WatchOS11.2.sdk -I /Users/admin/builder/spi-builder-workspace/.derivedData/Build/Products/Debug-watchos -I /Applications/Xcode-16.2.0.app/Contents/Developer/Platforms/WatchOS.platform/Developer/usr/lib -F /Users/admin/builder/spi-builder-workspace/.derivedData/Build/Products/Debug-watchos -F /Applications/Xcode-16.2.0.app/Contents/Developer/Platforms/WatchOS.platform/Developer/Library/Frameworks -F /Applications/Xcode-16.2.0.app/Contents/Developer/Platforms/WatchOS.platform/Developer/SDKs/WatchOS11.2.sdk/Developer/Library/Frameworks -no-color-diagnostics -enable-testing -g -debug-info-format\=dwarf -dwarf-version\=4 -module-cache-path /Users/admin/builder/spi-builder-workspace/.derivedData/ModuleCache.noindex -swift-version 6 -enforce-exclusivity\=checked -Onone -D SWIFT_PACKAGE -D DEBUG -D Xcode -serialize-debugging-options -const-gather-protocols-file /Users/admin/builder/spi-builder-workspace/.derivedData/Build/Intermediates.noindex/Prefire.build/Debug-watchos/Prefire.build/Objects-normal/armv7k/Prefire_const_extract_protocols.json -enable-experimental-feature DebugDescriptionMacro -enable-experimental-feature OpaqueTypeErasure -empty-abi-descriptor -plugin-path /Applications/Xcode-16.2.0.app/Contents/Developer/Toolchains/XcodeDefault.xctoolchain/usr/lib/swift/host/plugins/testing -validate-clang-modules-once -clang-build-session-file /Users/admin/builder/spi-builder-workspace/.derivedData/ModuleCache.noindex/Session.modulevalidation -Xcc -working-directory -Xcc /Users/admin/builder/spi-builder-workspace/.swiftpm/xcode -resource-dir /Applications/Xcode-16.2.0.app/Contents/Developer/Toolchains/XcodeDefault.xctoolchain/usr/lib/swift -enable-anonymous-context-mangled-names -file-compilation-dir /Users/admin/builder/spi-builder-workspace/.swiftpm/xcode -Xcc -D_LIBCPP_HARDENING_MODE\=_LIBCPP_HARDENING_MODE_DEBUG -Xcc -ivfsstatcache -Xcc /Users/admin/builder/spi-builder-workspace/.derivedData/SDKStatCaches.noindex/watchos11.2-22S97-8cb5c683f5e64b0ecfc74e8d0065fbf6.sdkstatcache -Xcc -I/Users/admin/builder/spi-builder-workspace/.derivedData/Build/Intermediates.noindex/Prefire.build/Debug-watchos/Prefire.build/swift-overrides.hmap -Xcc -I/Users/admin/builder/spi-builder-workspace/.derivedData/Build/Products/Debug-watchos/include -Xcc -I/Users/admin/builder/spi-builder-workspace/.derivedData/Build/Intermediates.noindex/Prefire.build/Debug-watchos/Prefire.build/DerivedSources-normal/armv7k -Xcc -I/Users/admin/builder/spi-builder-workspace/.derivedData/Build/Intermediates.noindex/Prefire.build/Debug-watchos/Prefire.build/DerivedSources/armv7k -Xcc -I/Users/admin/builder/spi-builder-workspace/.derivedData/Build/Intermediates.noindex/Prefire.build/Debug-watchos/Prefire.build/DerivedSources -Xcc -DSWIFT_PACKAGE -Xcc -DDEBUG\=1 -module-name Prefire -package-name spi_builder_workspace -frontend-parseable-output -disable-clang-spi -target-sdk-version 11.2 -target-sdk-name watchos11.2 -external-plugin-path /Applications/Xcode-16.2.0.app/Contents/Developer/Platforms/WatchOS.platform/Developer/usr/lib/swift/host/plugins\#/Applications/Xcode-16.2.0.app/Contents/Developer/Platforms/WatchOS.platform/Developer/usr/bin/swift-plugin-server -external-plugin-path /Applications/Xcode-16.2.0.app/Contents/Developer/Platforms/WatchOS.platform/Developer/usr/local/lib/swift/host/plugins\#/Applications/Xcode-16.2.0.app/Contents/Developer/Platforms/WatchOS.platform/Developer/usr/bin/swift-plugin-server -plugin-path /Applications/Xcode-16.2.0.app/Contents/Developer/Toolchains/XcodeDefault.xctoolchain/usr/lib/swift/host/plugins -plugin-path /Applications/Xcode-16.2.0.app/Contents/Developer/Toolchains/XcodeDefault.xctoolchain/usr/local/lib/swift/host/plugins -o /Users/admin/builder/spi-builder-workspace/.derivedData/Build/Intermediates.noindex/Prefire.build/Debug-watchos/Prefire.build/Objects-normal/armv7k/PreviewLayout+Equatable.o -index-unit-output-path /Prefire.build/Debug-watchos/Prefire.build/Objects-normal/armv7k/PreviewLayout+Equatable.o -index-store-path /Users/admin/builder/spi-builder-workspace/.derivedData/Index.noindex/DataStore -index-system-modules
SwiftCompile normal armv7k /Users/admin/builder/spi-builder-workspace/Sources/Prefire/Preview/PreviewLayout+Equatable.swift (in target 'Prefire' from project 'Prefire')
    cd /Users/admin/builder/spi-builder-workspace/.swiftpm/xcode
    /Applications/Xcode-16.2.0.app/Contents/Developer/Toolchains/XcodeDefault.xctoolchain/usr/bin/swift-frontend -c /Users/admin/builder/spi-builder-workspace/Sources/Prefire/Playbook/LoadingTimeModifier.swift /Users/admin/builder/spi-builder-workspace/Sources/Prefire/Playbook/PlaybookView.swift /Users/admin/builder/spi-builder-workspace/Sources/Prefire/Playbook/Scale.swift /Users/admin/builder/spi-builder-workspace/Sources/Prefire/Playbook/TransformIf.swift /Users/admin/builder/spi-builder-workspace/Sources/Prefire/Preview/PreferenceKeys.swift /Users/admin/builder/spi-builder-workspace/Sources/Prefire/Preview/PrefireProvider.swift /Users/admin/builder/spi-builder-workspace/Sources/Prefire/Preview/PrefireSnapshot.swift -primary-file /Users/admin/builder/spi-builder-workspace/Sources/Prefire/Preview/PreviewLayout+Equatable.swift /Users/admin/builder/spi-builder-workspace/Sources/Prefire/Preview/PreviewModel.swift /Users/admin/builder/spi-builder-workspace/Sources/Prefire/Preview/UIKitRepresentable.swift /Users/admin/builder/spi-builder-workspace/Sources/Prefire/Preview/View+Prefire.swift -emit-dependencies-path /Users/admin/builder/spi-builder-workspace/.derivedData/Build/Intermediates.noindex/Prefire.build/Debug-watchos/Prefire.build/Objects-normal/armv7k/PreviewLayout+Equatable.d -emit-const-values-path /Users/admin/builder/spi-builder-workspace/.derivedData/Build/Intermediates.noindex/Prefire.build/Debug-watchos/Prefire.build/Objects-normal/armv7k/PreviewLayout+Equatable.swiftconstvalues -emit-reference-dependencies-path /Users/admin/builder/spi-builder-workspace/.derivedData/Build/Intermediates.noindex/Prefire.build/Debug-watchos/Prefire.build/Objects-normal/armv7k/PreviewLayout+Equatable.swiftdeps -serialize-diagnostics-path /Users/admin/builder/spi-builder-workspace/.derivedData/Build/Intermediates.noindex/Prefire.build/Debug-watchos/Prefire.build/Objects-normal/armv7k/PreviewLayout+Equatable.dia -target armv7k-apple-watchos7.0 -enable-objc-interop -stack-check -sdk /Applications/Xcode-16.2.0.app/Contents/Developer/Platforms/WatchOS.platform/Developer/SDKs/WatchOS11.2.sdk -I /Users/admin/builder/spi-builder-workspace/.derivedData/Build/Products/Debug-watchos -I /Applications/Xcode-16.2.0.app/Contents/Developer/Platforms/WatchOS.platform/Developer/usr/lib -F /Users/admin/builder/spi-builder-workspace/.derivedData/Build/Products/Debug-watchos -F /Applications/Xcode-16.2.0.app/Contents/Developer/Platforms/WatchOS.platform/Developer/Library/Frameworks -F /Applications/Xcode-16.2.0.app/Contents/Developer/Platforms/WatchOS.platform/Developer/SDKs/WatchOS11.2.sdk/Developer/Library/Frameworks -no-color-diagnostics -enable-testing -g -debug-info-format\=dwarf -dwarf-version\=4 -module-cache-path /Users/admin/builder/spi-builder-workspace/.derivedData/ModuleCache.noindex -swift-version 6 -enforce-exclusivity\=checked -Onone -D SWIFT_PACKAGE -D DEBUG -D Xcode -serialize-debugging-options -const-gather-protocols-file /Users/admin/builder/spi-builder-workspace/.derivedData/Build/Intermediates.noindex/Prefire.build/Debug-watchos/Prefire.build/Objects-normal/armv7k/Prefire_const_extract_protocols.json -enable-experimental-feature DebugDescriptionMacro -enable-experimental-feature OpaqueTypeErasure -empty-abi-descriptor -plugin-path /Applications/Xcode-16.2.0.app/Contents/Developer/Toolchains/XcodeDefault.xctoolchain/usr/lib/swift/host/plugins/testing -validate-clang-modules-once -clang-build-session-file /Users/admin/builder/spi-builder-workspace/.derivedData/ModuleCache.noindex/Session.modulevalidation -Xcc -working-directory -Xcc /Users/admin/builder/spi-builder-workspace/.swiftpm/xcode -resource-dir /Applications/Xcode-16.2.0.app/Contents/Developer/Toolchains/XcodeDefault.xctoolchain/usr/lib/swift -enable-anonymous-context-mangled-names -file-compilation-dir /Users/admin/builder/spi-builder-workspace/.swiftpm/xcode -Xcc -D_LIBCPP_HARDENING_MODE\=_LIBCPP_HARDENING_MODE_DEBUG -Xcc -ivfsstatcache -Xcc /Users/admin/builder/spi-builder-workspace/.derivedData/SDKStatCaches.noindex/watchos11.2-22S97-8cb5c683f5e64b0ecfc74e8d0065fbf6.sdkstatcache -Xcc -I/Users/admin/builder/spi-builder-workspace/.derivedData/Build/Intermediates.noindex/Prefire.build/Debug-watchos/Prefire.build/swift-overrides.hmap -Xcc -I/Users/admin/builder/spi-builder-workspace/.derivedData/Build/Products/Debug-watchos/include -Xcc -I/Users/admin/builder/spi-builder-workspace/.derivedData/Build/Intermediates.noindex/Prefire.build/Debug-watchos/Prefire.build/DerivedSources-normal/armv7k -Xcc -I/Users/admin/builder/spi-builder-workspace/.derivedData/Build/Intermediates.noindex/Prefire.build/Debug-watchos/Prefire.build/DerivedSources/armv7k -Xcc -I/Users/admin/builder/spi-builder-workspace/.derivedData/Build/Intermediates.noindex/Prefire.build/Debug-watchos/Prefire.build/DerivedSources -Xcc -DSWIFT_PACKAGE -Xcc -DDEBUG\=1 -module-name Prefire -package-name spi_builder_workspace -frontend-parseable-output -disable-clang-spi -target-sdk-version 11.2 -target-sdk-name watchos11.2 -external-plugin-path /Applications/Xcode-16.2.0.app/Contents/Developer/Platforms/WatchOS.platform/Developer/usr/lib/swift/host/plugins\#/Applications/Xcode-16.2.0.app/Contents/Developer/Platforms/WatchOS.platform/Developer/usr/bin/swift-plugin-server -external-plugin-path /Applications/Xcode-16.2.0.app/Contents/Developer/Platforms/WatchOS.platform/Developer/usr/local/lib/swift/host/plugins\#/Applications/Xcode-16.2.0.app/Contents/Developer/Platforms/WatchOS.platform/Developer/usr/bin/swift-plugin-server -plugin-path /Applications/Xcode-16.2.0.app/Contents/Developer/Toolchains/XcodeDefault.xctoolchain/usr/lib/swift/host/plugins -plugin-path /Applications/Xcode-16.2.0.app/Contents/Developer/Toolchains/XcodeDefault.xctoolchain/usr/local/lib/swift/host/plugins -o /Users/admin/builder/spi-builder-workspace/.derivedData/Build/Intermediates.noindex/Prefire.build/Debug-watchos/Prefire.build/Objects-normal/armv7k/PreviewLayout+Equatable.o -index-unit-output-path /Prefire.build/Debug-watchos/Prefire.build/Objects-normal/armv7k/PreviewLayout+Equatable.o -index-store-path /Users/admin/builder/spi-builder-workspace/.derivedData/Index.noindex/DataStore -index-system-modules
SwiftCompile normal arm64 Compiling\ PrefireSnapshot.swift /Users/admin/builder/spi-builder-workspace/Sources/Prefire/Preview/PrefireSnapshot.swift (in target 'Prefire' from project 'Prefire')
    cd /Users/admin/builder/spi-builder-workspace/.swiftpm/xcode
    builtin-swiftTaskExecution -- /Applications/Xcode-16.2.0.app/Contents/Developer/Toolchains/XcodeDefault.xctoolchain/usr/bin/swift-frontend -frontend -c /Users/admin/builder/spi-builder-workspace/Sources/Prefire/Playbook/LoadingTimeModifier.swift /Users/admin/builder/spi-builder-workspace/Sources/Prefire/Playbook/PlaybookView.swift /Users/admin/builder/spi-builder-workspace/Sources/Prefire/Playbook/Scale.swift /Users/admin/builder/spi-builder-workspace/Sources/Prefire/Playbook/TransformIf.swift /Users/admin/builder/spi-builder-workspace/Sources/Prefire/Preview/PreferenceKeys.swift /Users/admin/builder/spi-builder-workspace/Sources/Prefire/Preview/PrefireProvider.swift -primary-file /Users/admin/builder/spi-builder-workspace/Sources/Prefire/Preview/PrefireSnapshot.swift /Users/admin/builder/spi-builder-workspace/Sources/Prefire/Preview/PreviewLayout+Equatable.swift /Users/admin/builder/spi-builder-workspace/Sources/Prefire/Preview/PreviewModel.swift /Users/admin/builder/spi-builder-workspace/Sources/Prefire/Preview/UIKitRepresentable.swift /Users/admin/builder/spi-builder-workspace/Sources/Prefire/Preview/View+Prefire.swift -emit-dependencies-path /Users/admin/builder/spi-builder-workspace/.derivedData/Build/Intermediates.noindex/Prefire.build/Debug-watchos/Prefire.build/Objects-normal/arm64/PrefireSnapshot.d -emit-const-values-path /Users/admin/builder/spi-builder-workspace/.derivedData/Build/Intermediates.noindex/Prefire.build/Debug-watchos/Prefire.build/Objects-normal/arm64/PrefireSnapshot.swiftconstvalues -emit-reference-dependencies-path /Users/admin/builder/spi-builder-workspace/.derivedData/Build/Intermediates.noindex/Prefire.build/Debug-watchos/Prefire.build/Objects-normal/arm64/PrefireSnapshot.swiftdeps -serialize-diagnostics-path /Users/admin/builder/spi-builder-workspace/.derivedData/Build/Intermediates.noindex/Prefire.build/Debug-watchos/Prefire.build/Objects-normal/arm64/PrefireSnapshot.dia -target arm64-apple-watchos7.0 -Xllvm -aarch64-use-tbi -enable-objc-interop -stack-check -sdk /Applications/Xcode-16.2.0.app/Contents/Developer/Platforms/WatchOS.platform/Developer/SDKs/WatchOS11.2.sdk -I /Users/admin/builder/spi-builder-workspace/.derivedData/Build/Products/Debug-watchos -I /Applications/Xcode-16.2.0.app/Contents/Developer/Platforms/WatchOS.platform/Developer/usr/lib -F /Users/admin/builder/spi-builder-workspace/.derivedData/Build/Products/Debug-watchos -F /Applications/Xcode-16.2.0.app/Contents/Developer/Platforms/WatchOS.platform/Developer/Library/Frameworks -F /Applications/Xcode-16.2.0.app/Contents/Developer/Platforms/WatchOS.platform/Developer/SDKs/WatchOS11.2.sdk/Developer/Library/Frameworks -no-color-diagnostics -enable-testing -g -debug-info-format\=dwarf -dwarf-version\=4 -module-cache-path /Users/admin/builder/spi-builder-workspace/.derivedData/ModuleCache.noindex -swift-version 6 -enforce-exclusivity\=checked -Onone -D SWIFT_PACKAGE -D DEBUG -D Xcode -serialize-debugging-options -const-gather-protocols-file /Users/admin/builder/spi-builder-workspace/.derivedData/Build/Intermediates.noindex/Prefire.build/Debug-watchos/Prefire.build/Objects-normal/arm64/Prefire_const_extract_protocols.json -enable-experimental-feature DebugDescriptionMacro -enable-experimental-feature OpaqueTypeErasure -empty-abi-descriptor -plugin-path /Applications/Xcode-16.2.0.app/Contents/Developer/Toolchains/XcodeDefault.xctoolchain/usr/lib/swift/host/plugins/testing -validate-clang-modules-once -clang-build-session-file /Users/admin/builder/spi-builder-workspace/.derivedData/ModuleCache.noindex/Session.modulevalidation -Xcc -working-directory -Xcc /Users/admin/builder/spi-builder-workspace/.swiftpm/xcode -resource-dir /Applications/Xcode-16.2.0.app/Contents/Developer/Toolchains/XcodeDefault.xctoolchain/usr/lib/swift -enable-anonymous-context-mangled-names -file-compilation-dir /Users/admin/builder/spi-builder-workspace/.swiftpm/xcode -Xcc -D_LIBCPP_HARDENING_MODE\=_LIBCPP_HARDENING_MODE_DEBUG -Xcc -ivfsstatcache -Xcc /Users/admin/builder/spi-builder-workspace/.derivedData/SDKStatCaches.noindex/watchos11.2-22S97-8cb5c683f5e64b0ecfc74e8d0065fbf6.sdkstatcache -Xcc -I/Users/admin/builder/spi-builder-workspace/.derivedData/Build/Intermediates.noindex/Prefire.build/Debug-watchos/Prefire.build/swift-overrides.hmap -Xcc -I/Users/admin/builder/spi-builder-workspace/.derivedData/Build/Products/Debug-watchos/include -Xcc -I/Users/admin/builder/spi-builder-workspace/.derivedData/Build/Intermediates.noindex/Prefire.build/Debug-watchos/Prefire.build/DerivedSources-normal/arm64 -Xcc -I/Users/admin/builder/spi-builder-workspace/.derivedData/Build/Intermediates.noindex/Prefire.build/Debug-watchos/Prefire.build/DerivedSources/arm64 -Xcc -I/Users/admin/builder/spi-builder-workspace/.derivedData/Build/Intermediates.noindex/Prefire.build/Debug-watchos/Prefire.build/DerivedSources -Xcc -DSWIFT_PACKAGE -Xcc -DDEBUG\=1 -module-name Prefire -package-name spi_builder_workspace -frontend-parseable-output -disable-clang-spi -target-sdk-version 11.2 -target-sdk-name watchos11.2 -external-plugin-path /Applications/Xcode-16.2.0.app/Contents/Developer/Platforms/WatchOS.platform/Developer/usr/lib/swift/host/plugins\#/Applications/Xcode-16.2.0.app/Contents/Developer/Platforms/WatchOS.platform/Developer/usr/bin/swift-plugin-server -external-plugin-path /Applications/Xcode-16.2.0.app/Contents/Developer/Platforms/WatchOS.platform/Developer/usr/local/lib/swift/host/plugins\#/Applications/Xcode-16.2.0.app/Contents/Developer/Platforms/WatchOS.platform/Developer/usr/bin/swift-plugin-server -plugin-path /Applications/Xcode-16.2.0.app/Contents/Developer/Toolchains/XcodeDefault.xctoolchain/usr/lib/swift/host/plugins -plugin-path /Applications/Xcode-16.2.0.app/Contents/Developer/Toolchains/XcodeDefault.xctoolchain/usr/local/lib/swift/host/plugins -o /Users/admin/builder/spi-builder-workspace/.derivedData/Build/Intermediates.noindex/Prefire.build/Debug-watchos/Prefire.build/Objects-normal/arm64/PrefireSnapshot.o -index-unit-output-path /Prefire.build/Debug-watchos/Prefire.build/Objects-normal/arm64/PrefireSnapshot.o -index-store-path /Users/admin/builder/spi-builder-workspace/.derivedData/Index.noindex/DataStore -index-system-modules
Command SwiftCompile failed with a nonzero exit code
** BUILD FAILED **
The following build commands failed:
	SwiftEmitModule normal armv7k Emitting\ module\ for\ Prefire (in target 'Prefire' from project 'Prefire')
	EmitSwiftModule normal armv7k (in target 'Prefire' from project 'Prefire')
	SwiftEmitModule normal arm64 Emitting\ module\ for\ Prefire (in target 'Prefire' from project 'Prefire')
	EmitSwiftModule normal arm64 (in target 'Prefire' from project 'Prefire')
	SwiftEmitModule normal arm64_32 Emitting\ module\ for\ Prefire (in target 'Prefire' from project 'Prefire')
	EmitSwiftModule normal arm64_32 (in target 'Prefire' from project 'Prefire')
	SwiftCompile normal arm64 Compiling\ PrefireSnapshot.swift /Users/admin/builder/spi-builder-workspace/Sources/Prefire/Preview/PrefireSnapshot.swift (in target 'Prefire' from project 'Prefire')
	Building workspace spi-builder-workspace with scheme Prefire
(8 failures)
BUILD FAILURE 6.0 watchOS