The Swift Package Index logo.Swift Package Index

Track the adoption of Swift 6 strict concurrency checks for data race safety. How many packages are Ready for Swift 6?

Build Information

Failed to build APNGKit, reference master (995386), with Swift 6.0 for Linux on 30 Nov 2024 18:34:37 UTC.

Build Command

bash -c docker run --pull=always --rm -v "checkouts-4609320-0":/host -w "$PWD" registry.gitlab.com/finestructure/spi-images:basic-6.0-latest swift build --triple x86_64-unknown-linux-gnu -Xswiftc -Xfrontend -Xswiftc -stats-output-dir -Xswiftc -Xfrontend -Xswiftc .stats -Xswiftc -strict-concurrency=complete -Xswiftc -enable-upcoming-feature -Xswiftc StrictConcurrency -Xswiftc -enable-upcoming-feature -Xswiftc DisableOutwardActorInference -Xswiftc -enable-upcoming-feature -Xswiftc GlobalActorIsolatedTypesUsability -Xswiftc -enable-upcoming-feature -Xswiftc InferSendableFromCaptures 2>&1

Build Log

========================================
RunAll
========================================
Builder version: 4.58.1
Interrupt handler set up.
========================================
Checkout
========================================
Clone URL: https://github.com/onevcat/APNGKit.git
Reference: master
Initialized empty Git repository in /host/spi-builder-workspace/.git/
hint: Using 'master' as the name for the initial branch. This default branch name
hint: is subject to change. To configure the initial branch name to use in all
hint: of your new repositories, which will suppress this warning, call:
hint:
hint: 	git config --global init.defaultBranch <name>
hint:
hint: Names commonly chosen instead of 'master' are 'main', 'trunk' and
hint: 'development'. The just-created branch can be renamed via this command:
hint:
hint: 	git branch -m <name>
From https://github.com/onevcat/APNGKit
 * branch            master     -> FETCH_HEAD
 * [new branch]      master     -> origin/master
HEAD is now at 9953862 Bump version to 2.3.0
Cloned https://github.com/onevcat/APNGKit.git
Revision (git rev-parse @):
995386261326bce7ff19879cac84b6f27ce35629
SUCCESS checkout https://github.com/onevcat/APNGKit.git at master
========================================
Build
========================================
Selected platform:         linux
Swift version:             6.0
Building package at path:  $PWD
https://github.com/onevcat/APNGKit.git
Running build ...
bash -c docker run --pull=always --rm -v "checkouts-4609320-0":/host -w "$PWD" registry.gitlab.com/finestructure/spi-images:basic-6.0-latest swift build --triple x86_64-unknown-linux-gnu -Xswiftc -Xfrontend -Xswiftc -stats-output-dir -Xswiftc -Xfrontend -Xswiftc .stats -Xswiftc -strict-concurrency=complete -Xswiftc -enable-upcoming-feature -Xswiftc StrictConcurrency -Xswiftc -enable-upcoming-feature -Xswiftc DisableOutwardActorInference -Xswiftc -enable-upcoming-feature -Xswiftc GlobalActorIsolatedTypesUsability -Xswiftc -enable-upcoming-feature -Xswiftc InferSendableFromCaptures 2>&1
basic-6.0-latest: Pulling from finestructure/spi-images
Digest: sha256:47d26c99ca4f1ac0a332c85fd5b13ff4390e72115219984a57a68fe9d1063a05
Status: Image is up to date for registry.gitlab.com/finestructure/spi-images:basic-6.0-latest
Fetching https://github.com/onevcat/Delegate.git
[1/48] Fetching delegate
Fetched https://github.com/onevcat/Delegate.git from cache (0.16s)
Computing version for https://github.com/onevcat/Delegate.git
Computed https://github.com/onevcat/Delegate.git at 1.3.0 (1.77s)
Creating working copy for https://github.com/onevcat/Delegate.git
Working copy of https://github.com/onevcat/Delegate.git resolved at 1.3.0
Building for debugging...
[0/4] Write sources
[2/4] Copying PrivacyInfo.xcprivacy
[3/4] Write swift-version-24593BA9C3E375BF.txt
[5/6] Compiling Delegate Delegate.swift
[6/6] Emitting module Delegate
[8/20] Compiling APNGKit APNGImageView.swift
/host/spi-builder-workspace/Source/APNGKit/APNGDecoder.swift:9:8: error: no such module 'Accelerate'
  7 |
  8 | import Foundation
  9 | import Accelerate
    |        `- error: no such module 'Accelerate'
 10 | import ImageIO
 11 | import zlib
[9/20] Compiling APNGKit APNGKitError.swift
/host/spi-builder-workspace/Source/APNGKit/APNGDecoder.swift:9:8: error: no such module 'Accelerate'
  7 |
  8 | import Foundation
  9 | import Accelerate
    |        `- error: no such module 'Accelerate'
 10 | import ImageIO
 11 | import zlib
[10/21] Compiling APNGKit resource_bundle_accessor.swift
/host/spi-builder-workspace/Source/APNGKit/APNGDecoder.swift:9:8: error: no such module 'Accelerate'
  7 |
  8 | import Foundation
  9 | import Accelerate
    |        `- error: no such module 'Accelerate'
 10 | import ImageIO
 11 | import zlib
[11/21] Compiling APNGKit Reader.swift
/host/spi-builder-workspace/Source/APNGKit/APNGDecoder.swift:9:8: error: no such module 'Accelerate'
  7 |
  8 | import Foundation
  9 | import Accelerate
    |        `- error: no such module 'Accelerate'
 10 | import ImageIO
 11 | import zlib
[12/21] Compiling APNGKit LogLevel.swift
/host/spi-builder-workspace/Source/APNGKit/APNGDecoder.swift:9:8: error: no such module 'Accelerate'
  7 |
  8 | import Foundation
  9 | import Accelerate
    |        `- error: no such module 'Accelerate'
 10 | import ImageIO
 11 | import zlib
[13/21] Compiling APNGKit Chunk.swift
/host/spi-builder-workspace/Source/APNGKit/APNGDecoder.swift:9:8: error: no such module 'Accelerate'
  7 |
  8 | import Foundation
  9 | import Accelerate
    |        `- error: no such module 'Accelerate'
 10 | import ImageIO
 11 | import zlib
[14/21] Compiling APNGKit CrossPlatform.swift
/host/spi-builder-workspace/Source/APNGKit/APNGDecoder.swift:9:8: error: no such module 'Accelerate'
  7 |
  8 | import Foundation
  9 | import Accelerate
    |        `- error: no such module 'Accelerate'
 10 | import ImageIO
 11 | import zlib
[15/21] Compiling APNGKit DisplayTimer.swift
/host/spi-builder-workspace/Source/APNGKit/APNGDecoder.swift:9:8: error: no such module 'Accelerate'
  7 |
  8 | import Foundation
  9 | import Accelerate
    |        `- error: no such module 'Accelerate'
 10 | import ImageIO
 11 | import zlib
[16/21] Compiling APNGKit Extensions.swift
/host/spi-builder-workspace/Source/APNGKit/APNGDecoder.swift:9:8: error: no such module 'Accelerate'
  7 |
  8 | import Foundation
  9 | import Accelerate
    |        `- error: no such module 'Accelerate'
 10 | import ImageIO
 11 | import zlib
error: emit-module command failed with exit code 1 (use -v to see invocation)
[17/21] Emitting module APNGKit
/host/spi-builder-workspace/Source/APNGKit/APNGDecoder.swift:9:8: error: no such module 'Accelerate'
  7 |
  8 | import Foundation
  9 | import Accelerate
    |        `- error: no such module 'Accelerate'
 10 | import ImageIO
 11 | import zlib
[18/21] Compiling APNGKit APNGDecoder.swift
/host/spi-builder-workspace/Source/APNGKit/APNGDecoder.swift:9:8: error: no such module 'Accelerate'
  7 |
  8 | import Foundation
  9 | import Accelerate
    |        `- error: no such module 'Accelerate'
 10 | import ImageIO
 11 | import zlib
[19/21] Compiling APNGKit APNGImage.DecodingOptions.swift
/host/spi-builder-workspace/Source/APNGKit/APNGDecoder.swift:9:8: error: no such module 'Accelerate'
  7 |
  8 | import Foundation
  9 | import Accelerate
    |        `- error: no such module 'Accelerate'
 10 | import ImageIO
 11 | import zlib
[20/21] Compiling APNGKit APNGImage.swift
/host/spi-builder-workspace/Source/APNGKit/APNGDecoder.swift:9:8: error: no such module 'Accelerate'
  7 |
  8 | import Foundation
  9 | import Accelerate
    |        `- error: no such module 'Accelerate'
 10 | import ImageIO
 11 | import zlib
[21/21] Compiling APNGKit APNGImageRenderer.swift
/host/spi-builder-workspace/Source/APNGKit/APNGDecoder.swift:9:8: error: no such module 'Accelerate'
  7 |
  8 | import Foundation
  9 | import Accelerate
    |        `- error: no such module 'Accelerate'
 10 | import ImageIO
 11 | import zlib
BUILD FAILURE 6.0 linux