Build Information
Failed to build MetaversePythonFramework, reference v3.11.7 (e2f4ba
), with Swift 6.0 for Linux on 1 Dec 2024 08:30:49 UTC.
Build Command
bash -c docker run --pull=always --rm -v "checkouts-4606859-0":/host -w "$PWD" registry.gitlab.com/finestructure/spi-images:basic-6.0-latest swift build --triple x86_64-unknown-linux-gnu -Xswiftc -Xfrontend -Xswiftc -stats-output-dir -Xswiftc -Xfrontend -Xswiftc .stats -Xswiftc -strict-concurrency=complete -Xswiftc -enable-upcoming-feature -Xswiftc StrictConcurrency -Xswiftc -enable-upcoming-feature -Xswiftc DisableOutwardActorInference -Xswiftc -enable-upcoming-feature -Xswiftc GlobalActorIsolatedTypesUsability -Xswiftc -enable-upcoming-feature -Xswiftc InferSendableFromCaptures 2>&1
Build Log
========================================
RunAll
========================================
Builder version: 4.58.1
Interrupt handler set up.
========================================
Checkout
========================================
Clone URL: https://github.com/wabiverse/MetaversePythonFramework.git
Reference: v3.11.7
Initialized empty Git repository in /host/spi-builder-workspace/.git/
hint: Using 'master' as the name for the initial branch. This default branch name
hint: is subject to change. To configure the initial branch name to use in all
hint: of your new repositories, which will suppress this warning, call:
hint:
hint: git config --global init.defaultBranch <name>
hint:
hint: Names commonly chosen instead of 'master' are 'main', 'trunk' and
hint: 'development'. The just-created branch can be renamed via this command:
hint:
hint: git branch -m <name>
From https://github.com/wabiverse/MetaversePythonFramework
* tag v3.11.7 -> FETCH_HEAD
HEAD is now at e2f4ba8 Fix visionOS headers.
Updating files: 20% (1026/5030)
Updating files: 21% (1057/5030)
Updating files: 22% (1107/5030)
Updating files: 23% (1157/5030)
Updating files: 24% (1208/5030)
Updating files: 25% (1258/5030)
Updating files: 26% (1308/5030)
Updating files: 27% (1359/5030)
Updating files: 28% (1409/5030)
Updating files: 29% (1459/5030)
Updating files: 30% (1509/5030)
Updating files: 31% (1560/5030)
Updating files: 32% (1610/5030)
Updating files: 33% (1660/5030)
Updating files: 34% (1711/5030)
Updating files: 35% (1761/5030)
Updating files: 36% (1811/5030)
Updating files: 37% (1862/5030)
Updating files: 38% (1912/5030)
Updating files: 39% (1962/5030)
Updating files: 40% (2012/5030)
Updating files: 41% (2063/5030)
Updating files: 42% (2113/5030)
Updating files: 43% (2163/5030)
Updating files: 44% (2214/5030)
Updating files: 45% (2264/5030)
Updating files: 46% (2314/5030)
Updating files: 47% (2365/5030)
Updating files: 48% (2415/5030)
Updating files: 49% (2465/5030)
Updating files: 50% (2515/5030)
Updating files: 51% (2566/5030)
Updating files: 52% (2616/5030)
Updating files: 53% (2666/5030)
Updating files: 54% (2717/5030)
Updating files: 55% (2767/5030)
Updating files: 56% (2817/5030)
Updating files: 57% (2868/5030)
Updating files: 58% (2918/5030)
Updating files: 59% (2968/5030)
Updating files: 60% (3018/5030)
Updating files: 61% (3069/5030)
Updating files: 62% (3119/5030)
Updating files: 63% (3169/5030)
Updating files: 64% (3220/5030)
Updating files: 65% (3270/5030)
Updating files: 66% (3320/5030)
Updating files: 67% (3371/5030)
Updating files: 68% (3421/5030)
Updating files: 69% (3471/5030)
Updating files: 70% (3521/5030)
Updating files: 71% (3572/5030)
Updating files: 72% (3622/5030)
Updating files: 73% (3672/5030)
Updating files: 74% (3723/5030)
Updating files: 75% (3773/5030)
Updating files: 76% (3823/5030)
Updating files: 77% (3874/5030)
Updating files: 78% (3924/5030)
Updating files: 79% (3974/5030)
Updating files: 80% (4024/5030)
Updating files: 81% (4075/5030)
Updating files: 82% (4125/5030)
Updating files: 83% (4175/5030)
Updating files: 84% (4226/5030)
Updating files: 85% (4276/5030)
Updating files: 86% (4326/5030)
Updating files: 87% (4377/5030)
Updating files: 88% (4427/5030)
Updating files: 89% (4477/5030)
Updating files: 90% (4527/5030)
Updating files: 91% (4578/5030)
Updating files: 92% (4628/5030)
Updating files: 93% (4678/5030)
Updating files: 94% (4729/5030)
Updating files: 95% (4779/5030)
Updating files: 96% (4829/5030)
Updating files: 97% (4880/5030)
Updating files: 98% (4930/5030)
Updating files: 99% (4980/5030)
Updating files: 100% (5030/5030)
Updating files: 100% (5030/5030), done.
Cloned https://github.com/wabiverse/MetaversePythonFramework.git
Revision (git rev-parse @):
e2f4ba867b7e287a283a27a0005ab64deef14279
SUCCESS checkout https://github.com/wabiverse/MetaversePythonFramework.git at v3.11.7
========================================
Build
========================================
Selected platform: linux
Swift version: 6.0
Building package at path: $PWD
https://github.com/wabiverse/MetaversePythonFramework.git
Running build ...
bash -c docker run --pull=always --rm -v "checkouts-4606859-0":/host -w "$PWD" registry.gitlab.com/finestructure/spi-images:basic-6.0-latest swift build --triple x86_64-unknown-linux-gnu -Xswiftc -Xfrontend -Xswiftc -stats-output-dir -Xswiftc -Xfrontend -Xswiftc .stats -Xswiftc -strict-concurrency=complete -Xswiftc -enable-upcoming-feature -Xswiftc StrictConcurrency -Xswiftc -enable-upcoming-feature -Xswiftc DisableOutwardActorInference -Xswiftc -enable-upcoming-feature -Xswiftc GlobalActorIsolatedTypesUsability -Xswiftc -enable-upcoming-feature -Xswiftc InferSendableFromCaptures 2>&1
basic-6.0-latest: Pulling from finestructure/spi-images
Digest: sha256:47d26c99ca4f1ac0a332c85fd5b13ff4390e72115219984a57a68fe9d1063a05
Status: Image is up to date for registry.gitlab.com/finestructure/spi-images:basic-6.0-latest
Fetching https://github.com/pvieito/PythonKit.git
[1/1633] Fetching pythonkit
Fetched https://github.com/pvieito/PythonKit.git from cache (0.21s)
Computing version for https://github.com/pvieito/PythonKit.git
Computed https://github.com/pvieito/PythonKit.git at 0.5.0 (2.03s)
Creating working copy for https://github.com/pvieito/PythonKit.git
Working copy of https://github.com/pvieito/PythonKit.git resolved at 0.5.0
Building for debugging...
[0/4] Write sources
[2/4] Write swift-version-24593BA9C3E375BF.txt
[3/9] Copying python
[5/9] Compiling PythonKit NumpyConversion.swift
[6/9] Emitting module PythonKit
[7/9] Compiling PythonKit Python.swift
[8/9] Compiling PythonKit PythonLibrary+Symbols.swift
[9/9] Compiling PythonKit PythonLibrary.swift
error: emit-module command failed with exit code 1 (use -v to see invocation)
[11/13] Emitting module PyBundle
/host/spi-builder-workspace/Sources/PyBundle/PyBundler.swift:25:8: error: no such module 'Python'
23 |
24 | import Foundation
25 | import Python
| `- error: no such module 'Python'
26 | import PythonKit
27 |
[12/13] Compiling PyBundle resource_bundle_accessor.swift
/host/spi-builder-workspace/Sources/PyBundle/PyBundler.swift:25:8: error: no such module 'Python'
23 |
24 | import Foundation
25 | import Python
| `- error: no such module 'Python'
26 | import PythonKit
27 |
[13/13] Compiling PyBundle PyBundler.swift
/host/spi-builder-workspace/Sources/PyBundle/PyBundler.swift:25:8: error: no such module 'Python'
23 |
24 | import Foundation
25 | import Python
| `- error: no such module 'Python'
26 | import PythonKit
27 |
BUILD FAILURE 6.0 linux