Build Information
Failed to build SwiftTheming, reference main (1042f7
), with Swift 6.0 for visionOS using Xcode 16.2 on 28 Nov 2024 23:31:15 UTC.
Build Command
env DEVELOPER_DIR=/Applications/Xcode-16.1.0.app xcrun xcodebuild -IDEClonedSourcePackagesDirPathOverride=$PWD/.dependencies -skipMacroValidation -skipPackagePluginValidation -derivedDataPath $PWD/.derivedData build -scheme SwiftTheming -destination generic/platform=xrOS OTHER_SWIFT_FLAGS=-stats-output-dir .stats -strict-concurrency=complete -enable-upcoming-feature StrictConcurrency -enable-upcoming-feature DisableOutwardActorInference -enable-upcoming-feature GlobalActorIsolatedTypesUsability -enable-upcoming-feature InferSendableFromCaptures
Build Log
/Users/admin/builder/spi-builder-workspace/Sources/SwiftTheming/ThemeProvider/ThemeProvider.swift:6:16: warning: static property 'shared' is not concurrency-safe because non-'Sendable' type 'ThemeProvider' may have shared mutable state; this is an error in the Swift 6 language mode
static let shared: ThemeProvider = ThemeProvider()
^
/Users/admin/builder/spi-builder-workspace/Sources/SwiftTheming/ThemeProvider/ThemeProvider.swift:5:14: note: class 'ThemeProvider' does not conform to the 'Sendable' protocol
public class ThemeProvider: ObservableObject {
^
/Users/admin/builder/spi-builder-workspace/Sources/SwiftTheming/ThemeProvider/ThemeProvider.swift:6:16: note: annotate 'shared' with '@MainActor' if property should only be accessed from the main actor
static let shared: ThemeProvider = ThemeProvider()
^
@MainActor
/Users/admin/builder/spi-builder-workspace/Sources/SwiftTheming/ThemeProvider/ThemeProvider.swift:6:16: note: disable concurrency-safety checks if accesses are protected by an external synchronization mechanism
static let shared: ThemeProvider = ThemeProvider()
^
nonisolated(unsafe)
SwiftDriverJobDiscovery normal arm64 Compiling Appearance.swift, PreferredAppearance.swift, AssetKeyWrappable.swift (in target 'SwiftTheming' from project 'SwiftTheming')
SwiftDriver\ Compilation\ Requirements SwiftTheming normal arm64 com.apple.xcode.tools.swift.compiler (in target 'SwiftTheming' from project 'SwiftTheming')
cd /Users/admin/builder/spi-builder-workspace/.swiftpm/xcode
builtin-Swift-Compilation-Requirements -- /Applications/Xcode-16.1.0.app/Contents/Developer/Toolchains/XcodeDefault.xctoolchain/usr/bin/swiftc -module-name SwiftTheming -Onone -enforce-exclusivity\=checked @/Users/admin/builder/spi-builder-workspace/.derivedData/Build/Intermediates.noindex/SwiftTheming.build/Debug-xros/SwiftTheming.build/Objects-normal/arm64/SwiftTheming.SwiftFileList -DSWIFT_PACKAGE -DDEBUG -stats-output-dir .stats -strict-concurrency\=complete -enable-upcoming-feature StrictConcurrency -enable-upcoming-feature DisableOutwardActorInference -enable-upcoming-feature GlobalActorIsolatedTypesUsability -enable-upcoming-feature InferSendableFromCaptures -plugin-path /Applications/Xcode-16.1.0.app/Contents/Developer/Toolchains/XcodeDefault.xctoolchain/usr/lib/swift/host/plugins/testing -enable-experimental-feature DebugDescriptionMacro -sdk /Applications/Xcode-16.1.0.app/Contents/Developer/Platforms/XROS.platform/Developer/SDKs/XROS2.1.sdk -target arm64-apple-xros1.0 -g -module-cache-path /Users/admin/builder/spi-builder-workspace/.derivedData/ModuleCache.noindex -Xfrontend -serialize-debugging-options -profile-coverage-mapping -profile-generate -enable-testing -index-store-path /Users/admin/builder/spi-builder-workspace/.derivedData/Index.noindex/DataStore -enable-experimental-feature OpaqueTypeErasure -Xcc -D_LIBCPP_HARDENING_MODE\=_LIBCPP_HARDENING_MODE_DEBUG -swift-version 5 -I /Users/admin/builder/spi-builder-workspace/.derivedData/Build/Products/Debug-xros -I /Applications/Xcode-16.1.0.app/Contents/Developer/Platforms/XROS.platform/Developer/usr/lib -F /Users/admin/builder/spi-builder-workspace/.derivedData/Build/Products/Debug-xros -F /Applications/Xcode-16.1.0.app/Contents/Developer/Platforms/XROS.platform/Developer/Library/Frameworks -F /Applications/Xcode-16.1.0.app/Contents/Developer/Platforms/XROS.platform/Developer/SDKs/XROS2.1.sdk/Developer/Library/Frameworks -c -j10 -enable-batch-mode -incremental -Xcc -ivfsstatcache -Xcc /Users/admin/builder/spi-builder-workspace/.derivedData/SDKStatCaches.noindex/xros2.1-22N573-02bafd7f43846583f0400bd788fa10b7.sdkstatcache -output-file-map /Users/admin/builder/spi-builder-workspace/.derivedData/Build/Intermediates.noindex/SwiftTheming.build/Debug-xros/SwiftTheming.build/Objects-normal/arm64/SwiftTheming-OutputFileMap.json -use-frontend-parseable-output -save-temps -no-color-diagnostics -serialize-diagnostics -emit-dependencies -emit-module -emit-module-path /Users/admin/builder/spi-builder-workspace/.derivedData/Build/Intermediates.noindex/SwiftTheming.build/Debug-xros/SwiftTheming.build/Objects-normal/arm64/SwiftTheming.swiftmodule -validate-clang-modules-once -clang-build-session-file /Users/admin/builder/spi-builder-workspace/.derivedData/ModuleCache.noindex/Session.modulevalidation -Xcc -I/Users/admin/builder/spi-builder-workspace/.derivedData/Build/Intermediates.noindex/SwiftTheming.build/Debug-xros/SwiftTheming.build/swift-overrides.hmap -emit-const-values -Xfrontend -const-gather-protocols-file -Xfrontend /Users/admin/builder/spi-builder-workspace/.derivedData/Build/Intermediates.noindex/SwiftTheming.build/Debug-xros/SwiftTheming.build/Objects-normal/arm64/SwiftTheming_const_extract_protocols.json -Xcc -I/Users/admin/builder/spi-builder-workspace/.derivedData/Build/Products/Debug-xros/include -Xcc -I/Users/admin/builder/spi-builder-workspace/.derivedData/Build/Intermediates.noindex/SwiftTheming.build/Debug-xros/SwiftTheming.build/DerivedSources-normal/arm64 -Xcc -I/Users/admin/builder/spi-builder-workspace/.derivedData/Build/Intermediates.noindex/SwiftTheming.build/Debug-xros/SwiftTheming.build/DerivedSources/arm64 -Xcc -I/Users/admin/builder/spi-builder-workspace/.derivedData/Build/Intermediates.noindex/SwiftTheming.build/Debug-xros/SwiftTheming.build/DerivedSources -Xcc -DSWIFT_PACKAGE -Xcc -DDEBUG\=1 -emit-objc-header -emit-objc-header-path /Users/admin/builder/spi-builder-workspace/.derivedData/Build/Intermediates.noindex/SwiftTheming.build/Debug-xros/SwiftTheming.build/Objects-normal/arm64/SwiftTheming-Swift.h -working-directory /Users/admin/builder/spi-builder-workspace/.swiftpm/xcode -experimental-emit-module-separately -disable-cmo
SwiftMergeGeneratedHeaders /Users/admin/builder/spi-builder-workspace/.derivedData/Build/Intermediates.noindex/GeneratedModuleMaps-xros/SwiftTheming-Swift.h /Users/admin/builder/spi-builder-workspace/.derivedData/Build/Intermediates.noindex/SwiftTheming.build/Debug-xros/SwiftTheming.build/Objects-normal/arm64/SwiftTheming-Swift.h (in target 'SwiftTheming' from project 'SwiftTheming')
cd /Users/admin/builder/spi-builder-workspace
builtin-swiftHeaderTool -arch arm64 /Users/admin/builder/spi-builder-workspace/.derivedData/Build/Intermediates.noindex/SwiftTheming.build/Debug-xros/SwiftTheming.build/Objects-normal/arm64/SwiftTheming-Swift.h -o /Users/admin/builder/spi-builder-workspace/.derivedData/Build/Intermediates.noindex/GeneratedModuleMaps-xros/SwiftTheming-Swift.h
Copy /Users/admin/builder/spi-builder-workspace/.derivedData/Build/Products/Debug-xros/SwiftTheming.swiftmodule/arm64-apple-xros.swiftmodule /Users/admin/builder/spi-builder-workspace/.derivedData/Build/Intermediates.noindex/SwiftTheming.build/Debug-xros/SwiftTheming.build/Objects-normal/arm64/SwiftTheming.swiftmodule (in target 'SwiftTheming' from project 'SwiftTheming')
cd /Users/admin/builder/spi-builder-workspace
builtin-copy -exclude .DS_Store -exclude CVS -exclude .svn -exclude .git -exclude .hg -resolve-src-symlinks -rename /Users/admin/builder/spi-builder-workspace/.derivedData/Build/Intermediates.noindex/SwiftTheming.build/Debug-xros/SwiftTheming.build/Objects-normal/arm64/SwiftTheming.swiftmodule /Users/admin/builder/spi-builder-workspace/.derivedData/Build/Products/Debug-xros/SwiftTheming.swiftmodule/arm64-apple-xros.swiftmodule
Copy /Users/admin/builder/spi-builder-workspace/.derivedData/Build/Products/Debug-xros/SwiftTheming.swiftmodule/arm64-apple-xros.swiftdoc /Users/admin/builder/spi-builder-workspace/.derivedData/Build/Intermediates.noindex/SwiftTheming.build/Debug-xros/SwiftTheming.build/Objects-normal/arm64/SwiftTheming.swiftdoc (in target 'SwiftTheming' from project 'SwiftTheming')
cd /Users/admin/builder/spi-builder-workspace
builtin-copy -exclude .DS_Store -exclude CVS -exclude .svn -exclude .git -exclude .hg -resolve-src-symlinks -rename /Users/admin/builder/spi-builder-workspace/.derivedData/Build/Intermediates.noindex/SwiftTheming.build/Debug-xros/SwiftTheming.build/Objects-normal/arm64/SwiftTheming.swiftdoc /Users/admin/builder/spi-builder-workspace/.derivedData/Build/Products/Debug-xros/SwiftTheming.swiftmodule/arm64-apple-xros.swiftdoc
Copy /Users/admin/builder/spi-builder-workspace/.derivedData/Build/Products/Debug-xros/SwiftTheming.swiftmodule/arm64-apple-xros.abi.json /Users/admin/builder/spi-builder-workspace/.derivedData/Build/Intermediates.noindex/SwiftTheming.build/Debug-xros/SwiftTheming.build/Objects-normal/arm64/SwiftTheming.abi.json (in target 'SwiftTheming' from project 'SwiftTheming')
cd /Users/admin/builder/spi-builder-workspace
builtin-copy -exclude .DS_Store -exclude CVS -exclude .svn -exclude .git -exclude .hg -resolve-src-symlinks -rename /Users/admin/builder/spi-builder-workspace/.derivedData/Build/Intermediates.noindex/SwiftTheming.build/Debug-xros/SwiftTheming.build/Objects-normal/arm64/SwiftTheming.abi.json /Users/admin/builder/spi-builder-workspace/.derivedData/Build/Products/Debug-xros/SwiftTheming.swiftmodule/arm64-apple-xros.abi.json
Copy /Users/admin/builder/spi-builder-workspace/.derivedData/Build/Products/Debug-xros/SwiftTheming.swiftmodule/Project/arm64-apple-xros.swiftsourceinfo /Users/admin/builder/spi-builder-workspace/.derivedData/Build/Intermediates.noindex/SwiftTheming.build/Debug-xros/SwiftTheming.build/Objects-normal/arm64/SwiftTheming.swiftsourceinfo (in target 'SwiftTheming' from project 'SwiftTheming')
cd /Users/admin/builder/spi-builder-workspace
builtin-copy -exclude .DS_Store -exclude CVS -exclude .svn -exclude .git -exclude .hg -resolve-src-symlinks -rename /Users/admin/builder/spi-builder-workspace/.derivedData/Build/Intermediates.noindex/SwiftTheming.build/Debug-xros/SwiftTheming.build/Objects-normal/arm64/SwiftTheming.swiftsourceinfo /Users/admin/builder/spi-builder-workspace/.derivedData/Build/Products/Debug-xros/SwiftTheming.swiftmodule/Project/arm64-apple-xros.swiftsourceinfo
SwiftDriverJobDiscovery normal arm64 Compiling Themed.swift, ThemeProvider.swift (in target 'SwiftTheming' from project 'SwiftTheming')
SwiftDriverJobDiscovery normal arm64 Compiling ImageSet.swift, Color++.swift (in target 'SwiftTheming' from project 'SwiftTheming')
SwiftDriverJobDiscovery normal arm64 Compiling View++.swift, DefaultTheming.swift (in target 'SwiftTheming' from project 'SwiftTheming')
SwiftDriverJobDiscovery normal arm64 Compiling Font++.swift, Gradient++.swift (in target 'SwiftTheming' from project 'SwiftTheming')
** BUILD FAILED **
The following build commands failed:
SwiftCompile normal arm64 /Users/admin/builder/spi-builder-workspace/Sources/SwiftTheming/ThemeProvider/ThemeProviding.swift (in target 'SwiftTheming' from project 'SwiftTheming')
SwiftCompile normal arm64 Compiling\ ThemeProviding.swift,\ ThemeProvidingViewModifier.swift /Users/admin/builder/spi-builder-workspace/Sources/SwiftTheming/ThemeProvider/ThemeProviding.swift /Users/admin/builder/spi-builder-workspace/Sources/SwiftTheming/ThemeProvider/ThemeProvidingViewModifier.swift (in target 'SwiftTheming' from project 'SwiftTheming')
Building workspace spi-builder-workspace with scheme SwiftTheming
(3 failures)
Command line invocation:
/Applications/Xcode-16.1.0.app/Contents/Developer/usr/bin/xcodebuild -IDEClonedSourcePackagesDirPathOverride=/Users/admin/builder/spi-builder-workspace/.dependencies -skipMacroValidation -skipPackagePluginValidation -derivedDataPath /Users/admin/builder/spi-builder-workspace/.derivedData build -scheme SwiftTheming -destination generic/platform=xrOS "OTHER_SWIFT_FLAGS=-stats-output-dir .stats -strict-concurrency=complete -enable-upcoming-feature StrictConcurrency -enable-upcoming-feature DisableOutwardActorInference -enable-upcoming-feature GlobalActorIsolatedTypesUsability -enable-upcoming-feature InferSendableFromCaptures"
User defaults from command line:
IDEClonedSourcePackagesDirPathOverride = /Users/admin/builder/spi-builder-workspace/.dependencies
IDEDerivedDataPathOverride = /Users/admin/builder/spi-builder-workspace/.derivedData
IDEPackageSupportUseBuiltinSCM = YES
Build settings from command line:
OTHER_SWIFT_FLAGS = -stats-output-dir .stats -strict-concurrency=complete -enable-upcoming-feature StrictConcurrency -enable-upcoming-feature DisableOutwardActorInference -enable-upcoming-feature GlobalActorIsolatedTypesUsability -enable-upcoming-feature InferSendableFromCaptures
Resolve Package Graph
Resolved source packages:
SwiftTheming: /Users/admin/builder/spi-builder-workspace
ViewInspector: https://github.com/nalexn/ViewInspector.git @ 0.9.0 (0d54687)
SwiftDocCPlugin: https://github.com/apple/swift-docc-plugin @ 1.4.3
SymbolKit: https://github.com/swiftlang/swift-docc-symbolkit @ 1.0.0
Prepare packages
ComputeTargetDependencyGraph
note: Building targets in dependency order
note: Target dependency graph (2 targets)
Target 'SwiftTheming' in project 'SwiftTheming'
➜ Explicit dependency on target 'SwiftTheming' in project 'SwiftTheming'
Target 'SwiftTheming' in project 'SwiftTheming' (no dependencies)
GatherProvisioningInputs
CreateBuildDescription
ClangStatCache /Applications/Xcode-16.1.0.app/Contents/Developer/Toolchains/XcodeDefault.xctoolchain/usr/bin/clang-stat-cache /Applications/Xcode-16.1.0.app/Contents/Developer/Platforms/XROS.platform/Developer/SDKs/XROS2.1.sdk /Users/admin/builder/spi-builder-workspace/.derivedData/SDKStatCaches.noindex/xros2.1-22N573-02bafd7f43846583f0400bd788fa10b7.sdkstatcache
cd /Users/admin/builder/spi-builder-workspace/.swiftpm/xcode
/Applications/Xcode-16.1.0.app/Contents/Developer/Toolchains/XcodeDefault.xctoolchain/usr/bin/clang-stat-cache /Applications/Xcode-16.1.0.app/Contents/Developer/Platforms/XROS.platform/Developer/SDKs/XROS2.1.sdk -o /Users/admin/builder/spi-builder-workspace/.derivedData/SDKStatCaches.noindex/xros2.1-22N573-02bafd7f43846583f0400bd788fa10b7.sdkstatcache
SwiftDriver SwiftTheming normal arm64 com.apple.xcode.tools.swift.compiler (in target 'SwiftTheming' from project 'SwiftTheming')
cd /Users/admin/builder/spi-builder-workspace/.swiftpm/xcode
builtin-SwiftDriver -- /Applications/Xcode-16.1.0.app/Contents/Developer/Toolchains/XcodeDefault.xctoolchain/usr/bin/swiftc -module-name SwiftTheming -Onone -enforce-exclusivity\=checked @/Users/admin/builder/spi-builder-workspace/.derivedData/Build/Intermediates.noindex/SwiftTheming.build/Debug-xros/SwiftTheming.build/Objects-normal/arm64/SwiftTheming.SwiftFileList -DSWIFT_PACKAGE -DDEBUG -stats-output-dir .stats -strict-concurrency\=complete -enable-upcoming-feature StrictConcurrency -enable-upcoming-feature DisableOutwardActorInference -enable-upcoming-feature GlobalActorIsolatedTypesUsability -enable-upcoming-feature InferSendableFromCaptures -plugin-path /Applications/Xcode-16.1.0.app/Contents/Developer/Toolchains/XcodeDefault.xctoolchain/usr/lib/swift/host/plugins/testing -enable-experimental-feature DebugDescriptionMacro -sdk /Applications/Xcode-16.1.0.app/Contents/Developer/Platforms/XROS.platform/Developer/SDKs/XROS2.1.sdk -target arm64-apple-xros1.0 -g -module-cache-path /Users/admin/builder/spi-builder-workspace/.derivedData/ModuleCache.noindex -Xfrontend -serialize-debugging-options -profile-coverage-mapping -profile-generate -enable-testing -index-store-path /Users/admin/builder/spi-builder-workspace/.derivedData/Index.noindex/DataStore -enable-experimental-feature OpaqueTypeErasure -Xcc -D_LIBCPP_HARDENING_MODE\=_LIBCPP_HARDENING_MODE_DEBUG -swift-version 5 -I /Users/admin/builder/spi-builder-workspace/.derivedData/Build/Products/Debug-xros -I /Applications/Xcode-16.1.0.app/Contents/Developer/Platforms/XROS.platform/Developer/usr/lib -F /Users/admin/builder/spi-builder-workspace/.derivedData/Build/Products/Debug-xros -F /Applications/Xcode-16.1.0.app/Contents/Developer/Platforms/XROS.platform/Developer/Library/Frameworks -F /Applications/Xcode-16.1.0.app/Contents/Developer/Platforms/XROS.platform/Developer/SDKs/XROS2.1.sdk/Developer/Library/Frameworks -c -j10 -enable-batch-mode -incremental -Xcc -ivfsstatcache -Xcc /Users/admin/builder/spi-builder-workspace/.derivedData/SDKStatCaches.noindex/xros2.1-22N573-02bafd7f43846583f0400bd788fa10b7.sdkstatcache -output-file-map /Users/admin/builder/spi-builder-workspace/.derivedData/Build/Intermediates.noindex/SwiftTheming.build/Debug-xros/SwiftTheming.build/Objects-normal/arm64/SwiftTheming-OutputFileMap.json -use-frontend-parseable-output -save-temps -no-color-diagnostics -serialize-diagnostics -emit-dependencies -emit-module -emit-module-path /Users/admin/builder/spi-builder-workspace/.derivedData/Build/Intermediates.noindex/SwiftTheming.build/Debug-xros/SwiftTheming.build/Objects-normal/arm64/SwiftTheming.swiftmodule -validate-clang-modules-once -clang-build-session-file /Users/admin/builder/spi-builder-workspace/.derivedData/ModuleCache.noindex/Session.modulevalidation -Xcc -I/Users/admin/builder/spi-builder-workspace/.derivedData/Build/Intermediates.noindex/SwiftTheming.build/Debug-xros/SwiftTheming.build/swift-overrides.hmap -emit-const-values -Xfrontend -const-gather-protocols-file -Xfrontend /Users/admin/builder/spi-builder-workspace/.derivedData/Build/Intermediates.noindex/SwiftTheming.build/Debug-xros/SwiftTheming.build/Objects-normal/arm64/SwiftTheming_const_extract_protocols.json -Xcc -I/Users/admin/builder/spi-builder-workspace/.derivedData/Build/Products/Debug-xros/include -Xcc -I/Users/admin/builder/spi-builder-workspace/.derivedData/Build/Intermediates.noindex/SwiftTheming.build/Debug-xros/SwiftTheming.build/DerivedSources-normal/arm64 -Xcc -I/Users/admin/builder/spi-builder-workspace/.derivedData/Build/Intermediates.noindex/SwiftTheming.build/Debug-xros/SwiftTheming.build/DerivedSources/arm64 -Xcc -I/Users/admin/builder/spi-builder-workspace/.derivedData/Build/Intermediates.noindex/SwiftTheming.build/Debug-xros/SwiftTheming.build/DerivedSources -Xcc -DSWIFT_PACKAGE -Xcc -DDEBUG\=1 -emit-objc-header -emit-objc-header-path /Users/admin/builder/spi-builder-workspace/.derivedData/Build/Intermediates.noindex/SwiftTheming.build/Debug-xros/SwiftTheming.build/Objects-normal/arm64/SwiftTheming-Swift.h -working-directory /Users/admin/builder/spi-builder-workspace/.swiftpm/xcode -experimental-emit-module-separately -disable-cmo
SwiftCompile normal arm64 Compiling\ ThemeProvidingViewModifier.swift /Users/admin/builder/spi-builder-workspace/Sources/SwiftTheming/ThemeProvider/ThemeProvidingViewModifier.swift (in target 'SwiftTheming' from project 'SwiftTheming')
cd /Users/admin/builder/spi-builder-workspace/.swiftpm/xcode
builtin-swiftTaskExecution -- /Applications/Xcode-16.1.0.app/Contents/Developer/Toolchains/XcodeDefault.xctoolchain/usr/bin/swift-frontend -frontend -c /Users/admin/builder/spi-builder-workspace/Sources/SwiftTheming/Appearance/Appearance.swift /Users/admin/builder/spi-builder-workspace/Sources/SwiftTheming/Appearance/PreferredAppearance.swift /Users/admin/builder/spi-builder-workspace/Sources/SwiftTheming/Asset/AssetKeyWrappable.swift /Users/admin/builder/spi-builder-workspace/Sources/SwiftTheming/Asset/Assetable.swift /Users/admin/builder/spi-builder-workspace/Sources/SwiftTheming/Asset/EmptyAsset.swift /Users/admin/builder/spi-builder-workspace/Sources/SwiftTheming/Asset/Sets/ColorSet.swift /Users/admin/builder/spi-builder-workspace/Sources/SwiftTheming/Asset/Sets/FontSet.swift /Users/admin/builder/spi-builder-workspace/Sources/SwiftTheming/Asset/Sets/GradientSet.swift /Users/admin/builder/spi-builder-workspace/Sources/SwiftTheming/Asset/Sets/ImageSet.swift /Users/admin/builder/spi-builder-workspace/Sources/SwiftTheming/Extensions/Color++.swift /Users/admin/builder/spi-builder-workspace/Sources/SwiftTheming/Extensions/Font++.swift /Users/admin/builder/spi-builder-workspace/Sources/SwiftTheming/Extensions/Gradient++.swift /Users/admin/builder/spi-builder-workspace/Sources/SwiftTheming/Extensions/Image++.swift /Users/admin/builder/spi-builder-workspace/Sources/SwiftTheming/Extensions/UserDefaults++.swift /Users/admin/builder/spi-builder-workspace/Sources/SwiftTheming/Extensions/View++.swift /Users/admin/builder/spi-builder-workspace/Sources/SwiftTheming/Theme/DefaultTheming.swift /Users/admin/builder/spi-builder-workspace/Sources/SwiftTheming/Theme/Theme.swift /Users/admin/builder/spi-builder-workspace/Sources/SwiftTheming/Theme/Themeable.swift /Users/admin/builder/spi-builder-workspace/Sources/SwiftTheming/Theme/Themed.swift /Users/admin/builder/spi-builder-workspace/Sources/SwiftTheming/ThemeProvider/ThemeProvider.swift /Users/admin/builder/spi-builder-workspace/Sources/SwiftTheming/ThemeProvider/ThemeProviding.swift -primary-file /Users/admin/builder/spi-builder-workspace/Sources/SwiftTheming/ThemeProvider/ThemeProvidingViewModifier.swift -emit-dependencies-path /Users/admin/builder/spi-builder-workspace/.derivedData/Build/Intermediates.noindex/SwiftTheming.build/Debug-xros/SwiftTheming.build/Objects-normal/arm64/ThemeProvidingViewModifier.d -emit-const-values-path /Users/admin/builder/spi-builder-workspace/.derivedData/Build/Intermediates.noindex/SwiftTheming.build/Debug-xros/SwiftTheming.build/Objects-normal/arm64/ThemeProvidingViewModifier.swiftconstvalues -emit-reference-dependencies-path /Users/admin/builder/spi-builder-workspace/.derivedData/Build/Intermediates.noindex/SwiftTheming.build/Debug-xros/SwiftTheming.build/Objects-normal/arm64/ThemeProvidingViewModifier.swiftdeps -serialize-diagnostics-path /Users/admin/builder/spi-builder-workspace/.derivedData/Build/Intermediates.noindex/SwiftTheming.build/Debug-xros/SwiftTheming.build/Objects-normal/arm64/ThemeProvidingViewModifier.dia -target arm64-apple-xros1.0 -Xllvm -aarch64-use-tbi -enable-objc-interop -stack-check -sdk /Applications/Xcode-16.1.0.app/Contents/Developer/Platforms/XROS.platform/Developer/SDKs/XROS2.1.sdk -I /Users/admin/builder/spi-builder-workspace/.derivedData/Build/Products/Debug-xros -I /Applications/Xcode-16.1.0.app/Contents/Developer/Platforms/XROS.platform/Developer/usr/lib -F /Users/admin/builder/spi-builder-workspace/.derivedData/Build/Products/Debug-xros -F /Applications/Xcode-16.1.0.app/Contents/Developer/Platforms/XROS.platform/Developer/Library/Frameworks -F /Applications/Xcode-16.1.0.app/Contents/Developer/Platforms/XROS.platform/Developer/SDKs/XROS2.1.sdk/Developer/Library/Frameworks -no-color-diagnostics -enable-testing -g -debug-info-format\=dwarf -dwarf-version\=4 -module-cache-path /Users/admin/builder/spi-builder-workspace/.derivedData/ModuleCache.noindex -profile-generate -profile-coverage-mapping -swift-version 5 -enforce-exclusivity\=checked -stats-output-dir /Users/admin/builder/spi-builder-workspace/.swiftpm/xcode/.stats -Onone -D SWIFT_PACKAGE -D DEBUG -serialize-debugging-options -const-gather-protocols-file /Users/admin/builder/spi-builder-workspace/.derivedData/Build/Intermediates.noindex/SwiftTheming.build/Debug-xros/SwiftTheming.build/Objects-normal/arm64/SwiftTheming_const_extract_protocols.json -enable-experimental-feature DebugDescriptionMacro -enable-experimental-feature OpaqueTypeErasure -enable-upcoming-feature StrictConcurrency -enable-upcoming-feature DisableOutwardActorInference -enable-upcoming-feature GlobalActorIsolatedTypesUsability -enable-upcoming-feature InferSendableFromCaptures -strict-concurrency\=complete -empty-abi-descriptor -plugin-path /Applications/Xcode-16.1.0.app/Contents/Developer/Toolchains/XcodeDefault.xctoolchain/usr/lib/swift/host/plugins/testing -validate-clang-modules-once -clang-build-session-file /Users/admin/builder/spi-builder-workspace/.derivedData/ModuleCache.noindex/Session.modulevalidation -Xcc -working-directory -Xcc /Users/admin/builder/spi-builder-workspace/.swiftpm/xcode -resource-dir /Applications/Xcode-16.1.0.app/Contents/Developer/Toolchains/XcodeDefault.xctoolchain/usr/lib/swift -enable-anonymous-context-mangled-names -file-compilation-dir /Users/admin/builder/spi-builder-workspace/.swiftpm/xcode -Xcc -D_LIBCPP_HARDENING_MODE\=_LIBCPP_HARDENING_MODE_DEBUG -Xcc -ivfsstatcache -Xcc /Users/admin/builder/spi-builder-workspace/.derivedData/SDKStatCaches.noindex/xros2.1-22N573-02bafd7f43846583f0400bd788fa10b7.sdkstatcache -Xcc -I/Users/admin/builder/spi-builder-workspace/.derivedData/Build/Intermediates.noindex/SwiftTheming.build/Debug-xros/SwiftTheming.build/swift-overrides.hmap -Xcc -I/Users/admin/builder/spi-builder-workspace/.derivedData/Build/Products/Debug-xros/include -Xcc -I/Users/admin/builder/spi-builder-workspace/.derivedData/Build/Intermediates.noindex/SwiftTheming.build/Debug-xros/SwiftTheming.build/DerivedSources-normal/arm64 -Xcc -I/Users/admin/builder/spi-builder-workspace/.derivedData/Build/Intermediates.noindex/SwiftTheming.build/Debug-xros/SwiftTheming.build/DerivedSources/arm64 -Xcc -I/Users/admin/builder/spi-builder-workspace/.derivedData/Build/Intermediates.noindex/SwiftTheming.build/Debug-xros/SwiftTheming.build/DerivedSources -Xcc -DSWIFT_PACKAGE -Xcc -DDEBUG\=1 -module-name SwiftTheming -frontend-parseable-output -disable-clang-spi -target-sdk-version 2.1 -target-sdk-name xros2.1 -external-plugin-path /Applications/Xcode-16.1.0.app/Contents/Developer/Platforms/XROS.platform/Developer/usr/lib/swift/host/plugins\#/Applications/Xcode-16.1.0.app/Contents/Developer/Platforms/XROS.platform/Developer/usr/bin/swift-plugin-server -external-plugin-path /Applications/Xcode-16.1.0.app/Contents/Developer/Platforms/XROS.platform/Developer/usr/local/lib/swift/host/plugins\#/Applications/Xcode-16.1.0.app/Contents/Developer/Platforms/XROS.platform/Developer/usr/bin/swift-plugin-server -plugin-path /Applications/Xcode-16.1.0.app/Contents/Developer/Toolchains/XcodeDefault.xctoolchain/usr/lib/swift/host/plugins -plugin-path /Applications/Xcode-16.1.0.app/Contents/Developer/Toolchains/XcodeDefault.xctoolchain/usr/local/lib/swift/host/plugins -o /Users/admin/builder/spi-builder-workspace/.derivedData/Build/Intermediates.noindex/SwiftTheming.build/Debug-xros/SwiftTheming.build/Objects-normal/arm64/ThemeProvidingViewModifier.o -index-unit-output-path /SwiftTheming.build/Debug-xros/SwiftTheming.build/Objects-normal/arm64/ThemeProvidingViewModifier.o -index-store-path /Users/admin/builder/spi-builder-workspace/.derivedData/Index.noindex/DataStore -index-system-modules
SwiftCompile normal arm64 /Users/admin/builder/spi-builder-workspace/Sources/SwiftTheming/ThemeProvider/ThemeProvidingViewModifier.swift (in target 'SwiftTheming' from project 'SwiftTheming')
cd /Users/admin/builder/spi-builder-workspace/.swiftpm/xcode
/Applications/Xcode-16.1.0.app/Contents/Developer/Toolchains/XcodeDefault.xctoolchain/usr/bin/swift-frontend -c /Users/admin/builder/spi-builder-workspace/Sources/SwiftTheming/Appearance/Appearance.swift /Users/admin/builder/spi-builder-workspace/Sources/SwiftTheming/Appearance/PreferredAppearance.swift /Users/admin/builder/spi-builder-workspace/Sources/SwiftTheming/Asset/AssetKeyWrappable.swift /Users/admin/builder/spi-builder-workspace/Sources/SwiftTheming/Asset/Assetable.swift /Users/admin/builder/spi-builder-workspace/Sources/SwiftTheming/Asset/EmptyAsset.swift /Users/admin/builder/spi-builder-workspace/Sources/SwiftTheming/Asset/Sets/ColorSet.swift /Users/admin/builder/spi-builder-workspace/Sources/SwiftTheming/Asset/Sets/FontSet.swift /Users/admin/builder/spi-builder-workspace/Sources/SwiftTheming/Asset/Sets/GradientSet.swift /Users/admin/builder/spi-builder-workspace/Sources/SwiftTheming/Asset/Sets/ImageSet.swift /Users/admin/builder/spi-builder-workspace/Sources/SwiftTheming/Extensions/Color++.swift /Users/admin/builder/spi-builder-workspace/Sources/SwiftTheming/Extensions/Font++.swift /Users/admin/builder/spi-builder-workspace/Sources/SwiftTheming/Extensions/Gradient++.swift /Users/admin/builder/spi-builder-workspace/Sources/SwiftTheming/Extensions/Image++.swift /Users/admin/builder/spi-builder-workspace/Sources/SwiftTheming/Extensions/UserDefaults++.swift /Users/admin/builder/spi-builder-workspace/Sources/SwiftTheming/Extensions/View++.swift /Users/admin/builder/spi-builder-workspace/Sources/SwiftTheming/Theme/DefaultTheming.swift /Users/admin/builder/spi-builder-workspace/Sources/SwiftTheming/Theme/Theme.swift /Users/admin/builder/spi-builder-workspace/Sources/SwiftTheming/Theme/Themeable.swift /Users/admin/builder/spi-builder-workspace/Sources/SwiftTheming/Theme/Themed.swift /Users/admin/builder/spi-builder-workspace/Sources/SwiftTheming/ThemeProvider/ThemeProvider.swift /Users/admin/builder/spi-builder-workspace/Sources/SwiftTheming/ThemeProvider/ThemeProviding.swift -primary-file /Users/admin/builder/spi-builder-workspace/Sources/SwiftTheming/ThemeProvider/ThemeProvidingViewModifier.swift -emit-dependencies-path /Users/admin/builder/spi-builder-workspace/.derivedData/Build/Intermediates.noindex/SwiftTheming.build/Debug-xros/SwiftTheming.build/Objects-normal/arm64/ThemeProvidingViewModifier.d -emit-const-values-path /Users/admin/builder/spi-builder-workspace/.derivedData/Build/Intermediates.noindex/SwiftTheming.build/Debug-xros/SwiftTheming.build/Objects-normal/arm64/ThemeProvidingViewModifier.swiftconstvalues -emit-reference-dependencies-path /Users/admin/builder/spi-builder-workspace/.derivedData/Build/Intermediates.noindex/SwiftTheming.build/Debug-xros/SwiftTheming.build/Objects-normal/arm64/ThemeProvidingViewModifier.swiftdeps -serialize-diagnostics-path /Users/admin/builder/spi-builder-workspace/.derivedData/Build/Intermediates.noindex/SwiftTheming.build/Debug-xros/SwiftTheming.build/Objects-normal/arm64/ThemeProvidingViewModifier.dia -target arm64-apple-xros1.0 -Xllvm -aarch64-use-tbi -enable-objc-interop -stack-check -sdk /Applications/Xcode-16.1.0.app/Contents/Developer/Platforms/XROS.platform/Developer/SDKs/XROS2.1.sdk -I /Users/admin/builder/spi-builder-workspace/.derivedData/Build/Products/Debug-xros -I /Applications/Xcode-16.1.0.app/Contents/Developer/Platforms/XROS.platform/Developer/usr/lib -F /Users/admin/builder/spi-builder-workspace/.derivedData/Build/Products/Debug-xros -F /Applications/Xcode-16.1.0.app/Contents/Developer/Platforms/XROS.platform/Developer/Library/Frameworks -F /Applications/Xcode-16.1.0.app/Contents/Developer/Platforms/XROS.platform/Developer/SDKs/XROS2.1.sdk/Developer/Library/Frameworks -no-color-diagnostics -enable-testing -g -debug-info-format\=dwarf -dwarf-version\=4 -module-cache-path /Users/admin/builder/spi-builder-workspace/.derivedData/ModuleCache.noindex -profile-generate -profile-coverage-mapping -swift-version 5 -enforce-exclusivity\=checked -stats-output-dir /Users/admin/builder/spi-builder-workspace/.swiftpm/xcode/.stats -Onone -D SWIFT_PACKAGE -D DEBUG -serialize-debugging-options -const-gather-protocols-file /Users/admin/builder/spi-builder-workspace/.derivedData/Build/Intermediates.noindex/SwiftTheming.build/Debug-xros/SwiftTheming.build/Objects-normal/arm64/SwiftTheming_const_extract_protocols.json -enable-experimental-feature DebugDescriptionMacro -enable-experimental-feature OpaqueTypeErasure -enable-upcoming-feature StrictConcurrency -enable-upcoming-feature DisableOutwardActorInference -enable-upcoming-feature GlobalActorIsolatedTypesUsability -enable-upcoming-feature InferSendableFromCaptures -strict-concurrency\=complete -empty-abi-descriptor -plugin-path /Applications/Xcode-16.1.0.app/Contents/Developer/Toolchains/XcodeDefault.xctoolchain/usr/lib/swift/host/plugins/testing -validate-clang-modules-once -clang-build-session-file /Users/admin/builder/spi-builder-workspace/.derivedData/ModuleCache.noindex/Session.modulevalidation -Xcc -working-directory -Xcc /Users/admin/builder/spi-builder-workspace/.swiftpm/xcode -resource-dir /Applications/Xcode-16.1.0.app/Contents/Developer/Toolchains/XcodeDefault.xctoolchain/usr/lib/swift -enable-anonymous-context-mangled-names -file-compilation-dir /Users/admin/builder/spi-builder-workspace/.swiftpm/xcode -Xcc -D_LIBCPP_HARDENING_MODE\=_LIBCPP_HARDENING_MODE_DEBUG -Xcc -ivfsstatcache -Xcc /Users/admin/builder/spi-builder-workspace/.derivedData/SDKStatCaches.noindex/xros2.1-22N573-02bafd7f43846583f0400bd788fa10b7.sdkstatcache -Xcc -I/Users/admin/builder/spi-builder-workspace/.derivedData/Build/Intermediates.noindex/SwiftTheming.build/Debug-xros/SwiftTheming.build/swift-overrides.hmap -Xcc -I/Users/admin/builder/spi-builder-workspace/.derivedData/Build/Products/Debug-xros/include -Xcc -I/Users/admin/builder/spi-builder-workspace/.derivedData/Build/Intermediates.noindex/SwiftTheming.build/Debug-xros/SwiftTheming.build/DerivedSources-normal/arm64 -Xcc -I/Users/admin/builder/spi-builder-workspace/.derivedData/Build/Intermediates.noindex/SwiftTheming.build/Debug-xros/SwiftTheming.build/DerivedSources/arm64 -Xcc -I/Users/admin/builder/spi-builder-workspace/.derivedData/Build/Intermediates.noindex/SwiftTheming.build/Debug-xros/SwiftTheming.build/DerivedSources -Xcc -DSWIFT_PACKAGE -Xcc -DDEBUG\=1 -module-name SwiftTheming -frontend-parseable-output -disable-clang-spi -target-sdk-version 2.1 -target-sdk-name xros2.1 -external-plugin-path /Applications/Xcode-16.1.0.app/Contents/Developer/Platforms/XROS.platform/Developer/usr/lib/swift/host/plugins\#/Applications/Xcode-16.1.0.app/Contents/Developer/Platforms/XROS.platform/Developer/usr/bin/swift-plugin-server -external-plugin-path /Applications/Xcode-16.1.0.app/Contents/Developer/Platforms/XROS.platform/Developer/usr/local/lib/swift/host/plugins\#/Applications/Xcode-16.1.0.app/Contents/Developer/Platforms/XROS.platform/Developer/usr/bin/swift-plugin-server -plugin-path /Applications/Xcode-16.1.0.app/Contents/Developer/Toolchains/XcodeDefault.xctoolchain/usr/lib/swift/host/plugins -plugin-path /Applications/Xcode-16.1.0.app/Contents/Developer/Toolchains/XcodeDefault.xctoolchain/usr/local/lib/swift/host/plugins -o /Users/admin/builder/spi-builder-workspace/.derivedData/Build/Intermediates.noindex/SwiftTheming.build/Debug-xros/SwiftTheming.build/Objects-normal/arm64/ThemeProvidingViewModifier.o -index-unit-output-path /SwiftTheming.build/Debug-xros/SwiftTheming.build/Objects-normal/arm64/ThemeProvidingViewModifier.o -index-store-path /Users/admin/builder/spi-builder-workspace/.derivedData/Index.noindex/DataStore -index-system-modules
SwiftCompile normal arm64 Compiling\ Theme.swift /Users/admin/builder/spi-builder-workspace/Sources/SwiftTheming/Theme/Theme.swift (in target 'SwiftTheming' from project 'SwiftTheming')
cd /Users/admin/builder/spi-builder-workspace/.swiftpm/xcode
builtin-swiftTaskExecution -- /Applications/Xcode-16.1.0.app/Contents/Developer/Toolchains/XcodeDefault.xctoolchain/usr/bin/swift-frontend -frontend -c /Users/admin/builder/spi-builder-workspace/Sources/SwiftTheming/Appearance/Appearance.swift /Users/admin/builder/spi-builder-workspace/Sources/SwiftTheming/Appearance/PreferredAppearance.swift /Users/admin/builder/spi-builder-workspace/Sources/SwiftTheming/Asset/AssetKeyWrappable.swift /Users/admin/builder/spi-builder-workspace/Sources/SwiftTheming/Asset/Assetable.swift /Users/admin/builder/spi-builder-workspace/Sources/SwiftTheming/Asset/EmptyAsset.swift /Users/admin/builder/spi-builder-workspace/Sources/SwiftTheming/Asset/Sets/ColorSet.swift /Users/admin/builder/spi-builder-workspace/Sources/SwiftTheming/Asset/Sets/FontSet.swift /Users/admin/builder/spi-builder-workspace/Sources/SwiftTheming/Asset/Sets/GradientSet.swift /Users/admin/builder/spi-builder-workspace/Sources/SwiftTheming/Asset/Sets/ImageSet.swift /Users/admin/builder/spi-builder-workspace/Sources/SwiftTheming/Extensions/Color++.swift /Users/admin/builder/spi-builder-workspace/Sources/SwiftTheming/Extensions/Font++.swift /Users/admin/builder/spi-builder-workspace/Sources/SwiftTheming/Extensions/Gradient++.swift /Users/admin/builder/spi-builder-workspace/Sources/SwiftTheming/Extensions/Image++.swift /Users/admin/builder/spi-builder-workspace/Sources/SwiftTheming/Extensions/UserDefaults++.swift /Users/admin/builder/spi-builder-workspace/Sources/SwiftTheming/Extensions/View++.swift /Users/admin/builder/spi-builder-workspace/Sources/SwiftTheming/Theme/DefaultTheming.swift -primary-file /Users/admin/builder/spi-builder-workspace/Sources/SwiftTheming/Theme/Theme.swift /Users/admin/builder/spi-builder-workspace/Sources/SwiftTheming/Theme/Themeable.swift /Users/admin/builder/spi-builder-workspace/Sources/SwiftTheming/Theme/Themed.swift /Users/admin/builder/spi-builder-workspace/Sources/SwiftTheming/ThemeProvider/ThemeProvider.swift /Users/admin/builder/spi-builder-workspace/Sources/SwiftTheming/ThemeProvider/ThemeProviding.swift /Users/admin/builder/spi-builder-workspace/Sources/SwiftTheming/ThemeProvider/ThemeProvidingViewModifier.swift -emit-dependencies-path /Users/admin/builder/spi-builder-workspace/.derivedData/Build/Intermediates.noindex/SwiftTheming.build/Debug-xros/SwiftTheming.build/Objects-normal/arm64/Theme.d -emit-const-values-path /Users/admin/builder/spi-builder-workspace/.derivedData/Build/Intermediates.noindex/SwiftTheming.build/Debug-xros/SwiftTheming.build/Objects-normal/arm64/Theme.swiftconstvalues -emit-reference-dependencies-path /Users/admin/builder/spi-builder-workspace/.derivedData/Build/Intermediates.noindex/SwiftTheming.build/Debug-xros/SwiftTheming.build/Objects-normal/arm64/Theme.swiftdeps -serialize-diagnostics-path /Users/admin/builder/spi-builder-workspace/.derivedData/Build/Intermediates.noindex/SwiftTheming.build/Debug-xros/SwiftTheming.build/Objects-normal/arm64/Theme.dia -target arm64-apple-xros1.0 -Xllvm -aarch64-use-tbi -enable-objc-interop -stack-check -sdk /Applications/Xcode-16.1.0.app/Contents/Developer/Platforms/XROS.platform/Developer/SDKs/XROS2.1.sdk -I /Users/admin/builder/spi-builder-workspace/.derivedData/Build/Products/Debug-xros -I /Applications/Xcode-16.1.0.app/Contents/Developer/Platforms/XROS.platform/Developer/usr/lib -F /Users/admin/builder/spi-builder-workspace/.derivedData/Build/Products/Debug-xros -F /Applications/Xcode-16.1.0.app/Contents/Developer/Platforms/XROS.platform/Developer/Library/Frameworks -F /Applications/Xcode-16.1.0.app/Contents/Developer/Platforms/XROS.platform/Developer/SDKs/XROS2.1.sdk/Developer/Library/Frameworks -no-color-diagnostics -enable-testing -g -debug-info-format\=dwarf -dwarf-version\=4 -module-cache-path /Users/admin/builder/spi-builder-workspace/.derivedData/ModuleCache.noindex -profile-generate -profile-coverage-mapping -swift-version 5 -enforce-exclusivity\=checked -stats-output-dir /Users/admin/builder/spi-builder-workspace/.swiftpm/xcode/.stats -Onone -D SWIFT_PACKAGE -D DEBUG -serialize-debugging-options -const-gather-protocols-file /Users/admin/builder/spi-builder-workspace/.derivedData/Build/Intermediates.noindex/SwiftTheming.build/Debug-xros/SwiftTheming.build/Objects-normal/arm64/SwiftTheming_const_extract_protocols.json -enable-experimental-feature DebugDescriptionMacro -enable-experimental-feature OpaqueTypeErasure -enable-upcoming-feature StrictConcurrency -enable-upcoming-feature DisableOutwardActorInference -enable-upcoming-feature GlobalActorIsolatedTypesUsability -enable-upcoming-feature InferSendableFromCaptures -strict-concurrency\=complete -empty-abi-descriptor -plugin-path /Applications/Xcode-16.1.0.app/Contents/Developer/Toolchains/XcodeDefault.xctoolchain/usr/lib/swift/host/plugins/testing -validate-clang-modules-once -clang-build-session-file /Users/admin/builder/spi-builder-workspace/.derivedData/ModuleCache.noindex/Session.modulevalidation -Xcc -working-directory -Xcc /Users/admin/builder/spi-builder-workspace/.swiftpm/xcode -resource-dir /Applications/Xcode-16.1.0.app/Contents/Developer/Toolchains/XcodeDefault.xctoolchain/usr/lib/swift -enable-anonymous-context-mangled-names -file-compilation-dir /Users/admin/builder/spi-builder-workspace/.swiftpm/xcode -Xcc -D_LIBCPP_HARDENING_MODE\=_LIBCPP_HARDENING_MODE_DEBUG -Xcc -ivfsstatcache -Xcc /Users/admin/builder/spi-builder-workspace/.derivedData/SDKStatCaches.noindex/xros2.1-22N573-02bafd7f43846583f0400bd788fa10b7.sdkstatcache -Xcc -I/Users/admin/builder/spi-builder-workspace/.derivedData/Build/Intermediates.noindex/SwiftTheming.build/Debug-xros/SwiftTheming.build/swift-overrides.hmap -Xcc -I/Users/admin/builder/spi-builder-workspace/.derivedData/Build/Products/Debug-xros/include -Xcc -I/Users/admin/builder/spi-builder-workspace/.derivedData/Build/Intermediates.noindex/SwiftTheming.build/Debug-xros/SwiftTheming.build/DerivedSources-normal/arm64 -Xcc -I/Users/admin/builder/spi-builder-workspace/.derivedData/Build/Intermediates.noindex/SwiftTheming.build/Debug-xros/SwiftTheming.build/DerivedSources/arm64 -Xcc -I/Users/admin/builder/spi-builder-workspace/.derivedData/Build/Intermediates.noindex/SwiftTheming.build/Debug-xros/SwiftTheming.build/DerivedSources -Xcc -DSWIFT_PACKAGE -Xcc -DDEBUG\=1 -module-name SwiftTheming -frontend-parseable-output -disable-clang-spi -target-sdk-version 2.1 -target-sdk-name xros2.1 -external-plugin-path /Applications/Xcode-16.1.0.app/Contents/Developer/Platforms/XROS.platform/Developer/usr/lib/swift/host/plugins\#/Applications/Xcode-16.1.0.app/Contents/Developer/Platforms/XROS.platform/Developer/usr/bin/swift-plugin-server -external-plugin-path /Applications/Xcode-16.1.0.app/Contents/Developer/Platforms/XROS.platform/Developer/usr/local/lib/swift/host/plugins\#/Applications/Xcode-16.1.0.app/Contents/Developer/Platforms/XROS.platform/Developer/usr/bin/swift-plugin-server -plugin-path /Applications/Xcode-16.1.0.app/Contents/Developer/Toolchains/XcodeDefault.xctoolchain/usr/lib/swift/host/plugins -plugin-path /Applications/Xcode-16.1.0.app/Contents/Developer/Toolchains/XcodeDefault.xctoolchain/usr/local/lib/swift/host/plugins -o /Users/admin/builder/spi-builder-workspace/.derivedData/Build/Intermediates.noindex/SwiftTheming.build/Debug-xros/SwiftTheming.build/Objects-normal/arm64/Theme.o -index-unit-output-path /SwiftTheming.build/Debug-xros/SwiftTheming.build/Objects-normal/arm64/Theme.o -index-store-path /Users/admin/builder/spi-builder-workspace/.derivedData/Index.noindex/DataStore -index-system-modules
SwiftCompile normal arm64 /Users/admin/builder/spi-builder-workspace/Sources/SwiftTheming/Theme/Theme.swift (in target 'SwiftTheming' from project 'SwiftTheming')
cd /Users/admin/builder/spi-builder-workspace/.swiftpm/xcode
/Applications/Xcode-16.1.0.app/Contents/Developer/Toolchains/XcodeDefault.xctoolchain/usr/bin/swift-frontend -c /Users/admin/builder/spi-builder-workspace/Sources/SwiftTheming/Appearance/Appearance.swift /Users/admin/builder/spi-builder-workspace/Sources/SwiftTheming/Appearance/PreferredAppearance.swift /Users/admin/builder/spi-builder-workspace/Sources/SwiftTheming/Asset/AssetKeyWrappable.swift /Users/admin/builder/spi-builder-workspace/Sources/SwiftTheming/Asset/Assetable.swift /Users/admin/builder/spi-builder-workspace/Sources/SwiftTheming/Asset/EmptyAsset.swift /Users/admin/builder/spi-builder-workspace/Sources/SwiftTheming/Asset/Sets/ColorSet.swift /Users/admin/builder/spi-builder-workspace/Sources/SwiftTheming/Asset/Sets/FontSet.swift /Users/admin/builder/spi-builder-workspace/Sources/SwiftTheming/Asset/Sets/GradientSet.swift /Users/admin/builder/spi-builder-workspace/Sources/SwiftTheming/Asset/Sets/ImageSet.swift /Users/admin/builder/spi-builder-workspace/Sources/SwiftTheming/Extensions/Color++.swift /Users/admin/builder/spi-builder-workspace/Sources/SwiftTheming/Extensions/Font++.swift /Users/admin/builder/spi-builder-workspace/Sources/SwiftTheming/Extensions/Gradient++.swift /Users/admin/builder/spi-builder-workspace/Sources/SwiftTheming/Extensions/Image++.swift /Users/admin/builder/spi-builder-workspace/Sources/SwiftTheming/Extensions/UserDefaults++.swift /Users/admin/builder/spi-builder-workspace/Sources/SwiftTheming/Extensions/View++.swift /Users/admin/builder/spi-builder-workspace/Sources/SwiftTheming/Theme/DefaultTheming.swift -primary-file /Users/admin/builder/spi-builder-workspace/Sources/SwiftTheming/Theme/Theme.swift /Users/admin/builder/spi-builder-workspace/Sources/SwiftTheming/Theme/Themeable.swift /Users/admin/builder/spi-builder-workspace/Sources/SwiftTheming/Theme/Themed.swift /Users/admin/builder/spi-builder-workspace/Sources/SwiftTheming/ThemeProvider/ThemeProvider.swift /Users/admin/builder/spi-builder-workspace/Sources/SwiftTheming/ThemeProvider/ThemeProviding.swift /Users/admin/builder/spi-builder-workspace/Sources/SwiftTheming/ThemeProvider/ThemeProvidingViewModifier.swift -emit-dependencies-path /Users/admin/builder/spi-builder-workspace/.derivedData/Build/Intermediates.noindex/SwiftTheming.build/Debug-xros/SwiftTheming.build/Objects-normal/arm64/Theme.d -emit-const-values-path /Users/admin/builder/spi-builder-workspace/.derivedData/Build/Intermediates.noindex/SwiftTheming.build/Debug-xros/SwiftTheming.build/Objects-normal/arm64/Theme.swiftconstvalues -emit-reference-dependencies-path /Users/admin/builder/spi-builder-workspace/.derivedData/Build/Intermediates.noindex/SwiftTheming.build/Debug-xros/SwiftTheming.build/Objects-normal/arm64/Theme.swiftdeps -serialize-diagnostics-path /Users/admin/builder/spi-builder-workspace/.derivedData/Build/Intermediates.noindex/SwiftTheming.build/Debug-xros/SwiftTheming.build/Objects-normal/arm64/Theme.dia -target arm64-apple-xros1.0 -Xllvm -aarch64-use-tbi -enable-objc-interop -stack-check -sdk /Applications/Xcode-16.1.0.app/Contents/Developer/Platforms/XROS.platform/Developer/SDKs/XROS2.1.sdk -I /Users/admin/builder/spi-builder-workspace/.derivedData/Build/Products/Debug-xros -I /Applications/Xcode-16.1.0.app/Contents/Developer/Platforms/XROS.platform/Developer/usr/lib -F /Users/admin/builder/spi-builder-workspace/.derivedData/Build/Products/Debug-xros -F /Applications/Xcode-16.1.0.app/Contents/Developer/Platforms/XROS.platform/Developer/Library/Frameworks -F /Applications/Xcode-16.1.0.app/Contents/Developer/Platforms/XROS.platform/Developer/SDKs/XROS2.1.sdk/Developer/Library/Frameworks -no-color-diagnostics -enable-testing -g -debug-info-format\=dwarf -dwarf-version\=4 -module-cache-path /Users/admin/builder/spi-builder-workspace/.derivedData/ModuleCache.noindex -profile-generate -profile-coverage-mapping -swift-version 5 -enforce-exclusivity\=checked -stats-output-dir /Users/admin/builder/spi-builder-workspace/.swiftpm/xcode/.stats -Onone -D SWIFT_PACKAGE -D DEBUG -serialize-debugging-options -const-gather-protocols-file /Users/admin/builder/spi-builder-workspace/.derivedData/Build/Intermediates.noindex/SwiftTheming.build/Debug-xros/SwiftTheming.build/Objects-normal/arm64/SwiftTheming_const_extract_protocols.json -enable-experimental-feature DebugDescriptionMacro -enable-experimental-feature OpaqueTypeErasure -enable-upcoming-feature StrictConcurrency -enable-upcoming-feature DisableOutwardActorInference -enable-upcoming-feature GlobalActorIsolatedTypesUsability -enable-upcoming-feature InferSendableFromCaptures -strict-concurrency\=complete -empty-abi-descriptor -plugin-path /Applications/Xcode-16.1.0.app/Contents/Developer/Toolchains/XcodeDefault.xctoolchain/usr/lib/swift/host/plugins/testing -validate-clang-modules-once -clang-build-session-file /Users/admin/builder/spi-builder-workspace/.derivedData/ModuleCache.noindex/Session.modulevalidation -Xcc -working-directory -Xcc /Users/admin/builder/spi-builder-workspace/.swiftpm/xcode -resource-dir /Applications/Xcode-16.1.0.app/Contents/Developer/Toolchains/XcodeDefault.xctoolchain/usr/lib/swift -enable-anonymous-context-mangled-names -file-compilation-dir /Users/admin/builder/spi-builder-workspace/.swiftpm/xcode -Xcc -D_LIBCPP_HARDENING_MODE\=_LIBCPP_HARDENING_MODE_DEBUG -Xcc -ivfsstatcache -Xcc /Users/admin/builder/spi-builder-workspace/.derivedData/SDKStatCaches.noindex/xros2.1-22N573-02bafd7f43846583f0400bd788fa10b7.sdkstatcache -Xcc -I/Users/admin/builder/spi-builder-workspace/.derivedData/Build/Intermediates.noindex/SwiftTheming.build/Debug-xros/SwiftTheming.build/swift-overrides.hmap -Xcc -I/Users/admin/builder/spi-builder-workspace/.derivedData/Build/Products/Debug-xros/include -Xcc -I/Users/admin/builder/spi-builder-workspace/.derivedData/Build/Intermediates.noindex/SwiftTheming.build/Debug-xros/SwiftTheming.build/DerivedSources-normal/arm64 -Xcc -I/Users/admin/builder/spi-builder-workspace/.derivedData/Build/Intermediates.noindex/SwiftTheming.build/Debug-xros/SwiftTheming.build/DerivedSources/arm64 -Xcc -I/Users/admin/builder/spi-builder-workspace/.derivedData/Build/Intermediates.noindex/SwiftTheming.build/Debug-xros/SwiftTheming.build/DerivedSources -Xcc -DSWIFT_PACKAGE -Xcc -DDEBUG\=1 -module-name SwiftTheming -frontend-parseable-output -disable-clang-spi -target-sdk-version 2.1 -target-sdk-name xros2.1 -external-plugin-path /Applications/Xcode-16.1.0.app/Contents/Developer/Platforms/XROS.platform/Developer/usr/lib/swift/host/plugins\#/Applications/Xcode-16.1.0.app/Contents/Developer/Platforms/XROS.platform/Developer/usr/bin/swift-plugin-server -external-plugin-path /Applications/Xcode-16.1.0.app/Contents/Developer/Platforms/XROS.platform/Developer/usr/local/lib/swift/host/plugins\#/Applications/Xcode-16.1.0.app/Contents/Developer/Platforms/XROS.platform/Developer/usr/bin/swift-plugin-server -plugin-path /Applications/Xcode-16.1.0.app/Contents/Developer/Toolchains/XcodeDefault.xctoolchain/usr/lib/swift/host/plugins -plugin-path /Applications/Xcode-16.1.0.app/Contents/Developer/Toolchains/XcodeDefault.xctoolchain/usr/local/lib/swift/host/plugins -o /Users/admin/builder/spi-builder-workspace/.derivedData/Build/Intermediates.noindex/SwiftTheming.build/Debug-xros/SwiftTheming.build/Objects-normal/arm64/Theme.o -index-unit-output-path /SwiftTheming.build/Debug-xros/SwiftTheming.build/Objects-normal/arm64/Theme.o -index-store-path /Users/admin/builder/spi-builder-workspace/.derivedData/Index.noindex/DataStore -index-system-modules
SwiftEmitModule normal arm64 Emitting\ module\ for\ SwiftTheming (in target 'SwiftTheming' from project 'SwiftTheming')
cd /Users/admin/builder/spi-builder-workspace/.swiftpm/xcode
builtin-swiftTaskExecution -- /Applications/Xcode-16.1.0.app/Contents/Developer/Toolchains/XcodeDefault.xctoolchain/usr/bin/swift-frontend -frontend -emit-module -experimental-skip-non-inlinable-function-bodies-without-types /Users/admin/builder/spi-builder-workspace/Sources/SwiftTheming/Appearance/Appearance.swift /Users/admin/builder/spi-builder-workspace/Sources/SwiftTheming/Appearance/PreferredAppearance.swift /Users/admin/builder/spi-builder-workspace/Sources/SwiftTheming/Asset/AssetKeyWrappable.swift /Users/admin/builder/spi-builder-workspace/Sources/SwiftTheming/Asset/Assetable.swift /Users/admin/builder/spi-builder-workspace/Sources/SwiftTheming/Asset/EmptyAsset.swift /Users/admin/builder/spi-builder-workspace/Sources/SwiftTheming/Asset/Sets/ColorSet.swift /Users/admin/builder/spi-builder-workspace/Sources/SwiftTheming/Asset/Sets/FontSet.swift /Users/admin/builder/spi-builder-workspace/Sources/SwiftTheming/Asset/Sets/GradientSet.swift /Users/admin/builder/spi-builder-workspace/Sources/SwiftTheming/Asset/Sets/ImageSet.swift /Users/admin/builder/spi-builder-workspace/Sources/SwiftTheming/Extensions/Color++.swift /Users/admin/builder/spi-builder-workspace/Sources/SwiftTheming/Extensions/Font++.swift /Users/admin/builder/spi-builder-workspace/Sources/SwiftTheming/Extensions/Gradient++.swift /Users/admin/builder/spi-builder-workspace/Sources/SwiftTheming/Extensions/Image++.swift /Users/admin/builder/spi-builder-workspace/Sources/SwiftTheming/Extensions/UserDefaults++.swift /Users/admin/builder/spi-builder-workspace/Sources/SwiftTheming/Extensions/View++.swift /Users/admin/builder/spi-builder-workspace/Sources/SwiftTheming/Theme/DefaultTheming.swift /Users/admin/builder/spi-builder-workspace/Sources/SwiftTheming/Theme/Theme.swift /Users/admin/builder/spi-builder-workspace/Sources/SwiftTheming/Theme/Themeable.swift /Users/admin/builder/spi-builder-workspace/Sources/SwiftTheming/Theme/Themed.swift /Users/admin/builder/spi-builder-workspace/Sources/SwiftTheming/ThemeProvider/ThemeProvider.swift /Users/admin/builder/spi-builder-workspace/Sources/SwiftTheming/ThemeProvider/ThemeProviding.swift /Users/admin/builder/spi-builder-workspace/Sources/SwiftTheming/ThemeProvider/ThemeProvidingViewModifier.swift -target arm64-apple-xros1.0 -Xllvm -aarch64-use-tbi -enable-objc-interop -stack-check -sdk /Applications/Xcode-16.1.0.app/Contents/Developer/Platforms/XROS.platform/Developer/SDKs/XROS2.1.sdk -I /Users/admin/builder/spi-builder-workspace/.derivedData/Build/Products/Debug-xros -I /Applications/Xcode-16.1.0.app/Contents/Developer/Platforms/XROS.platform/Developer/usr/lib -F /Users/admin/builder/spi-builder-workspace/.derivedData/Build/Products/Debug-xros -F /Applications/Xcode-16.1.0.app/Contents/Developer/Platforms/XROS.platform/Developer/Library/Frameworks -F /Applications/Xcode-16.1.0.app/Contents/Developer/Platforms/XROS.platform/Developer/SDKs/XROS2.1.sdk/Developer/Library/Frameworks -no-color-diagnostics -enable-testing -g -debug-info-format\=dwarf -dwarf-version\=4 -module-cache-path /Users/admin/builder/spi-builder-workspace/.derivedData/ModuleCache.noindex -profile-generate -profile-coverage-mapping -swift-version 5 -enforce-exclusivity\=checked -stats-output-dir /Users/admin/builder/spi-builder-workspace/.swiftpm/xcode/.stats -Onone -D SWIFT_PACKAGE -D DEBUG -serialize-debugging-options -const-gather-protocols-file /Users/admin/builder/spi-builder-workspace/.derivedData/Build/Intermediates.noindex/SwiftTheming.build/Debug-xros/SwiftTheming.build/Objects-normal/arm64/SwiftTheming_const_extract_protocols.json -enable-experimental-feature DebugDescriptionMacro -enable-experimental-feature OpaqueTypeErasure -enable-upcoming-feature StrictConcurrency -enable-upcoming-feature DisableOutwardActorInference -enable-upcoming-feature GlobalActorIsolatedTypesUsability -enable-upcoming-feature InferSendableFromCaptures -strict-concurrency\=complete -empty-abi-descriptor -plugin-path /Applications/Xcode-16.1.0.app/Contents/Developer/Toolchains/XcodeDefault.xctoolchain/usr/lib/swift/host/plugins/testing -validate-clang-modules-once -clang-build-session-file /Users/admin/builder/spi-builder-workspace/.derivedData/ModuleCache.noindex/Session.modulevalidation -Xcc -working-directory -Xcc /Users/admin/builder/spi-builder-workspace/.swiftpm/xcode -resource-dir /Applications/Xcode-16.1.0.app/Contents/Developer/Toolchains/XcodeDefault.xctoolchain/usr/lib/swift -enable-anonymous-context-mangled-names -file-compilation-dir /Users/admin/builder/spi-builder-workspace/.swiftpm/xcode -Xcc -D_LIBCPP_HARDENING_MODE\=_LIBCPP_HARDENING_MODE_DEBUG -Xcc -ivfsstatcache -Xcc /Users/admin/builder/spi-builder-workspace/.derivedData/SDKStatCaches.noindex/xros2.1-22N573-02bafd7f43846583f0400bd788fa10b7.sdkstatcache -Xcc -I/Users/admin/builder/spi-builder-workspace/.derivedData/Build/Intermediates.noindex/SwiftTheming.build/Debug-xros/SwiftTheming.build/swift-overrides.hmap -Xcc -I/Users/admin/builder/spi-builder-workspace/.derivedData/Build/Products/Debug-xros/include -Xcc -I/Users/admin/builder/spi-builder-workspace/.derivedData/Build/Intermediates.noindex/SwiftTheming.build/Debug-xros/SwiftTheming.build/DerivedSources-normal/arm64 -Xcc -I/Users/admin/builder/spi-builder-workspace/.derivedData/Build/Intermediates.noindex/SwiftTheming.build/Debug-xros/SwiftTheming.build/DerivedSources/arm64 -Xcc -I/Users/admin/builder/spi-builder-workspace/.derivedData/Build/Intermediates.noindex/SwiftTheming.build/Debug-xros/SwiftTheming.build/DerivedSources -Xcc -DSWIFT_PACKAGE -Xcc -DDEBUG\=1 -module-name SwiftTheming -frontend-parseable-output -disable-clang-spi -target-sdk-version 2.1 -target-sdk-name xros2.1 -external-plugin-path /Applications/Xcode-16.1.0.app/Contents/Developer/Platforms/XROS.platform/Developer/usr/lib/swift/host/plugins\#/Applications/Xcode-16.1.0.app/Contents/Developer/Platforms/XROS.platform/Developer/usr/bin/swift-plugin-server -external-plugin-path /Applications/Xcode-16.1.0.app/Contents/Developer/Platforms/XROS.platform/Developer/usr/local/lib/swift/host/plugins\#/Applications/Xcode-16.1.0.app/Contents/Developer/Platforms/XROS.platform/Developer/usr/bin/swift-plugin-server -plugin-path /Applications/Xcode-16.1.0.app/Contents/Developer/Toolchains/XcodeDefault.xctoolchain/usr/lib/swift/host/plugins -plugin-path /Applications/Xcode-16.1.0.app/Contents/Developer/Toolchains/XcodeDefault.xctoolchain/usr/local/lib/swift/host/plugins -emit-module-doc-path /Users/admin/builder/spi-builder-workspace/.derivedData/Build/Intermediates.noindex/SwiftTheming.build/Debug-xros/SwiftTheming.build/Objects-normal/arm64/SwiftTheming.swiftdoc -emit-module-source-info-path /Users/admin/builder/spi-builder-workspace/.derivedData/Build/Intermediates.noindex/SwiftTheming.build/Debug-xros/SwiftTheming.build/Objects-normal/arm64/SwiftTheming.swiftsourceinfo -emit-objc-header-path /Users/admin/builder/spi-builder-workspace/.derivedData/Build/Intermediates.noindex/SwiftTheming.build/Debug-xros/SwiftTheming.build/Objects-normal/arm64/SwiftTheming-Swift.h -serialize-diagnostics-path /Users/admin/builder/spi-builder-workspace/.derivedData/Build/Intermediates.noindex/SwiftTheming.build/Debug-xros/SwiftTheming.build/Objects-normal/arm64/SwiftTheming-master-emit-module.dia -emit-dependencies-path /Users/admin/builder/spi-builder-workspace/.derivedData/Build/Intermediates.noindex/SwiftTheming.build/Debug-xros/SwiftTheming.build/Objects-normal/arm64/SwiftTheming-master-emit-module.d -o /Users/admin/builder/spi-builder-workspace/.derivedData/Build/Intermediates.noindex/SwiftTheming.build/Debug-xros/SwiftTheming.build/Objects-normal/arm64/SwiftTheming.swiftmodule -emit-abi-descriptor-path /Users/admin/builder/spi-builder-workspace/.derivedData/Build/Intermediates.noindex/SwiftTheming.build/Debug-xros/SwiftTheming.build/Objects-normal/arm64/SwiftTheming.abi.json
EmitSwiftModule normal arm64 (in target 'SwiftTheming' from project 'SwiftTheming')
cd /Users/admin/builder/spi-builder-workspace/.swiftpm/xcode
/Applications/Xcode-16.1.0.app/Contents/Developer/Toolchains/XcodeDefault.xctoolchain/usr/bin/swift-frontend -emit-module -experimental-skip-non-inlinable-function-bodies-without-types /Users/admin/builder/spi-builder-workspace/Sources/SwiftTheming/Appearance/Appearance.swift /Users/admin/builder/spi-builder-workspace/Sources/SwiftTheming/Appearance/PreferredAppearance.swift /Users/admin/builder/spi-builder-workspace/Sources/SwiftTheming/Asset/AssetKeyWrappable.swift /Users/admin/builder/spi-builder-workspace/Sources/SwiftTheming/Asset/Assetable.swift /Users/admin/builder/spi-builder-workspace/Sources/SwiftTheming/Asset/EmptyAsset.swift /Users/admin/builder/spi-builder-workspace/Sources/SwiftTheming/Asset/Sets/ColorSet.swift /Users/admin/builder/spi-builder-workspace/Sources/SwiftTheming/Asset/Sets/FontSet.swift /Users/admin/builder/spi-builder-workspace/Sources/SwiftTheming/Asset/Sets/GradientSet.swift /Users/admin/builder/spi-builder-workspace/Sources/SwiftTheming/Asset/Sets/ImageSet.swift /Users/admin/builder/spi-builder-workspace/Sources/SwiftTheming/Extensions/Color++.swift /Users/admin/builder/spi-builder-workspace/Sources/SwiftTheming/Extensions/Font++.swift /Users/admin/builder/spi-builder-workspace/Sources/SwiftTheming/Extensions/Gradient++.swift /Users/admin/builder/spi-builder-workspace/Sources/SwiftTheming/Extensions/Image++.swift /Users/admin/builder/spi-builder-workspace/Sources/SwiftTheming/Extensions/UserDefaults++.swift /Users/admin/builder/spi-builder-workspace/Sources/SwiftTheming/Extensions/View++.swift /Users/admin/builder/spi-builder-workspace/Sources/SwiftTheming/Theme/DefaultTheming.swift /Users/admin/builder/spi-builder-workspace/Sources/SwiftTheming/Theme/Theme.swift /Users/admin/builder/spi-builder-workspace/Sources/SwiftTheming/Theme/Themeable.swift /Users/admin/builder/spi-builder-workspace/Sources/SwiftTheming/Theme/Themed.swift /Users/admin/builder/spi-builder-workspace/Sources/SwiftTheming/ThemeProvider/ThemeProvider.swift /Users/admin/builder/spi-builder-workspace/Sources/SwiftTheming/ThemeProvider/ThemeProviding.swift /Users/admin/builder/spi-builder-workspace/Sources/SwiftTheming/ThemeProvider/ThemeProvidingViewModifier.swift -target arm64-apple-xros1.0 -Xllvm -aarch64-use-tbi -enable-objc-interop -stack-check -sdk /Applications/Xcode-16.1.0.app/Contents/Developer/Platforms/XROS.platform/Developer/SDKs/XROS2.1.sdk -I /Users/admin/builder/spi-builder-workspace/.derivedData/Build/Products/Debug-xros -I /Applications/Xcode-16.1.0.app/Contents/Developer/Platforms/XROS.platform/Developer/usr/lib -F /Users/admin/builder/spi-builder-workspace/.derivedData/Build/Products/Debug-xros -F /Applications/Xcode-16.1.0.app/Contents/Developer/Platforms/XROS.platform/Developer/Library/Frameworks -F /Applications/Xcode-16.1.0.app/Contents/Developer/Platforms/XROS.platform/Developer/SDKs/XROS2.1.sdk/Developer/Library/Frameworks -no-color-diagnostics -enable-testing -g -debug-info-format\=dwarf -dwarf-version\=4 -module-cache-path /Users/admin/builder/spi-builder-workspace/.derivedData/ModuleCache.noindex -profile-generate -profile-coverage-mapping -swift-version 5 -enforce-exclusivity\=checked -stats-output-dir /Users/admin/builder/spi-builder-workspace/.swiftpm/xcode/.stats -Onone -D SWIFT_PACKAGE -D DEBUG -serialize-debugging-options -const-gather-protocols-file /Users/admin/builder/spi-builder-workspace/.derivedData/Build/Intermediates.noindex/SwiftTheming.build/Debug-xros/SwiftTheming.build/Objects-normal/arm64/SwiftTheming_const_extract_protocols.json -enable-experimental-feature DebugDescriptionMacro -enable-experimental-feature OpaqueTypeErasure -enable-upcoming-feature StrictConcurrency -enable-upcoming-feature DisableOutwardActorInference -enable-upcoming-feature GlobalActorIsolatedTypesUsability -enable-upcoming-feature InferSendableFromCaptures -strict-concurrency\=complete -empty-abi-descriptor -plugin-path /Applications/Xcode-16.1.0.app/Contents/Developer/Toolchains/XcodeDefault.xctoolchain/usr/lib/swift/host/plugins/testing -validate-clang-modules-once -clang-build-session-file /Users/admin/builder/spi-builder-workspace/.derivedData/ModuleCache.noindex/Session.modulevalidation -Xcc -working-directory -Xcc /Users/admin/builder/spi-builder-workspace/.swiftpm/xcode -resource-dir /Applications/Xcode-16.1.0.app/Contents/Developer/Toolchains/XcodeDefault.xctoolchain/usr/lib/swift -enable-anonymous-context-mangled-names -file-compilation-dir /Users/admin/builder/spi-builder-workspace/.swiftpm/xcode -Xcc -D_LIBCPP_HARDENING_MODE\=_LIBCPP_HARDENING_MODE_DEBUG -Xcc -ivfsstatcache -Xcc /Users/admin/builder/spi-builder-workspace/.derivedData/SDKStatCaches.noindex/xros2.1-22N573-02bafd7f43846583f0400bd788fa10b7.sdkstatcache -Xcc -I/Users/admin/builder/spi-builder-workspace/.derivedData/Build/Intermediates.noindex/SwiftTheming.build/Debug-xros/SwiftTheming.build/swift-overrides.hmap -Xcc -I/Users/admin/builder/spi-builder-workspace/.derivedData/Build/Products/Debug-xros/include -Xcc -I/Users/admin/builder/spi-builder-workspace/.derivedData/Build/Intermediates.noindex/SwiftTheming.build/Debug-xros/SwiftTheming.build/DerivedSources-normal/arm64 -Xcc -I/Users/admin/builder/spi-builder-workspace/.derivedData/Build/Intermediates.noindex/SwiftTheming.build/Debug-xros/SwiftTheming.build/DerivedSources/arm64 -Xcc -I/Users/admin/builder/spi-builder-workspace/.derivedData/Build/Intermediates.noindex/SwiftTheming.build/Debug-xros/SwiftTheming.build/DerivedSources -Xcc -DSWIFT_PACKAGE -Xcc -DDEBUG\=1 -module-name SwiftTheming -frontend-parseable-output -disable-clang-spi -target-sdk-version 2.1 -target-sdk-name xros2.1 -external-plugin-path /Applications/Xcode-16.1.0.app/Contents/Developer/Platforms/XROS.platform/Developer/usr/lib/swift/host/plugins\#/Applications/Xcode-16.1.0.app/Contents/Developer/Platforms/XROS.platform/Developer/usr/bin/swift-plugin-server -external-plugin-path /Applications/Xcode-16.1.0.app/Contents/Developer/Platforms/XROS.platform/Developer/usr/local/lib/swift/host/plugins\#/Applications/Xcode-16.1.0.app/Contents/Developer/Platforms/XROS.platform/Developer/usr/bin/swift-plugin-server -plugin-path /Applications/Xcode-16.1.0.app/Contents/Developer/Toolchains/XcodeDefault.xctoolchain/usr/lib/swift/host/plugins -plugin-path /Applications/Xcode-16.1.0.app/Contents/Developer/Toolchains/XcodeDefault.xctoolchain/usr/local/lib/swift/host/plugins -emit-module-doc-path /Users/admin/builder/spi-builder-workspace/.derivedData/Build/Intermediates.noindex/SwiftTheming.build/Debug-xros/SwiftTheming.build/Objects-normal/arm64/SwiftTheming.swiftdoc -emit-module-source-info-path /Users/admin/builder/spi-builder-workspace/.derivedData/Build/Intermediates.noindex/SwiftTheming.build/Debug-xros/SwiftTheming.build/Objects-normal/arm64/SwiftTheming.swiftsourceinfo -emit-objc-header-path /Users/admin/builder/spi-builder-workspace/.derivedData/Build/Intermediates.noindex/SwiftTheming.build/Debug-xros/SwiftTheming.build/Objects-normal/arm64/SwiftTheming-Swift.h -serialize-diagnostics-path /Users/admin/builder/spi-builder-workspace/.derivedData/Build/Intermediates.noindex/SwiftTheming.build/Debug-xros/SwiftTheming.build/Objects-normal/arm64/SwiftTheming-master-emit-module.dia -emit-dependencies-path /Users/admin/builder/spi-builder-workspace/.derivedData/Build/Intermediates.noindex/SwiftTheming.build/Debug-xros/SwiftTheming.build/Objects-normal/arm64/SwiftTheming-master-emit-module.d -o /Users/admin/builder/spi-builder-workspace/.derivedData/Build/Intermediates.noindex/SwiftTheming.build/Debug-xros/SwiftTheming.build/Objects-normal/arm64/SwiftTheming.swiftmodule -emit-abi-descriptor-path /Users/admin/builder/spi-builder-workspace/.derivedData/Build/Intermediates.noindex/SwiftTheming.build/Debug-xros/SwiftTheming.build/Objects-normal/arm64/SwiftTheming.abi.json
SwiftCompile normal arm64 Compiling\ ThemeProviding.swift /Users/admin/builder/spi-builder-workspace/Sources/SwiftTheming/ThemeProvider/ThemeProviding.swift (in target 'SwiftTheming' from project 'SwiftTheming')
cd /Users/admin/builder/spi-builder-workspace/.swiftpm/xcode
builtin-swiftTaskExecution -- /Applications/Xcode-16.1.0.app/Contents/Developer/Toolchains/XcodeDefault.xctoolchain/usr/bin/swift-frontend -frontend -c /Users/admin/builder/spi-builder-workspace/Sources/SwiftTheming/Appearance/Appearance.swift /Users/admin/builder/spi-builder-workspace/Sources/SwiftTheming/Appearance/PreferredAppearance.swift /Users/admin/builder/spi-builder-workspace/Sources/SwiftTheming/Asset/AssetKeyWrappable.swift /Users/admin/builder/spi-builder-workspace/Sources/SwiftTheming/Asset/Assetable.swift /Users/admin/builder/spi-builder-workspace/Sources/SwiftTheming/Asset/EmptyAsset.swift /Users/admin/builder/spi-builder-workspace/Sources/SwiftTheming/Asset/Sets/ColorSet.swift /Users/admin/builder/spi-builder-workspace/Sources/SwiftTheming/Asset/Sets/FontSet.swift /Users/admin/builder/spi-builder-workspace/Sources/SwiftTheming/Asset/Sets/GradientSet.swift /Users/admin/builder/spi-builder-workspace/Sources/SwiftTheming/Asset/Sets/ImageSet.swift /Users/admin/builder/spi-builder-workspace/Sources/SwiftTheming/Extensions/Color++.swift /Users/admin/builder/spi-builder-workspace/Sources/SwiftTheming/Extensions/Font++.swift /Users/admin/builder/spi-builder-workspace/Sources/SwiftTheming/Extensions/Gradient++.swift /Users/admin/builder/spi-builder-workspace/Sources/SwiftTheming/Extensions/Image++.swift /Users/admin/builder/spi-builder-workspace/Sources/SwiftTheming/Extensions/UserDefaults++.swift /Users/admin/builder/spi-builder-workspace/Sources/SwiftTheming/Extensions/View++.swift /Users/admin/builder/spi-builder-workspace/Sources/SwiftTheming/Theme/DefaultTheming.swift /Users/admin/builder/spi-builder-workspace/Sources/SwiftTheming/Theme/Theme.swift /Users/admin/builder/spi-builder-workspace/Sources/SwiftTheming/Theme/Themeable.swift /Users/admin/builder/spi-builder-workspace/Sources/SwiftTheming/Theme/Themed.swift /Users/admin/builder/spi-builder-workspace/Sources/SwiftTheming/ThemeProvider/ThemeProvider.swift -primary-file /Users/admin/builder/spi-builder-workspace/Sources/SwiftTheming/ThemeProvider/ThemeProviding.swift /Users/admin/builder/spi-builder-workspace/Sources/SwiftTheming/ThemeProvider/ThemeProvidingViewModifier.swift -emit-dependencies-path /Users/admin/builder/spi-builder-workspace/.derivedData/Build/Intermediates.noindex/SwiftTheming.build/Debug-xros/SwiftTheming.build/Objects-normal/arm64/ThemeProviding.d -emit-const-values-path /Users/admin/builder/spi-builder-workspace/.derivedData/Build/Intermediates.noindex/SwiftTheming.build/Debug-xros/SwiftTheming.build/Objects-normal/arm64/ThemeProviding.swiftconstvalues -emit-reference-dependencies-path /Users/admin/builder/spi-builder-workspace/.derivedData/Build/Intermediates.noindex/SwiftTheming.build/Debug-xros/SwiftTheming.build/Objects-normal/arm64/ThemeProviding.swiftdeps -serialize-diagnostics-path /Users/admin/builder/spi-builder-workspace/.derivedData/Build/Intermediates.noindex/SwiftTheming.build/Debug-xros/SwiftTheming.build/Objects-normal/arm64/ThemeProviding.dia -target arm64-apple-xros1.0 -Xllvm -aarch64-use-tbi -enable-objc-interop -stack-check -sdk /Applications/Xcode-16.1.0.app/Contents/Developer/Platforms/XROS.platform/Developer/SDKs/XROS2.1.sdk -I /Users/admin/builder/spi-builder-workspace/.derivedData/Build/Products/Debug-xros -I /Applications/Xcode-16.1.0.app/Contents/Developer/Platforms/XROS.platform/Developer/usr/lib -F /Users/admin/builder/spi-builder-workspace/.derivedData/Build/Products/Debug-xros -F /Applications/Xcode-16.1.0.app/Contents/Developer/Platforms/XROS.platform/Developer/Library/Frameworks -F /Applications/Xcode-16.1.0.app/Contents/Developer/Platforms/XROS.platform/Developer/SDKs/XROS2.1.sdk/Developer/Library/Frameworks -no-color-diagnostics -enable-testing -g -debug-info-format\=dwarf -dwarf-version\=4 -module-cache-path /Users/admin/builder/spi-builder-workspace/.derivedData/ModuleCache.noindex -profile-generate -profile-coverage-mapping -swift-version 5 -enforce-exclusivity\=checked -stats-output-dir /Users/admin/builder/spi-builder-workspace/.swiftpm/xcode/.stats -Onone -D SWIFT_PACKAGE -D DEBUG -serialize-debugging-options -const-gather-protocols-file /Users/admin/builder/spi-builder-workspace/.derivedData/Build/Intermediates.noindex/SwiftTheming.build/Debug-xros/SwiftTheming.build/Objects-normal/arm64/SwiftTheming_const_extract_protocols.json -enable-experimental-feature DebugDescriptionMacro -enable-experimental-feature OpaqueTypeErasure -enable-upcoming-feature StrictConcurrency -enable-upcoming-feature DisableOutwardActorInference -enable-upcoming-feature GlobalActorIsolatedTypesUsability -enable-upcoming-feature InferSendableFromCaptures -strict-concurrency\=complete -empty-abi-descriptor -plugin-path /Applications/Xcode-16.1.0.app/Contents/Developer/Toolchains/XcodeDefault.xctoolchain/usr/lib/swift/host/plugins/testing -validate-clang-modules-once -clang-build-session-file /Users/admin/builder/spi-builder-workspace/.derivedData/ModuleCache.noindex/Session.modulevalidation -Xcc -working-directory -Xcc /Users/admin/builder/spi-builder-workspace/.swiftpm/xcode -resource-dir /Applications/Xcode-16.1.0.app/Contents/Developer/Toolchains/XcodeDefault.xctoolchain/usr/lib/swift -enable-anonymous-context-mangled-names -file-compilation-dir /Users/admin/builder/spi-builder-workspace/.swiftpm/xcode -Xcc -D_LIBCPP_HARDENING_MODE\=_LIBCPP_HARDENING_MODE_DEBUG -Xcc -ivfsstatcache -Xcc /Users/admin/builder/spi-builder-workspace/.derivedData/SDKStatCaches.noindex/xros2.1-22N573-02bafd7f43846583f0400bd788fa10b7.sdkstatcache -Xcc -I/Users/admin/builder/spi-builder-workspace/.derivedData/Build/Intermediates.noindex/SwiftTheming.build/Debug-xros/SwiftTheming.build/swift-overrides.hmap -Xcc -I/Users/admin/builder/spi-builder-workspace/.derivedData/Build/Products/Debug-xros/include -Xcc -I/Users/admin/builder/spi-builder-workspace/.derivedData/Build/Intermediates.noindex/SwiftTheming.build/Debug-xros/SwiftTheming.build/DerivedSources-normal/arm64 -Xcc -I/Users/admin/builder/spi-builder-workspace/.derivedData/Build/Intermediates.noindex/SwiftTheming.build/Debug-xros/SwiftTheming.build/DerivedSources/arm64 -Xcc -I/Users/admin/builder/spi-builder-workspace/.derivedData/Build/Intermediates.noindex/SwiftTheming.build/Debug-xros/SwiftTheming.build/DerivedSources -Xcc -DSWIFT_PACKAGE -Xcc -DDEBUG\=1 -module-name SwiftTheming -frontend-parseable-output -disable-clang-spi -target-sdk-version 2.1 -target-sdk-name xros2.1 -external-plugin-path /Applications/Xcode-16.1.0.app/Contents/Developer/Platforms/XROS.platform/Developer/usr/lib/swift/host/plugins\#/Applications/Xcode-16.1.0.app/Contents/Developer/Platforms/XROS.platform/Developer/usr/bin/swift-plugin-server -external-plugin-path /Applications/Xcode-16.1.0.app/Contents/Developer/Platforms/XROS.platform/Developer/usr/local/lib/swift/host/plugins\#/Applications/Xcode-16.1.0.app/Contents/Developer/Platforms/XROS.platform/Developer/usr/bin/swift-plugin-server -plugin-path /Applications/Xcode-16.1.0.app/Contents/Developer/Toolchains/XcodeDefault.xctoolchain/usr/lib/swift/host/plugins -plugin-path /Applications/Xcode-16.1.0.app/Contents/Developer/Toolchains/XcodeDefault.xctoolchain/usr/local/lib/swift/host/plugins -o /Users/admin/builder/spi-builder-workspace/.derivedData/Build/Intermediates.noindex/SwiftTheming.build/Debug-xros/SwiftTheming.build/Objects-normal/arm64/ThemeProviding.o -index-unit-output-path /SwiftTheming.build/Debug-xros/SwiftTheming.build/Objects-normal/arm64/ThemeProviding.o -index-store-path /Users/admin/builder/spi-builder-workspace/.derivedData/Index.noindex/DataStore -index-system-modules
SwiftCompile normal arm64 /Users/admin/builder/spi-builder-workspace/Sources/SwiftTheming/ThemeProvider/ThemeProviding.swift (in target 'SwiftTheming' from project 'SwiftTheming')
cd /Users/admin/builder/spi-builder-workspace/.swiftpm/xcode
/Applications/Xcode-16.1.0.app/Contents/Developer/Toolchains/XcodeDefault.xctoolchain/usr/bin/swift-frontend -c /Users/admin/builder/spi-builder-workspace/Sources/SwiftTheming/Appearance/Appearance.swift /Users/admin/builder/spi-builder-workspace/Sources/SwiftTheming/Appearance/PreferredAppearance.swift /Users/admin/builder/spi-builder-workspace/Sources/SwiftTheming/Asset/AssetKeyWrappable.swift /Users/admin/builder/spi-builder-workspace/Sources/SwiftTheming/Asset/Assetable.swift /Users/admin/builder/spi-builder-workspace/Sources/SwiftTheming/Asset/EmptyAsset.swift /Users/admin/builder/spi-builder-workspace/Sources/SwiftTheming/Asset/Sets/ColorSet.swift /Users/admin/builder/spi-builder-workspace/Sources/SwiftTheming/Asset/Sets/FontSet.swift /Users/admin/builder/spi-builder-workspace/Sources/SwiftTheming/Asset/Sets/GradientSet.swift /Users/admin/builder/spi-builder-workspace/Sources/SwiftTheming/Asset/Sets/ImageSet.swift /Users/admin/builder/spi-builder-workspace/Sources/SwiftTheming/Extensions/Color++.swift /Users/admin/builder/spi-builder-workspace/Sources/SwiftTheming/Extensions/Font++.swift /Users/admin/builder/spi-builder-workspace/Sources/SwiftTheming/Extensions/Gradient++.swift /Users/admin/builder/spi-builder-workspace/Sources/SwiftTheming/Extensions/Image++.swift /Users/admin/builder/spi-builder-workspace/Sources/SwiftTheming/Extensions/UserDefaults++.swift /Users/admin/builder/spi-builder-workspace/Sources/SwiftTheming/Extensions/View++.swift /Users/admin/builder/spi-builder-workspace/Sources/SwiftTheming/Theme/DefaultTheming.swift /Users/admin/builder/spi-builder-workspace/Sources/SwiftTheming/Theme/Theme.swift /Users/admin/builder/spi-builder-workspace/Sources/SwiftTheming/Theme/Themeable.swift /Users/admin/builder/spi-builder-workspace/Sources/SwiftTheming/Theme/Themed.swift /Users/admin/builder/spi-builder-workspace/Sources/SwiftTheming/ThemeProvider/ThemeProvider.swift -primary-file /Users/admin/builder/spi-builder-workspace/Sources/SwiftTheming/ThemeProvider/ThemeProviding.swift /Users/admin/builder/spi-builder-workspace/Sources/SwiftTheming/ThemeProvider/ThemeProvidingViewModifier.swift -emit-dependencies-path /Users/admin/builder/spi-builder-workspace/.derivedData/Build/Intermediates.noindex/SwiftTheming.build/Debug-xros/SwiftTheming.build/Objects-normal/arm64/ThemeProviding.d -emit-const-values-path /Users/admin/builder/spi-builder-workspace/.derivedData/Build/Intermediates.noindex/SwiftTheming.build/Debug-xros/SwiftTheming.build/Objects-normal/arm64/ThemeProviding.swiftconstvalues -emit-reference-dependencies-path /Users/admin/builder/spi-builder-workspace/.derivedData/Build/Intermediates.noindex/SwiftTheming.build/Debug-xros/SwiftTheming.build/Objects-normal/arm64/ThemeProviding.swiftdeps -serialize-diagnostics-path /Users/admin/builder/spi-builder-workspace/.derivedData/Build/Intermediates.noindex/SwiftTheming.build/Debug-xros/SwiftTheming.build/Objects-normal/arm64/ThemeProviding.dia -target arm64-apple-xros1.0 -Xllvm -aarch64-use-tbi -enable-objc-interop -stack-check -sdk /Applications/Xcode-16.1.0.app/Contents/Developer/Platforms/XROS.platform/Developer/SDKs/XROS2.1.sdk -I /Users/admin/builder/spi-builder-workspace/.derivedData/Build/Products/Debug-xros -I /Applications/Xcode-16.1.0.app/Contents/Developer/Platforms/XROS.platform/Developer/usr/lib -F /Users/admin/builder/spi-builder-workspace/.derivedData/Build/Products/Debug-xros -F /Applications/Xcode-16.1.0.app/Contents/Developer/Platforms/XROS.platform/Developer/Library/Frameworks -F /Applications/Xcode-16.1.0.app/Contents/Developer/Platforms/XROS.platform/Developer/SDKs/XROS2.1.sdk/Developer/Library/Frameworks -no-color-diagnostics -enable-testing -g -debug-info-format\=dwarf -dwarf-version\=4 -module-cache-path /Users/admin/builder/spi-builder-workspace/.derivedData/ModuleCache.noindex -profile-generate -profile-coverage-mapping -swift-version 5 -enforce-exclusivity\=checked -stats-output-dir /Users/admin/builder/spi-builder-workspace/.swiftpm/xcode/.stats -Onone -D SWIFT_PACKAGE -D DEBUG -serialize-debugging-options -const-gather-protocols-file /Users/admin/builder/spi-builder-workspace/.derivedData/Build/Intermediates.noindex/SwiftTheming.build/Debug-xros/SwiftTheming.build/Objects-normal/arm64/SwiftTheming_const_extract_protocols.json -enable-experimental-feature DebugDescriptionMacro -enable-experimental-feature OpaqueTypeErasure -enable-upcoming-feature StrictConcurrency -enable-upcoming-feature DisableOutwardActorInference -enable-upcoming-feature GlobalActorIsolatedTypesUsability -enable-upcoming-feature InferSendableFromCaptures -strict-concurrency\=complete -empty-abi-descriptor -plugin-path /Applications/Xcode-16.1.0.app/Contents/Developer/Toolchains/XcodeDefault.xctoolchain/usr/lib/swift/host/plugins/testing -validate-clang-modules-once -clang-build-session-file /Users/admin/builder/spi-builder-workspace/.derivedData/ModuleCache.noindex/Session.modulevalidation -Xcc -working-directory -Xcc /Users/admin/builder/spi-builder-workspace/.swiftpm/xcode -resource-dir /Applications/Xcode-16.1.0.app/Contents/Developer/Toolchains/XcodeDefault.xctoolchain/usr/lib/swift -enable-anonymous-context-mangled-names -file-compilation-dir /Users/admin/builder/spi-builder-workspace/.swiftpm/xcode -Xcc -D_LIBCPP_HARDENING_MODE\=_LIBCPP_HARDENING_MODE_DEBUG -Xcc -ivfsstatcache -Xcc /Users/admin/builder/spi-builder-workspace/.derivedData/SDKStatCaches.noindex/xros2.1-22N573-02bafd7f43846583f0400bd788fa10b7.sdkstatcache -Xcc -I/Users/admin/builder/spi-builder-workspace/.derivedData/Build/Intermediates.noindex/SwiftTheming.build/Debug-xros/SwiftTheming.build/swift-overrides.hmap -Xcc -I/Users/admin/builder/spi-builder-workspace/.derivedData/Build/Products/Debug-xros/include -Xcc -I/Users/admin/builder/spi-builder-workspace/.derivedData/Build/Intermediates.noindex/SwiftTheming.build/Debug-xros/SwiftTheming.build/DerivedSources-normal/arm64 -Xcc -I/Users/admin/builder/spi-builder-workspace/.derivedData/Build/Intermediates.noindex/SwiftTheming.build/Debug-xros/SwiftTheming.build/DerivedSources/arm64 -Xcc -I/Users/admin/builder/spi-builder-workspace/.derivedData/Build/Intermediates.noindex/SwiftTheming.build/Debug-xros/SwiftTheming.build/DerivedSources -Xcc -DSWIFT_PACKAGE -Xcc -DDEBUG\=1 -module-name SwiftTheming -frontend-parseable-output -disable-clang-spi -target-sdk-version 2.1 -target-sdk-name xros2.1 -external-plugin-path /Applications/Xcode-16.1.0.app/Contents/Developer/Platforms/XROS.platform/Developer/usr/lib/swift/host/plugins\#/Applications/Xcode-16.1.0.app/Contents/Developer/Platforms/XROS.platform/Developer/usr/bin/swift-plugin-server -external-plugin-path /Applications/Xcode-16.1.0.app/Contents/Developer/Platforms/XROS.platform/Developer/usr/local/lib/swift/host/plugins\#/Applications/Xcode-16.1.0.app/Contents/Developer/Platforms/XROS.platform/Developer/usr/bin/swift-plugin-server -plugin-path /Applications/Xcode-16.1.0.app/Contents/Developer/Toolchains/XcodeDefault.xctoolchain/usr/lib/swift/host/plugins -plugin-path /Applications/Xcode-16.1.0.app/Contents/Developer/Toolchains/XcodeDefault.xctoolchain/usr/local/lib/swift/host/plugins -o /Users/admin/builder/spi-builder-workspace/.derivedData/Build/Intermediates.noindex/SwiftTheming.build/Debug-xros/SwiftTheming.build/Objects-normal/arm64/ThemeProviding.o -index-unit-output-path /SwiftTheming.build/Debug-xros/SwiftTheming.build/Objects-normal/arm64/ThemeProviding.o -index-store-path /Users/admin/builder/spi-builder-workspace/.derivedData/Index.noindex/DataStore -index-system-modules
/Users/admin/builder/spi-builder-workspace/Sources/SwiftTheming/ThemeProvider/ThemeProviding.swift:9:9: warning: main actor-isolated property 'themeProvider' can not be referenced from a nonisolated context; this is an error in the Swift 6 language mode
themeProvider
^
/Users/admin/builder/spi-builder-workspace/Sources/SwiftTheming/ThemeProvider/ThemeProviding.swift:6:36: note: property declared here
@EnvironmentObject private var themeProvider: ThemeProvider
^
/Users/admin/builder/spi-builder-workspace/Sources/SwiftTheming/ThemeProvider/ThemeProviding.swift:12:21: error: return from initializer without initializing all stored properties
public init() { }
^
/Users/admin/builder/spi-builder-workspace/Sources/SwiftTheming/ThemeProvider/ThemeProviding.swift:12:21: note: 'self.themeProvider' not initialized
public init() { }
^
SwiftCompile normal arm64 Compiling\ Themeable.swift /Users/admin/builder/spi-builder-workspace/Sources/SwiftTheming/Theme/Themeable.swift (in target 'SwiftTheming' from project 'SwiftTheming')
cd /Users/admin/builder/spi-builder-workspace/.swiftpm/xcode
builtin-swiftTaskExecution -- /Applications/Xcode-16.1.0.app/Contents/Developer/Toolchains/XcodeDefault.xctoolchain/usr/bin/swift-frontend -frontend -c /Users/admin/builder/spi-builder-workspace/Sources/SwiftTheming/Appearance/Appearance.swift /Users/admin/builder/spi-builder-workspace/Sources/SwiftTheming/Appearance/PreferredAppearance.swift /Users/admin/builder/spi-builder-workspace/Sources/SwiftTheming/Asset/AssetKeyWrappable.swift /Users/admin/builder/spi-builder-workspace/Sources/SwiftTheming/Asset/Assetable.swift /Users/admin/builder/spi-builder-workspace/Sources/SwiftTheming/Asset/EmptyAsset.swift /Users/admin/builder/spi-builder-workspace/Sources/SwiftTheming/Asset/Sets/ColorSet.swift /Users/admin/builder/spi-builder-workspace/Sources/SwiftTheming/Asset/Sets/FontSet.swift /Users/admin/builder/spi-builder-workspace/Sources/SwiftTheming/Asset/Sets/GradientSet.swift /Users/admin/builder/spi-builder-workspace/Sources/SwiftTheming/Asset/Sets/ImageSet.swift /Users/admin/builder/spi-builder-workspace/Sources/SwiftTheming/Extensions/Color++.swift /Users/admin/builder/spi-builder-workspace/Sources/SwiftTheming/Extensions/Font++.swift /Users/admin/builder/spi-builder-workspace/Sources/SwiftTheming/Extensions/Gradient++.swift /Users/admin/builder/spi-builder-workspace/Sources/SwiftTheming/Extensions/Image++.swift /Users/admin/builder/spi-builder-workspace/Sources/SwiftTheming/Extensions/UserDefaults++.swift /Users/admin/builder/spi-builder-workspace/Sources/SwiftTheming/Extensions/View++.swift /Users/admin/builder/spi-builder-workspace/Sources/SwiftTheming/Theme/DefaultTheming.swift /Users/admin/builder/spi-builder-workspace/Sources/SwiftTheming/Theme/Theme.swift -primary-file /Users/admin/builder/spi-builder-workspace/Sources/SwiftTheming/Theme/Themeable.swift /Users/admin/builder/spi-builder-workspace/Sources/SwiftTheming/Theme/Themed.swift /Users/admin/builder/spi-builder-workspace/Sources/SwiftTheming/ThemeProvider/ThemeProvider.swift /Users/admin/builder/spi-builder-workspace/Sources/SwiftTheming/ThemeProvider/ThemeProviding.swift /Users/admin/builder/spi-builder-workspace/Sources/SwiftTheming/ThemeProvider/ThemeProvidingViewModifier.swift -emit-dependencies-path /Users/admin/builder/spi-builder-workspace/.derivedData/Build/Intermediates.noindex/SwiftTheming.build/Debug-xros/SwiftTheming.build/Objects-normal/arm64/Themeable.d -emit-const-values-path /Users/admin/builder/spi-builder-workspace/.derivedData/Build/Intermediates.noindex/SwiftTheming.build/Debug-xros/SwiftTheming.build/Objects-normal/arm64/Themeable.swiftconstvalues -emit-reference-dependencies-path /Users/admin/builder/spi-builder-workspace/.derivedData/Build/Intermediates.noindex/SwiftTheming.build/Debug-xros/SwiftTheming.build/Objects-normal/arm64/Themeable.swiftdeps -serialize-diagnostics-path /Users/admin/builder/spi-builder-workspace/.derivedData/Build/Intermediates.noindex/SwiftTheming.build/Debug-xros/SwiftTheming.build/Objects-normal/arm64/Themeable.dia -target arm64-apple-xros1.0 -Xllvm -aarch64-use-tbi -enable-objc-interop -stack-check -sdk /Applications/Xcode-16.1.0.app/Contents/Developer/Platforms/XROS.platform/Developer/SDKs/XROS2.1.sdk -I /Users/admin/builder/spi-builder-workspace/.derivedData/Build/Products/Debug-xros -I /Applications/Xcode-16.1.0.app/Contents/Developer/Platforms/XROS.platform/Developer/usr/lib -F /Users/admin/builder/spi-builder-workspace/.derivedData/Build/Products/Debug-xros -F /Applications/Xcode-16.1.0.app/Contents/Developer/Platforms/XROS.platform/Developer/Library/Frameworks -F /Applications/Xcode-16.1.0.app/Contents/Developer/Platforms/XROS.platform/Developer/SDKs/XROS2.1.sdk/Developer/Library/Frameworks -no-color-diagnostics -enable-testing -g -debug-info-format\=dwarf -dwarf-version\=4 -module-cache-path /Users/admin/builder/spi-builder-workspace/.derivedData/ModuleCache.noindex -profile-generate -profile-coverage-mapping -swift-version 5 -enforce-exclusivity\=checked -stats-output-dir /Users/admin/builder/spi-builder-workspace/.swiftpm/xcode/.stats -Onone -D SWIFT_PACKAGE -D DEBUG -serialize-debugging-options -const-gather-protocols-file /Users/admin/builder/spi-builder-workspace/.derivedData/Build/Intermediates.noindex/SwiftTheming.build/Debug-xros/SwiftTheming.build/Objects-normal/arm64/SwiftTheming_const_extract_protocols.json -enable-experimental-feature DebugDescriptionMacro -enable-experimental-feature OpaqueTypeErasure -enable-upcoming-feature StrictConcurrency -enable-upcoming-feature DisableOutwardActorInference -enable-upcoming-feature GlobalActorIsolatedTypesUsability -enable-upcoming-feature InferSendableFromCaptures -strict-concurrency\=complete -empty-abi-descriptor -plugin-path /Applications/Xcode-16.1.0.app/Contents/Developer/Toolchains/XcodeDefault.xctoolchain/usr/lib/swift/host/plugins/testing -validate-clang-modules-once -clang-build-session-file /Users/admin/builder/spi-builder-workspace/.derivedData/ModuleCache.noindex/Session.modulevalidation -Xcc -working-directory -Xcc /Users/admin/builder/spi-builder-workspace/.swiftpm/xcode -resource-dir /Applications/Xcode-16.1.0.app/Contents/Developer/Toolchains/XcodeDefault.xctoolchain/usr/lib/swift -enable-anonymous-context-mangled-names -file-compilation-dir /Users/admin/builder/spi-builder-workspace/.swiftpm/xcode -Xcc -D_LIBCPP_HARDENING_MODE\=_LIBCPP_HARDENING_MODE_DEBUG -Xcc -ivfsstatcache -Xcc /Users/admin/builder/spi-builder-workspace/.derivedData/SDKStatCaches.noindex/xros2.1-22N573-02bafd7f43846583f0400bd788fa10b7.sdkstatcache -Xcc -I/Users/admin/builder/spi-builder-workspace/.derivedData/Build/Intermediates.noindex/SwiftTheming.build/Debug-xros/SwiftTheming.build/swift-overrides.hmap -Xcc -I/Users/admin/builder/spi-builder-workspace/.derivedData/Build/Products/Debug-xros/include -Xcc -I/Users/admin/builder/spi-builder-workspace/.derivedData/Build/Intermediates.noindex/SwiftTheming.build/Debug-xros/SwiftTheming.build/DerivedSources-normal/arm64 -Xcc -I/Users/admin/builder/spi-builder-workspace/.derivedData/Build/Intermediates.noindex/SwiftTheming.build/Debug-xros/SwiftTheming.build/DerivedSources/arm64 -Xcc -I/Users/admin/builder/spi-builder-workspace/.derivedData/Build/Intermediates.noindex/SwiftTheming.build/Debug-xros/SwiftTheming.build/DerivedSources -Xcc -DSWIFT_PACKAGE -Xcc -DDEBUG\=1 -module-name SwiftTheming -frontend-parseable-output -disable-clang-spi -target-sdk-version 2.1 -target-sdk-name xros2.1 -external-plugin-path /Applications/Xcode-16.1.0.app/Contents/Developer/Platforms/XROS.platform/Developer/usr/lib/swift/host/plugins\#/Applications/Xcode-16.1.0.app/Contents/Developer/Platforms/XROS.platform/Developer/usr/bin/swift-plugin-server -external-plugin-path /Applications/Xcode-16.1.0.app/Contents/Developer/Platforms/XROS.platform/Developer/usr/local/lib/swift/host/plugins\#/Applications/Xcode-16.1.0.app/Contents/Developer/Platforms/XROS.platform/Developer/usr/bin/swift-plugin-server -plugin-path /Applications/Xcode-16.1.0.app/Contents/Developer/Toolchains/XcodeDefault.xctoolchain/usr/lib/swift/host/plugins -plugin-path /Applications/Xcode-16.1.0.app/Contents/Developer/Toolchains/XcodeDefault.xctoolchain/usr/local/lib/swift/host/plugins -o /Users/admin/builder/spi-builder-workspace/.derivedData/Build/Intermediates.noindex/SwiftTheming.build/Debug-xros/SwiftTheming.build/Objects-normal/arm64/Themeable.o -index-unit-output-path /SwiftTheming.build/Debug-xros/SwiftTheming.build/Objects-normal/arm64/Themeable.o -index-store-path /Users/admin/builder/spi-builder-workspace/.derivedData/Index.noindex/DataStore -index-system-modules
SwiftCompile normal arm64 /Users/admin/builder/spi-builder-workspace/Sources/SwiftTheming/Theme/Themeable.swift (in target 'SwiftTheming' from project 'SwiftTheming')
cd /Users/admin/builder/spi-builder-workspace/.swiftpm/xcode
/Applications/Xcode-16.1.0.app/Contents/Developer/Toolchains/XcodeDefault.xctoolchain/usr/bin/swift-frontend -c /Users/admin/builder/spi-builder-workspace/Sources/SwiftTheming/Appearance/Appearance.swift /Users/admin/builder/spi-builder-workspace/Sources/SwiftTheming/Appearance/PreferredAppearance.swift /Users/admin/builder/spi-builder-workspace/Sources/SwiftTheming/Asset/AssetKeyWrappable.swift /Users/admin/builder/spi-builder-workspace/Sources/SwiftTheming/Asset/Assetable.swift /Users/admin/builder/spi-builder-workspace/Sources/SwiftTheming/Asset/EmptyAsset.swift /Users/admin/builder/spi-builder-workspace/Sources/SwiftTheming/Asset/Sets/ColorSet.swift /Users/admin/builder/spi-builder-workspace/Sources/SwiftTheming/Asset/Sets/FontSet.swift /Users/admin/builder/spi-builder-workspace/Sources/SwiftTheming/Asset/Sets/GradientSet.swift /Users/admin/builder/spi-builder-workspace/Sources/SwiftTheming/Asset/Sets/ImageSet.swift /Users/admin/builder/spi-builder-workspace/Sources/SwiftTheming/Extensions/Color++.swift /Users/admin/builder/spi-builder-workspace/Sources/SwiftTheming/Extensions/Font++.swift /Users/admin/builder/spi-builder-workspace/Sources/SwiftTheming/Extensions/Gradient++.swift /Users/admin/builder/spi-builder-workspace/Sources/SwiftTheming/Extensions/Image++.swift /Users/admin/builder/spi-builder-workspace/Sources/SwiftTheming/Extensions/UserDefaults++.swift /Users/admin/builder/spi-builder-workspace/Sources/SwiftTheming/Extensions/View++.swift /Users/admin/builder/spi-builder-workspace/Sources/SwiftTheming/Theme/DefaultTheming.swift /Users/admin/builder/spi-builder-workspace/Sources/SwiftTheming/Theme/Theme.swift -primary-file /Users/admin/builder/spi-builder-workspace/Sources/SwiftTheming/Theme/Themeable.swift /Users/admin/builder/spi-builder-workspace/Sources/SwiftTheming/Theme/Themed.swift /Users/admin/builder/spi-builder-workspace/Sources/SwiftTheming/ThemeProvider/ThemeProvider.swift /Users/admin/builder/spi-builder-workspace/Sources/SwiftTheming/ThemeProvider/ThemeProviding.swift /Users/admin/builder/spi-builder-workspace/Sources/SwiftTheming/ThemeProvider/ThemeProvidingViewModifier.swift -emit-dependencies-path /Users/admin/builder/spi-builder-workspace/.derivedData/Build/Intermediates.noindex/SwiftTheming.build/Debug-xros/SwiftTheming.build/Objects-normal/arm64/Themeable.d -emit-const-values-path /Users/admin/builder/spi-builder-workspace/.derivedData/Build/Intermediates.noindex/SwiftTheming.build/Debug-xros/SwiftTheming.build/Objects-normal/arm64/Themeable.swiftconstvalues -emit-reference-dependencies-path /Users/admin/builder/spi-builder-workspace/.derivedData/Build/Intermediates.noindex/SwiftTheming.build/Debug-xros/SwiftTheming.build/Objects-normal/arm64/Themeable.swiftdeps -serialize-diagnostics-path /Users/admin/builder/spi-builder-workspace/.derivedData/Build/Intermediates.noindex/SwiftTheming.build/Debug-xros/SwiftTheming.build/Objects-normal/arm64/Themeable.dia -target arm64-apple-xros1.0 -Xllvm -aarch64-use-tbi -enable-objc-interop -stack-check -sdk /Applications/Xcode-16.1.0.app/Contents/Developer/Platforms/XROS.platform/Developer/SDKs/XROS2.1.sdk -I /Users/admin/builder/spi-builder-workspace/.derivedData/Build/Products/Debug-xros -I /Applications/Xcode-16.1.0.app/Contents/Developer/Platforms/XROS.platform/Developer/usr/lib -F /Users/admin/builder/spi-builder-workspace/.derivedData/Build/Products/Debug-xros -F /Applications/Xcode-16.1.0.app/Contents/Developer/Platforms/XROS.platform/Developer/Library/Frameworks -F /Applications/Xcode-16.1.0.app/Contents/Developer/Platforms/XROS.platform/Developer/SDKs/XROS2.1.sdk/Developer/Library/Frameworks -no-color-diagnostics -enable-testing -g -debug-info-format\=dwarf -dwarf-version\=4 -module-cache-path /Users/admin/builder/spi-builder-workspace/.derivedData/ModuleCache.noindex -profile-generate -profile-coverage-mapping -swift-version 5 -enforce-exclusivity\=checked -stats-output-dir /Users/admin/builder/spi-builder-workspace/.swiftpm/xcode/.stats -Onone -D SWIFT_PACKAGE -D DEBUG -serialize-debugging-options -const-gather-protocols-file /Users/admin/builder/spi-builder-workspace/.derivedData/Build/Intermediates.noindex/SwiftTheming.build/Debug-xros/SwiftTheming.build/Objects-normal/arm64/SwiftTheming_const_extract_protocols.json -enable-experimental-feature DebugDescriptionMacro -enable-experimental-feature OpaqueTypeErasure -enable-upcoming-feature StrictConcurrency -enable-upcoming-feature DisableOutwardActorInference -enable-upcoming-feature GlobalActorIsolatedTypesUsability -enable-upcoming-feature InferSendableFromCaptures -strict-concurrency\=complete -empty-abi-descriptor -plugin-path /Applications/Xcode-16.1.0.app/Contents/Developer/Toolchains/XcodeDefault.xctoolchain/usr/lib/swift/host/plugins/testing -validate-clang-modules-once -clang-build-session-file /Users/admin/builder/spi-builder-workspace/.derivedData/ModuleCache.noindex/Session.modulevalidation -Xcc -working-directory -Xcc /Users/admin/builder/spi-builder-workspace/.swiftpm/xcode -resource-dir /Applications/Xcode-16.1.0.app/Contents/Developer/Toolchains/XcodeDefault.xctoolchain/usr/lib/swift -enable-anonymous-context-mangled-names -file-compilation-dir /Users/admin/builder/spi-builder-workspace/.swiftpm/xcode -Xcc -D_LIBCPP_HARDENING_MODE\=_LIBCPP_HARDENING_MODE_DEBUG -Xcc -ivfsstatcache -Xcc /Users/admin/builder/spi-builder-workspace/.derivedData/SDKStatCaches.noindex/xros2.1-22N573-02bafd7f43846583f0400bd788fa10b7.sdkstatcache -Xcc -I/Users/admin/builder/spi-builder-workspace/.derivedData/Build/Intermediates.noindex/SwiftTheming.build/Debug-xros/SwiftTheming.build/swift-overrides.hmap -Xcc -I/Users/admin/builder/spi-builder-workspace/.derivedData/Build/Products/Debug-xros/include -Xcc -I/Users/admin/builder/spi-builder-workspace/.derivedData/Build/Intermediates.noindex/SwiftTheming.build/Debug-xros/SwiftTheming.build/DerivedSources-normal/arm64 -Xcc -I/Users/admin/builder/spi-builder-workspace/.derivedData/Build/Intermediates.noindex/SwiftTheming.build/Debug-xros/SwiftTheming.build/DerivedSources/arm64 -Xcc -I/Users/admin/builder/spi-builder-workspace/.derivedData/Build/Intermediates.noindex/SwiftTheming.build/Debug-xros/SwiftTheming.build/DerivedSources -Xcc -DSWIFT_PACKAGE -Xcc -DDEBUG\=1 -module-name SwiftTheming -frontend-parseable-output -disable-clang-spi -target-sdk-version 2.1 -target-sdk-name xros2.1 -external-plugin-path /Applications/Xcode-16.1.0.app/Contents/Developer/Platforms/XROS.platform/Developer/usr/lib/swift/host/plugins\#/Applications/Xcode-16.1.0.app/Contents/Developer/Platforms/XROS.platform/Developer/usr/bin/swift-plugin-server -external-plugin-path /Applications/Xcode-16.1.0.app/Contents/Developer/Platforms/XROS.platform/Developer/usr/local/lib/swift/host/plugins\#/Applications/Xcode-16.1.0.app/Contents/Developer/Platforms/XROS.platform/Developer/usr/bin/swift-plugin-server -plugin-path /Applications/Xcode-16.1.0.app/Contents/Developer/Toolchains/XcodeDefault.xctoolchain/usr/lib/swift/host/plugins -plugin-path /Applications/Xcode-16.1.0.app/Contents/Developer/Toolchains/XcodeDefault.xctoolchain/usr/local/lib/swift/host/plugins -o /Users/admin/builder/spi-builder-workspace/.derivedData/Build/Intermediates.noindex/SwiftTheming.build/Debug-xros/SwiftTheming.build/Objects-normal/arm64/Themeable.o -index-unit-output-path /SwiftTheming.build/Debug-xros/SwiftTheming.build/Objects-normal/arm64/Themeable.o -index-store-path /Users/admin/builder/spi-builder-workspace/.derivedData/Index.noindex/DataStore -index-system-modules
SwiftCompile normal arm64 Compiling\ UserDefaults++.swift /Users/admin/builder/spi-builder-workspace/Sources/SwiftTheming/Extensions/UserDefaults++.swift (in target 'SwiftTheming' from project 'SwiftTheming')
cd /Users/admin/builder/spi-builder-workspace/.swiftpm/xcode
builtin-swiftTaskExecution -- /Applications/Xcode-16.1.0.app/Contents/Developer/Toolchains/XcodeDefault.xctoolchain/usr/bin/swift-frontend -frontend -c /Users/admin/builder/spi-builder-workspace/Sources/SwiftTheming/Appearance/Appearance.swift /Users/admin/builder/spi-builder-workspace/Sources/SwiftTheming/Appearance/PreferredAppearance.swift /Users/admin/builder/spi-builder-workspace/Sources/SwiftTheming/Asset/AssetKeyWrappable.swift /Users/admin/builder/spi-builder-workspace/Sources/SwiftTheming/Asset/Assetable.swift /Users/admin/builder/spi-builder-workspace/Sources/SwiftTheming/Asset/EmptyAsset.swift /Users/admin/builder/spi-builder-workspace/Sources/SwiftTheming/Asset/Sets/ColorSet.swift /Users/admin/builder/spi-builder-workspace/Sources/SwiftTheming/Asset/Sets/FontSet.swift /Users/admin/builder/spi-builder-workspace/Sources/SwiftTheming/Asset/Sets/GradientSet.swift /Users/admin/builder/spi-builder-workspace/Sources/SwiftTheming/Asset/Sets/ImageSet.swift /Users/admin/builder/spi-builder-workspace/Sources/SwiftTheming/Extensions/Color++.swift /Users/admin/builder/spi-builder-workspace/Sources/SwiftTheming/Extensions/Font++.swift /Users/admin/builder/spi-builder-workspace/Sources/SwiftTheming/Extensions/Gradient++.swift /Users/admin/builder/spi-builder-workspace/Sources/SwiftTheming/Extensions/Image++.swift -primary-file /Users/admin/builder/spi-builder-workspace/Sources/SwiftTheming/Extensions/UserDefaults++.swift /Users/admin/builder/spi-builder-workspace/Sources/SwiftTheming/Extensions/View++.swift /Users/admin/builder/spi-builder-workspace/Sources/SwiftTheming/Theme/DefaultTheming.swift /Users/admin/builder/spi-builder-workspace/Sources/SwiftTheming/Theme/Theme.swift /Users/admin/builder/spi-builder-workspace/Sources/SwiftTheming/Theme/Themeable.swift /Users/admin/builder/spi-builder-workspace/Sources/SwiftTheming/Theme/Themed.swift /Users/admin/builder/spi-builder-workspace/Sources/SwiftTheming/ThemeProvider/ThemeProvider.swift /Users/admin/builder/spi-builder-workspace/Sources/SwiftTheming/ThemeProvider/ThemeProviding.swift /Users/admin/builder/spi-builder-workspace/Sources/SwiftTheming/ThemeProvider/ThemeProvidingViewModifier.swift -emit-dependencies-path /Users/admin/builder/spi-builder-workspace/.derivedData/Build/Intermediates.noindex/SwiftTheming.build/Debug-xros/SwiftTheming.build/Objects-normal/arm64/UserDefaults++.d -emit-const-values-path /Users/admin/builder/spi-builder-workspace/.derivedData/Build/Intermediates.noindex/SwiftTheming.build/Debug-xros/SwiftTheming.build/Objects-normal/arm64/UserDefaults++.swiftconstvalues -emit-reference-dependencies-path /Users/admin/builder/spi-builder-workspace/.derivedData/Build/Intermediates.noindex/SwiftTheming.build/Debug-xros/SwiftTheming.build/Objects-normal/arm64/UserDefaults++.swiftdeps -serialize-diagnostics-path /Users/admin/builder/spi-builder-workspace/.derivedData/Build/Intermediates.noindex/SwiftTheming.build/Debug-xros/SwiftTheming.build/Objects-normal/arm64/UserDefaults++.dia -target arm64-apple-xros1.0 -Xllvm -aarch64-use-tbi -enable-objc-interop -stack-check -sdk /Applications/Xcode-16.1.0.app/Contents/Developer/Platforms/XROS.platform/Developer/SDKs/XROS2.1.sdk -I /Users/admin/builder/spi-builder-workspace/.derivedData/Build/Products/Debug-xros -I /Applications/Xcode-16.1.0.app/Contents/Developer/Platforms/XROS.platform/Developer/usr/lib -F /Users/admin/builder/spi-builder-workspace/.derivedData/Build/Products/Debug-xros -F /Applications/Xcode-16.1.0.app/Contents/Developer/Platforms/XROS.platform/Developer/Library/Frameworks -F /Applications/Xcode-16.1.0.app/Contents/Developer/Platforms/XROS.platform/Developer/SDKs/XROS2.1.sdk/Developer/Library/Frameworks -no-color-diagnostics -enable-testing -g -debug-info-format\=dwarf -dwarf-version\=4 -module-cache-path /Users/admin/builder/spi-builder-workspace/.derivedData/ModuleCache.noindex -profile-generate -profile-coverage-mapping -swift-version 5 -enforce-exclusivity\=checked -stats-output-dir /Users/admin/builder/spi-builder-workspace/.swiftpm/xcode/.stats -Onone -D SWIFT_PACKAGE -D DEBUG -serialize-debugging-options -const-gather-protocols-file /Users/admin/builder/spi-builder-workspace/.derivedData/Build/Intermediates.noindex/SwiftTheming.build/Debug-xros/SwiftTheming.build/Objects-normal/arm64/SwiftTheming_const_extract_protocols.json -enable-experimental-feature DebugDescriptionMacro -enable-experimental-feature OpaqueTypeErasure -enable-upcoming-feature StrictConcurrency -enable-upcoming-feature DisableOutwardActorInference -enable-upcoming-feature GlobalActorIsolatedTypesUsability -enable-upcoming-feature InferSendableFromCaptures -strict-concurrency\=complete -empty-abi-descriptor -plugin-path /Applications/Xcode-16.1.0.app/Contents/Developer/Toolchains/XcodeDefault.xctoolchain/usr/lib/swift/host/plugins/testing -validate-clang-modules-once -clang-build-session-file /Users/admin/builder/spi-builder-workspace/.derivedData/ModuleCache.noindex/Session.modulevalidation -Xcc -working-directory -Xcc /Users/admin/builder/spi-builder-workspace/.swiftpm/xcode -resource-dir /Applications/Xcode-16.1.0.app/Contents/Developer/Toolchains/XcodeDefault.xctoolchain/usr/lib/swift -enable-anonymous-context-mangled-names -file-compilation-dir /Users/admin/builder/spi-builder-workspace/.swiftpm/xcode -Xcc -D_LIBCPP_HARDENING_MODE\=_LIBCPP_HARDENING_MODE_DEBUG -Xcc -ivfsstatcache -Xcc /Users/admin/builder/spi-builder-workspace/.derivedData/SDKStatCaches.noindex/xros2.1-22N573-02bafd7f43846583f0400bd788fa10b7.sdkstatcache -Xcc -I/Users/admin/builder/spi-builder-workspace/.derivedData/Build/Intermediates.noindex/SwiftTheming.build/Debug-xros/SwiftTheming.build/swift-overrides.hmap -Xcc -I/Users/admin/builder/spi-builder-workspace/.derivedData/Build/Products/Debug-xros/include -Xcc -I/Users/admin/builder/spi-builder-workspace/.derivedData/Build/Intermediates.noindex/SwiftTheming.build/Debug-xros/SwiftTheming.build/DerivedSources-normal/arm64 -Xcc -I/Users/admin/builder/spi-builder-workspace/.derivedData/Build/Intermediates.noindex/SwiftTheming.build/Debug-xros/SwiftTheming.build/DerivedSources/arm64 -Xcc -I/Users/admin/builder/spi-builder-workspace/.derivedData/Build/Intermediates.noindex/SwiftTheming.build/Debug-xros/SwiftTheming.build/DerivedSources -Xcc -DSWIFT_PACKAGE -Xcc -DDEBUG\=1 -module-name SwiftTheming -frontend-parseable-output -disable-clang-spi -target-sdk-version 2.1 -target-sdk-name xros2.1 -external-plugin-path /Applications/Xcode-16.1.0.app/Contents/Developer/Platforms/XROS.platform/Developer/usr/lib/swift/host/plugins\#/Applications/Xcode-16.1.0.app/Contents/Developer/Platforms/XROS.platform/Developer/usr/bin/swift-plugin-server -external-plugin-path /Applications/Xcode-16.1.0.app/Contents/Developer/Platforms/XROS.platform/Developer/usr/local/lib/swift/host/plugins\#/Applications/Xcode-16.1.0.app/Contents/Developer/Platforms/XROS.platform/Developer/usr/bin/swift-plugin-server -plugin-path /Applications/Xcode-16.1.0.app/Contents/Developer/Toolchains/XcodeDefault.xctoolchain/usr/lib/swift/host/plugins -plugin-path /Applications/Xcode-16.1.0.app/Contents/Developer/Toolchains/XcodeDefault.xctoolchain/usr/local/lib/swift/host/plugins -o /Users/admin/builder/spi-builder-workspace/.derivedData/Build/Intermediates.noindex/SwiftTheming.build/Debug-xros/SwiftTheming.build/Objects-normal/arm64/UserDefaults++.o -index-unit-output-path /SwiftTheming.build/Debug-xros/SwiftTheming.build/Objects-normal/arm64/UserDefaults++.o -index-store-path /Users/admin/builder/spi-builder-workspace/.derivedData/Index.noindex/DataStore -index-system-modules
SwiftCompile normal arm64 /Users/admin/builder/spi-builder-workspace/Sources/SwiftTheming/Extensions/UserDefaults++.swift (in target 'SwiftTheming' from project 'SwiftTheming')
cd /Users/admin/builder/spi-builder-workspace/.swiftpm/xcode
/Applications/Xcode-16.1.0.app/Contents/Developer/Toolchains/XcodeDefault.xctoolchain/usr/bin/swift-frontend -c /Users/admin/builder/spi-builder-workspace/Sources/SwiftTheming/Appearance/Appearance.swift /Users/admin/builder/spi-builder-workspace/Sources/SwiftTheming/Appearance/PreferredAppearance.swift /Users/admin/builder/spi-builder-workspace/Sources/SwiftTheming/Asset/AssetKeyWrappable.swift /Users/admin/builder/spi-builder-workspace/Sources/SwiftTheming/Asset/Assetable.swift /Users/admin/builder/spi-builder-workspace/Sources/SwiftTheming/Asset/EmptyAsset.swift /Users/admin/builder/spi-builder-workspace/Sources/SwiftTheming/Asset/Sets/ColorSet.swift /Users/admin/builder/spi-builder-workspace/Sources/SwiftTheming/Asset/Sets/FontSet.swift /Users/admin/builder/spi-builder-workspace/Sources/SwiftTheming/Asset/Sets/GradientSet.swift /Users/admin/builder/spi-builder-workspace/Sources/SwiftTheming/Asset/Sets/ImageSet.swift /Users/admin/builder/spi-builder-workspace/Sources/SwiftTheming/Extensions/Color++.swift /Users/admin/builder/spi-builder-workspace/Sources/SwiftTheming/Extensions/Font++.swift /Users/admin/builder/spi-builder-workspace/Sources/SwiftTheming/Extensions/Gradient++.swift /Users/admin/builder/spi-builder-workspace/Sources/SwiftTheming/Extensions/Image++.swift -primary-file /Users/admin/builder/spi-builder-workspace/Sources/SwiftTheming/Extensions/UserDefaults++.swift /Users/admin/builder/spi-builder-workspace/Sources/SwiftTheming/Extensions/View++.swift /Users/admin/builder/spi-builder-workspace/Sources/SwiftTheming/Theme/DefaultTheming.swift /Users/admin/builder/spi-builder-workspace/Sources/SwiftTheming/Theme/Theme.swift /Users/admin/builder/spi-builder-workspace/Sources/SwiftTheming/Theme/Themeable.swift /Users/admin/builder/spi-builder-workspace/Sources/SwiftTheming/Theme/Themed.swift /Users/admin/builder/spi-builder-workspace/Sources/SwiftTheming/ThemeProvider/ThemeProvider.swift /Users/admin/builder/spi-builder-workspace/Sources/SwiftTheming/ThemeProvider/ThemeProviding.swift /Users/admin/builder/spi-builder-workspace/Sources/SwiftTheming/ThemeProvider/ThemeProvidingViewModifier.swift -emit-dependencies-path /Users/admin/builder/spi-builder-workspace/.derivedData/Build/Intermediates.noindex/SwiftTheming.build/Debug-xros/SwiftTheming.build/Objects-normal/arm64/UserDefaults++.d -emit-const-values-path /Users/admin/builder/spi-builder-workspace/.derivedData/Build/Intermediates.noindex/SwiftTheming.build/Debug-xros/SwiftTheming.build/Objects-normal/arm64/UserDefaults++.swiftconstvalues -emit-reference-dependencies-path /Users/admin/builder/spi-builder-workspace/.derivedData/Build/Intermediates.noindex/SwiftTheming.build/Debug-xros/SwiftTheming.build/Objects-normal/arm64/UserDefaults++.swiftdeps -serialize-diagnostics-path /Users/admin/builder/spi-builder-workspace/.derivedData/Build/Intermediates.noindex/SwiftTheming.build/Debug-xros/SwiftTheming.build/Objects-normal/arm64/UserDefaults++.dia -target arm64-apple-xros1.0 -Xllvm -aarch64-use-tbi -enable-objc-interop -stack-check -sdk /Applications/Xcode-16.1.0.app/Contents/Developer/Platforms/XROS.platform/Developer/SDKs/XROS2.1.sdk -I /Users/admin/builder/spi-builder-workspace/.derivedData/Build/Products/Debug-xros -I /Applications/Xcode-16.1.0.app/Contents/Developer/Platforms/XROS.platform/Developer/usr/lib -F /Users/admin/builder/spi-builder-workspace/.derivedData/Build/Products/Debug-xros -F /Applications/Xcode-16.1.0.app/Contents/Developer/Platforms/XROS.platform/Developer/Library/Frameworks -F /Applications/Xcode-16.1.0.app/Contents/Developer/Platforms/XROS.platform/Developer/SDKs/XROS2.1.sdk/Developer/Library/Frameworks -no-color-diagnostics -enable-testing -g -debug-info-format\=dwarf -dwarf-version\=4 -module-cache-path /Users/admin/builder/spi-builder-workspace/.derivedData/ModuleCache.noindex -profile-generate -profile-coverage-mapping -swift-version 5 -enforce-exclusivity\=checked -stats-output-dir /Users/admin/builder/spi-builder-workspace/.swiftpm/xcode/.stats -Onone -D SWIFT_PACKAGE -D DEBUG -serialize-debugging-options -const-gather-protocols-file /Users/admin/builder/spi-builder-workspace/.derivedData/Build/Intermediates.noindex/SwiftTheming.build/Debug-xros/SwiftTheming.build/Objects-normal/arm64/SwiftTheming_const_extract_protocols.json -enable-experimental-feature DebugDescriptionMacro -enable-experimental-feature OpaqueTypeErasure -enable-upcoming-feature StrictConcurrency -enable-upcoming-feature DisableOutwardActorInference -enable-upcoming-feature GlobalActorIsolatedTypesUsability -enable-upcoming-feature InferSendableFromCaptures -strict-concurrency\=complete -empty-abi-descriptor -plugin-path /Applications/Xcode-16.1.0.app/Contents/Developer/Toolchains/XcodeDefault.xctoolchain/usr/lib/swift/host/plugins/testing -validate-clang-modules-once -clang-build-session-file /Users/admin/builder/spi-builder-workspace/.derivedData/ModuleCache.noindex/Session.modulevalidation -Xcc -working-directory -Xcc /Users/admin/builder/spi-builder-workspace/.swiftpm/xcode -resource-dir /Applications/Xcode-16.1.0.app/Contents/Developer/Toolchains/XcodeDefault.xctoolchain/usr/lib/swift -enable-anonymous-context-mangled-names -file-compilation-dir /Users/admin/builder/spi-builder-workspace/.swiftpm/xcode -Xcc -D_LIBCPP_HARDENING_MODE\=_LIBCPP_HARDENING_MODE_DEBUG -Xcc -ivfsstatcache -Xcc /Users/admin/builder/spi-builder-workspace/.derivedData/SDKStatCaches.noindex/xros2.1-22N573-02bafd7f43846583f0400bd788fa10b7.sdkstatcache -Xcc -I/Users/admin/builder/spi-builder-workspace/.derivedData/Build/Intermediates.noindex/SwiftTheming.build/Debug-xros/SwiftTheming.build/swift-overrides.hmap -Xcc -I/Users/admin/builder/spi-builder-workspace/.derivedData/Build/Products/Debug-xros/include -Xcc -I/Users/admin/builder/spi-builder-workspace/.derivedData/Build/Intermediates.noindex/SwiftTheming.build/Debug-xros/SwiftTheming.build/DerivedSources-normal/arm64 -Xcc -I/Users/admin/builder/spi-builder-workspace/.derivedData/Build/Intermediates.noindex/SwiftTheming.build/Debug-xros/SwiftTheming.build/DerivedSources/arm64 -Xcc -I/Users/admin/builder/spi-builder-workspace/.derivedData/Build/Intermediates.noindex/SwiftTheming.build/Debug-xros/SwiftTheming.build/DerivedSources -Xcc -DSWIFT_PACKAGE -Xcc -DDEBUG\=1 -module-name SwiftTheming -frontend-parseable-output -disable-clang-spi -target-sdk-version 2.1 -target-sdk-name xros2.1 -external-plugin-path /Applications/Xcode-16.1.0.app/Contents/Developer/Platforms/XROS.platform/Developer/usr/lib/swift/host/plugins\#/Applications/Xcode-16.1.0.app/Contents/Developer/Platforms/XROS.platform/Developer/usr/bin/swift-plugin-server -external-plugin-path /Applications/Xcode-16.1.0.app/Contents/Developer/Platforms/XROS.platform/Developer/usr/local/lib/swift/host/plugins\#/Applications/Xcode-16.1.0.app/Contents/Developer/Platforms/XROS.platform/Developer/usr/bin/swift-plugin-server -plugin-path /Applications/Xcode-16.1.0.app/Contents/Developer/Toolchains/XcodeDefault.xctoolchain/usr/lib/swift/host/plugins -plugin-path /Applications/Xcode-16.1.0.app/Contents/Developer/Toolchains/XcodeDefault.xctoolchain/usr/local/lib/swift/host/plugins -o /Users/admin/builder/spi-builder-workspace/.derivedData/Build/Intermediates.noindex/SwiftTheming.build/Debug-xros/SwiftTheming.build/Objects-normal/arm64/UserDefaults++.o -index-unit-output-path /SwiftTheming.build/Debug-xros/SwiftTheming.build/Objects-normal/arm64/UserDefaults++.o -index-store-path /Users/admin/builder/spi-builder-workspace/.derivedData/Index.noindex/DataStore -index-system-modules
SwiftCompile normal arm64 Compiling\ FontSet.swift /Users/admin/builder/spi-builder-workspace/Sources/SwiftTheming/Asset/Sets/FontSet.swift (in target 'SwiftTheming' from project 'SwiftTheming')
cd /Users/admin/builder/spi-builder-workspace/.swiftpm/xcode
builtin-swiftTaskExecution -- /Applications/Xcode-16.1.0.app/Contents/Developer/Toolchains/XcodeDefault.xctoolchain/usr/bin/swift-frontend -frontend -c /Users/admin/builder/spi-builder-workspace/Sources/SwiftTheming/Appearance/Appearance.swift /Users/admin/builder/spi-builder-workspace/Sources/SwiftTheming/Appearance/PreferredAppearance.swift /Users/admin/builder/spi-builder-workspace/Sources/SwiftTheming/Asset/AssetKeyWrappable.swift /Users/admin/builder/spi-builder-workspace/Sources/SwiftTheming/Asset/Assetable.swift /Users/admin/builder/spi-builder-workspace/Sources/SwiftTheming/Asset/EmptyAsset.swift /Users/admin/builder/spi-builder-workspace/Sources/SwiftTheming/Asset/Sets/ColorSet.swift -primary-file /Users/admin/builder/spi-builder-workspace/Sources/SwiftTheming/Asset/Sets/FontSet.swift /Users/admin/builder/spi-builder-workspace/Sources/SwiftTheming/Asset/Sets/GradientSet.swift /Users/admin/builder/spi-builder-workspace/Sources/SwiftTheming/Asset/Sets/ImageSet.swift /Users/admin/builder/spi-builder-workspace/Sources/SwiftTheming/Extensions/Color++.swift /Users/admin/builder/spi-builder-workspace/Sources/SwiftTheming/Extensions/Font++.swift /Users/admin/builder/spi-builder-workspace/Sources/SwiftTheming/Extensions/Gradient++.swift /Users/admin/builder/spi-builder-workspace/Sources/SwiftTheming/Extensions/Image++.swift /Users/admin/builder/spi-builder-workspace/Sources/SwiftTheming/Extensions/UserDefaults++.swift /Users/admin/builder/spi-builder-workspace/Sources/SwiftTheming/Extensions/View++.swift /Users/admin/builder/spi-builder-workspace/Sources/SwiftTheming/Theme/DefaultTheming.swift /Users/admin/builder/spi-builder-workspace/Sources/SwiftTheming/Theme/Theme.swift /Users/admin/builder/spi-builder-workspace/Sources/SwiftTheming/Theme/Themeable.swift /Users/admin/builder/spi-builder-workspace/Sources/SwiftTheming/Theme/Themed.swift /Users/admin/builder/spi-builder-workspace/Sources/SwiftTheming/ThemeProvider/ThemeProvider.swift /Users/admin/builder/spi-builder-workspace/Sources/SwiftTheming/ThemeProvider/ThemeProviding.swift /Users/admin/builder/spi-builder-workspace/Sources/SwiftTheming/ThemeProvider/ThemeProvidingViewModifier.swift -emit-dependencies-path /Users/admin/builder/spi-builder-workspace/.derivedData/Build/Intermediates.noindex/SwiftTheming.build/Debug-xros/SwiftTheming.build/Objects-normal/arm64/FontSet.d -emit-const-values-path /Users/admin/builder/spi-builder-workspace/.derivedData/Build/Intermediates.noindex/SwiftTheming.build/Debug-xros/SwiftTheming.build/Objects-normal/arm64/FontSet.swiftconstvalues -emit-reference-dependencies-path /Users/admin/builder/spi-builder-workspace/.derivedData/Build/Intermediates.noindex/SwiftTheming.build/Debug-xros/SwiftTheming.build/Objects-normal/arm64/FontSet.swiftdeps -serialize-diagnostics-path /Users/admin/builder/spi-builder-workspace/.derivedData/Build/Intermediates.noindex/SwiftTheming.build/Debug-xros/SwiftTheming.build/Objects-normal/arm64/FontSet.dia -target arm64-apple-xros1.0 -Xllvm -aarch64-use-tbi -enable-objc-interop -stack-check -sdk /Applications/Xcode-16.1.0.app/Contents/Developer/Platforms/XROS.platform/Developer/SDKs/XROS2.1.sdk -I /Users/admin/builder/spi-builder-workspace/.derivedData/Build/Products/Debug-xros -I /Applications/Xcode-16.1.0.app/Contents/Developer/Platforms/XROS.platform/Developer/usr/lib -F /Users/admin/builder/spi-builder-workspace/.derivedData/Build/Products/Debug-xros -F /Applications/Xcode-16.1.0.app/Contents/Developer/Platforms/XROS.platform/Developer/Library/Frameworks -F /Applications/Xcode-16.1.0.app/Contents/Developer/Platforms/XROS.platform/Developer/SDKs/XROS2.1.sdk/Developer/Library/Frameworks -no-color-diagnostics -enable-testing -g -debug-info-format\=dwarf -dwarf-version\=4 -module-cache-path /Users/admin/builder/spi-builder-workspace/.derivedData/ModuleCache.noindex -profile-generate -profile-coverage-mapping -swift-version 5 -enforce-exclusivity\=checked -stats-output-dir /Users/admin/builder/spi-builder-workspace/.swiftpm/xcode/.stats -Onone -D SWIFT_PACKAGE -D DEBUG -serialize-debugging-options -const-gather-protocols-file /Users/admin/builder/spi-builder-workspace/.derivedData/Build/Intermediates.noindex/SwiftTheming.build/Debug-xros/SwiftTheming.build/Objects-normal/arm64/SwiftTheming_const_extract_protocols.json -enable-experimental-feature DebugDescriptionMacro -enable-experimental-feature OpaqueTypeErasure -enable-upcoming-feature StrictConcurrency -enable-upcoming-feature DisableOutwardActorInference -enable-upcoming-feature GlobalActorIsolatedTypesUsability -enable-upcoming-feature InferSendableFromCaptures -strict-concurrency\=complete -empty-abi-descriptor -plugin-path /Applications/Xcode-16.1.0.app/Contents/Developer/Toolchains/XcodeDefault.xctoolchain/usr/lib/swift/host/plugins/testing -validate-clang-modules-once -clang-build-session-file /Users/admin/builder/spi-builder-workspace/.derivedData/ModuleCache.noindex/Session.modulevalidation -Xcc -working-directory -Xcc /Users/admin/builder/spi-builder-workspace/.swiftpm/xcode -resource-dir /Applications/Xcode-16.1.0.app/Contents/Developer/Toolchains/XcodeDefault.xctoolchain/usr/lib/swift -enable-anonymous-context-mangled-names -file-compilation-dir /Users/admin/builder/spi-builder-workspace/.swiftpm/xcode -Xcc -D_LIBCPP_HARDENING_MODE\=_LIBCPP_HARDENING_MODE_DEBUG -Xcc -ivfsstatcache -Xcc /Users/admin/builder/spi-builder-workspace/.derivedData/SDKStatCaches.noindex/xros2.1-22N573-02bafd7f43846583f0400bd788fa10b7.sdkstatcache -Xcc -I/Users/admin/builder/spi-builder-workspace/.derivedData/Build/Intermediates.noindex/SwiftTheming.build/Debug-xros/SwiftTheming.build/swift-overrides.hmap -Xcc -I/Users/admin/builder/spi-builder-workspace/.derivedData/Build/Products/Debug-xros/include -Xcc -I/Users/admin/builder/spi-builder-workspace/.derivedData/Build/Intermediates.noindex/SwiftTheming.build/Debug-xros/SwiftTheming.build/DerivedSources-normal/arm64 -Xcc -I/Users/admin/builder/spi-builder-workspace/.derivedData/Build/Intermediates.noindex/SwiftTheming.build/Debug-xros/SwiftTheming.build/DerivedSources/arm64 -Xcc -I/Users/admin/builder/spi-builder-workspace/.derivedData/Build/Intermediates.noindex/SwiftTheming.build/Debug-xros/SwiftTheming.build/DerivedSources -Xcc -DSWIFT_PACKAGE -Xcc -DDEBUG\=1 -module-name SwiftTheming -frontend-parseable-output -disable-clang-spi -target-sdk-version 2.1 -target-sdk-name xros2.1 -external-plugin-path /Applications/Xcode-16.1.0.app/Contents/Developer/Platforms/XROS.platform/Developer/usr/lib/swift/host/plugins\#/Applications/Xcode-16.1.0.app/Contents/Developer/Platforms/XROS.platform/Developer/usr/bin/swift-plugin-server -external-plugin-path /Applications/Xcode-16.1.0.app/Contents/Developer/Platforms/XROS.platform/Developer/usr/local/lib/swift/host/plugins\#/Applications/Xcode-16.1.0.app/Contents/Developer/Platforms/XROS.platform/Developer/usr/bin/swift-plugin-server -plugin-path /Applications/Xcode-16.1.0.app/Contents/Developer/Toolchains/XcodeDefault.xctoolchain/usr/lib/swift/host/plugins -plugin-path /Applications/Xcode-16.1.0.app/Contents/Developer/Toolchains/XcodeDefault.xctoolchain/usr/local/lib/swift/host/plugins -o /Users/admin/builder/spi-builder-workspace/.derivedData/Build/Intermediates.noindex/SwiftTheming.build/Debug-xros/SwiftTheming.build/Objects-normal/arm64/FontSet.o -index-unit-output-path /SwiftTheming.build/Debug-xros/SwiftTheming.build/Objects-normal/arm64/FontSet.o -index-store-path /Users/admin/builder/spi-builder-workspace/.derivedData/Index.noindex/DataStore -index-system-modules
SwiftCompile normal arm64 /Users/admin/builder/spi-builder-workspace/Sources/SwiftTheming/Asset/Sets/FontSet.swift (in target 'SwiftTheming' from project 'SwiftTheming')
cd /Users/admin/builder/spi-builder-workspace/.swiftpm/xcode
/Applications/Xcode-16.1.0.app/Contents/Developer/Toolchains/XcodeDefault.xctoolchain/usr/bin/swift-frontend -c /Users/admin/builder/spi-builder-workspace/Sources/SwiftTheming/Appearance/Appearance.swift /Users/admin/builder/spi-builder-workspace/Sources/SwiftTheming/Appearance/PreferredAppearance.swift /Users/admin/builder/spi-builder-workspace/Sources/SwiftTheming/Asset/AssetKeyWrappable.swift /Users/admin/builder/spi-builder-workspace/Sources/SwiftTheming/Asset/Assetable.swift /Users/admin/builder/spi-builder-workspace/Sources/SwiftTheming/Asset/EmptyAsset.swift /Users/admin/builder/spi-builder-workspace/Sources/SwiftTheming/Asset/Sets/ColorSet.swift -primary-file /Users/admin/builder/spi-builder-workspace/Sources/SwiftTheming/Asset/Sets/FontSet.swift /Users/admin/builder/spi-builder-workspace/Sources/SwiftTheming/Asset/Sets/GradientSet.swift /Users/admin/builder/spi-builder-workspace/Sources/SwiftTheming/Asset/Sets/ImageSet.swift /Users/admin/builder/spi-builder-workspace/Sources/SwiftTheming/Extensions/Color++.swift /Users/admin/builder/spi-builder-workspace/Sources/SwiftTheming/Extensions/Font++.swift /Users/admin/builder/spi-builder-workspace/Sources/SwiftTheming/Extensions/Gradient++.swift /Users/admin/builder/spi-builder-workspace/Sources/SwiftTheming/Extensions/Image++.swift /Users/admin/builder/spi-builder-workspace/Sources/SwiftTheming/Extensions/UserDefaults++.swift /Users/admin/builder/spi-builder-workspace/Sources/SwiftTheming/Extensions/View++.swift /Users/admin/builder/spi-builder-workspace/Sources/SwiftTheming/Theme/DefaultTheming.swift /Users/admin/builder/spi-builder-workspace/Sources/SwiftTheming/Theme/Theme.swift /Users/admin/builder/spi-builder-workspace/Sources/SwiftTheming/Theme/Themeable.swift /Users/admin/builder/spi-builder-workspace/Sources/SwiftTheming/Theme/Themed.swift /Users/admin/builder/spi-builder-workspace/Sources/SwiftTheming/ThemeProvider/ThemeProvider.swift /Users/admin/builder/spi-builder-workspace/Sources/SwiftTheming/ThemeProvider/ThemeProviding.swift /Users/admin/builder/spi-builder-workspace/Sources/SwiftTheming/ThemeProvider/ThemeProvidingViewModifier.swift -emit-dependencies-path /Users/admin/builder/spi-builder-workspace/.derivedData/Build/Intermediates.noindex/SwiftTheming.build/Debug-xros/SwiftTheming.build/Objects-normal/arm64/FontSet.d -emit-const-values-path /Users/admin/builder/spi-builder-workspace/.derivedData/Build/Intermediates.noindex/SwiftTheming.build/Debug-xros/SwiftTheming.build/Objects-normal/arm64/FontSet.swiftconstvalues -emit-reference-dependencies-path /Users/admin/builder/spi-builder-workspace/.derivedData/Build/Intermediates.noindex/SwiftTheming.build/Debug-xros/SwiftTheming.build/Objects-normal/arm64/FontSet.swiftdeps -serialize-diagnostics-path /Users/admin/builder/spi-builder-workspace/.derivedData/Build/Intermediates.noindex/SwiftTheming.build/Debug-xros/SwiftTheming.build/Objects-normal/arm64/FontSet.dia -target arm64-apple-xros1.0 -Xllvm -aarch64-use-tbi -enable-objc-interop -stack-check -sdk /Applications/Xcode-16.1.0.app/Contents/Developer/Platforms/XROS.platform/Developer/SDKs/XROS2.1.sdk -I /Users/admin/builder/spi-builder-workspace/.derivedData/Build/Products/Debug-xros -I /Applications/Xcode-16.1.0.app/Contents/Developer/Platforms/XROS.platform/Developer/usr/lib -F /Users/admin/builder/spi-builder-workspace/.derivedData/Build/Products/Debug-xros -F /Applications/Xcode-16.1.0.app/Contents/Developer/Platforms/XROS.platform/Developer/Library/Frameworks -F /Applications/Xcode-16.1.0.app/Contents/Developer/Platforms/XROS.platform/Developer/SDKs/XROS2.1.sdk/Developer/Library/Frameworks -no-color-diagnostics -enable-testing -g -debug-info-format\=dwarf -dwarf-version\=4 -module-cache-path /Users/admin/builder/spi-builder-workspace/.derivedData/ModuleCache.noindex -profile-generate -profile-coverage-mapping -swift-version 5 -enforce-exclusivity\=checked -stats-output-dir /Users/admin/builder/spi-builder-workspace/.swiftpm/xcode/.stats -Onone -D SWIFT_PACKAGE -D DEBUG -serialize-debugging-options -const-gather-protocols-file /Users/admin/builder/spi-builder-workspace/.derivedData/Build/Intermediates.noindex/SwiftTheming.build/Debug-xros/SwiftTheming.build/Objects-normal/arm64/SwiftTheming_const_extract_protocols.json -enable-experimental-feature DebugDescriptionMacro -enable-experimental-feature OpaqueTypeErasure -enable-upcoming-feature StrictConcurrency -enable-upcoming-feature DisableOutwardActorInference -enable-upcoming-feature GlobalActorIsolatedTypesUsability -enable-upcoming-feature InferSendableFromCaptures -strict-concurrency\=complete -empty-abi-descriptor -plugin-path /Applications/Xcode-16.1.0.app/Contents/Developer/Toolchains/XcodeDefault.xctoolchain/usr/lib/swift/host/plugins/testing -validate-clang-modules-once -clang-build-session-file /Users/admin/builder/spi-builder-workspace/.derivedData/ModuleCache.noindex/Session.modulevalidation -Xcc -working-directory -Xcc /Users/admin/builder/spi-builder-workspace/.swiftpm/xcode -resource-dir /Applications/Xcode-16.1.0.app/Contents/Developer/Toolchains/XcodeDefault.xctoolchain/usr/lib/swift -enable-anonymous-context-mangled-names -file-compilation-dir /Users/admin/builder/spi-builder-workspace/.swiftpm/xcode -Xcc -D_LIBCPP_HARDENING_MODE\=_LIBCPP_HARDENING_MODE_DEBUG -Xcc -ivfsstatcache -Xcc /Users/admin/builder/spi-builder-workspace/.derivedData/SDKStatCaches.noindex/xros2.1-22N573-02bafd7f43846583f0400bd788fa10b7.sdkstatcache -Xcc -I/Users/admin/builder/spi-builder-workspace/.derivedData/Build/Intermediates.noindex/SwiftTheming.build/Debug-xros/SwiftTheming.build/swift-overrides.hmap -Xcc -I/Users/admin/builder/spi-builder-workspace/.derivedData/Build/Products/Debug-xros/include -Xcc -I/Users/admin/builder/spi-builder-workspace/.derivedData/Build/Intermediates.noindex/SwiftTheming.build/Debug-xros/SwiftTheming.build/DerivedSources-normal/arm64 -Xcc -I/Users/admin/builder/spi-builder-workspace/.derivedData/Build/Intermediates.noindex/SwiftTheming.build/Debug-xros/SwiftTheming.build/DerivedSources/arm64 -Xcc -I/Users/admin/builder/spi-builder-workspace/.derivedData/Build/Intermediates.noindex/SwiftTheming.build/Debug-xros/SwiftTheming.build/DerivedSources -Xcc -DSWIFT_PACKAGE -Xcc -DDEBUG\=1 -module-name SwiftTheming -frontend-parseable-output -disable-clang-spi -target-sdk-version 2.1 -target-sdk-name xros2.1 -external-plugin-path /Applications/Xcode-16.1.0.app/Contents/Developer/Platforms/XROS.platform/Developer/usr/lib/swift/host/plugins\#/Applications/Xcode-16.1.0.app/Contents/Developer/Platforms/XROS.platform/Developer/usr/bin/swift-plugin-server -external-plugin-path /Applications/Xcode-16.1.0.app/Contents/Developer/Platforms/XROS.platform/Developer/usr/local/lib/swift/host/plugins\#/Applications/Xcode-16.1.0.app/Contents/Developer/Platforms/XROS.platform/Developer/usr/bin/swift-plugin-server -plugin-path /Applications/Xcode-16.1.0.app/Contents/Developer/Toolchains/XcodeDefault.xctoolchain/usr/lib/swift/host/plugins -plugin-path /Applications/Xcode-16.1.0.app/Contents/Developer/Toolchains/XcodeDefault.xctoolchain/usr/local/lib/swift/host/plugins -o /Users/admin/builder/spi-builder-workspace/.derivedData/Build/Intermediates.noindex/SwiftTheming.build/Debug-xros/SwiftTheming.build/Objects-normal/arm64/FontSet.o -index-unit-output-path /SwiftTheming.build/Debug-xros/SwiftTheming.build/Objects-normal/arm64/FontSet.o -index-store-path /Users/admin/builder/spi-builder-workspace/.derivedData/Index.noindex/DataStore -index-system-modules
SwiftCompile normal arm64 Compiling\ GradientSet.swift /Users/admin/builder/spi-builder-workspace/Sources/SwiftTheming/Asset/Sets/GradientSet.swift (in target 'SwiftTheming' from project 'SwiftTheming')
cd /Users/admin/builder/spi-builder-workspace/.swiftpm/xcode
builtin-swiftTaskExecution -- /Applications/Xcode-16.1.0.app/Contents/Developer/Toolchains/XcodeDefault.xctoolchain/usr/bin/swift-frontend -frontend -c /Users/admin/builder/spi-builder-workspace/Sources/SwiftTheming/Appearance/Appearance.swift /Users/admin/builder/spi-builder-workspace/Sources/SwiftTheming/Appearance/PreferredAppearance.swift /Users/admin/builder/spi-builder-workspace/Sources/SwiftTheming/Asset/AssetKeyWrappable.swift /Users/admin/builder/spi-builder-workspace/Sources/SwiftTheming/Asset/Assetable.swift /Users/admin/builder/spi-builder-workspace/Sources/SwiftTheming/Asset/EmptyAsset.swift /Users/admin/builder/spi-builder-workspace/Sources/SwiftTheming/Asset/Sets/ColorSet.swift /Users/admin/builder/spi-builder-workspace/Sources/SwiftTheming/Asset/Sets/FontSet.swift -primary-file /Users/admin/builder/spi-builder-workspace/Sources/SwiftTheming/Asset/Sets/GradientSet.swift /Users/admin/builder/spi-builder-workspace/Sources/SwiftTheming/Asset/Sets/ImageSet.swift /Users/admin/builder/spi-builder-workspace/Sources/SwiftTheming/Extensions/Color++.swift /Users/admin/builder/spi-builder-workspace/Sources/SwiftTheming/Extensions/Font++.swift /Users/admin/builder/spi-builder-workspace/Sources/SwiftTheming/Extensions/Gradient++.swift /Users/admin/builder/spi-builder-workspace/Sources/SwiftTheming/Extensions/Image++.swift /Users/admin/builder/spi-builder-workspace/Sources/SwiftTheming/Extensions/UserDefaults++.swift /Users/admin/builder/spi-builder-workspace/Sources/SwiftTheming/Extensions/View++.swift /Users/admin/builder/spi-builder-workspace/Sources/SwiftTheming/Theme/DefaultTheming.swift /Users/admin/builder/spi-builder-workspace/Sources/SwiftTheming/Theme/Theme.swift /Users/admin/builder/spi-builder-workspace/Sources/SwiftTheming/Theme/Themeable.swift /Users/admin/builder/spi-builder-workspace/Sources/SwiftTheming/Theme/Themed.swift /Users/admin/builder/spi-builder-workspace/Sources/SwiftTheming/ThemeProvider/ThemeProvider.swift /Users/admin/builder/spi-builder-workspace/Sources/SwiftTheming/ThemeProvider/ThemeProviding.swift /Users/admin/builder/spi-builder-workspace/Sources/SwiftTheming/ThemeProvider/ThemeProvidingViewModifier.swift -emit-dependencies-path /Users/admin/builder/spi-builder-workspace/.derivedData/Build/Intermediates.noindex/SwiftTheming.build/Debug-xros/SwiftTheming.build/Objects-normal/arm64/GradientSet.d -emit-const-values-path /Users/admin/builder/spi-builder-workspace/.derivedData/Build/Intermediates.noindex/SwiftTheming.build/Debug-xros/SwiftTheming.build/Objects-normal/arm64/GradientSet.swiftconstvalues -emit-reference-dependencies-path /Users/admin/builder/spi-builder-workspace/.derivedData/Build/Intermediates.noindex/SwiftTheming.build/Debug-xros/SwiftTheming.build/Objects-normal/arm64/GradientSet.swiftdeps -serialize-diagnostics-path /Users/admin/builder/spi-builder-workspace/.derivedData/Build/Intermediates.noindex/SwiftTheming.build/Debug-xros/SwiftTheming.build/Objects-normal/arm64/GradientSet.dia -target arm64-apple-xros1.0 -Xllvm -aarch64-use-tbi -enable-objc-interop -stack-check -sdk /Applications/Xcode-16.1.0.app/Contents/Developer/Platforms/XROS.platform/Developer/SDKs/XROS2.1.sdk -I /Users/admin/builder/spi-builder-workspace/.derivedData/Build/Products/Debug-xros -I /Applications/Xcode-16.1.0.app/Contents/Developer/Platforms/XROS.platform/Developer/usr/lib -F /Users/admin/builder/spi-builder-workspace/.derivedData/Build/Products/Debug-xros -F /Applications/Xcode-16.1.0.app/Contents/Developer/Platforms/XROS.platform/Developer/Library/Frameworks -F /Applications/Xcode-16.1.0.app/Contents/Developer/Platforms/XROS.platform/Developer/SDKs/XROS2.1.sdk/Developer/Library/Frameworks -no-color-diagnostics -enable-testing -g -debug-info-format\=dwarf -dwarf-version\=4 -module-cache-path /Users/admin/builder/spi-builder-workspace/.derivedData/ModuleCache.noindex -profile-generate -profile-coverage-mapping -swift-version 5 -enforce-exclusivity\=checked -stats-output-dir /Users/admin/builder/spi-builder-workspace/.swiftpm/xcode/.stats -Onone -D SWIFT_PACKAGE -D DEBUG -serialize-debugging-options -const-gather-protocols-file /Users/admin/builder/spi-builder-workspace/.derivedData/Build/Intermediates.noindex/SwiftTheming.build/Debug-xros/SwiftTheming.build/Objects-normal/arm64/SwiftTheming_const_extract_protocols.json -enable-experimental-feature DebugDescriptionMacro -enable-experimental-feature OpaqueTypeErasure -enable-upcoming-feature StrictConcurrency -enable-upcoming-feature DisableOutwardActorInference -enable-upcoming-feature GlobalActorIsolatedTypesUsability -enable-upcoming-feature InferSendableFromCaptures -strict-concurrency\=complete -empty-abi-descriptor -plugin-path /Applications/Xcode-16.1.0.app/Contents/Developer/Toolchains/XcodeDefault.xctoolchain/usr/lib/swift/host/plugins/testing -validate-clang-modules-once -clang-build-session-file /Users/admin/builder/spi-builder-workspace/.derivedData/ModuleCache.noindex/Session.modulevalidation -Xcc -working-directory -Xcc /Users/admin/builder/spi-builder-workspace/.swiftpm/xcode -resource-dir /Applications/Xcode-16.1.0.app/Contents/Developer/Toolchains/XcodeDefault.xctoolchain/usr/lib/swift -enable-anonymous-context-mangled-names -file-compilation-dir /Users/admin/builder/spi-builder-workspace/.swiftpm/xcode -Xcc -D_LIBCPP_HARDENING_MODE\=_LIBCPP_HARDENING_MODE_DEBUG -Xcc -ivfsstatcache -Xcc /Users/admin/builder/spi-builder-workspace/.derivedData/SDKStatCaches.noindex/xros2.1-22N573-02bafd7f43846583f0400bd788fa10b7.sdkstatcache -Xcc -I/Users/admin/builder/spi-builder-workspace/.derivedData/Build/Intermediates.noindex/SwiftTheming.build/Debug-xros/SwiftTheming.build/swift-overrides.hmap -Xcc -I/Users/admin/builder/spi-builder-workspace/.derivedData/Build/Products/Debug-xros/include -Xcc -I/Users/admin/builder/spi-builder-workspace/.derivedData/Build/Intermediates.noindex/SwiftTheming.build/Debug-xros/SwiftTheming.build/DerivedSources-normal/arm64 -Xcc -I/Users/admin/builder/spi-builder-workspace/.derivedData/Build/Intermediates.noindex/SwiftTheming.build/Debug-xros/SwiftTheming.build/DerivedSources/arm64 -Xcc -I/Users/admin/builder/spi-builder-workspace/.derivedData/Build/Intermediates.noindex/SwiftTheming.build/Debug-xros/SwiftTheming.build/DerivedSources -Xcc -DSWIFT_PACKAGE -Xcc -DDEBUG\=1 -module-name SwiftTheming -frontend-parseable-output -disable-clang-spi -target-sdk-version 2.1 -target-sdk-name xros2.1 -external-plugin-path /Applications/Xcode-16.1.0.app/Contents/Developer/Platforms/XROS.platform/Developer/usr/lib/swift/host/plugins\#/Applications/Xcode-16.1.0.app/Contents/Developer/Platforms/XROS.platform/Developer/usr/bin/swift-plugin-server -external-plugin-path /Applications/Xcode-16.1.0.app/Contents/Developer/Platforms/XROS.platform/Developer/usr/local/lib/swift/host/plugins\#/Applications/Xcode-16.1.0.app/Contents/Developer/Platforms/XROS.platform/Developer/usr/bin/swift-plugin-server -plugin-path /Applications/Xcode-16.1.0.app/Contents/Developer/Toolchains/XcodeDefault.xctoolchain/usr/lib/swift/host/plugins -plugin-path /Applications/Xcode-16.1.0.app/Contents/Developer/Toolchains/XcodeDefault.xctoolchain/usr/local/lib/swift/host/plugins -o /Users/admin/builder/spi-builder-workspace/.derivedData/Build/Intermediates.noindex/SwiftTheming.build/Debug-xros/SwiftTheming.build/Objects-normal/arm64/GradientSet.o -index-unit-output-path /SwiftTheming.build/Debug-xros/SwiftTheming.build/Objects-normal/arm64/GradientSet.o -index-store-path /Users/admin/builder/spi-builder-workspace/.derivedData/Index.noindex/DataStore -index-system-modules
SwiftCompile normal arm64 /Users/admin/builder/spi-builder-workspace/Sources/SwiftTheming/Asset/Sets/GradientSet.swift (in target 'SwiftTheming' from project 'SwiftTheming')
cd /Users/admin/builder/spi-builder-workspace/.swiftpm/xcode
/Applications/Xcode-16.1.0.app/Contents/Developer/Toolchains/XcodeDefault.xctoolchain/usr/bin/swift-frontend -c /Users/admin/builder/spi-builder-workspace/Sources/SwiftTheming/Appearance/Appearance.swift /Users/admin/builder/spi-builder-workspace/Sources/SwiftTheming/Appearance/PreferredAppearance.swift /Users/admin/builder/spi-builder-workspace/Sources/SwiftTheming/Asset/AssetKeyWrappable.swift /Users/admin/builder/spi-builder-workspace/Sources/SwiftTheming/Asset/Assetable.swift /Users/admin/builder/spi-builder-workspace/Sources/SwiftTheming/Asset/EmptyAsset.swift /Users/admin/builder/spi-builder-workspace/Sources/SwiftTheming/Asset/Sets/ColorSet.swift /Users/admin/builder/spi-builder-workspace/Sources/SwiftTheming/Asset/Sets/FontSet.swift -primary-file /Users/admin/builder/spi-builder-workspace/Sources/SwiftTheming/Asset/Sets/GradientSet.swift /Users/admin/builder/spi-builder-workspace/Sources/SwiftTheming/Asset/Sets/ImageSet.swift /Users/admin/builder/spi-builder-workspace/Sources/SwiftTheming/Extensions/Color++.swift /Users/admin/builder/spi-builder-workspace/Sources/SwiftTheming/Extensions/Font++.swift /Users/admin/builder/spi-builder-workspace/Sources/SwiftTheming/Extensions/Gradient++.swift /Users/admin/builder/spi-builder-workspace/Sources/SwiftTheming/Extensions/Image++.swift /Users/admin/builder/spi-builder-workspace/Sources/SwiftTheming/Extensions/UserDefaults++.swift /Users/admin/builder/spi-builder-workspace/Sources/SwiftTheming/Extensions/View++.swift /Users/admin/builder/spi-builder-workspace/Sources/SwiftTheming/Theme/DefaultTheming.swift /Users/admin/builder/spi-builder-workspace/Sources/SwiftTheming/Theme/Theme.swift /Users/admin/builder/spi-builder-workspace/Sources/SwiftTheming/Theme/Themeable.swift /Users/admin/builder/spi-builder-workspace/Sources/SwiftTheming/Theme/Themed.swift /Users/admin/builder/spi-builder-workspace/Sources/SwiftTheming/ThemeProvider/ThemeProvider.swift /Users/admin/builder/spi-builder-workspace/Sources/SwiftTheming/ThemeProvider/ThemeProviding.swift /Users/admin/builder/spi-builder-workspace/Sources/SwiftTheming/ThemeProvider/ThemeProvidingViewModifier.swift -emit-dependencies-path /Users/admin/builder/spi-builder-workspace/.derivedData/Build/Intermediates.noindex/SwiftTheming.build/Debug-xros/SwiftTheming.build/Objects-normal/arm64/GradientSet.d -emit-const-values-path /Users/admin/builder/spi-builder-workspace/.derivedData/Build/Intermediates.noindex/SwiftTheming.build/Debug-xros/SwiftTheming.build/Objects-normal/arm64/GradientSet.swiftconstvalues -emit-reference-dependencies-path /Users/admin/builder/spi-builder-workspace/.derivedData/Build/Intermediates.noindex/SwiftTheming.build/Debug-xros/SwiftTheming.build/Objects-normal/arm64/GradientSet.swiftdeps -serialize-diagnostics-path /Users/admin/builder/spi-builder-workspace/.derivedData/Build/Intermediates.noindex/SwiftTheming.build/Debug-xros/SwiftTheming.build/Objects-normal/arm64/GradientSet.dia -target arm64-apple-xros1.0 -Xllvm -aarch64-use-tbi -enable-objc-interop -stack-check -sdk /Applications/Xcode-16.1.0.app/Contents/Developer/Platforms/XROS.platform/Developer/SDKs/XROS2.1.sdk -I /Users/admin/builder/spi-builder-workspace/.derivedData/Build/Products/Debug-xros -I /Applications/Xcode-16.1.0.app/Contents/Developer/Platforms/XROS.platform/Developer/usr/lib -F /Users/admin/builder/spi-builder-workspace/.derivedData/Build/Products/Debug-xros -F /Applications/Xcode-16.1.0.app/Contents/Developer/Platforms/XROS.platform/Developer/Library/Frameworks -F /Applications/Xcode-16.1.0.app/Contents/Developer/Platforms/XROS.platform/Developer/SDKs/XROS2.1.sdk/Developer/Library/Frameworks -no-color-diagnostics -enable-testing -g -debug-info-format\=dwarf -dwarf-version\=4 -module-cache-path /Users/admin/builder/spi-builder-workspace/.derivedData/ModuleCache.noindex -profile-generate -profile-coverage-mapping -swift-version 5 -enforce-exclusivity\=checked -stats-output-dir /Users/admin/builder/spi-builder-workspace/.swiftpm/xcode/.stats -Onone -D SWIFT_PACKAGE -D DEBUG -serialize-debugging-options -const-gather-protocols-file /Users/admin/builder/spi-builder-workspace/.derivedData/Build/Intermediates.noindex/SwiftTheming.build/Debug-xros/SwiftTheming.build/Objects-normal/arm64/SwiftTheming_const_extract_protocols.json -enable-experimental-feature DebugDescriptionMacro -enable-experimental-feature OpaqueTypeErasure -enable-upcoming-feature StrictConcurrency -enable-upcoming-feature DisableOutwardActorInference -enable-upcoming-feature GlobalActorIsolatedTypesUsability -enable-upcoming-feature InferSendableFromCaptures -strict-concurrency\=complete -empty-abi-descriptor -plugin-path /Applications/Xcode-16.1.0.app/Contents/Developer/Toolchains/XcodeDefault.xctoolchain/usr/lib/swift/host/plugins/testing -validate-clang-modules-once -clang-build-session-file /Users/admin/builder/spi-builder-workspace/.derivedData/ModuleCache.noindex/Session.modulevalidation -Xcc -working-directory -Xcc /Users/admin/builder/spi-builder-workspace/.swiftpm/xcode -resource-dir /Applications/Xcode-16.1.0.app/Contents/Developer/Toolchains/XcodeDefault.xctoolchain/usr/lib/swift -enable-anonymous-context-mangled-names -file-compilation-dir /Users/admin/builder/spi-builder-workspace/.swiftpm/xcode -Xcc -D_LIBCPP_HARDENING_MODE\=_LIBCPP_HARDENING_MODE_DEBUG -Xcc -ivfsstatcache -Xcc /Users/admin/builder/spi-builder-workspace/.derivedData/SDKStatCaches.noindex/xros2.1-22N573-02bafd7f43846583f0400bd788fa10b7.sdkstatcache -Xcc -I/Users/admin/builder/spi-builder-workspace/.derivedData/Build/Intermediates.noindex/SwiftTheming.build/Debug-xros/SwiftTheming.build/swift-overrides.hmap -Xcc -I/Users/admin/builder/spi-builder-workspace/.derivedData/Build/Products/Debug-xros/include -Xcc -I/Users/admin/builder/spi-builder-workspace/.derivedData/Build/Intermediates.noindex/SwiftTheming.build/Debug-xros/SwiftTheming.build/DerivedSources-normal/arm64 -Xcc -I/Users/admin/builder/spi-builder-workspace/.derivedData/Build/Intermediates.noindex/SwiftTheming.build/Debug-xros/SwiftTheming.build/DerivedSources/arm64 -Xcc -I/Users/admin/builder/spi-builder-workspace/.derivedData/Build/Intermediates.noindex/SwiftTheming.build/Debug-xros/SwiftTheming.build/DerivedSources -Xcc -DSWIFT_PACKAGE -Xcc -DDEBUG\=1 -module-name SwiftTheming -frontend-parseable-output -disable-clang-spi -target-sdk-version 2.1 -target-sdk-name xros2.1 -external-plugin-path /Applications/Xcode-16.1.0.app/Contents/Developer/Platforms/XROS.platform/Developer/usr/lib/swift/host/plugins\#/Applications/Xcode-16.1.0.app/Contents/Developer/Platforms/XROS.platform/Developer/usr/bin/swift-plugin-server -external-plugin-path /Applications/Xcode-16.1.0.app/Contents/Developer/Platforms/XROS.platform/Developer/usr/local/lib/swift/host/plugins\#/Applications/Xcode-16.1.0.app/Contents/Developer/Platforms/XROS.platform/Developer/usr/bin/swift-plugin-server -plugin-path /Applications/Xcode-16.1.0.app/Contents/Developer/Toolchains/XcodeDefault.xctoolchain/usr/lib/swift/host/plugins -plugin-path /Applications/Xcode-16.1.0.app/Contents/Developer/Toolchains/XcodeDefault.xctoolchain/usr/local/lib/swift/host/plugins -o /Users/admin/builder/spi-builder-workspace/.derivedData/Build/Intermediates.noindex/SwiftTheming.build/Debug-xros/SwiftTheming.build/Objects-normal/arm64/GradientSet.o -index-unit-output-path /SwiftTheming.build/Debug-xros/SwiftTheming.build/Objects-normal/arm64/GradientSet.o -index-store-path /Users/admin/builder/spi-builder-workspace/.derivedData/Index.noindex/DataStore -index-system-modules
SwiftCompile normal arm64 Compiling\ Image++.swift /Users/admin/builder/spi-builder-workspace/Sources/SwiftTheming/Extensions/Image++.swift (in target 'SwiftTheming' from project 'SwiftTheming')
cd /Users/admin/builder/spi-builder-workspace/.swiftpm/xcode
builtin-swiftTaskExecution -- /Applications/Xcode-16.1.0.app/Contents/Developer/Toolchains/XcodeDefault.xctoolchain/usr/bin/swift-frontend -frontend -c /Users/admin/builder/spi-builder-workspace/Sources/SwiftTheming/Appearance/Appearance.swift /Users/admin/builder/spi-builder-workspace/Sources/SwiftTheming/Appearance/PreferredAppearance.swift /Users/admin/builder/spi-builder-workspace/Sources/SwiftTheming/Asset/AssetKeyWrappable.swift /Users/admin/builder/spi-builder-workspace/Sources/SwiftTheming/Asset/Assetable.swift /Users/admin/builder/spi-builder-workspace/Sources/SwiftTheming/Asset/EmptyAsset.swift /Users/admin/builder/spi-builder-workspace/Sources/SwiftTheming/Asset/Sets/ColorSet.swift /Users/admin/builder/spi-builder-workspace/Sources/SwiftTheming/Asset/Sets/FontSet.swift /Users/admin/builder/spi-builder-workspace/Sources/SwiftTheming/Asset/Sets/GradientSet.swift /Users/admin/builder/spi-builder-workspace/Sources/SwiftTheming/Asset/Sets/ImageSet.swift /Users/admin/builder/spi-builder-workspace/Sources/SwiftTheming/Extensions/Color++.swift /Users/admin/builder/spi-builder-workspace/Sources/SwiftTheming/Extensions/Font++.swift /Users/admin/builder/spi-builder-workspace/Sources/SwiftTheming/Extensions/Gradient++.swift -primary-file /Users/admin/builder/spi-builder-workspace/Sources/SwiftTheming/Extensions/Image++.swift /Users/admin/builder/spi-builder-workspace/Sources/SwiftTheming/Extensions/UserDefaults++.swift /Users/admin/builder/spi-builder-workspace/Sources/SwiftTheming/Extensions/View++.swift /Users/admin/builder/spi-builder-workspace/Sources/SwiftTheming/Theme/DefaultTheming.swift /Users/admin/builder/spi-builder-workspace/Sources/SwiftTheming/Theme/Theme.swift /Users/admin/builder/spi-builder-workspace/Sources/SwiftTheming/Theme/Themeable.swift /Users/admin/builder/spi-builder-workspace/Sources/SwiftTheming/Theme/Themed.swift /Users/admin/builder/spi-builder-workspace/Sources/SwiftTheming/ThemeProvider/ThemeProvider.swift /Users/admin/builder/spi-builder-workspace/Sources/SwiftTheming/ThemeProvider/ThemeProviding.swift /Users/admin/builder/spi-builder-workspace/Sources/SwiftTheming/ThemeProvider/ThemeProvidingViewModifier.swift -emit-dependencies-path /Users/admin/builder/spi-builder-workspace/.derivedData/Build/Intermediates.noindex/SwiftTheming.build/Debug-xros/SwiftTheming.build/Objects-normal/arm64/Image++.d -emit-const-values-path /Users/admin/builder/spi-builder-workspace/.derivedData/Build/Intermediates.noindex/SwiftTheming.build/Debug-xros/SwiftTheming.build/Objects-normal/arm64/Image++.swiftconstvalues -emit-reference-dependencies-path /Users/admin/builder/spi-builder-workspace/.derivedData/Build/Intermediates.noindex/SwiftTheming.build/Debug-xros/SwiftTheming.build/Objects-normal/arm64/Image++.swiftdeps -serialize-diagnostics-path /Users/admin/builder/spi-builder-workspace/.derivedData/Build/Intermediates.noindex/SwiftTheming.build/Debug-xros/SwiftTheming.build/Objects-normal/arm64/Image++.dia -target arm64-apple-xros1.0 -Xllvm -aarch64-use-tbi -enable-objc-interop -stack-check -sdk /Applications/Xcode-16.1.0.app/Contents/Developer/Platforms/XROS.platform/Developer/SDKs/XROS2.1.sdk -I /Users/admin/builder/spi-builder-workspace/.derivedData/Build/Products/Debug-xros -I /Applications/Xcode-16.1.0.app/Contents/Developer/Platforms/XROS.platform/Developer/usr/lib -F /Users/admin/builder/spi-builder-workspace/.derivedData/Build/Products/Debug-xros -F /Applications/Xcode-16.1.0.app/Contents/Developer/Platforms/XROS.platform/Developer/Library/Frameworks -F /Applications/Xcode-16.1.0.app/Contents/Developer/Platforms/XROS.platform/Developer/SDKs/XROS2.1.sdk/Developer/Library/Frameworks -no-color-diagnostics -enable-testing -g -debug-info-format\=dwarf -dwarf-version\=4 -module-cache-path /Users/admin/builder/spi-builder-workspace/.derivedData/ModuleCache.noindex -profile-generate -profile-coverage-mapping -swift-version 5 -enforce-exclusivity\=checked -stats-output-dir /Users/admin/builder/spi-builder-workspace/.swiftpm/xcode/.stats -Onone -D SWIFT_PACKAGE -D DEBUG -serialize-debugging-options -const-gather-protocols-file /Users/admin/builder/spi-builder-workspace/.derivedData/Build/Intermediates.noindex/SwiftTheming.build/Debug-xros/SwiftTheming.build/Objects-normal/arm64/SwiftTheming_const_extract_protocols.json -enable-experimental-feature DebugDescriptionMacro -enable-experimental-feature OpaqueTypeErasure -enable-upcoming-feature StrictConcurrency -enable-upcoming-feature DisableOutwardActorInference -enable-upcoming-feature GlobalActorIsolatedTypesUsability -enable-upcoming-feature InferSendableFromCaptures -strict-concurrency\=complete -empty-abi-descriptor -plugin-path /Applications/Xcode-16.1.0.app/Contents/Developer/Toolchains/XcodeDefault.xctoolchain/usr/lib/swift/host/plugins/testing -validate-clang-modules-once -clang-build-session-file /Users/admin/builder/spi-builder-workspace/.derivedData/ModuleCache.noindex/Session.modulevalidation -Xcc -working-directory -Xcc /Users/admin/builder/spi-builder-workspace/.swiftpm/xcode -resource-dir /Applications/Xcode-16.1.0.app/Contents/Developer/Toolchains/XcodeDefault.xctoolchain/usr/lib/swift -enable-anonymous-context-mangled-names -file-compilation-dir /Users/admin/builder/spi-builder-workspace/.swiftpm/xcode -Xcc -D_LIBCPP_HARDENING_MODE\=_LIBCPP_HARDENING_MODE_DEBUG -Xcc -ivfsstatcache -Xcc /Users/admin/builder/spi-builder-workspace/.derivedData/SDKStatCaches.noindex/xros2.1-22N573-02bafd7f43846583f0400bd788fa10b7.sdkstatcache -Xcc -I/Users/admin/builder/spi-builder-workspace/.derivedData/Build/Intermediates.noindex/SwiftTheming.build/Debug-xros/SwiftTheming.build/swift-overrides.hmap -Xcc -I/Users/admin/builder/spi-builder-workspace/.derivedData/Build/Products/Debug-xros/include -Xcc -I/Users/admin/builder/spi-builder-workspace/.derivedData/Build/Intermediates.noindex/SwiftTheming.build/Debug-xros/SwiftTheming.build/DerivedSources-normal/arm64 -Xcc -I/Users/admin/builder/spi-builder-workspace/.derivedData/Build/Intermediates.noindex/SwiftTheming.build/Debug-xros/SwiftTheming.build/DerivedSources/arm64 -Xcc -I/Users/admin/builder/spi-builder-workspace/.derivedData/Build/Intermediates.noindex/SwiftTheming.build/Debug-xros/SwiftTheming.build/DerivedSources -Xcc -DSWIFT_PACKAGE -Xcc -DDEBUG\=1 -module-name SwiftTheming -frontend-parseable-output -disable-clang-spi -target-sdk-version 2.1 -target-sdk-name xros2.1 -external-plugin-path /Applications/Xcode-16.1.0.app/Contents/Developer/Platforms/XROS.platform/Developer/usr/lib/swift/host/plugins\#/Applications/Xcode-16.1.0.app/Contents/Developer/Platforms/XROS.platform/Developer/usr/bin/swift-plugin-server -external-plugin-path /Applications/Xcode-16.1.0.app/Contents/Developer/Platforms/XROS.platform/Developer/usr/local/lib/swift/host/plugins\#/Applications/Xcode-16.1.0.app/Contents/Developer/Platforms/XROS.platform/Developer/usr/bin/swift-plugin-server -plugin-path /Applications/Xcode-16.1.0.app/Contents/Developer/Toolchains/XcodeDefault.xctoolchain/usr/lib/swift/host/plugins -plugin-path /Applications/Xcode-16.1.0.app/Contents/Developer/Toolchains/XcodeDefault.xctoolchain/usr/local/lib/swift/host/plugins -o /Users/admin/builder/spi-builder-workspace/.derivedData/Build/Intermediates.noindex/SwiftTheming.build/Debug-xros/SwiftTheming.build/Objects-normal/arm64/Image++.o -index-unit-output-path /SwiftTheming.build/Debug-xros/SwiftTheming.build/Objects-normal/arm64/Image++.o -index-store-path /Users/admin/builder/spi-builder-workspace/.derivedData/Index.noindex/DataStore -index-system-modules
SwiftCompile normal arm64 /Users/admin/builder/spi-builder-workspace/Sources/SwiftTheming/Extensions/Image++.swift (in target 'SwiftTheming' from project 'SwiftTheming')
cd /Users/admin/builder/spi-builder-workspace/.swiftpm/xcode
/Applications/Xcode-16.1.0.app/Contents/Developer/Toolchains/XcodeDefault.xctoolchain/usr/bin/swift-frontend -c /Users/admin/builder/spi-builder-workspace/Sources/SwiftTheming/Appearance/Appearance.swift /Users/admin/builder/spi-builder-workspace/Sources/SwiftTheming/Appearance/PreferredAppearance.swift /Users/admin/builder/spi-builder-workspace/Sources/SwiftTheming/Asset/AssetKeyWrappable.swift /Users/admin/builder/spi-builder-workspace/Sources/SwiftTheming/Asset/Assetable.swift /Users/admin/builder/spi-builder-workspace/Sources/SwiftTheming/Asset/EmptyAsset.swift /Users/admin/builder/spi-builder-workspace/Sources/SwiftTheming/Asset/Sets/ColorSet.swift /Users/admin/builder/spi-builder-workspace/Sources/SwiftTheming/Asset/Sets/FontSet.swift /Users/admin/builder/spi-builder-workspace/Sources/SwiftTheming/Asset/Sets/GradientSet.swift /Users/admin/builder/spi-builder-workspace/Sources/SwiftTheming/Asset/Sets/ImageSet.swift /Users/admin/builder/spi-builder-workspace/Sources/SwiftTheming/Extensions/Color++.swift /Users/admin/builder/spi-builder-workspace/Sources/SwiftTheming/Extensions/Font++.swift /Users/admin/builder/spi-builder-workspace/Sources/SwiftTheming/Extensions/Gradient++.swift -primary-file /Users/admin/builder/spi-builder-workspace/Sources/SwiftTheming/Extensions/Image++.swift /Users/admin/builder/spi-builder-workspace/Sources/SwiftTheming/Extensions/UserDefaults++.swift /Users/admin/builder/spi-builder-workspace/Sources/SwiftTheming/Extensions/View++.swift /Users/admin/builder/spi-builder-workspace/Sources/SwiftTheming/Theme/DefaultTheming.swift /Users/admin/builder/spi-builder-workspace/Sources/SwiftTheming/Theme/Theme.swift /Users/admin/builder/spi-builder-workspace/Sources/SwiftTheming/Theme/Themeable.swift /Users/admin/builder/spi-builder-workspace/Sources/SwiftTheming/Theme/Themed.swift /Users/admin/builder/spi-builder-workspace/Sources/SwiftTheming/ThemeProvider/ThemeProvider.swift /Users/admin/builder/spi-builder-workspace/Sources/SwiftTheming/ThemeProvider/ThemeProviding.swift /Users/admin/builder/spi-builder-workspace/Sources/SwiftTheming/ThemeProvider/ThemeProvidingViewModifier.swift -emit-dependencies-path /Users/admin/builder/spi-builder-workspace/.derivedData/Build/Intermediates.noindex/SwiftTheming.build/Debug-xros/SwiftTheming.build/Objects-normal/arm64/Image++.d -emit-const-values-path /Users/admin/builder/spi-builder-workspace/.derivedData/Build/Intermediates.noindex/SwiftTheming.build/Debug-xros/SwiftTheming.build/Objects-normal/arm64/Image++.swiftconstvalues -emit-reference-dependencies-path /Users/admin/builder/spi-builder-workspace/.derivedData/Build/Intermediates.noindex/SwiftTheming.build/Debug-xros/SwiftTheming.build/Objects-normal/arm64/Image++.swiftdeps -serialize-diagnostics-path /Users/admin/builder/spi-builder-workspace/.derivedData/Build/Intermediates.noindex/SwiftTheming.build/Debug-xros/SwiftTheming.build/Objects-normal/arm64/Image++.dia -target arm64-apple-xros1.0 -Xllvm -aarch64-use-tbi -enable-objc-interop -stack-check -sdk /Applications/Xcode-16.1.0.app/Contents/Developer/Platforms/XROS.platform/Developer/SDKs/XROS2.1.sdk -I /Users/admin/builder/spi-builder-workspace/.derivedData/Build/Products/Debug-xros -I /Applications/Xcode-16.1.0.app/Contents/Developer/Platforms/XROS.platform/Developer/usr/lib -F /Users/admin/builder/spi-builder-workspace/.derivedData/Build/Products/Debug-xros -F /Applications/Xcode-16.1.0.app/Contents/Developer/Platforms/XROS.platform/Developer/Library/Frameworks -F /Applications/Xcode-16.1.0.app/Contents/Developer/Platforms/XROS.platform/Developer/SDKs/XROS2.1.sdk/Developer/Library/Frameworks -no-color-diagnostics -enable-testing -g -debug-info-format\=dwarf -dwarf-version\=4 -module-cache-path /Users/admin/builder/spi-builder-workspace/.derivedData/ModuleCache.noindex -profile-generate -profile-coverage-mapping -swift-version 5 -enforce-exclusivity\=checked -stats-output-dir /Users/admin/builder/spi-builder-workspace/.swiftpm/xcode/.stats -Onone -D SWIFT_PACKAGE -D DEBUG -serialize-debugging-options -const-gather-protocols-file /Users/admin/builder/spi-builder-workspace/.derivedData/Build/Intermediates.noindex/SwiftTheming.build/Debug-xros/SwiftTheming.build/Objects-normal/arm64/SwiftTheming_const_extract_protocols.json -enable-experimental-feature DebugDescriptionMacro -enable-experimental-feature OpaqueTypeErasure -enable-upcoming-feature StrictConcurrency -enable-upcoming-feature DisableOutwardActorInference -enable-upcoming-feature GlobalActorIsolatedTypesUsability -enable-upcoming-feature InferSendableFromCaptures -strict-concurrency\=complete -empty-abi-descriptor -plugin-path /Applications/Xcode-16.1.0.app/Contents/Developer/Toolchains/XcodeDefault.xctoolchain/usr/lib/swift/host/plugins/testing -validate-clang-modules-once -clang-build-session-file /Users/admin/builder/spi-builder-workspace/.derivedData/ModuleCache.noindex/Session.modulevalidation -Xcc -working-directory -Xcc /Users/admin/builder/spi-builder-workspace/.swiftpm/xcode -resource-dir /Applications/Xcode-16.1.0.app/Contents/Developer/Toolchains/XcodeDefault.xctoolchain/usr/lib/swift -enable-anonymous-context-mangled-names -file-compilation-dir /Users/admin/builder/spi-builder-workspace/.swiftpm/xcode -Xcc -D_LIBCPP_HARDENING_MODE\=_LIBCPP_HARDENING_MODE_DEBUG -Xcc -ivfsstatcache -Xcc /Users/admin/builder/spi-builder-workspace/.derivedData/SDKStatCaches.noindex/xros2.1-22N573-02bafd7f43846583f0400bd788fa10b7.sdkstatcache -Xcc -I/Users/admin/builder/spi-builder-workspace/.derivedData/Build/Intermediates.noindex/SwiftTheming.build/Debug-xros/SwiftTheming.build/swift-overrides.hmap -Xcc -I/Users/admin/builder/spi-builder-workspace/.derivedData/Build/Products/Debug-xros/include -Xcc -I/Users/admin/builder/spi-builder-workspace/.derivedData/Build/Intermediates.noindex/SwiftTheming.build/Debug-xros/SwiftTheming.build/DerivedSources-normal/arm64 -Xcc -I/Users/admin/builder/spi-builder-workspace/.derivedData/Build/Intermediates.noindex/SwiftTheming.build/Debug-xros/SwiftTheming.build/DerivedSources/arm64 -Xcc -I/Users/admin/builder/spi-builder-workspace/.derivedData/Build/Intermediates.noindex/SwiftTheming.build/Debug-xros/SwiftTheming.build/DerivedSources -Xcc -DSWIFT_PACKAGE -Xcc -DDEBUG\=1 -module-name SwiftTheming -frontend-parseable-output -disable-clang-spi -target-sdk-version 2.1 -target-sdk-name xros2.1 -external-plugin-path /Applications/Xcode-16.1.0.app/Contents/Developer/Platforms/XROS.platform/Developer/usr/lib/swift/host/plugins\#/Applications/Xcode-16.1.0.app/Contents/Developer/Platforms/XROS.platform/Developer/usr/bin/swift-plugin-server -external-plugin-path /Applications/Xcode-16.1.0.app/Contents/Developer/Platforms/XROS.platform/Developer/usr/local/lib/swift/host/plugins\#/Applications/Xcode-16.1.0.app/Contents/Developer/Platforms/XROS.platform/Developer/usr/bin/swift-plugin-server -plugin-path /Applications/Xcode-16.1.0.app/Contents/Developer/Toolchains/XcodeDefault.xctoolchain/usr/lib/swift/host/plugins -plugin-path /Applications/Xcode-16.1.0.app/Contents/Developer/Toolchains/XcodeDefault.xctoolchain/usr/local/lib/swift/host/plugins -o /Users/admin/builder/spi-builder-workspace/.derivedData/Build/Intermediates.noindex/SwiftTheming.build/Debug-xros/SwiftTheming.build/Objects-normal/arm64/Image++.o -index-unit-output-path /SwiftTheming.build/Debug-xros/SwiftTheming.build/Objects-normal/arm64/Image++.o -index-store-path /Users/admin/builder/spi-builder-workspace/.derivedData/Index.noindex/DataStore -index-system-modules
SwiftCompile normal arm64 Compiling\ Assetable.swift,\ EmptyAsset.swift /Users/admin/builder/spi-builder-workspace/Sources/SwiftTheming/Asset/Assetable.swift /Users/admin/builder/spi-builder-workspace/Sources/SwiftTheming/Asset/EmptyAsset.swift (in target 'SwiftTheming' from project 'SwiftTheming')
cd /Users/admin/builder/spi-builder-workspace/.swiftpm/xcode
builtin-swiftTaskExecution -- /Applications/Xcode-16.1.0.app/Contents/Developer/Toolchains/XcodeDefault.xctoolchain/usr/bin/swift-frontend -frontend -c /Users/admin/builder/spi-builder-workspace/Sources/SwiftTheming/Appearance/Appearance.swift /Users/admin/builder/spi-builder-workspace/Sources/SwiftTheming/Appearance/PreferredAppearance.swift /Users/admin/builder/spi-builder-workspace/Sources/SwiftTheming/Asset/AssetKeyWrappable.swift -primary-file /Users/admin/builder/spi-builder-workspace/Sources/SwiftTheming/Asset/Assetable.swift -primary-file /Users/admin/builder/spi-builder-workspace/Sources/SwiftTheming/Asset/EmptyAsset.swift /Users/admin/builder/spi-builder-workspace/Sources/SwiftTheming/Asset/Sets/ColorSet.swift /Users/admin/builder/spi-builder-workspace/Sources/SwiftTheming/Asset/Sets/FontSet.swift /Users/admin/builder/spi-builder-workspace/Sources/SwiftTheming/Asset/Sets/GradientSet.swift /Users/admin/builder/spi-builder-workspace/Sources/SwiftTheming/Asset/Sets/ImageSet.swift /Users/admin/builder/spi-builder-workspace/Sources/SwiftTheming/Extensions/Color++.swift /Users/admin/builder/spi-builder-workspace/Sources/SwiftTheming/Extensions/Font++.swift /Users/admin/builder/spi-builder-workspace/Sources/SwiftTheming/Extensions/Gradient++.swift /Users/admin/builder/spi-builder-workspace/Sources/SwiftTheming/Extensions/Image++.swift /Users/admin/builder/spi-builder-workspace/Sources/SwiftTheming/Extensions/UserDefaults++.swift /Users/admin/builder/spi-builder-workspace/Sources/SwiftTheming/Extensions/View++.swift /Users/admin/builder/spi-builder-workspace/Sources/SwiftTheming/Theme/DefaultTheming.swift /Users/admin/builder/spi-builder-workspace/Sources/SwiftTheming/Theme/Theme.swift /Users/admin/builder/spi-builder-workspace/Sources/SwiftTheming/Theme/Themeable.swift /Users/admin/builder/spi-builder-workspace/Sources/SwiftTheming/Theme/Themed.swift /Users/admin/builder/spi-builder-workspace/Sources/SwiftTheming/ThemeProvider/ThemeProvider.swift /Users/admin/builder/spi-builder-workspace/Sources/SwiftTheming/ThemeProvider/ThemeProviding.swift /Users/admin/builder/spi-builder-workspace/Sources/SwiftTheming/ThemeProvider/ThemeProvidingViewModifier.swift -emit-dependencies-path /Users/admin/builder/spi-builder-workspace/.derivedData/Build/Intermediates.noindex/SwiftTheming.build/Debug-xros/SwiftTheming.build/Objects-normal/arm64/Assetable.d -emit-const-values-path /Users/admin/builder/spi-builder-workspace/.derivedData/Build/Intermediates.noindex/SwiftTheming.build/Debug-xros/SwiftTheming.build/Objects-normal/arm64/Assetable.swiftconstvalues -emit-reference-dependencies-path /Users/admin/builder/spi-builder-workspace/.derivedData/Build/Intermediates.noindex/SwiftTheming.build/Debug-xros/SwiftTheming.build/Objects-normal/arm64/Assetable.swiftdeps -serialize-diagnostics-path /Users/admin/builder/spi-builder-workspace/.derivedData/Build/Intermediates.noindex/SwiftTheming.build/Debug-xros/SwiftTheming.build/Objects-normal/arm64/Assetable.dia -emit-dependencies-path /Users/admin/builder/spi-builder-workspace/.derivedData/Build/Intermediates.noindex/SwiftTheming.build/Debug-xros/SwiftTheming.build/Objects-normal/arm64/EmptyAsset.d -emit-const-values-path /Users/admin/builder/spi-builder-workspace/.derivedData/Build/Intermediates.noindex/SwiftTheming.build/Debug-xros/SwiftTheming.build/Objects-normal/arm64/EmptyAsset.swiftconstvalues -emit-reference-dependencies-path /Users/admin/builder/spi-builder-workspace/.derivedData/Build/Intermediates.noindex/SwiftTheming.build/Debug-xros/SwiftTheming.build/Objects-normal/arm64/EmptyAsset.swiftdeps -serialize-diagnostics-path /Users/admin/builder/spi-builder-workspace/.derivedData/Build/Intermediates.noindex/SwiftTheming.build/Debug-xros/SwiftTheming.build/Objects-normal/arm64/EmptyAsset.dia -target arm64-apple-xros1.0 -Xllvm -aarch64-use-tbi -enable-objc-interop -stack-check -sdk /Applications/Xcode-16.1.0.app/Contents/Developer/Platforms/XROS.platform/Developer/SDKs/XROS2.1.sdk -I /Users/admin/builder/spi-builder-workspace/.derivedData/Build/Products/Debug-xros -I /Applications/Xcode-16.1.0.app/Contents/Developer/Platforms/XROS.platform/Developer/usr/lib -F /Users/admin/builder/spi-builder-workspace/.derivedData/Build/Products/Debug-xros -F /Applications/Xcode-16.1.0.app/Contents/Developer/Platforms/XROS.platform/Developer/Library/Frameworks -F /Applications/Xcode-16.1.0.app/Contents/Developer/Platforms/XROS.platform/Developer/SDKs/XROS2.1.sdk/Developer/Library/Frameworks -no-color-diagnostics -enable-testing -g -debug-info-format\=dwarf -dwarf-version\=4 -module-cache-path /Users/admin/builder/spi-builder-workspace/.derivedData/ModuleCache.noindex -profile-generate -profile-coverage-mapping -swift-version 5 -enforce-exclusivity\=checked -stats-output-dir /Users/admin/builder/spi-builder-workspace/.swiftpm/xcode/.stats -Onone -D SWIFT_PACKAGE -D DEBUG -serialize-debugging-options -const-gather-protocols-file /Users/admin/builder/spi-builder-workspace/.derivedData/Build/Intermediates.noindex/SwiftTheming.build/Debug-xros/SwiftTheming.build/Objects-normal/arm64/SwiftTheming_const_extract_protocols.json -enable-experimental-feature DebugDescriptionMacro -enable-experimental-feature OpaqueTypeErasure -enable-upcoming-feature StrictConcurrency -enable-upcoming-feature DisableOutwardActorInference -enable-upcoming-feature GlobalActorIsolatedTypesUsability -enable-upcoming-feature InferSendableFromCaptures -strict-concurrency\=complete -empty-abi-descriptor -plugin-path /Applications/Xcode-16.1.0.app/Contents/Developer/Toolchains/XcodeDefault.xctoolchain/usr/lib/swift/host/plugins/testing -validate-clang-modules-once -clang-build-session-file /Users/admin/builder/spi-builder-workspace/.derivedData/ModuleCache.noindex/Session.modulevalidation -Xcc -working-directory -Xcc /Users/admin/builder/spi-builder-workspace/.swiftpm/xcode -resource-dir /Applications/Xcode-16.1.0.app/Contents/Developer/Toolchains/XcodeDefault.xctoolchain/usr/lib/swift -enable-anonymous-context-mangled-names -file-compilation-dir /Users/admin/builder/spi-builder-workspace/.swiftpm/xcode -Xcc -D_LIBCPP_HARDENING_MODE\=_LIBCPP_HARDENING_MODE_DEBUG -Xcc -ivfsstatcache -Xcc /Users/admin/builder/spi-builder-workspace/.derivedData/SDKStatCaches.noindex/xros2.1-22N573-02bafd7f43846583f0400bd788fa10b7.sdkstatcache -Xcc -I/Users/admin/builder/spi-builder-workspace/.derivedData/Build/Intermediates.noindex/SwiftTheming.build/Debug-xros/SwiftTheming.build/swift-overrides.hmap -Xcc -I/Users/admin/builder/spi-builder-workspace/.derivedData/Build/Products/Debug-xros/include -Xcc -I/Users/admin/builder/spi-builder-workspace/.derivedData/Build/Intermediates.noindex/SwiftTheming.build/Debug-xros/SwiftTheming.build/DerivedSources-normal/arm64 -Xcc -I/Users/admin/builder/spi-builder-workspace/.derivedData/Build/Intermediates.noindex/SwiftTheming.build/Debug-xros/SwiftTheming.build/DerivedSources/arm64 -Xcc -I/Users/admin/builder/spi-builder-workspace/.derivedData/Build/Intermediates.noindex/SwiftTheming.build/Debug-xros/SwiftTheming.build/DerivedSources -Xcc -DSWIFT_PACKAGE -Xcc -DDEBUG\=1 -module-name SwiftTheming -frontend-parseable-output -disable-clang-spi -target-sdk-version 2.1 -target-sdk-name xros2.1 -external-plugin-path /Applications/Xcode-16.1.0.app/Contents/Developer/Platforms/XROS.platform/Developer/usr/lib/swift/host/plugins\#/Applications/Xcode-16.1.0.app/Contents/Developer/Platforms/XROS.platform/Developer/usr/bin/swift-plugin-server -external-plugin-path /Applications/Xcode-16.1.0.app/Contents/Developer/Platforms/XROS.platform/Developer/usr/local/lib/swift/host/plugins\#/Applications/Xcode-16.1.0.app/Contents/Developer/Platforms/XROS.platform/Developer/usr/bin/swift-plugin-server -plugin-path /Applications/Xcode-16.1.0.app/Contents/Developer/Toolchains/XcodeDefault.xctoolchain/usr/lib/swift/host/plugins -plugin-path /Applications/Xcode-16.1.0.app/Contents/Developer/Toolchains/XcodeDefault.xctoolchain/usr/local/lib/swift/host/plugins -o /Users/admin/builder/spi-builder-workspace/.derivedData/Build/Intermediates.noindex/SwiftTheming.build/Debug-xros/SwiftTheming.build/Objects-normal/arm64/Assetable.o -o /Users/admin/builder/spi-builder-workspace/.derivedData/Build/Intermediates.noindex/SwiftTheming.build/Debug-xros/SwiftTheming.build/Objects-normal/arm64/EmptyAsset.o -index-unit-output-path /SwiftTheming.build/Debug-xros/SwiftTheming.build/Objects-normal/arm64/Assetable.o -index-unit-output-path /SwiftTheming.build/Debug-xros/SwiftTheming.build/Objects-normal/arm64/EmptyAsset.o -index-store-path /Users/admin/builder/spi-builder-workspace/.derivedData/Index.noindex/DataStore -index-system-modules
SwiftCompile normal arm64 /Users/admin/builder/spi-builder-workspace/Sources/SwiftTheming/Asset/Assetable.swift (in target 'SwiftTheming' from project 'SwiftTheming')
cd /Users/admin/builder/spi-builder-workspace/.swiftpm/xcode
/Applications/Xcode-16.1.0.app/Contents/Developer/Toolchains/XcodeDefault.xctoolchain/usr/bin/swift-frontend -c /Users/admin/builder/spi-builder-workspace/Sources/SwiftTheming/Appearance/Appearance.swift /Users/admin/builder/spi-builder-workspace/Sources/SwiftTheming/Appearance/PreferredAppearance.swift /Users/admin/builder/spi-builder-workspace/Sources/SwiftTheming/Asset/AssetKeyWrappable.swift -primary-file /Users/admin/builder/spi-builder-workspace/Sources/SwiftTheming/Asset/Assetable.swift -primary-file /Users/admin/builder/spi-builder-workspace/Sources/SwiftTheming/Asset/EmptyAsset.swift /Users/admin/builder/spi-builder-workspace/Sources/SwiftTheming/Asset/Sets/ColorSet.swift /Users/admin/builder/spi-builder-workspace/Sources/SwiftTheming/Asset/Sets/FontSet.swift /Users/admin/builder/spi-builder-workspace/Sources/SwiftTheming/Asset/Sets/GradientSet.swift /Users/admin/builder/spi-builder-workspace/Sources/SwiftTheming/Asset/Sets/ImageSet.swift /Users/admin/builder/spi-builder-workspace/Sources/SwiftTheming/Extensions/Color++.swift /Users/admin/builder/spi-builder-workspace/Sources/SwiftTheming/Extensions/Font++.swift /Users/admin/builder/spi-builder-workspace/Sources/SwiftTheming/Extensions/Gradient++.swift /Users/admin/builder/spi-builder-workspace/Sources/SwiftTheming/Extensions/Image++.swift /Users/admin/builder/spi-builder-workspace/Sources/SwiftTheming/Extensions/UserDefaults++.swift /Users/admin/builder/spi-builder-workspace/Sources/SwiftTheming/Extensions/View++.swift /Users/admin/builder/spi-builder-workspace/Sources/SwiftTheming/Theme/DefaultTheming.swift /Users/admin/builder/spi-builder-workspace/Sources/SwiftTheming/Theme/Theme.swift /Users/admin/builder/spi-builder-workspace/Sources/SwiftTheming/Theme/Themeable.swift /Users/admin/builder/spi-builder-workspace/Sources/SwiftTheming/Theme/Themed.swift /Users/admin/builder/spi-builder-workspace/Sources/SwiftTheming/ThemeProvider/ThemeProvider.swift /Users/admin/builder/spi-builder-workspace/Sources/SwiftTheming/ThemeProvider/ThemeProviding.swift /Users/admin/builder/spi-builder-workspace/Sources/SwiftTheming/ThemeProvider/ThemeProvidingViewModifier.swift -emit-dependencies-path /Users/admin/builder/spi-builder-workspace/.derivedData/Build/Intermediates.noindex/SwiftTheming.build/Debug-xros/SwiftTheming.build/Objects-normal/arm64/Assetable.d -emit-const-values-path /Users/admin/builder/spi-builder-workspace/.derivedData/Build/Intermediates.noindex/SwiftTheming.build/Debug-xros/SwiftTheming.build/Objects-normal/arm64/Assetable.swiftconstvalues -emit-reference-dependencies-path /Users/admin/builder/spi-builder-workspace/.derivedData/Build/Intermediates.noindex/SwiftTheming.build/Debug-xros/SwiftTheming.build/Objects-normal/arm64/Assetable.swiftdeps -serialize-diagnostics-path /Users/admin/builder/spi-builder-workspace/.derivedData/Build/Intermediates.noindex/SwiftTheming.build/Debug-xros/SwiftTheming.build/Objects-normal/arm64/Assetable.dia -emit-dependencies-path /Users/admin/builder/spi-builder-workspace/.derivedData/Build/Intermediates.noindex/SwiftTheming.build/Debug-xros/SwiftTheming.build/Objects-normal/arm64/EmptyAsset.d -emit-const-values-path /Users/admin/builder/spi-builder-workspace/.derivedData/Build/Intermediates.noindex/SwiftTheming.build/Debug-xros/SwiftTheming.build/Objects-normal/arm64/EmptyAsset.swiftconstvalues -emit-reference-dependencies-path /Users/admin/builder/spi-builder-workspace/.derivedData/Build/Intermediates.noindex/SwiftTheming.build/Debug-xros/SwiftTheming.build/Objects-normal/arm64/EmptyAsset.swiftdeps -serialize-diagnostics-path /Users/admin/builder/spi-builder-workspace/.derivedData/Build/Intermediates.noindex/SwiftTheming.build/Debug-xros/SwiftTheming.build/Objects-normal/arm64/EmptyAsset.dia -target arm64-apple-xros1.0 -Xllvm -aarch64-use-tbi -enable-objc-interop -stack-check -sdk /Applications/Xcode-16.1.0.app/Contents/Developer/Platforms/XROS.platform/Developer/SDKs/XROS2.1.sdk -I /Users/admin/builder/spi-builder-workspace/.derivedData/Build/Products/Debug-xros -I /Applications/Xcode-16.1.0.app/Contents/Developer/Platforms/XROS.platform/Developer/usr/lib -F /Users/admin/builder/spi-builder-workspace/.derivedData/Build/Products/Debug-xros -F /Applications/Xcode-16.1.0.app/Contents/Developer/Platforms/XROS.platform/Developer/Library/Frameworks -F /Applications/Xcode-16.1.0.app/Contents/Developer/Platforms/XROS.platform/Developer/SDKs/XROS2.1.sdk/Developer/Library/Frameworks -no-color-diagnostics -enable-testing -g -debug-info-format\=dwarf -dwarf-version\=4 -module-cache-path /Users/admin/builder/spi-builder-workspace/.derivedData/ModuleCache.noindex -profile-generate -profile-coverage-mapping -swift-version 5 -enforce-exclusivity\=checked -stats-output-dir /Users/admin/builder/spi-builder-workspace/.swiftpm/xcode/.stats -Onone -D SWIFT_PACKAGE -D DEBUG -serialize-debugging-options -const-gather-protocols-file /Users/admin/builder/spi-builder-workspace/.derivedData/Build/Intermediates.noindex/SwiftTheming.build/Debug-xros/SwiftTheming.build/Objects-normal/arm64/SwiftTheming_const_extract_protocols.json -enable-experimental-feature DebugDescriptionMacro -enable-experimental-feature OpaqueTypeErasure -enable-upcoming-feature StrictConcurrency -enable-upcoming-feature DisableOutwardActorInference -enable-upcoming-feature GlobalActorIsolatedTypesUsability -enable-upcoming-feature InferSendableFromCaptures -strict-concurrency\=complete -empty-abi-descriptor -plugin-path /Applications/Xcode-16.1.0.app/Contents/Developer/Toolchains/XcodeDefault.xctoolchain/usr/lib/swift/host/plugins/testing -validate-clang-modules-once -clang-build-session-file /Users/admin/builder/spi-builder-workspace/.derivedData/ModuleCache.noindex/Session.modulevalidation -Xcc -working-directory -Xcc /Users/admin/builder/spi-builder-workspace/.swiftpm/xcode -resource-dir /Applications/Xcode-16.1.0.app/Contents/Developer/Toolchains/XcodeDefault.xctoolchain/usr/lib/swift -enable-anonymous-context-mangled-names -file-compilation-dir /Users/admin/builder/spi-builder-workspace/.swiftpm/xcode -Xcc -D_LIBCPP_HARDENING_MODE\=_LIBCPP_HARDENING_MODE_DEBUG -Xcc -ivfsstatcache -Xcc /Users/admin/builder/spi-builder-workspace/.derivedData/SDKStatCaches.noindex/xros2.1-22N573-02bafd7f43846583f0400bd788fa10b7.sdkstatcache -Xcc -I/Users/admin/builder/spi-builder-workspace/.derivedData/Build/Intermediates.noindex/SwiftTheming.build/Debug-xros/SwiftTheming.build/swift-overrides.hmap -Xcc -I/Users/admin/builder/spi-builder-workspace/.derivedData/Build/Products/Debug-xros/include -Xcc -I/Users/admin/builder/spi-builder-workspace/.derivedData/Build/Intermediates.noindex/SwiftTheming.build/Debug-xros/SwiftTheming.build/DerivedSources-normal/arm64 -Xcc -I/Users/admin/builder/spi-builder-workspace/.derivedData/Build/Intermediates.noindex/SwiftTheming.build/Debug-xros/SwiftTheming.build/DerivedSources/arm64 -Xcc -I/Users/admin/builder/spi-builder-workspace/.derivedData/Build/Intermediates.noindex/SwiftTheming.build/Debug-xros/SwiftTheming.build/DerivedSources -Xcc -DSWIFT_PACKAGE -Xcc -DDEBUG\=1 -module-name SwiftTheming -frontend-parseable-output -disable-clang-spi -target-sdk-version 2.1 -target-sdk-name xros2.1 -external-plugin-path /Applications/Xcode-16.1.0.app/Contents/Developer/Platforms/XROS.platform/Developer/usr/lib/swift/host/plugins\#/Applications/Xcode-16.1.0.app/Contents/Developer/Platforms/XROS.platform/Developer/usr/bin/swift-plugin-server -external-plugin-path /Applications/Xcode-16.1.0.app/Contents/Developer/Platforms/XROS.platform/Developer/usr/local/lib/swift/host/plugins\#/Applications/Xcode-16.1.0.app/Contents/Developer/Platforms/XROS.platform/Developer/usr/bin/swift-plugin-server -plugin-path /Applications/Xcode-16.1.0.app/Contents/Developer/Toolchains/XcodeDefault.xctoolchain/usr/lib/swift/host/plugins -plugin-path /Applications/Xcode-16.1.0.app/Contents/Developer/Toolchains/XcodeDefault.xctoolchain/usr/local/lib/swift/host/plugins -o /Users/admin/builder/spi-builder-workspace/.derivedData/Build/Intermediates.noindex/SwiftTheming.build/Debug-xros/SwiftTheming.build/Objects-normal/arm64/Assetable.o -o /Users/admin/builder/spi-builder-workspace/.derivedData/Build/Intermediates.noindex/SwiftTheming.build/Debug-xros/SwiftTheming.build/Objects-normal/arm64/EmptyAsset.o -index-unit-output-path /SwiftTheming.build/Debug-xros/SwiftTheming.build/Objects-normal/arm64/Assetable.o -index-unit-output-path /SwiftTheming.build/Debug-xros/SwiftTheming.build/Objects-normal/arm64/EmptyAsset.o -index-store-path /Users/admin/builder/spi-builder-workspace/.derivedData/Index.noindex/DataStore -index-system-modules
SwiftCompile normal arm64 /Users/admin/builder/spi-builder-workspace/Sources/SwiftTheming/Asset/EmptyAsset.swift (in target 'SwiftTheming' from project 'SwiftTheming')
cd /Users/admin/builder/spi-builder-workspace/.swiftpm/xcode
/Applications/Xcode-16.1.0.app/Contents/Developer/Toolchains/XcodeDefault.xctoolchain/usr/bin/swift-frontend -c /Users/admin/builder/spi-builder-workspace/Sources/SwiftTheming/Appearance/Appearance.swift /Users/admin/builder/spi-builder-workspace/Sources/SwiftTheming/Appearance/PreferredAppearance.swift /Users/admin/builder/spi-builder-workspace/Sources/SwiftTheming/Asset/AssetKeyWrappable.swift -primary-file /Users/admin/builder/spi-builder-workspace/Sources/SwiftTheming/Asset/Assetable.swift -primary-file /Users/admin/builder/spi-builder-workspace/Sources/SwiftTheming/Asset/EmptyAsset.swift /Users/admin/builder/spi-builder-workspace/Sources/SwiftTheming/Asset/Sets/ColorSet.swift /Users/admin/builder/spi-builder-workspace/Sources/SwiftTheming/Asset/Sets/FontSet.swift /Users/admin/builder/spi-builder-workspace/Sources/SwiftTheming/Asset/Sets/GradientSet.swift /Users/admin/builder/spi-builder-workspace/Sources/SwiftTheming/Asset/Sets/ImageSet.swift /Users/admin/builder/spi-builder-workspace/Sources/SwiftTheming/Extensions/Color++.swift /Users/admin/builder/spi-builder-workspace/Sources/SwiftTheming/Extensions/Font++.swift /Users/admin/builder/spi-builder-workspace/Sources/SwiftTheming/Extensions/Gradient++.swift /Users/admin/builder/spi-builder-workspace/Sources/SwiftTheming/Extensions/Image++.swift /Users/admin/builder/spi-builder-workspace/Sources/SwiftTheming/Extensions/UserDefaults++.swift /Users/admin/builder/spi-builder-workspace/Sources/SwiftTheming/Extensions/View++.swift /Users/admin/builder/spi-builder-workspace/Sources/SwiftTheming/Theme/DefaultTheming.swift /Users/admin/builder/spi-builder-workspace/Sources/SwiftTheming/Theme/Theme.swift /Users/admin/builder/spi-builder-workspace/Sources/SwiftTheming/Theme/Themeable.swift /Users/admin/builder/spi-builder-workspace/Sources/SwiftTheming/Theme/Themed.swift /Users/admin/builder/spi-builder-workspace/Sources/SwiftTheming/ThemeProvider/ThemeProvider.swift /Users/admin/builder/spi-builder-workspace/Sources/SwiftTheming/ThemeProvider/ThemeProviding.swift /Users/admin/builder/spi-builder-workspace/Sources/SwiftTheming/ThemeProvider/ThemeProvidingViewModifier.swift -emit-dependencies-path /Users/admin/builder/spi-builder-workspace/.derivedData/Build/Intermediates.noindex/SwiftTheming.build/Debug-xros/SwiftTheming.build/Objects-normal/arm64/Assetable.d -emit-const-values-path /Users/admin/builder/spi-builder-workspace/.derivedData/Build/Intermediates.noindex/SwiftTheming.build/Debug-xros/SwiftTheming.build/Objects-normal/arm64/Assetable.swiftconstvalues -emit-reference-dependencies-path /Users/admin/builder/spi-builder-workspace/.derivedData/Build/Intermediates.noindex/SwiftTheming.build/Debug-xros/SwiftTheming.build/Objects-normal/arm64/Assetable.swiftdeps -serialize-diagnostics-path /Users/admin/builder/spi-builder-workspace/.derivedData/Build/Intermediates.noindex/SwiftTheming.build/Debug-xros/SwiftTheming.build/Objects-normal/arm64/Assetable.dia -emit-dependencies-path /Users/admin/builder/spi-builder-workspace/.derivedData/Build/Intermediates.noindex/SwiftTheming.build/Debug-xros/SwiftTheming.build/Objects-normal/arm64/EmptyAsset.d -emit-const-values-path /Users/admin/builder/spi-builder-workspace/.derivedData/Build/Intermediates.noindex/SwiftTheming.build/Debug-xros/SwiftTheming.build/Objects-normal/arm64/EmptyAsset.swiftconstvalues -emit-reference-dependencies-path /Users/admin/builder/spi-builder-workspace/.derivedData/Build/Intermediates.noindex/SwiftTheming.build/Debug-xros/SwiftTheming.build/Objects-normal/arm64/EmptyAsset.swiftdeps -serialize-diagnostics-path /Users/admin/builder/spi-builder-workspace/.derivedData/Build/Intermediates.noindex/SwiftTheming.build/Debug-xros/SwiftTheming.build/Objects-normal/arm64/EmptyAsset.dia -target arm64-apple-xros1.0 -Xllvm -aarch64-use-tbi -enable-objc-interop -stack-check -sdk /Applications/Xcode-16.1.0.app/Contents/Developer/Platforms/XROS.platform/Developer/SDKs/XROS2.1.sdk -I /Users/admin/builder/spi-builder-workspace/.derivedData/Build/Products/Debug-xros -I /Applications/Xcode-16.1.0.app/Contents/Developer/Platforms/XROS.platform/Developer/usr/lib -F /Users/admin/builder/spi-builder-workspace/.derivedData/Build/Products/Debug-xros -F /Applications/Xcode-16.1.0.app/Contents/Developer/Platforms/XROS.platform/Developer/Library/Frameworks -F /Applications/Xcode-16.1.0.app/Contents/Developer/Platforms/XROS.platform/Developer/SDKs/XROS2.1.sdk/Developer/Library/Frameworks -no-color-diagnostics -enable-testing -g -debug-info-format\=dwarf -dwarf-version\=4 -module-cache-path /Users/admin/builder/spi-builder-workspace/.derivedData/ModuleCache.noindex -profile-generate -profile-coverage-mapping -swift-version 5 -enforce-exclusivity\=checked -stats-output-dir /Users/admin/builder/spi-builder-workspace/.swiftpm/xcode/.stats -Onone -D SWIFT_PACKAGE -D DEBUG -serialize-debugging-options -const-gather-protocols-file /Users/admin/builder/spi-builder-workspace/.derivedData/Build/Intermediates.noindex/SwiftTheming.build/Debug-xros/SwiftTheming.build/Objects-normal/arm64/SwiftTheming_const_extract_protocols.json -enable-experimental-feature DebugDescriptionMacro -enable-experimental-feature OpaqueTypeErasure -enable-upcoming-feature StrictConcurrency -enable-upcoming-feature DisableOutwardActorInference -enable-upcoming-feature GlobalActorIsolatedTypesUsability -enable-upcoming-feature InferSendableFromCaptures -strict-concurrency\=complete -empty-abi-descriptor -plugin-path /Applications/Xcode-16.1.0.app/Contents/Developer/Toolchains/XcodeDefault.xctoolchain/usr/lib/swift/host/plugins/testing -validate-clang-modules-once -clang-build-session-file /Users/admin/builder/spi-builder-workspace/.derivedData/ModuleCache.noindex/Session.modulevalidation -Xcc -working-directory -Xcc /Users/admin/builder/spi-builder-workspace/.swiftpm/xcode -resource-dir /Applications/Xcode-16.1.0.app/Contents/Developer/Toolchains/XcodeDefault.xctoolchain/usr/lib/swift -enable-anonymous-context-mangled-names -file-compilation-dir /Users/admin/builder/spi-builder-workspace/.swiftpm/xcode -Xcc -D_LIBCPP_HARDENING_MODE\=_LIBCPP_HARDENING_MODE_DEBUG -Xcc -ivfsstatcache -Xcc /Users/admin/builder/spi-builder-workspace/.derivedData/SDKStatCaches.noindex/xros2.1-22N573-02bafd7f43846583f0400bd788fa10b7.sdkstatcache -Xcc -I/Users/admin/builder/spi-builder-workspace/.derivedData/Build/Intermediates.noindex/SwiftTheming.build/Debug-xros/SwiftTheming.build/swift-overrides.hmap -Xcc -I/Users/admin/builder/spi-builder-workspace/.derivedData/Build/Products/Debug-xros/include -Xcc -I/Users/admin/builder/spi-builder-workspace/.derivedData/Build/Intermediates.noindex/SwiftTheming.build/Debug-xros/SwiftTheming.build/DerivedSources-normal/arm64 -Xcc -I/Users/admin/builder/spi-builder-workspace/.derivedData/Build/Intermediates.noindex/SwiftTheming.build/Debug-xros/SwiftTheming.build/DerivedSources/arm64 -Xcc -I/Users/admin/builder/spi-builder-workspace/.derivedData/Build/Intermediates.noindex/SwiftTheming.build/Debug-xros/SwiftTheming.build/DerivedSources -Xcc -DSWIFT_PACKAGE -Xcc -DDEBUG\=1 -module-name SwiftTheming -frontend-parseable-output -disable-clang-spi -target-sdk-version 2.1 -target-sdk-name xros2.1 -external-plugin-path /Applications/Xcode-16.1.0.app/Contents/Developer/Platforms/XROS.platform/Developer/usr/lib/swift/host/plugins\#/Applications/Xcode-16.1.0.app/Contents/Developer/Platforms/XROS.platform/Developer/usr/bin/swift-plugin-server -external-plugin-path /Applications/Xcode-16.1.0.app/Contents/Developer/Platforms/XROS.platform/Developer/usr/local/lib/swift/host/plugins\#/Applications/Xcode-16.1.0.app/Contents/Developer/Platforms/XROS.platform/Developer/usr/bin/swift-plugin-server -plugin-path /Applications/Xcode-16.1.0.app/Contents/Developer/Toolchains/XcodeDefault.xctoolchain/usr/lib/swift/host/plugins -plugin-path /Applications/Xcode-16.1.0.app/Contents/Developer/Toolchains/XcodeDefault.xctoolchain/usr/local/lib/swift/host/plugins -o /Users/admin/builder/spi-builder-workspace/.derivedData/Build/Intermediates.noindex/SwiftTheming.build/Debug-xros/SwiftTheming.build/Objects-normal/arm64/Assetable.o -o /Users/admin/builder/spi-builder-workspace/.derivedData/Build/Intermediates.noindex/SwiftTheming.build/Debug-xros/SwiftTheming.build/Objects-normal/arm64/EmptyAsset.o -index-unit-output-path /SwiftTheming.build/Debug-xros/SwiftTheming.build/Objects-normal/arm64/Assetable.o -index-unit-output-path /SwiftTheming.build/Debug-xros/SwiftTheming.build/Objects-normal/arm64/EmptyAsset.o -index-store-path /Users/admin/builder/spi-builder-workspace/.derivedData/Index.noindex/DataStore -index-system-modules
SwiftCompile normal arm64 Compiling\ ColorSet.swift /Users/admin/builder/spi-builder-workspace/Sources/SwiftTheming/Asset/Sets/ColorSet.swift (in target 'SwiftTheming' from project 'SwiftTheming')
cd /Users/admin/builder/spi-builder-workspace/.swiftpm/xcode
builtin-swiftTaskExecution -- /Applications/Xcode-16.1.0.app/Contents/Developer/Toolchains/XcodeDefault.xctoolchain/usr/bin/swift-frontend -frontend -c /Users/admin/builder/spi-builder-workspace/Sources/SwiftTheming/Appearance/Appearance.swift /Users/admin/builder/spi-builder-workspace/Sources/SwiftTheming/Appearance/PreferredAppearance.swift /Users/admin/builder/spi-builder-workspace/Sources/SwiftTheming/Asset/AssetKeyWrappable.swift /Users/admin/builder/spi-builder-workspace/Sources/SwiftTheming/Asset/Assetable.swift /Users/admin/builder/spi-builder-workspace/Sources/SwiftTheming/Asset/EmptyAsset.swift -primary-file /Users/admin/builder/spi-builder-workspace/Sources/SwiftTheming/Asset/Sets/ColorSet.swift /Users/admin/builder/spi-builder-workspace/Sources/SwiftTheming/Asset/Sets/FontSet.swift /Users/admin/builder/spi-builder-workspace/Sources/SwiftTheming/Asset/Sets/GradientSet.swift /Users/admin/builder/spi-builder-workspace/Sources/SwiftTheming/Asset/Sets/ImageSet.swift /Users/admin/builder/spi-builder-workspace/Sources/SwiftTheming/Extensions/Color++.swift /Users/admin/builder/spi-builder-workspace/Sources/SwiftTheming/Extensions/Font++.swift /Users/admin/builder/spi-builder-workspace/Sources/SwiftTheming/Extensions/Gradient++.swift /Users/admin/builder/spi-builder-workspace/Sources/SwiftTheming/Extensions/Image++.swift /Users/admin/builder/spi-builder-workspace/Sources/SwiftTheming/Extensions/UserDefaults++.swift /Users/admin/builder/spi-builder-workspace/Sources/SwiftTheming/Extensions/View++.swift /Users/admin/builder/spi-builder-workspace/Sources/SwiftTheming/Theme/DefaultTheming.swift /Users/admin/builder/spi-builder-workspace/Sources/SwiftTheming/Theme/Theme.swift /Users/admin/builder/spi-builder-workspace/Sources/SwiftTheming/Theme/Themeable.swift /Users/admin/builder/spi-builder-workspace/Sources/SwiftTheming/Theme/Themed.swift /Users/admin/builder/spi-builder-workspace/Sources/SwiftTheming/ThemeProvider/ThemeProvider.swift /Users/admin/builder/spi-builder-workspace/Sources/SwiftTheming/ThemeProvider/ThemeProviding.swift /Users/admin/builder/spi-builder-workspace/Sources/SwiftTheming/ThemeProvider/ThemeProvidingViewModifier.swift -emit-dependencies-path /Users/admin/builder/spi-builder-workspace/.derivedData/Build/Intermediates.noindex/SwiftTheming.build/Debug-xros/SwiftTheming.build/Objects-normal/arm64/ColorSet.d -emit-const-values-path /Users/admin/builder/spi-builder-workspace/.derivedData/Build/Intermediates.noindex/SwiftTheming.build/Debug-xros/SwiftTheming.build/Objects-normal/arm64/ColorSet.swiftconstvalues -emit-reference-dependencies-path /Users/admin/builder/spi-builder-workspace/.derivedData/Build/Intermediates.noindex/SwiftTheming.build/Debug-xros/SwiftTheming.build/Objects-normal/arm64/ColorSet.swiftdeps -serialize-diagnostics-path /Users/admin/builder/spi-builder-workspace/.derivedData/Build/Intermediates.noindex/SwiftTheming.build/Debug-xros/SwiftTheming.build/Objects-normal/arm64/ColorSet.dia -target arm64-apple-xros1.0 -Xllvm -aarch64-use-tbi -enable-objc-interop -stack-check -sdk /Applications/Xcode-16.1.0.app/Contents/Developer/Platforms/XROS.platform/Developer/SDKs/XROS2.1.sdk -I /Users/admin/builder/spi-builder-workspace/.derivedData/Build/Products/Debug-xros -I /Applications/Xcode-16.1.0.app/Contents/Developer/Platforms/XROS.platform/Developer/usr/lib -F /Users/admin/builder/spi-builder-workspace/.derivedData/Build/Products/Debug-xros -F /Applications/Xcode-16.1.0.app/Contents/Developer/Platforms/XROS.platform/Developer/Library/Frameworks -F /Applications/Xcode-16.1.0.app/Contents/Developer/Platforms/XROS.platform/Developer/SDKs/XROS2.1.sdk/Developer/Library/Frameworks -no-color-diagnostics -enable-testing -g -debug-info-format\=dwarf -dwarf-version\=4 -module-cache-path /Users/admin/builder/spi-builder-workspace/.derivedData/ModuleCache.noindex -profile-generate -profile-coverage-mapping -swift-version 5 -enforce-exclusivity\=checked -stats-output-dir /Users/admin/builder/spi-builder-workspace/.swiftpm/xcode/.stats -Onone -D SWIFT_PACKAGE -D DEBUG -serialize-debugging-options -const-gather-protocols-file /Users/admin/builder/spi-builder-workspace/.derivedData/Build/Intermediates.noindex/SwiftTheming.build/Debug-xros/SwiftTheming.build/Objects-normal/arm64/SwiftTheming_const_extract_protocols.json -enable-experimental-feature DebugDescriptionMacro -enable-experimental-feature OpaqueTypeErasure -enable-upcoming-feature StrictConcurrency -enable-upcoming-feature DisableOutwardActorInference -enable-upcoming-feature GlobalActorIsolatedTypesUsability -enable-upcoming-feature InferSendableFromCaptures -strict-concurrency\=complete -empty-abi-descriptor -plugin-path /Applications/Xcode-16.1.0.app/Contents/Developer/Toolchains/XcodeDefault.xctoolchain/usr/lib/swift/host/plugins/testing -validate-clang-modules-once -clang-build-session-file /Users/admin/builder/spi-builder-workspace/.derivedData/ModuleCache.noindex/Session.modulevalidation -Xcc -working-directory -Xcc /Users/admin/builder/spi-builder-workspace/.swiftpm/xcode -resource-dir /Applications/Xcode-16.1.0.app/Contents/Developer/Toolchains/XcodeDefault.xctoolchain/usr/lib/swift -enable-anonymous-context-mangled-names -file-compilation-dir /Users/admin/builder/spi-builder-workspace/.swiftpm/xcode -Xcc -D_LIBCPP_HARDENING_MODE\=_LIBCPP_HARDENING_MODE_DEBUG -Xcc -ivfsstatcache -Xcc /Users/admin/builder/spi-builder-workspace/.derivedData/SDKStatCaches.noindex/xros2.1-22N573-02bafd7f43846583f0400bd788fa10b7.sdkstatcache -Xcc -I/Users/admin/builder/spi-builder-workspace/.derivedData/Build/Intermediates.noindex/SwiftTheming.build/Debug-xros/SwiftTheming.build/swift-overrides.hmap -Xcc -I/Users/admin/builder/spi-builder-workspace/.derivedData/Build/Products/Debug-xros/include -Xcc -I/Users/admin/builder/spi-builder-workspace/.derivedData/Build/Intermediates.noindex/SwiftTheming.build/Debug-xros/SwiftTheming.build/DerivedSources-normal/arm64 -Xcc -I/Users/admin/builder/spi-builder-workspace/.derivedData/Build/Intermediates.noindex/SwiftTheming.build/Debug-xros/SwiftTheming.build/DerivedSources/arm64 -Xcc -I/Users/admin/builder/spi-builder-workspace/.derivedData/Build/Intermediates.noindex/SwiftTheming.build/Debug-xros/SwiftTheming.build/DerivedSources -Xcc -DSWIFT_PACKAGE -Xcc -DDEBUG\=1 -module-name SwiftTheming -frontend-parseable-output -disable-clang-spi -target-sdk-version 2.1 -target-sdk-name xros2.1 -external-plugin-path /Applications/Xcode-16.1.0.app/Contents/Developer/Platforms/XROS.platform/Developer/usr/lib/swift/host/plugins\#/Applications/Xcode-16.1.0.app/Contents/Developer/Platforms/XROS.platform/Developer/usr/bin/swift-plugin-server -external-plugin-path /Applications/Xcode-16.1.0.app/Contents/Developer/Platforms/XROS.platform/Developer/usr/local/lib/swift/host/plugins\#/Applications/Xcode-16.1.0.app/Contents/Developer/Platforms/XROS.platform/Developer/usr/bin/swift-plugin-server -plugin-path /Applications/Xcode-16.1.0.app/Contents/Developer/Toolchains/XcodeDefault.xctoolchain/usr/lib/swift/host/plugins -plugin-path /Applications/Xcode-16.1.0.app/Contents/Developer/Toolchains/XcodeDefault.xctoolchain/usr/local/lib/swift/host/plugins -o /Users/admin/builder/spi-builder-workspace/.derivedData/Build/Intermediates.noindex/SwiftTheming.build/Debug-xros/SwiftTheming.build/Objects-normal/arm64/ColorSet.o -index-unit-output-path /SwiftTheming.build/Debug-xros/SwiftTheming.build/Objects-normal/arm64/ColorSet.o -index-store-path /Users/admin/builder/spi-builder-workspace/.derivedData/Index.noindex/DataStore -index-system-modules
Command SwiftCompile failed with a nonzero exit code
** BUILD FAILED **
The following build commands failed:
SwiftCompile normal arm64 Compiling\ ThemeProviding.swift /Users/admin/builder/spi-builder-workspace/Sources/SwiftTheming/ThemeProvider/ThemeProviding.swift (in target 'SwiftTheming' from project 'SwiftTheming')
SwiftCompile normal arm64 /Users/admin/builder/spi-builder-workspace/Sources/SwiftTheming/ThemeProvider/ThemeProviding.swift (in target 'SwiftTheming' from project 'SwiftTheming')
SwiftCompile normal arm64 Compiling\ ColorSet.swift /Users/admin/builder/spi-builder-workspace/Sources/SwiftTheming/Asset/Sets/ColorSet.swift (in target 'SwiftTheming' from project 'SwiftTheming')
Building workspace spi-builder-workspace with scheme SwiftTheming
(4 failures)
BUILD FAILURE 6.0 visionOS