The Swift Package Index logo.Swift Package Index

Has it really been five years since Swift Package Index launched? Read our anniversary blog post!

Build Information

Failed to build IBLinter, reference 0.5.0 (d62942), with Swift 6.2 (beta) for visionOS using Xcode 26.0 on 19 Jun 2025 10:17:52 UTC.

Build Command

env DEVELOPER_DIR=/Applications/Xcode-26.0.0-Beta.app xcrun xcodebuild -IDEClonedSourcePackagesDirPathOverride=$PWD/.dependencies -skipMacroValidation -skipPackagePluginValidation -derivedDataPath $PWD/.derivedData build -scheme IBLinter-Package -destination generic/platform=xrOS

Build Log

SwiftExplicitDependencyGeneratePcm arm64 /Users/admin/builder/spi-builder-workspace/.derivedData/ModuleCache.noindex/_Builtin_float-1YQCTN0O73AHNHZOS6SY3HD3E.pcm
SwiftMergeGeneratedHeaders /Users/admin/builder/spi-builder-workspace/.derivedData/Build/Intermediates.noindex/GeneratedModuleMaps-xros/XcodeProjKit-Swift.h /Users/admin/builder/spi-builder-workspace/.derivedData/Build/Intermediates.noindex/XcodeProjKit.build/Debug-xros/XcodeProjKit.build/Objects-normal/arm64/XcodeProjKit-Swift.h (in target 'XcodeProjKit' from project 'XcodeProjKit')
    cd /Users/admin/builder/spi-builder-workspace/.dependencies/checkouts/XcodeProjKit
    builtin-swiftHeaderTool -arch arm64 /Users/admin/builder/spi-builder-workspace/.derivedData/Build/Intermediates.noindex/XcodeProjKit.build/Debug-xros/XcodeProjKit.build/Objects-normal/arm64/XcodeProjKit-Swift.h -o /Users/admin/builder/spi-builder-workspace/.derivedData/Build/Intermediates.noindex/GeneratedModuleMaps-xros/XcodeProjKit-Swift.h
Copy /Users/admin/builder/spi-builder-workspace/.derivedData/Build/Products/Debug-xros/XcodeProjKit.swiftmodule/arm64-apple-xros.swiftmodule /Users/admin/builder/spi-builder-workspace/.derivedData/Build/Intermediates.noindex/XcodeProjKit.build/Debug-xros/XcodeProjKit.build/Objects-normal/arm64/XcodeProjKit.swiftmodule (in target 'XcodeProjKit' from project 'XcodeProjKit')
    cd /Users/admin/builder/spi-builder-workspace/.dependencies/checkouts/XcodeProjKit
    builtin-copy -exclude .DS_Store -exclude CVS -exclude .svn -exclude .git -exclude .hg -resolve-src-symlinks -rename /Users/admin/builder/spi-builder-workspace/.derivedData/Build/Intermediates.noindex/XcodeProjKit.build/Debug-xros/XcodeProjKit.build/Objects-normal/arm64/XcodeProjKit.swiftmodule /Users/admin/builder/spi-builder-workspace/.derivedData/Build/Products/Debug-xros/XcodeProjKit.swiftmodule/arm64-apple-xros.swiftmodule
Copy /Users/admin/builder/spi-builder-workspace/.derivedData/Build/Products/Debug-xros/XcodeProjKit.swiftmodule/arm64-apple-xros.swiftdoc /Users/admin/builder/spi-builder-workspace/.derivedData/Build/Intermediates.noindex/XcodeProjKit.build/Debug-xros/XcodeProjKit.build/Objects-normal/arm64/XcodeProjKit.swiftdoc (in target 'XcodeProjKit' from project 'XcodeProjKit')
    cd /Users/admin/builder/spi-builder-workspace/.dependencies/checkouts/XcodeProjKit
    builtin-copy -exclude .DS_Store -exclude CVS -exclude .svn -exclude .git -exclude .hg -resolve-src-symlinks -rename /Users/admin/builder/spi-builder-workspace/.derivedData/Build/Intermediates.noindex/XcodeProjKit.build/Debug-xros/XcodeProjKit.build/Objects-normal/arm64/XcodeProjKit.swiftdoc /Users/admin/builder/spi-builder-workspace/.derivedData/Build/Products/Debug-xros/XcodeProjKit.swiftmodule/arm64-apple-xros.swiftdoc
Copy /Users/admin/builder/spi-builder-workspace/.derivedData/Build/Products/Debug-xros/XcodeProjKit.swiftmodule/arm64-apple-xros.abi.json /Users/admin/builder/spi-builder-workspace/.derivedData/Build/Intermediates.noindex/XcodeProjKit.build/Debug-xros/XcodeProjKit.build/Objects-normal/arm64/XcodeProjKit.abi.json (in target 'XcodeProjKit' from project 'XcodeProjKit')
    cd /Users/admin/builder/spi-builder-workspace/.dependencies/checkouts/XcodeProjKit
    builtin-copy -exclude .DS_Store -exclude CVS -exclude .svn -exclude .git -exclude .hg -resolve-src-symlinks -rename /Users/admin/builder/spi-builder-workspace/.derivedData/Build/Intermediates.noindex/XcodeProjKit.build/Debug-xros/XcodeProjKit.build/Objects-normal/arm64/XcodeProjKit.abi.json /Users/admin/builder/spi-builder-workspace/.derivedData/Build/Products/Debug-xros/XcodeProjKit.swiftmodule/arm64-apple-xros.abi.json
Copy /Users/admin/builder/spi-builder-workspace/.derivedData/Build/Products/Debug-xros/XcodeProjKit.swiftmodule/Project/arm64-apple-xros.swiftsourceinfo /Users/admin/builder/spi-builder-workspace/.derivedData/Build/Intermediates.noindex/XcodeProjKit.build/Debug-xros/XcodeProjKit.build/Objects-normal/arm64/XcodeProjKit.swiftsourceinfo (in target 'XcodeProjKit' from project 'XcodeProjKit')
    cd /Users/admin/builder/spi-builder-workspace/.dependencies/checkouts/XcodeProjKit
    builtin-copy -exclude .DS_Store -exclude CVS -exclude .svn -exclude .git -exclude .hg -resolve-src-symlinks -rename /Users/admin/builder/spi-builder-workspace/.derivedData/Build/Intermediates.noindex/XcodeProjKit.build/Debug-xros/XcodeProjKit.build/Objects-normal/arm64/XcodeProjKit.swiftsourceinfo /Users/admin/builder/spi-builder-workspace/.derivedData/Build/Products/Debug-xros/XcodeProjKit.swiftmodule/Project/arm64-apple-xros.swiftsourceinfo
SwiftExplicitDependencyGeneratePcm arm64 /Users/admin/builder/spi-builder-workspace/.derivedData/ModuleCache.noindex/_SwiftConcurrencyShims-3Y28RS13OLUVOBC4C4VRCDT1I.pcm
SwiftExplicitDependencyGeneratePcm arm64 /Users/admin/builder/spi-builder-workspace/.derivedData/ModuleCache.noindex/_AvailabilityInternal-C2AB6M1NNYPFLWYMKDOFRYH8X.pcm
SwiftExplicitDependencyGeneratePcm arm64 /Users/admin/builder/spi-builder-workspace/.derivedData/ModuleCache.noindex/_AvailabilityInternal-2XEPCLQ9EOQ9HX8ECLP1N50DM.pcm
SwiftExplicitDependencyGeneratePcm arm64 /Users/admin/builder/spi-builder-workspace/.derivedData/ModuleCache.noindex/ptrcheck-CX4R5WDS7PHMFI21T1ODOOT2V.pcm
SwiftExplicitDependencyGeneratePcm arm64 /Users/admin/builder/spi-builder-workspace/.derivedData/ModuleCache.noindex/_SwiftConcurrencyShims-63O7P0417CITDU5TAPFWA16RK.pcm
SwiftExplicitDependencyGeneratePcm arm64 /Users/admin/builder/spi-builder-workspace/.derivedData/ModuleCache.noindex/SwiftShims-F46X5FXY7I1HWEOCOQVSQWDNN.pcm
SwiftExplicitDependencyGeneratePcm arm64 /Users/admin/builder/spi-builder-workspace/.derivedData/ModuleCache.noindex/ptrcheck-E7LE7DV0CNK9MJMHLAZCYDQGG.pcm
SwiftExplicitDependencyGeneratePcm arm64 /Users/admin/builder/spi-builder-workspace/.derivedData/ModuleCache.noindex/_Builtin_stdarg-2P22HPL9YP6QIG6DMD96IUMEH.pcm
SwiftExplicitDependencyGeneratePcm arm64 /Users/admin/builder/spi-builder-workspace/.derivedData/ModuleCache.noindex/_DarwinFoundation1-EFETDZLNX0FEPQZ2E3PZFKYNR.pcm
SwiftExplicitDependencyGeneratePcm arm64 /Users/admin/builder/spi-builder-workspace/.derivedData/ModuleCache.noindex/_Builtin_stddef-21H3N9DH1KLS9X4PIJZT9JFO8.pcm
SwiftExplicitDependencyGeneratePcm arm64 /Users/admin/builder/spi-builder-workspace/.derivedData/ModuleCache.noindex/_Builtin_limits-DKV1BYCIVIYMBC5V04ISHLS5A.pcm
SwiftExplicitDependencyGeneratePcm arm64 /Users/admin/builder/spi-builder-workspace/.derivedData/ModuleCache.noindex/_Builtin_stdbool-7G57MOE58GZVJMWN1GCZ599TP.pcm
SwiftExplicitDependencyGeneratePcm arm64 /Users/admin/builder/spi-builder-workspace/.derivedData/ModuleCache.noindex/SwiftShims-AU3C710NMU8Z63A0OJHENVH02.pcm
SwiftExplicitDependencyGeneratePcm arm64 /Users/admin/builder/spi-builder-workspace/.derivedData/ModuleCache.noindex/ptrauth-3H3LLJBXUZYXL2X8I9QOFQSE2.pcm
SwiftExplicitDependencyGeneratePcm arm64 /Users/admin/builder/spi-builder-workspace/.derivedData/ModuleCache.noindex/_Builtin_stdarg-AGIMNIU03RBGDKDFQRREAQMB0.pcm
SwiftExplicitDependencyGeneratePcm arm64 /Users/admin/builder/spi-builder-workspace/.derivedData/ModuleCache.noindex/_Builtin_stdbool-53WEJC40SBD0L91DVUORGXYOO.pcm
SwiftExplicitDependencyGeneratePcm arm64 /Users/admin/builder/spi-builder-workspace/.derivedData/ModuleCache.noindex/_DarwinFoundation1-AP15KW45C6BTHKCN7MLB0URNP.pcm
SwiftExplicitDependencyGeneratePcm arm64 /Users/admin/builder/spi-builder-workspace/.derivedData/ModuleCache.noindex/_Builtin_float-2H12BMA65AKYHPIYOK23CLZX4.pcm
SwiftExplicitDependencyGeneratePcm arm64 /Users/admin/builder/spi-builder-workspace/.derivedData/ModuleCache.noindex/_Builtin_limits-BTNW1C2M4TTE3WTIEME984SEE.pcm
SwiftExplicitDependencyGeneratePcm arm64 /Users/admin/builder/spi-builder-workspace/.derivedData/ModuleCache.noindex/_DarwinFoundation2-E60OGYQQCI50TU38JKHOXIOVC.pcm
SwiftExplicitDependencyGeneratePcm arm64 /Users/admin/builder/spi-builder-workspace/.derivedData/ModuleCache.noindex/_Builtin_stddef-7VTWRXXDZUUSYQE0ZJQAEDNNQ.pcm
SwiftExplicitDependencyGeneratePcm arm64 /Users/admin/builder/spi-builder-workspace/.derivedData/ModuleCache.noindex/_Builtin_stdint-DN40O2QXVAPS5PX3RRQK2CDTB.pcm
SwiftExplicitDependencyGeneratePcm arm64 /Users/admin/builder/spi-builder-workspace/.derivedData/ModuleCache.noindex/_DarwinFoundation2-4S35JU68XE3OO8Q8J6PV7AK6P.pcm
SwiftExplicitDependencyGeneratePcm arm64 /Users/admin/builder/spi-builder-workspace/.derivedData/ModuleCache.noindex/_DarwinFoundation3-2J7H31OFACG6OUGQJF3Z2HH2P.pcm
SwiftExplicitDependencyGeneratePcm arm64 /Users/admin/builder/spi-builder-workspace/.derivedData/ModuleCache.noindex/_Builtin_stdint-127L5DREYJMSWYE8S6B3HCEOV.pcm
SwiftExplicitDependencyGeneratePcm arm64 /Users/admin/builder/spi-builder-workspace/.derivedData/ModuleCache.noindex/_Builtin_inttypes-7IAHOD1D4EZJRBSJ4YXQCX8QK.pcm
SwiftExplicitDependencyGeneratePcm arm64 /Users/admin/builder/spi-builder-workspace/.derivedData/ModuleCache.noindex/_DarwinFoundation3-6WZGSDAMQKWGYSU6EJ0C76XLA.pcm
SwiftExplicitDependencyGeneratePcm arm64 /Users/admin/builder/spi-builder-workspace/.derivedData/ModuleCache.noindex/Darwin-ANJZ93KTRF4ZV05C6NV5Q0SRR.pcm
SwiftExplicitDependencyGeneratePcm arm64 /Users/admin/builder/spi-builder-workspace/.derivedData/Build/Intermediates.noindex/SwiftExplicitPrecompiledModules/CYaml-ED2ICWWCRVFLB7B4GKYSK9ET0.pcm
SwiftDriverJobDiscovery normal arm64 Compiling XcodeProj+FilePath.swift, XcodeProj+Serialization.swift, XcodeProj.swift, XcodeProjError.swift (in target 'XcodeProjKit' from project 'XcodeProjKit')
SwiftExplicitDependencyGeneratePcm arm64 /Users/admin/builder/spi-builder-workspace/.derivedData/ModuleCache.noindex/_Builtin_inttypes-3W6P9K4ARHRKQISB3QD9YQ39L.pcm
SwiftDriverJobDiscovery normal arm64 Compiling XCConfigurationList.swift, XCRemoteSwiftPackageReference.swift, XCSwiftPackageProductDependency.swift, XCVersionGroup.swift (in target 'XcodeProjKit' from project 'XcodeProjKit')
SwiftCompile normal arm64 Compiling\ PBXVariantGroup.swift,\ PathType.swift,\ Sequence+XcodeProjKit.swift,\ SourceTree.swift /Users/admin/builder/spi-builder-workspace/.dependencies/checkouts/XcodeProjKit/Sources/PBXVariantGroup.swift /Users/admin/builder/spi-builder-workspace/.dependencies/checkouts/XcodeProjKit/Sources/PathType.swift /Users/admin/builder/spi-builder-workspace/.dependencies/checkouts/XcodeProjKit/Sources/Sequence+XcodeProjKit.swift /Users/admin/builder/spi-builder-workspace/.dependencies/checkouts/XcodeProjKit/Sources/SourceTree.swift (in target 'XcodeProjKit' from project 'XcodeProjKit')
SwiftCompile normal arm64 /Users/admin/builder/spi-builder-workspace/.dependencies/checkouts/XcodeProjKit/Sources/PBXVariantGroup.swift (in target 'XcodeProjKit' from project 'XcodeProjKit')
    cd /Users/admin/builder/spi-builder-workspace/.swiftpm/xcode

SwiftCompile normal arm64 /Users/admin/builder/spi-builder-workspace/.dependencies/checkouts/XcodeProjKit/Sources/PathType.swift (in target 'XcodeProjKit' from project 'XcodeProjKit')
    cd /Users/admin/builder/spi-builder-workspace/.swiftpm/xcode

SwiftCompile normal arm64 /Users/admin/builder/spi-builder-workspace/.dependencies/checkouts/XcodeProjKit/Sources/Sequence+XcodeProjKit.swift (in target 'XcodeProjKit' from project 'XcodeProjKit')
    cd /Users/admin/builder/spi-builder-workspace/.swiftpm/xcode

SwiftCompile normal arm64 /Users/admin/builder/spi-builder-workspace/.dependencies/checkouts/XcodeProjKit/Sources/SourceTree.swift (in target 'XcodeProjKit' from project 'XcodeProjKit')
    cd /Users/admin/builder/spi-builder-workspace/.swiftpm/xcode

SwiftDriverJobDiscovery normal arm64 Compiling PBXShellScriptBuildPhase.swift, PBXSourcesBuildPhase.swift, PBXTarget.swift, PBXTargetDependency.swift (in target 'XcodeProjKit' from project 'XcodeProjKit')
SwiftDriverJobDiscovery normal arm64 Compiling PBXHeadersBuildPhase.swift, PBXLegacyTarget.swift, PBXNativeTarget.swift, PBXObject.swift, PBXProductType.swift (in target 'XcodeProjKit' from project 'XcodeProjKit')
SwiftDriverJobDiscovery normal arm64 Compiling PBXBuildFile.swift, PBXBuildPhase.swift, PBXBuildStyle.swift, PBXContainer.swift, PBXContainerItem.swift (in target 'XcodeProjKit' from project 'XcodeProjKit')
SwiftDriverJobDiscovery normal arm64 Compiling SourceTreeFolder.swift, String+XcodeProjKit.swift, URL+XcodeProjKit.swift, XCBuildConfiguration.swift (in target 'XcodeProjKit' from project 'XcodeProjKit')
SwiftDriverJobDiscovery normal arm64 Compiling PBXProject.swift, PBXProjectItem.swift, PBXReference.swift, PBXReferenceProxy.swift, PBXResourcesBuildPhase.swift (in target 'XcodeProjKit' from project 'XcodeProjKit')
SwiftExplicitDependencyGeneratePcm arm64 /Users/admin/builder/spi-builder-workspace/.derivedData/ModuleCache.noindex/Darwin-1211SUL4L9Y3S9FIMHXG5U7HH.pcm
SwiftDriverJobDiscovery normal arm64 Compiling PBXContainerItemProxy.swift, PBXCopyFilesBuildPhase.swift, PBXFileReference.swift, PBXFrameworksBuildPhase.swift, PBXGroup.swift (in target 'XcodeProjKit' from project 'XcodeProjKit')
SwiftDriverJobDiscovery normal arm64 Compiling Dictionary+XcodeProjKit.swift, FieldKey.swift, Isa.swift, OpenStepSerializer.swift, PBXAggregateTarget.swift (in target 'XcodeProjKit' from project 'XcodeProjKit')
SwiftExplicitDependencyGeneratePcm arm64 /Users/admin/builder/spi-builder-workspace/.derivedData/ModuleCache.noindex/ObjectiveC-1UIC5AG2ZCLFQ1S2SJZ5E9I8I.pcm
SwiftExplicitDependencyGeneratePcm arm64 /Users/admin/builder/spi-builder-workspace/.derivedData/ModuleCache.noindex/os_object-14HP1DXB4AHZLLZ2VG0XM57OP.pcm
SwiftExplicitDependencyGeneratePcm arm64 /Users/admin/builder/spi-builder-workspace/.derivedData/ModuleCache.noindex/os_workgroup-1TVSUO7YH3KW9W6KS32GSRDVI.pcm
SwiftDriverJobDiscovery normal arm64 Compiling PBXVariantGroup.swift, PathType.swift, Sequence+XcodeProjKit.swift, SourceTree.swift (in target 'XcodeProjKit' from project 'XcodeProjKit')
SwiftDriver\ Compilation XcodeProjKit normal arm64 com.apple.xcode.tools.swift.compiler (in target 'XcodeProjKit' from project 'XcodeProjKit')
    cd /Users/admin/builder/spi-builder-workspace/.swiftpm/xcode
    builtin-Swift-Compilation -- /Applications/Xcode-26.0.0-Beta.app/Contents/Developer/Toolchains/XcodeDefault.xctoolchain/usr/bin/swiftc -module-name XcodeProjKit -Onone -enforce-exclusivity\=checked @/Users/admin/builder/spi-builder-workspace/.derivedData/Build/Intermediates.noindex/XcodeProjKit.build/Debug-xros/XcodeProjKit.build/Objects-normal/arm64/XcodeProjKit.SwiftFileList -DSWIFT_PACKAGE -DDEBUG -DSWIFT_MODULE_RESOURCE_BUNDLE_UNAVAILABLE -DXcode -plugin-path /Applications/Xcode-26.0.0-Beta.app/Contents/Developer/Toolchains/XcodeDefault.xctoolchain/usr/lib/swift/host/plugins/testing -enable-experimental-feature DebugDescriptionMacro -sdk /Applications/Xcode-26.0.0-Beta.app/Contents/Developer/Platforms/XROS.platform/Developer/SDKs/XROS26.0.sdk -target arm64-apple-xros1.0 -g -module-cache-path /Users/admin/builder/spi-builder-workspace/.derivedData/ModuleCache.noindex -Xfrontend -serialize-debugging-options -profile-coverage-mapping -profile-generate -enable-testing -suppress-warnings -index-store-path /Users/admin/builder/spi-builder-workspace/.derivedData/Index.noindex/DataStore -swift-version 4.2 -I /Users/admin/builder/spi-builder-workspace/.derivedData/Build/Products/Debug-xros -I /Applications/Xcode-26.0.0-Beta.app/Contents/Developer/Platforms/XROS.platform/Developer/usr/lib -F /Users/admin/builder/spi-builder-workspace/.derivedData/Build/Products/Debug-xros -F /Applications/Xcode-26.0.0-Beta.app/Contents/Developer/Platforms/XROS.platform/Developer/Library/Frameworks -F /Applications/Xcode-26.0.0-Beta.app/Contents/Developer/Platforms/XROS.platform/Developer/SDKs/XROS26.0.sdk/Developer/Library/Frameworks -c -j10 -enable-batch-mode -incremental -Xcc -ivfsstatcache -Xcc /Users/admin/builder/spi-builder-workspace/.derivedData/SDKStatCaches.noindex/xros26.0-23M5263k-63777232b7fc5220f33897c1cc69dbf5.sdkstatcache -output-file-map /Users/admin/builder/spi-builder-workspace/.derivedData/Build/Intermediates.noindex/XcodeProjKit.build/Debug-xros/XcodeProjKit.build/Objects-normal/arm64/XcodeProjKit-OutputFileMap.json -use-frontend-parseable-output -save-temps -no-color-diagnostics -serialize-diagnostics -emit-dependencies -emit-module -emit-module-path /Users/admin/builder/spi-builder-workspace/.derivedData/Build/Intermediates.noindex/XcodeProjKit.build/Debug-xros/XcodeProjKit.build/Objects-normal/arm64/XcodeProjKit.swiftmodule -validate-clang-modules-once -clang-build-session-file /Users/admin/builder/spi-builder-workspace/.derivedData/ModuleCache.noindex/Session.modulevalidation -Xcc -I/Users/admin/builder/spi-builder-workspace/.derivedData/Build/Intermediates.noindex/XcodeProjKit.build/Debug-xros/XcodeProjKit.build/swift-overrides.hmap -emit-const-values -Xfrontend -const-gather-protocols-file -Xfrontend /Users/admin/builder/spi-builder-workspace/.derivedData/Build/Intermediates.noindex/XcodeProjKit.build/Debug-xros/XcodeProjKit.build/Objects-normal/arm64/XcodeProjKit_const_extract_protocols.json -Xcc -I/Users/admin/builder/spi-builder-workspace/.derivedData/Build/Products/Debug-xros/include -Xcc -I/Users/admin/builder/spi-builder-workspace/.derivedData/Build/Intermediates.noindex/XcodeProjKit.build/Debug-xros/XcodeProjKit.build/DerivedSources-normal/arm64 -Xcc -I/Users/admin/builder/spi-builder-workspace/.derivedData/Build/Intermediates.noindex/XcodeProjKit.build/Debug-xros/XcodeProjKit.build/DerivedSources/arm64 -Xcc -I/Users/admin/builder/spi-builder-workspace/.derivedData/Build/Intermediates.noindex/XcodeProjKit.build/Debug-xros/XcodeProjKit.build/DerivedSources -Xcc -DSWIFT_PACKAGE -Xcc -DDEBUG\=1 -emit-objc-header -emit-objc-header-path /Users/admin/builder/spi-builder-workspace/.derivedData/Build/Intermediates.noindex/XcodeProjKit.build/Debug-xros/XcodeProjKit.build/Objects-normal/arm64/XcodeProjKit-Swift.h -working-directory /Users/admin/builder/spi-builder-workspace/.swiftpm/xcode -experimental-emit-module-separately -disable-cmo
Ld /Users/admin/builder/spi-builder-workspace/.derivedData/Build/Products/Debug-xros/XcodeProjKit.o normal (in target 'XcodeProjKit' from project 'XcodeProjKit')
    cd /Users/admin/builder/spi-builder-workspace/.dependencies/checkouts/XcodeProjKit
    /Applications/Xcode-26.0.0-Beta.app/Contents/Developer/Toolchains/XcodeDefault.xctoolchain/usr/bin/clang -Xlinker -reproducible -target arm64-apple-xros1.0 -r -isysroot /Applications/Xcode-26.0.0-Beta.app/Contents/Developer/Platforms/XROS.platform/Developer/SDKs/XROS26.0.sdk -O0 -w -L/Users/admin/builder/spi-builder-workspace/.derivedData/Build/Intermediates.noindex/EagerLinkingTBDs/Debug-xros -L/Users/admin/builder/spi-builder-workspace/.derivedData/Build/Products/Debug-xros -L/Applications/Xcode-26.0.0-Beta.app/Contents/Developer/Platforms/XROS.platform/Developer/usr/lib -F/Users/admin/builder/spi-builder-workspace/.derivedData/Build/Intermediates.noindex/EagerLinkingTBDs/Debug-xros -F/Users/admin/builder/spi-builder-workspace/.derivedData/Build/Products/Debug-xros -iframework /Applications/Xcode-26.0.0-Beta.app/Contents/Developer/Platforms/XROS.platform/Developer/Library/Frameworks -iframework /Applications/Xcode-26.0.0-Beta.app/Contents/Developer/Platforms/XROS.platform/Developer/SDKs/XROS26.0.sdk/Developer/Library/Frameworks -filelist /Users/admin/builder/spi-builder-workspace/.derivedData/Build/Intermediates.noindex/XcodeProjKit.build/Debug-xros/XcodeProjKit.build/Objects-normal/arm64/XcodeProjKit.LinkFileList -nostdlib -Xlinker -object_path_lto -Xlinker /Users/admin/builder/spi-builder-workspace/.derivedData/Build/Intermediates.noindex/XcodeProjKit.build/Debug-xros/XcodeProjKit.build/Objects-normal/arm64/XcodeProjKit_lto.o -rdynamic -Xlinker -no_deduplicate -Xlinker -debug_variant -Xlinker -dependency_info -Xlinker /Users/admin/builder/spi-builder-workspace/.derivedData/Build/Intermediates.noindex/XcodeProjKit.build/Debug-xros/XcodeProjKit.build/Objects-normal/arm64/XcodeProjKit_dependency_info.dat -fobjc-link-runtime -L/Applications/Xcode-26.0.0-Beta.app/Contents/Developer/Toolchains/XcodeDefault.xctoolchain/usr/lib/swift/xros -L/usr/lib/swift -Xlinker -add_ast_path -Xlinker /Users/admin/builder/spi-builder-workspace/.derivedData/Build/Intermediates.noindex/XcodeProjKit.build/Debug-xros/XcodeProjKit.build/Objects-normal/arm64/XcodeProjKit.swiftmodule @/Users/admin/builder/spi-builder-workspace/.derivedData/Build/Intermediates.noindex/XcodeProjKit.build/Debug-xros/XcodeProjKit.build/Objects-normal/arm64/XcodeProjKit-linker-args.resp -o /Users/admin/builder/spi-builder-workspace/.derivedData/Build/Products/Debug-xros/XcodeProjKit.o
ExtractAppIntentsMetadata (in target 'XcodeProjKit' from project 'XcodeProjKit')
    cd /Users/admin/builder/spi-builder-workspace/.dependencies/checkouts/XcodeProjKit
    /Applications/Xcode-26.0.0-Beta.app/Contents/Developer/Toolchains/XcodeDefault.xctoolchain/usr/bin/appintentsmetadataprocessor --toolchain-dir /Applications/Xcode-26.0.0-Beta.app/Contents/Developer/Toolchains/XcodeDefault.xctoolchain --module-name XcodeProjKit --sdk-root /Applications/Xcode-26.0.0-Beta.app/Contents/Developer/Platforms/XROS.platform/Developer/SDKs/XROS26.0.sdk --xcode-version 17A5241e --platform-family xrOS --deployment-target 1.0 --bundle-identifier xcodeprojkit.XcodeProjKit --output /Users/admin/builder/spi-builder-workspace/.derivedData/Build/Products/Debug-xros/XcodeProjKit.appintents --target-triple arm64-apple-xros1.0 --binary-file /Users/admin/builder/spi-builder-workspace/.derivedData/Build/Products/Debug-xros/XcodeProjKit.o --dependency-file /Users/admin/builder/spi-builder-workspace/.derivedData/Build/Intermediates.noindex/XcodeProjKit.build/Debug-xros/XcodeProjKit.build/Objects-normal/arm64/XcodeProjKit_dependency_info.dat --stringsdata-file /Users/admin/builder/spi-builder-workspace/.derivedData/Build/Intermediates.noindex/XcodeProjKit.build/Debug-xros/XcodeProjKit.build/Objects-normal/arm64/ExtractedAppShortcutsMetadata.stringsdata --source-file-list /Users/admin/builder/spi-builder-workspace/.derivedData/Build/Intermediates.noindex/XcodeProjKit.build/Debug-xros/XcodeProjKit.build/Objects-normal/arm64/XcodeProjKit.SwiftFileList --metadata-file-list /Users/admin/builder/spi-builder-workspace/.derivedData/Build/Intermediates.noindex/XcodeProjKit.build/Debug-xros/XcodeProjKit.build/XcodeProjKit.DependencyMetadataFileList --static-metadata-file-list /Users/admin/builder/spi-builder-workspace/.derivedData/Build/Intermediates.noindex/XcodeProjKit.build/Debug-xros/XcodeProjKit.build/XcodeProjKit.DependencyStaticMetadataFileList --swift-const-vals-list /Users/admin/builder/spi-builder-workspace/.derivedData/Build/Intermediates.noindex/XcodeProjKit.build/Debug-xros/XcodeProjKit.build/Objects-normal/arm64/XcodeProjKit.SwiftConstValuesFileList --force --compile-time-extraction --deployment-aware-processing --validate-assistant-intents --no-app-shortcuts-localization
2025-06-19 03:17:41.541 appintentsmetadataprocessor[1236:6325] Starting appintentsmetadataprocessor export
2025-06-19 03:17:41.606 appintentsmetadataprocessor[1236:6325] Extracted no relevant App Intents symbols, skipping writing output
SwiftExplicitDependencyGeneratePcm arm64 /Users/admin/builder/spi-builder-workspace/.derivedData/ModuleCache.noindex/Dispatch-AA5V45I59GR8Q18J0KTZFB92T.pcm
SwiftExplicitDependencyGeneratePcm arm64 /Users/admin/builder/spi-builder-workspace/.derivedData/ModuleCache.noindex/CoreFoundation-C55Z6VZ589KY8LHRRM3J869RS.pcm
SwiftExplicitDependencyGeneratePcm arm64 /Users/admin/builder/spi-builder-workspace/.derivedData/ModuleCache.noindex/ObjectiveC-2KQQR2KR7ZJBLCZVA2O9YFPBW.pcm
RegisterExecutionPolicyException /Users/admin/builder/spi-builder-workspace/.derivedData/Build/Products/Debug-xros/XcodeProjKit.o (in target 'XcodeProjKit' from project 'XcodeProjKit')
    cd /Users/admin/builder/spi-builder-workspace/.dependencies/checkouts/XcodeProjKit
    builtin-RegisterExecutionPolicyException /Users/admin/builder/spi-builder-workspace/.derivedData/Build/Products/Debug-xros/XcodeProjKit.o
SwiftExplicitDependencyGeneratePcm arm64 /Users/admin/builder/spi-builder-workspace/.derivedData/ModuleCache.noindex/os_object-7VRML360IK2EXX9EP296GGXZN.pcm
SwiftExplicitDependencyGeneratePcm arm64 /Users/admin/builder/spi-builder-workspace/.derivedData/ModuleCache.noindex/CFNetwork-9EX4JLL2HOHSIU45ZL7AEA88A.pcm
SwiftExplicitDependencyGeneratePcm arm64 /Users/admin/builder/spi-builder-workspace/.derivedData/ModuleCache.noindex/Security-8BP09VQ2TO94G5OK8X98USG8N.pcm
SwiftExplicitDependencyGeneratePcm arm64 /Users/admin/builder/spi-builder-workspace/.derivedData/ModuleCache.noindex/os_workgroup-9XK579B98IROQCQTN1LO4UTBQ.pcm
SwiftExplicitDependencyGeneratePcm arm64 /Users/admin/builder/spi-builder-workspace/.derivedData/ModuleCache.noindex/Dispatch-BZ7LJLWUGIBTE63QUO6JSS01D.pcm
SwiftExplicitDependencyGeneratePcm arm64 /Users/admin/builder/spi-builder-workspace/.derivedData/ModuleCache.noindex/Foundation-9ABIQSLNMD9AJ6942NNHN34Z2.pcm
SwiftExplicitDependencyGeneratePcm arm64 /Users/admin/builder/spi-builder-workspace/.derivedData/ModuleCache.noindex/CoreFoundation-56MC6NL2F6FLTYV3ZET2UF0SM.pcm
SwiftExplicitDependencyGeneratePcm arm64 /Users/admin/builder/spi-builder-workspace/.derivedData/ModuleCache.noindex/Security-6VQFYSA5EMUJISVX5RWTWHGEK.pcm
SwiftExplicitDependencyGeneratePcm arm64 /Users/admin/builder/spi-builder-workspace/.derivedData/ModuleCache.noindex/CFNetwork-92KN86L438S5BRD0JD1W89NUQ.pcm
SwiftExplicitDependencyGeneratePcm arm64 /Users/admin/builder/spi-builder-workspace/.derivedData/ModuleCache.noindex/Foundation-CQJSPAXK2947IVHE5YYQMZIW.pcm
SwiftCompile normal arm64 Compiling\ XMLContent.swift,\ XMLElement.swift /Users/admin/builder/spi-builder-workspace/.dependencies/checkouts/SWXMLHash/Source/XMLContent.swift /Users/admin/builder/spi-builder-workspace/.dependencies/checkouts/SWXMLHash/Source/XMLElement.swift (in target 'SWXMLHash' from project 'SWXMLHash')
SwiftCompile normal arm64 /Users/admin/builder/spi-builder-workspace/.dependencies/checkouts/SWXMLHash/Source/XMLContent.swift (in target 'SWXMLHash' from project 'SWXMLHash')
    cd /Users/admin/builder/spi-builder-workspace/.swiftpm/xcode

SwiftCompile normal arm64 /Users/admin/builder/spi-builder-workspace/.dependencies/checkouts/SWXMLHash/Source/XMLElement.swift (in target 'SWXMLHash' from project 'SWXMLHash')
    cd /Users/admin/builder/spi-builder-workspace/.swiftpm/xcode

SwiftCompile normal arm64 Compiling\ TextElement.swift,\ XMLAttribute.swift /Users/admin/builder/spi-builder-workspace/.dependencies/checkouts/SWXMLHash/Source/TextElement.swift /Users/admin/builder/spi-builder-workspace/.dependencies/checkouts/SWXMLHash/Source/XMLAttribute.swift (in target 'SWXMLHash' from project 'SWXMLHash')
SwiftCompile normal arm64 /Users/admin/builder/spi-builder-workspace/.dependencies/checkouts/SWXMLHash/Source/TextElement.swift (in target 'SWXMLHash' from project 'SWXMLHash')
    cd /Users/admin/builder/spi-builder-workspace/.swiftpm/xcode

SwiftCompile normal arm64 /Users/admin/builder/spi-builder-workspace/.dependencies/checkouts/SWXMLHash/Source/XMLAttribute.swift (in target 'SWXMLHash' from project 'SWXMLHash')
    cd /Users/admin/builder/spi-builder-workspace/.swiftpm/xcode

SwiftEmitModule normal arm64 Emitting\ module\ for\ SWXMLHash (in target 'SWXMLHash' from project 'SWXMLHash')
EmitSwiftModule normal arm64 (in target 'SWXMLHash' from project 'SWXMLHash')
    cd /Users/admin/builder/spi-builder-workspace/.swiftpm/xcode

SwiftCompile normal arm64 Compiling\ XMLDeserializationError.swift,\ FullXMLParser.swift,\ IndexOp.swift /Users/admin/builder/spi-builder-workspace/.dependencies/checkouts/SWXMLHash/Source/Errors/XMLDeserializationError.swift /Users/admin/builder/spi-builder-workspace/.dependencies/checkouts/SWXMLHash/Source/FullXMLParser.swift /Users/admin/builder/spi-builder-workspace/.dependencies/checkouts/SWXMLHash/Source/IndexOp.swift (in target 'SWXMLHash' from project 'SWXMLHash')
SwiftCompile normal arm64 /Users/admin/builder/spi-builder-workspace/.dependencies/checkouts/SWXMLHash/Source/Errors/XMLDeserializationError.swift (in target 'SWXMLHash' from project 'SWXMLHash')
    cd /Users/admin/builder/spi-builder-workspace/.swiftpm/xcode

SwiftCompile normal arm64 /Users/admin/builder/spi-builder-workspace/.dependencies/checkouts/SWXMLHash/Source/FullXMLParser.swift (in target 'SWXMLHash' from project 'SWXMLHash')
    cd /Users/admin/builder/spi-builder-workspace/.swiftpm/xcode

SwiftCompile normal arm64 /Users/admin/builder/spi-builder-workspace/.dependencies/checkouts/SWXMLHash/Source/IndexOp.swift (in target 'SWXMLHash' from project 'SWXMLHash')
    cd /Users/admin/builder/spi-builder-workspace/.swiftpm/xcode

SwiftCompile normal arm64 Compiling\ XMLIndexer.swift,\ shim.swift /Users/admin/builder/spi-builder-workspace/.dependencies/checkouts/SWXMLHash/Source/XMLIndexer.swift /Users/admin/builder/spi-builder-workspace/.dependencies/checkouts/SWXMLHash/Source/shim.swift (in target 'SWXMLHash' from project 'SWXMLHash')
SwiftCompile normal arm64 /Users/admin/builder/spi-builder-workspace/.dependencies/checkouts/SWXMLHash/Source/XMLIndexer.swift (in target 'SWXMLHash' from project 'SWXMLHash')
    cd /Users/admin/builder/spi-builder-workspace/.swiftpm/xcode

SwiftCompile normal arm64 /Users/admin/builder/spi-builder-workspace/.dependencies/checkouts/SWXMLHash/Source/shim.swift (in target 'SWXMLHash' from project 'SWXMLHash')
    cd /Users/admin/builder/spi-builder-workspace/.swiftpm/xcode

SwiftCompile normal arm64 Compiling\ XMLHash.swift,\ XMLHashOptions.swift /Users/admin/builder/spi-builder-workspace/.dependencies/checkouts/SWXMLHash/Source/XMLHash.swift /Users/admin/builder/spi-builder-workspace/.dependencies/checkouts/SWXMLHash/Source/XMLHashOptions.swift (in target 'SWXMLHash' from project 'SWXMLHash')
SwiftCompile normal arm64 /Users/admin/builder/spi-builder-workspace/.dependencies/checkouts/SWXMLHash/Source/XMLHash.swift (in target 'SWXMLHash' from project 'SWXMLHash')
    cd /Users/admin/builder/spi-builder-workspace/.swiftpm/xcode

SwiftCompile normal arm64 /Users/admin/builder/spi-builder-workspace/.dependencies/checkouts/SWXMLHash/Source/XMLHashOptions.swift (in target 'SWXMLHash' from project 'SWXMLHash')
    cd /Users/admin/builder/spi-builder-workspace/.swiftpm/xcode

SwiftEmitModule normal arm64 Emitting\ module\ for\ Commandant (in target 'Commandant' from project 'Commandant')
EmitSwiftModule normal arm64 (in target 'Commandant' from project 'Commandant')
    cd /Users/admin/builder/spi-builder-workspace/.swiftpm/xcode

SwiftCompile normal arm64 Compiling\ String+XMLDeserialization.swift,\ IndexingError.swift,\ ParsingError.swift /Users/admin/builder/spi-builder-workspace/.dependencies/checkouts/SWXMLHash/Source/DeserializationTypes/String+XMLDeserialization.swift /Users/admin/builder/spi-builder-workspace/.dependencies/checkouts/SWXMLHash/Source/Errors/IndexingError.swift /Users/admin/builder/spi-builder-workspace/.dependencies/checkouts/SWXMLHash/Source/Errors/ParsingError.swift (in target 'SWXMLHash' from project 'SWXMLHash')
SwiftCompile normal arm64 /Users/admin/builder/spi-builder-workspace/.dependencies/checkouts/SWXMLHash/Source/DeserializationTypes/String+XMLDeserialization.swift (in target 'SWXMLHash' from project 'SWXMLHash')
    cd /Users/admin/builder/spi-builder-workspace/.swiftpm/xcode

SwiftCompile normal arm64 /Users/admin/builder/spi-builder-workspace/.dependencies/checkouts/SWXMLHash/Source/Errors/IndexingError.swift (in target 'SWXMLHash' from project 'SWXMLHash')
    cd /Users/admin/builder/spi-builder-workspace/.swiftpm/xcode

SwiftCompile normal arm64 /Users/admin/builder/spi-builder-workspace/.dependencies/checkouts/SWXMLHash/Source/Errors/ParsingError.swift (in target 'SWXMLHash' from project 'SWXMLHash')
    cd /Users/admin/builder/spi-builder-workspace/.swiftpm/xcode

SwiftCompile normal arm64 Compiling\ LazyXMLParser.swift,\ Stack.swift,\ String+Extensions.swift /Users/admin/builder/spi-builder-workspace/.dependencies/checkouts/SWXMLHash/Source/LazyXMLParser.swift /Users/admin/builder/spi-builder-workspace/.dependencies/checkouts/SWXMLHash/Source/Stack.swift /Users/admin/builder/spi-builder-workspace/.dependencies/checkouts/SWXMLHash/Source/String+Extensions.swift (in target 'SWXMLHash' from project 'SWXMLHash')
SwiftCompile normal arm64 /Users/admin/builder/spi-builder-workspace/.dependencies/checkouts/SWXMLHash/Source/LazyXMLParser.swift (in target 'SWXMLHash' from project 'SWXMLHash')
    cd /Users/admin/builder/spi-builder-workspace/.swiftpm/xcode

SwiftCompile normal arm64 /Users/admin/builder/spi-builder-workspace/.dependencies/checkouts/SWXMLHash/Source/Stack.swift (in target 'SWXMLHash' from project 'SWXMLHash')
    cd /Users/admin/builder/spi-builder-workspace/.swiftpm/xcode

SwiftCompile normal arm64 /Users/admin/builder/spi-builder-workspace/.dependencies/checkouts/SWXMLHash/Source/String+Extensions.swift (in target 'SWXMLHash' from project 'SWXMLHash')
    cd /Users/admin/builder/spi-builder-workspace/.swiftpm/xcode

SwiftCompile normal arm64 Compiling\ Double+XMLDeserialization.swift,\ Float+XMLDeserialization.swift,\ Int+XMLDeserialization.swift /Users/admin/builder/spi-builder-workspace/.dependencies/checkouts/SWXMLHash/Source/DeserializationTypes/Double+XMLDeserialization.swift /Users/admin/builder/spi-builder-workspace/.dependencies/checkouts/SWXMLHash/Source/DeserializationTypes/Float+XMLDeserialization.swift /Users/admin/builder/spi-builder-workspace/.dependencies/checkouts/SWXMLHash/Source/DeserializationTypes/Int+XMLDeserialization.swift (in target 'SWXMLHash' from project 'SWXMLHash')
SwiftCompile normal arm64 /Users/admin/builder/spi-builder-workspace/.dependencies/checkouts/SWXMLHash/Source/DeserializationTypes/Double+XMLDeserialization.swift (in target 'SWXMLHash' from project 'SWXMLHash')
    cd /Users/admin/builder/spi-builder-workspace/.swiftpm/xcode

SwiftCompile normal arm64 /Users/admin/builder/spi-builder-workspace/.dependencies/checkouts/SWXMLHash/Source/DeserializationTypes/Float+XMLDeserialization.swift (in target 'SWXMLHash' from project 'SWXMLHash')
    cd /Users/admin/builder/spi-builder-workspace/.swiftpm/xcode

SwiftCompile normal arm64 /Users/admin/builder/spi-builder-workspace/.dependencies/checkouts/SWXMLHash/Source/DeserializationTypes/Int+XMLDeserialization.swift (in target 'SWXMLHash' from project 'SWXMLHash')
    cd /Users/admin/builder/spi-builder-workspace/.swiftpm/xcode

SwiftDriverJobDiscovery normal arm64 Emitting module for Commandant (in target 'Commandant' from project 'Commandant')
SwiftDriver\ Compilation\ Requirements Commandant normal arm64 com.apple.xcode.tools.swift.compiler (in target 'Commandant' from project 'Commandant')
    cd /Users/admin/builder/spi-builder-workspace/.swiftpm/xcode
    builtin-Swift-Compilation-Requirements -- /Applications/Xcode-26.0.0-Beta.app/Contents/Developer/Toolchains/XcodeDefault.xctoolchain/usr/bin/swiftc -module-name Commandant -Onone -enforce-exclusivity\=checked @/Users/admin/builder/spi-builder-workspace/.derivedData/Build/Intermediates.noindex/Commandant.build/Debug-xros/Commandant.build/Objects-normal/arm64/Commandant.SwiftFileList -DSWIFT_PACKAGE -DDEBUG -DSWIFT_MODULE_RESOURCE_BUNDLE_UNAVAILABLE -DXcode -plugin-path /Applications/Xcode-26.0.0-Beta.app/Contents/Developer/Toolchains/XcodeDefault.xctoolchain/usr/lib/swift/host/plugins/testing -enable-experimental-feature DebugDescriptionMacro -sdk /Applications/Xcode-26.0.0-Beta.app/Contents/Developer/Platforms/XROS.platform/Developer/SDKs/XROS26.0.sdk -target arm64-apple-xros1.0 -g -module-cache-path /Users/admin/builder/spi-builder-workspace/.derivedData/ModuleCache.noindex -Xfrontend -serialize-debugging-options -profile-coverage-mapping -profile-generate -enable-testing -suppress-warnings -index-store-path /Users/admin/builder/spi-builder-workspace/.derivedData/Index.noindex/DataStore -swift-version 5 -I /Users/admin/builder/spi-builder-workspace/.derivedData/Build/Products/Debug-xros -I /Applications/Xcode-26.0.0-Beta.app/Contents/Developer/Platforms/XROS.platform/Developer/usr/lib -F /Users/admin/builder/spi-builder-workspace/.derivedData/Build/Products/Debug-xros -F /Applications/Xcode-26.0.0-Beta.app/Contents/Developer/Platforms/XROS.platform/Developer/Library/Frameworks -F /Applications/Xcode-26.0.0-Beta.app/Contents/Developer/Platforms/XROS.platform/Developer/SDKs/XROS26.0.sdk/Developer/Library/Frameworks -c -j10 -enable-batch-mode -incremental -Xcc -ivfsstatcache -Xcc /Users/admin/builder/spi-builder-workspace/.derivedData/SDKStatCaches.noindex/xros26.0-23M5263k-63777232b7fc5220f33897c1cc69dbf5.sdkstatcache -output-file-map /Users/admin/builder/spi-builder-workspace/.derivedData/Build/Intermediates.noindex/Commandant.build/Debug-xros/Commandant.build/Objects-normal/arm64/Commandant-OutputFileMap.json -use-frontend-parseable-output -save-temps -no-color-diagnostics -explicit-module-build -module-cache-path /Users/admin/builder/spi-builder-workspace/.derivedData/Build/Intermediates.noindex/SwiftExplicitPrecompiledModules -clang-scanner-module-cache-path /Users/admin/builder/spi-builder-workspace/.derivedData/ModuleCache.noindex -sdk-module-cache-path /Users/admin/builder/spi-builder-workspace/.derivedData/ModuleCache.noindex -serialize-diagnostics -emit-dependencies -emit-module -emit-module-path /Users/admin/builder/spi-builder-workspace/.derivedData/Build/Intermediates.noindex/Commandant.build/Debug-xros/Commandant.build/Objects-normal/arm64/Commandant.swiftmodule -validate-clang-modules-once -clang-build-session-file /Users/admin/builder/spi-builder-workspace/.derivedData/ModuleCache.noindex/Session.modulevalidation -Xcc -I/Users/admin/builder/spi-builder-workspace/.derivedData/Build/Intermediates.noindex/Commandant.build/Debug-xros/Commandant.build/swift-overrides.hmap -emit-const-values -Xfrontend -const-gather-protocols-file -Xfrontend /Users/admin/builder/spi-builder-workspace/.derivedData/Build/Intermediates.noindex/Commandant.build/Debug-xros/Commandant.build/Objects-normal/arm64/Commandant_const_extract_protocols.json -Xcc -I/Users/admin/builder/spi-builder-workspace/.derivedData/Build/Products/Debug-xros/include -Xcc -I/Users/admin/builder/spi-builder-workspace/.derivedData/Build/Intermediates.noindex/Commandant.build/Debug-xros/Commandant.build/DerivedSources-normal/arm64 -Xcc -I/Users/admin/builder/spi-builder-workspace/.derivedData/Build/Intermediates.noindex/Commandant.build/Debug-xros/Commandant.build/DerivedSources/arm64 -Xcc -I/Users/admin/builder/spi-builder-workspace/.derivedData/Build/Intermediates.noindex/Commandant.build/Debug-xros/Commandant.build/DerivedSources -Xcc -DSWIFT_PACKAGE -Xcc -DDEBUG\=1 -emit-objc-header -emit-objc-header-path /Users/admin/builder/spi-builder-workspace/.derivedData/Build/Intermediates.noindex/Commandant.build/Debug-xros/Commandant.build/Objects-normal/arm64/Commandant-Swift.h -working-directory /Users/admin/builder/spi-builder-workspace/.swiftpm/xcode -experimental-emit-module-separately -disable-cmo
SwiftDriverJobDiscovery normal arm64 Emitting module for SWXMLHash (in target 'SWXMLHash' from project 'SWXMLHash')
SwiftCompile normal arm64 Compiling\ XMLAttributeDeserializable.swift,\ XMLElementDeserializable.swift,\ XMLIndexer+XMLDeserialization.swift /Users/admin/builder/spi-builder-workspace/.dependencies/checkouts/SWXMLHash/Source/Deserialization/XMLAttributeDeserializable.swift /Users/admin/builder/spi-builder-workspace/.dependencies/checkouts/SWXMLHash/Source/Deserialization/XMLElementDeserializable.swift /Users/admin/builder/spi-builder-workspace/.dependencies/checkouts/SWXMLHash/Source/Deserialization/XMLIndexer+XMLDeserialization.swift (in target 'SWXMLHash' from project 'SWXMLHash')
SwiftCompile normal arm64 /Users/admin/builder/spi-builder-workspace/.dependencies/checkouts/SWXMLHash/Source/Deserialization/XMLAttributeDeserializable.swift (in target 'SWXMLHash' from project 'SWXMLHash')
    cd /Users/admin/builder/spi-builder-workspace/.swiftpm/xcode

SwiftCompile normal arm64 /Users/admin/builder/spi-builder-workspace/.dependencies/checkouts/SWXMLHash/Source/Deserialization/XMLElementDeserializable.swift (in target 'SWXMLHash' from project 'SWXMLHash')
    cd /Users/admin/builder/spi-builder-workspace/.swiftpm/xcode

SwiftCompile normal arm64 /Users/admin/builder/spi-builder-workspace/.dependencies/checkouts/SWXMLHash/Source/Deserialization/XMLIndexer+XMLDeserialization.swift (in target 'SWXMLHash' from project 'SWXMLHash')
    cd /Users/admin/builder/spi-builder-workspace/.swiftpm/xcode

SwiftDriver\ Compilation\ Requirements SWXMLHash normal arm64 com.apple.xcode.tools.swift.compiler (in target 'SWXMLHash' from project 'SWXMLHash')
    cd /Users/admin/builder/spi-builder-workspace/.swiftpm/xcode
    builtin-Swift-Compilation-Requirements -- /Applications/Xcode-26.0.0-Beta.app/Contents/Developer/Toolchains/XcodeDefault.xctoolchain/usr/bin/swiftc -module-name SWXMLHash -Onone -enforce-exclusivity\=checked @/Users/admin/builder/spi-builder-workspace/.derivedData/Build/Intermediates.noindex/SWXMLHash.build/Debug-xros/SWXMLHash.build/Objects-normal/arm64/SWXMLHash.SwiftFileList -DSWIFT_PACKAGE -DDEBUG -DSWIFT_MODULE_RESOURCE_BUNDLE_UNAVAILABLE -DXcode -plugin-path /Applications/Xcode-26.0.0-Beta.app/Contents/Developer/Toolchains/XcodeDefault.xctoolchain/usr/lib/swift/host/plugins/testing -enable-experimental-feature DebugDescriptionMacro -sdk /Applications/Xcode-26.0.0-Beta.app/Contents/Developer/Platforms/XROS.platform/Developer/SDKs/XROS26.0.sdk -target arm64-apple-xros1.0 -g -module-cache-path /Users/admin/builder/spi-builder-workspace/.derivedData/ModuleCache.noindex -Xfrontend -serialize-debugging-options -profile-coverage-mapping -profile-generate -enable-testing -suppress-warnings -index-store-path /Users/admin/builder/spi-builder-workspace/.derivedData/Index.noindex/DataStore -swift-version 5 -I /Users/admin/builder/spi-builder-workspace/.derivedData/Build/Products/Debug-xros -I /Applications/Xcode-26.0.0-Beta.app/Contents/Developer/Platforms/XROS.platform/Developer/usr/lib -F /Users/admin/builder/spi-builder-workspace/.derivedData/Build/Products/Debug-xros -F /Applications/Xcode-26.0.0-Beta.app/Contents/Developer/Platforms/XROS.platform/Developer/Library/Frameworks -F /Applications/Xcode-26.0.0-Beta.app/Contents/Developer/Platforms/XROS.platform/Developer/SDKs/XROS26.0.sdk/Developer/Library/Frameworks -c -j10 -enable-batch-mode -incremental -Xcc -ivfsstatcache -Xcc /Users/admin/builder/spi-builder-workspace/.derivedData/SDKStatCaches.noindex/xros26.0-23M5263k-63777232b7fc5220f33897c1cc69dbf5.sdkstatcache -output-file-map /Users/admin/builder/spi-builder-workspace/.derivedData/Build/Intermediates.noindex/SWXMLHash.build/Debug-xros/SWXMLHash.build/Objects-normal/arm64/SWXMLHash-OutputFileMap.json -use-frontend-parseable-output -save-temps -no-color-diagnostics -explicit-module-build -module-cache-path /Users/admin/builder/spi-builder-workspace/.derivedData/Build/Intermediates.noindex/SwiftExplicitPrecompiledModules -clang-scanner-module-cache-path /Users/admin/builder/spi-builder-workspace/.derivedData/ModuleCache.noindex -sdk-module-cache-path /Users/admin/builder/spi-builder-workspace/.derivedData/ModuleCache.noindex -serialize-diagnostics -emit-dependencies -emit-module -emit-module-path /Users/admin/builder/spi-builder-workspace/.derivedData/Build/Intermediates.noindex/SWXMLHash.build/Debug-xros/SWXMLHash.build/Objects-normal/arm64/SWXMLHash.swiftmodule -validate-clang-modules-once -clang-build-session-file /Users/admin/builder/spi-builder-workspace/.derivedData/ModuleCache.noindex/Session.modulevalidation -Xcc -I/Users/admin/builder/spi-builder-workspace/.derivedData/Build/Intermediates.noindex/SWXMLHash.build/Debug-xros/SWXMLHash.build/swift-overrides.hmap -emit-const-values -Xfrontend -const-gather-protocols-file -Xfrontend /Users/admin/builder/spi-builder-workspace/.derivedData/Build/Intermediates.noindex/SWXMLHash.build/Debug-xros/SWXMLHash.build/Objects-normal/arm64/SWXMLHash_const_extract_protocols.json -Xcc -I/Users/admin/builder/spi-builder-workspace/.derivedData/Build/Products/Debug-xros/include -Xcc -I/Users/admin/builder/spi-builder-workspace/.derivedData/Build/Intermediates.noindex/SWXMLHash.build/Debug-xros/SWXMLHash.build/DerivedSources-normal/arm64 -Xcc -I/Users/admin/builder/spi-builder-workspace/.derivedData/Build/Intermediates.noindex/SWXMLHash.build/Debug-xros/SWXMLHash.build/DerivedSources/arm64 -Xcc -I/Users/admin/builder/spi-builder-workspace/.derivedData/Build/Intermediates.noindex/SWXMLHash.build/Debug-xros/SWXMLHash.build/DerivedSources -Xcc -DSWIFT_PACKAGE -Xcc -DDEBUG\=1 -emit-objc-header -emit-objc-header-path /Users/admin/builder/spi-builder-workspace/.derivedData/Build/Intermediates.noindex/SWXMLHash.build/Debug-xros/SWXMLHash.build/Objects-normal/arm64/SWXMLHash-Swift.h -working-directory /Users/admin/builder/spi-builder-workspace/.swiftpm/xcode -experimental-emit-module-separately -disable-cmo
SwiftDriverJobDiscovery normal arm64 Compiling TextElement.swift, XMLAttribute.swift (in target 'SWXMLHash' from project 'SWXMLHash')
SwiftMergeGeneratedHeaders /Users/admin/builder/spi-builder-workspace/.derivedData/Build/Intermediates.noindex/GeneratedModuleMaps-xros/Commandant-Swift.h /Users/admin/builder/spi-builder-workspace/.derivedData/Build/Intermediates.noindex/Commandant.build/Debug-xros/Commandant.build/Objects-normal/arm64/Commandant-Swift.h (in target 'Commandant' from project 'Commandant')
    cd /Users/admin/builder/spi-builder-workspace/.dependencies/checkouts/Commandant
    builtin-swiftHeaderTool -arch arm64 /Users/admin/builder/spi-builder-workspace/.derivedData/Build/Intermediates.noindex/Commandant.build/Debug-xros/Commandant.build/Objects-normal/arm64/Commandant-Swift.h -o /Users/admin/builder/spi-builder-workspace/.derivedData/Build/Intermediates.noindex/GeneratedModuleMaps-xros/Commandant-Swift.h
SwiftMergeGeneratedHeaders /Users/admin/builder/spi-builder-workspace/.derivedData/Build/Intermediates.noindex/GeneratedModuleMaps-xros/SWXMLHash-Swift.h /Users/admin/builder/spi-builder-workspace/.derivedData/Build/Intermediates.noindex/SWXMLHash.build/Debug-xros/SWXMLHash.build/Objects-normal/arm64/SWXMLHash-Swift.h (in target 'SWXMLHash' from project 'SWXMLHash')
    cd /Users/admin/builder/spi-builder-workspace/.dependencies/checkouts/SWXMLHash
    builtin-swiftHeaderTool -arch arm64 /Users/admin/builder/spi-builder-workspace/.derivedData/Build/Intermediates.noindex/SWXMLHash.build/Debug-xros/SWXMLHash.build/Objects-normal/arm64/SWXMLHash-Swift.h -o /Users/admin/builder/spi-builder-workspace/.derivedData/Build/Intermediates.noindex/GeneratedModuleMaps-xros/SWXMLHash-Swift.h
Copy /Users/admin/builder/spi-builder-workspace/.derivedData/Build/Products/Debug-xros/SWXMLHash.swiftmodule/arm64-apple-xros.swiftmodule /Users/admin/builder/spi-builder-workspace/.derivedData/Build/Intermediates.noindex/SWXMLHash.build/Debug-xros/SWXMLHash.build/Objects-normal/arm64/SWXMLHash.swiftmodule (in target 'SWXMLHash' from project 'SWXMLHash')
    cd /Users/admin/builder/spi-builder-workspace/.dependencies/checkouts/SWXMLHash
    builtin-copy -exclude .DS_Store -exclude CVS -exclude .svn -exclude .git -exclude .hg -resolve-src-symlinks -rename /Users/admin/builder/spi-builder-workspace/.derivedData/Build/Intermediates.noindex/SWXMLHash.build/Debug-xros/SWXMLHash.build/Objects-normal/arm64/SWXMLHash.swiftmodule /Users/admin/builder/spi-builder-workspace/.derivedData/Build/Products/Debug-xros/SWXMLHash.swiftmodule/arm64-apple-xros.swiftmodule
Copy /Users/admin/builder/spi-builder-workspace/.derivedData/Build/Products/Debug-xros/SWXMLHash.swiftmodule/arm64-apple-xros.swiftdoc /Users/admin/builder/spi-builder-workspace/.derivedData/Build/Intermediates.noindex/SWXMLHash.build/Debug-xros/SWXMLHash.build/Objects-normal/arm64/SWXMLHash.swiftdoc (in target 'SWXMLHash' from project 'SWXMLHash')
    cd /Users/admin/builder/spi-builder-workspace/.dependencies/checkouts/SWXMLHash
    builtin-copy -exclude .DS_Store -exclude CVS -exclude .svn -exclude .git -exclude .hg -resolve-src-symlinks -rename /Users/admin/builder/spi-builder-workspace/.derivedData/Build/Intermediates.noindex/SWXMLHash.build/Debug-xros/SWXMLHash.build/Objects-normal/arm64/SWXMLHash.swiftdoc /Users/admin/builder/spi-builder-workspace/.derivedData/Build/Products/Debug-xros/SWXMLHash.swiftmodule/arm64-apple-xros.swiftdoc
Copy /Users/admin/builder/spi-builder-workspace/.derivedData/Build/Products/Debug-xros/SWXMLHash.swiftmodule/arm64-apple-xros.abi.json /Users/admin/builder/spi-builder-workspace/.derivedData/Build/Intermediates.noindex/SWXMLHash.build/Debug-xros/SWXMLHash.build/Objects-normal/arm64/SWXMLHash.abi.json (in target 'SWXMLHash' from project 'SWXMLHash')
    cd /Users/admin/builder/spi-builder-workspace/.dependencies/checkouts/SWXMLHash
    builtin-copy -exclude .DS_Store -exclude CVS -exclude .svn -exclude .git -exclude .hg -resolve-src-symlinks -rename /Users/admin/builder/spi-builder-workspace/.derivedData/Build/Intermediates.noindex/SWXMLHash.build/Debug-xros/SWXMLHash.build/Objects-normal/arm64/SWXMLHash.abi.json /Users/admin/builder/spi-builder-workspace/.derivedData/Build/Products/Debug-xros/SWXMLHash.swiftmodule/arm64-apple-xros.abi.json
Copy /Users/admin/builder/spi-builder-workspace/.derivedData/Build/Products/Debug-xros/SWXMLHash.swiftmodule/Project/arm64-apple-xros.swiftsourceinfo /Users/admin/builder/spi-builder-workspace/.derivedData/Build/Intermediates.noindex/SWXMLHash.build/Debug-xros/SWXMLHash.build/Objects-normal/arm64/SWXMLHash.swiftsourceinfo (in target 'SWXMLHash' from project 'SWXMLHash')
    cd /Users/admin/builder/spi-builder-workspace/.dependencies/checkouts/SWXMLHash
    builtin-copy -exclude .DS_Store -exclude CVS -exclude .svn -exclude .git -exclude .hg -resolve-src-symlinks -rename /Users/admin/builder/spi-builder-workspace/.derivedData/Build/Intermediates.noindex/SWXMLHash.build/Debug-xros/SWXMLHash.build/Objects-normal/arm64/SWXMLHash.swiftsourceinfo /Users/admin/builder/spi-builder-workspace/.derivedData/Build/Products/Debug-xros/SWXMLHash.swiftmodule/Project/arm64-apple-xros.swiftsourceinfo
SwiftDriverJobDiscovery normal arm64 Compiling String+XMLDeserialization.swift, IndexingError.swift, ParsingError.swift (in target 'SWXMLHash' from project 'SWXMLHash')
Copy /Users/admin/builder/spi-builder-workspace/.derivedData/Build/Products/Debug-xros/Commandant.swiftmodule/arm64-apple-xros.swiftmodule /Users/admin/builder/spi-builder-workspace/.derivedData/Build/Intermediates.noindex/Commandant.build/Debug-xros/Commandant.build/Objects-normal/arm64/Commandant.swiftmodule (in target 'Commandant' from project 'Commandant')
    cd /Users/admin/builder/spi-builder-workspace/.dependencies/checkouts/Commandant
    builtin-copy -exclude .DS_Store -exclude CVS -exclude .svn -exclude .git -exclude .hg -resolve-src-symlinks -rename /Users/admin/builder/spi-builder-workspace/.derivedData/Build/Intermediates.noindex/Commandant.build/Debug-xros/Commandant.build/Objects-normal/arm64/Commandant.swiftmodule /Users/admin/builder/spi-builder-workspace/.derivedData/Build/Products/Debug-xros/Commandant.swiftmodule/arm64-apple-xros.swiftmodule
Copy /Users/admin/builder/spi-builder-workspace/.derivedData/Build/Products/Debug-xros/Commandant.swiftmodule/arm64-apple-xros.swiftdoc /Users/admin/builder/spi-builder-workspace/.derivedData/Build/Intermediates.noindex/Commandant.build/Debug-xros/Commandant.build/Objects-normal/arm64/Commandant.swiftdoc (in target 'Commandant' from project 'Commandant')
    cd /Users/admin/builder/spi-builder-workspace/.dependencies/checkouts/Commandant
    builtin-copy -exclude .DS_Store -exclude CVS -exclude .svn -exclude .git -exclude .hg -resolve-src-symlinks -rename /Users/admin/builder/spi-builder-workspace/.derivedData/Build/Intermediates.noindex/Commandant.build/Debug-xros/Commandant.build/Objects-normal/arm64/Commandant.swiftdoc /Users/admin/builder/spi-builder-workspace/.derivedData/Build/Products/Debug-xros/Commandant.swiftmodule/arm64-apple-xros.swiftdoc
Copy /Users/admin/builder/spi-builder-workspace/.derivedData/Build/Products/Debug-xros/Commandant.swiftmodule/arm64-apple-xros.abi.json /Users/admin/builder/spi-builder-workspace/.derivedData/Build/Intermediates.noindex/Commandant.build/Debug-xros/Commandant.build/Objects-normal/arm64/Commandant.abi.json (in target 'Commandant' from project 'Commandant')
    cd /Users/admin/builder/spi-builder-workspace/.dependencies/checkouts/Commandant
    builtin-copy -exclude .DS_Store -exclude CVS -exclude .svn -exclude .git -exclude .hg -resolve-src-symlinks -rename /Users/admin/builder/spi-builder-workspace/.derivedData/Build/Intermediates.noindex/Commandant.build/Debug-xros/Commandant.build/Objects-normal/arm64/Commandant.abi.json /Users/admin/builder/spi-builder-workspace/.derivedData/Build/Products/Debug-xros/Commandant.swiftmodule/arm64-apple-xros.abi.json
Copy /Users/admin/builder/spi-builder-workspace/.derivedData/Build/Products/Debug-xros/Commandant.swiftmodule/Project/arm64-apple-xros.swiftsourceinfo /Users/admin/builder/spi-builder-workspace/.derivedData/Build/Intermediates.noindex/Commandant.build/Debug-xros/Commandant.build/Objects-normal/arm64/Commandant.swiftsourceinfo (in target 'Commandant' from project 'Commandant')
    cd /Users/admin/builder/spi-builder-workspace/.dependencies/checkouts/Commandant
    builtin-copy -exclude .DS_Store -exclude CVS -exclude .svn -exclude .git -exclude .hg -resolve-src-symlinks -rename /Users/admin/builder/spi-builder-workspace/.derivedData/Build/Intermediates.noindex/Commandant.build/Debug-xros/Commandant.build/Objects-normal/arm64/Commandant.swiftsourceinfo /Users/admin/builder/spi-builder-workspace/.derivedData/Build/Products/Debug-xros/Commandant.swiftmodule/Project/arm64-apple-xros.swiftsourceinfo
SwiftCompile normal arm64 Compiling\ XMLObjectDeserialization.swift,\ XMLValueDeserialization.swift,\ Bool+XMLDeserialization.swift /Users/admin/builder/spi-builder-workspace/.dependencies/checkouts/SWXMLHash/Source/Deserialization/XMLObjectDeserialization.swift /Users/admin/builder/spi-builder-workspace/.dependencies/checkouts/SWXMLHash/Source/Deserialization/XMLValueDeserialization.swift /Users/admin/builder/spi-builder-workspace/.dependencies/checkouts/SWXMLHash/Source/DeserializationTypes/Bool+XMLDeserialization.swift (in target 'SWXMLHash' from project 'SWXMLHash')
SwiftCompile normal arm64 /Users/admin/builder/spi-builder-workspace/.dependencies/checkouts/SWXMLHash/Source/Deserialization/XMLObjectDeserialization.swift (in target 'SWXMLHash' from project 'SWXMLHash')
    cd /Users/admin/builder/spi-builder-workspace/.swiftpm/xcode

SwiftCompile normal arm64 /Users/admin/builder/spi-builder-workspace/.dependencies/checkouts/SWXMLHash/Source/Deserialization/XMLValueDeserialization.swift (in target 'SWXMLHash' from project 'SWXMLHash')
    cd /Users/admin/builder/spi-builder-workspace/.swiftpm/xcode

SwiftCompile normal arm64 /Users/admin/builder/spi-builder-workspace/.dependencies/checkouts/SWXMLHash/Source/DeserializationTypes/Bool+XMLDeserialization.swift (in target 'SWXMLHash' from project 'SWXMLHash')
    cd /Users/admin/builder/spi-builder-workspace/.swiftpm/xcode

SwiftCompile normal arm64 Compiling\ Command.swift /Users/admin/builder/spi-builder-workspace/.dependencies/checkouts/Commandant/Sources/Commandant/Command.swift (in target 'Commandant' from project 'Commandant')
Failed frontend command:
/Applications/Xcode-26.0.0-Beta.app/Contents/Developer/Toolchains/XcodeDefault.xctoolchain/usr/bin/swift-frontend -frontend -c /Users/admin/builder/spi-builder-workspace/.dependencies/checkouts/Commandant/Sources/Commandant/Argument.swift /Users/admin/builder/spi-builder-workspace/.dependencies/checkouts/Commandant/Sources/Commandant/ArgumentParser.swift /Users/admin/builder/spi-builder-workspace/.dependencies/checkouts/Commandant/Sources/Commandant/ArgumentProtocol.swift -primary-file /Users/admin/builder/spi-builder-workspace/.dependencies/checkouts/Commandant/Sources/Commandant/Command.swift /Users/admin/builder/spi-builder-workspace/.dependencies/checkouts/Commandant/Sources/Commandant/Errors.swift /Users/admin/builder/spi-builder-workspace/.dependencies/checkouts/Commandant/Sources/Commandant/HelpCommand.swift /Users/admin/builder/spi-builder-workspace/.dependencies/checkouts/Commandant/Sources/Commandant/Option.swift /Users/admin/builder/spi-builder-workspace/.dependencies/checkouts/Commandant/Sources/Commandant/OrderedSet.swift /Users/admin/builder/spi-builder-workspace/.dependencies/checkouts/Commandant/Sources/Commandant/Result+Additions.swift /Users/admin/builder/spi-builder-workspace/.dependencies/checkouts/Commandant/Sources/Commandant/Switch.swift -emit-dependencies-path /Users/admin/builder/spi-builder-workspace/.derivedData/Build/Intermediates.noindex/Commandant.build/Debug-xros/Commandant.build/Objects-normal/arm64/Command.d -emit-const-values-path /Users/admin/builder/spi-builder-workspace/.derivedData/Build/Intermediates.noindex/Commandant.build/Debug-xros/Commandant.build/Objects-normal/arm64/Command.swiftconstvalues -emit-reference-dependencies-path /Users/admin/builder/spi-builder-workspace/.derivedData/Build/Intermediates.noindex/Commandant.build/Debug-xros/Commandant.build/Objects-normal/arm64/Command.swiftdeps -serialize-diagnostics-path /Users/admin/builder/spi-builder-workspace/.derivedData/Build/Intermediates.noindex/Commandant.build/Debug-xros/Commandant.build/Objects-normal/arm64/Command.dia -target arm64-apple-xros1.0 -module-can-import-version Darwin 346 0 -load-resolved-plugin /Applications/Xcode-26.0.0-Beta.app/Contents/Developer/Platforms/XROS.platform/Developer/usr/lib/swift/host/plugins/libFoundationMacros.dylib\#/Applications/Xcode-26.0.0-Beta.app/Contents/Developer/Platforms/XROS.platform/Developer/usr/bin/swift-plugin-server\#FoundationMacros -load-resolved-plugin /Applications/Xcode-26.0.0-Beta.app/Contents/Developer/Platforms/XROS.platform/Developer/usr/lib/swift/host/plugins/libObservationMacros.dylib\#/Applications/Xcode-26.0.0-Beta.app/Contents/Developer/Platforms/XROS.platform/Developer/usr/bin/swift-plugin-server\#ObservationMacros -load-resolved-plugin /Applications/Xcode-26.0.0-Beta.app/Contents/Developer/Platforms/XROS.platform/Developer/usr/lib/swift/host/plugins/libSwiftMacros.dylib\#/Applications/Xcode-26.0.0-Beta.app/Contents/Developer/Platforms/XROS.platform/Developer/usr/bin/swift-plugin-server\#SwiftMacros -disable-implicit-swift-modules -Xcc -fno-implicit-modules -Xcc -fno-implicit-module-maps -explicit-swift-module-map-file /Users/admin/builder/spi-builder-workspace/.derivedData/Build/Intermediates.noindex/Commandant.build/Debug-xros/Commandant.build/Objects-normal/arm64/Commandant-dependencies-1.json -Xllvm -aarch64-use-tbi -enable-objc-interop -stack-check -sdk /Applications/Xcode-26.0.0-Beta.app/Contents/Developer/Platforms/XROS.platform/Developer/SDKs/XROS26.0.sdk -I /Users/admin/builder/spi-builder-workspace/.derivedData/Build/Products/Debug-xros -I /Applications/Xcode-26.0.0-Beta.app/Contents/Developer/Platforms/XROS.platform/Developer/usr/lib -F /Users/admin/builder/spi-builder-workspace/.derivedData/Build/Products/Debug-xros -F /Applications/Xcode-26.0.0-Beta.app/Contents/Developer/Platforms/XROS.platform/Developer/Library/Frameworks -F /Applications/Xcode-26.0.0-Beta.app/Contents/Developer/Platforms/XROS.platform/Developer/SDKs/XROS26.0.sdk/Developer/Library/Frameworks -no-color-diagnostics -Xcc -fno-color-diagnostics -enable-testing -g -debug-info-format\=dwarf -dwarf-version\=4 -module-cache-path /Users/admin/builder/spi-builder-workspace/.derivedData/Build/Intermediates.noindex/SwiftExplicitPrecompiledModules -suppress-warnings -profile-generate -profile-coverage-mapping -swift-version 5 -enforce-exclusivity\=checked -Onone -D SWIFT_PACKAGE -D DEBUG -D SWIFT_MODULE_RESOURCE_BUNDLE_UNAVAILABLE -D Xcode -serialize-debugging-options -const-gather-protocols-file /Users/admin/builder/spi-builder-workspace/.derivedData/Build/Intermediates.noindex/Commandant.build/Debug-xros/Commandant.build/Objects-normal/arm64/Commandant_const_extract_protocols.json -enable-experimental-feature DebugDescriptionMacro -empty-abi-descriptor -validate-clang-modules-once -clang-build-session-file /Users/admin/builder/spi-builder-workspace/.derivedData/ModuleCache.noindex/Session.modulevalidation -Xcc -working-directory -Xcc /Users/admin/builder/spi-builder-workspace/.swiftpm/xcode -enable-anonymous-context-mangled-names -file-compilation-dir /Users/admin/builder/spi-builder-workspace/.swiftpm/xcode -Xcc -ivfsstatcache -Xcc /Users/admin/builder/spi-builder-workspace/.derivedData/SDKStatCaches.noindex/xros26.0-23M5263k-63777232b7fc5220f33897c1cc69dbf5.sdkstatcache -Xcc -I/Users/admin/builder/spi-builder-workspace/.derivedData/Build/Intermediates.noindex/Commandant.build/Debug-xros/Commandant.build/swift-overrides.hmap -Xcc -I/Users/admin/builder/spi-builder-workspace/.derivedData/Build/Products/Debug-xros/include -Xcc -I/Users/admin/builder/spi-builder-workspace/.derivedData/Build/Intermediates.noindex/Commandant.build/Debug-xros/Commandant.build/DerivedSources-normal/arm64 -Xcc -I/Users/admin/builder/spi-builder-workspace/.derivedData/Build/Intermediates.noindex/Commandant.build/Debug-xros/Commandant.build/DerivedSources/arm64 -Xcc -I/Users/admin/builder/spi-builder-workspace/.derivedData/Build/Intermediates.noindex/Commandant.build/Debug-xros/Commandant.build/DerivedSources -Xcc -DSWIFT_PACKAGE -Xcc -DDEBUG\=1 -no-auto-bridging-header-chaining -module-name Commandant -frontend-parseable-output -disable-clang-spi -target-sdk-version 26.0 -target-sdk-name xros26.0 -clang-target arm64-apple-xros26.0 -o /Users/admin/builder/spi-builder-workspace/.derivedData/Build/Intermediates.noindex/Commandant.build/Debug-xros/Commandant.build/Objects-normal/arm64/Command.o -index-unit-output-path /Commandant.build/Debug-xros/Commandant.build/Objects-normal/arm64/Command.o -index-store-path /Users/admin/builder/spi-builder-workspace/.derivedData/Index.noindex/DataStore -index-system-modules
SwiftCompile normal arm64 /Users/admin/builder/spi-builder-workspace/.dependencies/checkouts/Commandant/Sources/Commandant/Command.swift (in target 'Commandant' from project 'Commandant')
    cd /Users/admin/builder/spi-builder-workspace/.swiftpm/xcode

/Users/admin/builder/spi-builder-workspace/.dependencies/checkouts/Commandant/Sources/Commandant/Command.swift:206:15: error: cannot find 'Process' in scope
                        let task = Process()
                                   ^~~~~~~
SwiftDriverJobDiscovery normal arm64 Compiling XMLHash.swift, XMLHashOptions.swift (in target 'SWXMLHash' from project 'SWXMLHash')
SwiftCompile normal arm64 Compiling\ ArgumentProtocol.swift /Users/admin/builder/spi-builder-workspace/.dependencies/checkouts/Commandant/Sources/Commandant/ArgumentProtocol.swift (in target 'Commandant' from project 'Commandant')
SwiftCompile normal arm64 /Users/admin/builder/spi-builder-workspace/.dependencies/checkouts/Commandant/Sources/Commandant/ArgumentProtocol.swift (in target 'Commandant' from project 'Commandant')
    cd /Users/admin/builder/spi-builder-workspace/.swiftpm/xcode

SwiftDriverJobDiscovery normal arm64 Compiling XMLContent.swift, XMLElement.swift (in target 'SWXMLHash' from project 'SWXMLHash')
SwiftCompile normal arm64 Compiling\ Switch.swift /Users/admin/builder/spi-builder-workspace/.dependencies/checkouts/Commandant/Sources/Commandant/Switch.swift (in target 'Commandant' from project 'Commandant')
SwiftCompile normal arm64 /Users/admin/builder/spi-builder-workspace/.dependencies/checkouts/Commandant/Sources/Commandant/Switch.swift (in target 'Commandant' from project 'Commandant')
    cd /Users/admin/builder/spi-builder-workspace/.swiftpm/xcode

SwiftDriverJobDiscovery normal arm64 Compiling XMLIndexer.swift, shim.swift (in target 'SWXMLHash' from project 'SWXMLHash')
SwiftCompile normal arm64 Compiling\ HelpCommand.swift /Users/admin/builder/spi-builder-workspace/.dependencies/checkouts/Commandant/Sources/Commandant/HelpCommand.swift (in target 'Commandant' from project 'Commandant')
SwiftCompile normal arm64 /Users/admin/builder/spi-builder-workspace/.dependencies/checkouts/Commandant/Sources/Commandant/HelpCommand.swift (in target 'Commandant' from project 'Commandant')
    cd /Users/admin/builder/spi-builder-workspace/.swiftpm/xcode

SwiftDriverJobDiscovery normal arm64 Compiling LazyXMLParser.swift, Stack.swift, String+Extensions.swift (in target 'SWXMLHash' from project 'SWXMLHash')
SwiftCompile normal arm64 Compiling\ Argument.swift /Users/admin/builder/spi-builder-workspace/.dependencies/checkouts/Commandant/Sources/Commandant/Argument.swift (in target 'Commandant' from project 'Commandant')
SwiftCompile normal arm64 /Users/admin/builder/spi-builder-workspace/.dependencies/checkouts/Commandant/Sources/Commandant/Argument.swift (in target 'Commandant' from project 'Commandant')
    cd /Users/admin/builder/spi-builder-workspace/.swiftpm/xcode

SwiftCompile normal arm64 Compiling\ OrderedSet.swift /Users/admin/builder/spi-builder-workspace/.dependencies/checkouts/Commandant/Sources/Commandant/OrderedSet.swift (in target 'Commandant' from project 'Commandant')
SwiftCompile normal arm64 /Users/admin/builder/spi-builder-workspace/.dependencies/checkouts/Commandant/Sources/Commandant/OrderedSet.swift (in target 'Commandant' from project 'Commandant')
    cd /Users/admin/builder/spi-builder-workspace/.swiftpm/xcode

SwiftDriverJobDiscovery normal arm64 Compiling XMLDeserializationError.swift, FullXMLParser.swift, IndexOp.swift (in target 'SWXMLHash' from project 'SWXMLHash')
SwiftCompile normal arm64 Compiling\ Option.swift /Users/admin/builder/spi-builder-workspace/.dependencies/checkouts/Commandant/Sources/Commandant/Option.swift (in target 'Commandant' from project 'Commandant')
SwiftEmitModule normal arm64 Emitting\ module\ for\ Yams (in target 'Yams' from project 'Yams')
SwiftDriverJobDiscovery normal arm64 Compiling Double+XMLDeserialization.swift, Float+XMLDeserialization.swift, Int+XMLDeserialization.swift (in target 'SWXMLHash' from project 'SWXMLHash')
SwiftCompile normal arm64 Compiling\ RedundancyAliasingStrategy.swift,\ Representer.swift /Users/admin/builder/spi-builder-workspace/.dependencies/checkouts/Yams/Sources/Yams/RedundancyAliasingStrategy.swift /Users/admin/builder/spi-builder-workspace/.dependencies/checkouts/Yams/Sources/Yams/Representer.swift (in target 'Yams' from project 'Yams')
SwiftDriverJobDiscovery normal arm64 Compiling XMLObjectDeserialization.swift, XMLValueDeserialization.swift, Bool+XMLDeserialization.swift (in target 'SWXMLHash' from project 'SWXMLHash')
SwiftCompile normal arm64 Compiling\ Encoder.swift,\ Mark.swift /Users/admin/builder/spi-builder-workspace/.dependencies/checkouts/Yams/Sources/Yams/Encoder.swift /Users/admin/builder/spi-builder-workspace/.dependencies/checkouts/Yams/Sources/Yams/Mark.swift (in target 'Yams' from project 'Yams')
SwiftDriverJobDiscovery normal arm64 Compiling Switch.swift (in target 'Commandant' from project 'Commandant')
SwiftCompile normal arm64 Compiling\ Node.swift,\ Parser.swift /Users/admin/builder/spi-builder-workspace/.dependencies/checkouts/Yams/Sources/Yams/Node.swift /Users/admin/builder/spi-builder-workspace/.dependencies/checkouts/Yams/Sources/Yams/Parser.swift (in target 'Yams' from project 'Yams')
** BUILD FAILED **
The following build commands failed:
	SwiftCompile normal arm64 Compiling\ Command.swift /Users/admin/builder/spi-builder-workspace/.dependencies/checkouts/Commandant/Sources/Commandant/Command.swift (in target 'Commandant' from project 'Commandant')
	SwiftCompile normal arm64 /Users/admin/builder/spi-builder-workspace/.dependencies/checkouts/Commandant/Sources/Commandant/Command.swift (in target 'Commandant' from project 'Commandant')
	Building workspace spi-builder-workspace with scheme IBLinter-Package
(3 failures)
Command line invocation:
    /Applications/Xcode-26.0.0-Beta.app/Contents/Developer/usr/bin/xcodebuild -IDEClonedSourcePackagesDirPathOverride=/Users/admin/builder/spi-builder-workspace/.dependencies -resolvePackageDependencies
Resolve Package Graph
Resolved source packages:
  SWXMLHash: https://github.com/drmohundro/SWXMLHash.git @ 7.0.2
  SourceKitten: https://github.com/jpsim/SourceKitten.git @ 0.37.2
  Commandant: https://github.com/Carthage/Commandant.git @ 0.17.0
  swift-argument-parser: https://github.com/apple/swift-argument-parser.git @ 1.5.1
  IBDecodable: https://github.com/IBDecodable/IBDecodable.git @ 0.6.1
  Nimble: https://github.com/Quick/Nimble.git @ 8.1.2
  IBLinter: /Users/admin/builder/spi-builder-workspace
  XcodeProjKit: https://github.com/phimage/XcodeProjKit.git @ 2.3.0
  Yams: https://github.com/jpsim/Yams.git @ 6.0.1
  Quick: https://github.com/Quick/Quick.git @ 2.2.1
resolved source packages: SWXMLHash, SourceKitten, Commandant, swift-argument-parser, IBDecodable, Nimble, IBLinter, XcodeProjKit, Yams, Quick
{
  "dependencies" : [
    {
      "identity" : "ibdecodable",
      "requirement" : {
        "range" : [
          {
            "lower_bound" : "0.5.0",
            "upper_bound" : "1.0.0"
          }
        ]
      },
      "type" : "sourceControl",
      "url" : "https://github.com/IBDecodable/IBDecodable.git"
    },
    {
      "identity" : "commandant",
      "requirement" : {
        "range" : [
          {
            "lower_bound" : "0.17.0",
            "upper_bound" : "0.18.0"
          }
        ]
      },
      "type" : "sourceControl",
      "url" : "https://github.com/Carthage/Commandant.git"
    },
    {
      "identity" : "sourcekitten",
      "requirement" : {
        "range" : [
          {
            "lower_bound" : "0.29.0",
            "upper_bound" : "1.0.0"
          }
        ]
      },
      "type" : "sourceControl",
      "url" : "https://github.com/jpsim/SourceKitten.git"
    },
    {
      "identity" : "xcodeprojkit",
      "requirement" : {
        "range" : [
          {
            "lower_bound" : "2.2.0",
            "upper_bound" : "3.0.0"
          }
        ]
      },
      "type" : "sourceControl",
      "url" : "https://github.com/phimage/XcodeProjKit.git"
    }
  ],
  "manifest_display_name" : "IBLinter",
  "name" : "IBLinter",
  "path" : "/Users/admin/builder/spi-builder-workspace",
  "platforms" : [
    {
      "name" : "macos",
      "version" : "10.13"
    }
  ],
  "products" : [
    {
      "name" : "iblinter",
      "targets" : [
        "IBLinter"
      ],
      "type" : {
        "executable" : null
      }
    },
    {
      "name" : "IBLinterFrontend",
      "targets" : [
        "IBLinterFrontend"
      ],
      "type" : {
        "library" : [
          "dynamic"
        ]
      }
    },
    {
      "name" : "IBLinterKit",
      "targets" : [
        "IBLinterKit"
      ],
      "type" : {
        "library" : [
          "automatic"
        ]
      }
    },
    {
      "name" : "iblinter-tools",
      "targets" : [
        "IBLinterTools"
      ],
      "type" : {
        "executable" : null
      }
    }
  ],
  "targets" : [
    {
      "c99name" : "IBLinterTools",
      "module_type" : "SwiftTarget",
      "name" : "IBLinterTools",
      "path" : "Sources/IBLinterTools",
      "product_dependencies" : [
        "Commandant"
      ],
      "product_memberships" : [
        "iblinter-tools"
      ],
      "sources" : [
        "DumpRuleDocument.swift",
        "main.swift"
      ],
      "target_dependencies" : [
        "IBLinterKit"
      ],
      "type" : "executable"
    },
    {
      "c99name" : "IBLinterKitTest",
      "module_type" : "SwiftTarget",
      "name" : "IBLinterKitTest",
      "path" : "Tests/IBLinterKitTest",
      "sources" : [
        "ReportersTest.swift",
        "RuleTest.swift",
        "Rules/AmbiguousViewRuleTests.swift",
        "Rules/ColorResourcesRuleTests.swift",
        "Rules/CustomClassNameRuleTests.swift",
        "Rules/CustomModuleRuleTests.swift",
        "Rules/DuplicateConstraintRuleTests.swift",
        "Rules/DuplicateIDRuleTests.swift",
        "Rules/HidesBottomBarRuleTests.swift",
        "Rules/ImageResourcesRuleTests.swift",
        "Rules/RelativeToMarginRuleTests.swift",
        "Rules/ReuseIdentifierRuleTests.swift",
        "Rules/StackViewBackgroundColorRuleTests.swift",
        "Rules/UseBaseClassRuleTests.swift",
        "Rules/UseTraitCollectionsTests.swift",
        "Rules/ViewAsDeviceRuleTests.swift",
        "Supports/Context+Mock.swift",
        "Supports/Fixture.swift",
        "Utils/AssetsCatalogTest.swift",
        "Utils/ConfigTest.swift",
        "Utils/GlobTests.swift",
        "Utils/LintCacheTests.swift",
        "Utils/LintablePathsTests.swift",
        "ValidatorTest.swift"
      ],
      "target_dependencies" : [
        "IBLinterKit"
      ],
      "type" : "test"
    },
    {
      "c99name" : "IBLinterKit",
      "module_type" : "SwiftTarget",
      "name" : "IBLinterKit",
      "path" : "Sources/IBLinterKit",
      "product_dependencies" : [
        "IBDecodable",
        "Commandant",
        "SourceKittenFramework",
        "XcodeProjKit"
      ],
      "product_memberships" : [
        "iblinter",
        "IBLinterFrontend",
        "IBLinterKit",
        "iblinter-tools"
      ],
      "sources" : [
        "Config/Config.swift",
        "Config/CustomModuleConfig.swift",
        "Config/HidesBottomBarConfig.swift",
        "Config/UseBaseClassConfig.swift",
        "Config/UseTraitCollectionsConfig.swift",
        "Config/ViewAsDeviceConfig.swift",
        "Context.swift",
        "Entity/AssetsCatalog.swift",
        "Extensions/String+md5.swift",
        "Extensions/String+xml.swift",
        "Reporters/CheckstyleReporter.swift",
        "Reporters/CodeClimateReporter.swift",
        "Reporters/EmojiReporter.swift",
        "Reporters/GitLabJUnitReporter.swift",
        "Reporters/JSONReporter.swift",
        "Reporters/Reporter.swift",
        "Reporters/XcodeReporter.swift",
        "Rule.swift",
        "Rules/AmbiguousViewRule.swift",
        "Rules/ColorResourcesRule.swift",
        "Rules/CustomClassNameRule.swift",
        "Rules/CustomModuleRule.swift",
        "Rules/DuplicateConstraintRule.swift",
        "Rules/DuplicateIDRule.swift",
        "Rules/ForceToEnableAutoLayoutRule.swift",
        "Rules/HidesBottomBarRule.swift",
        "Rules/ImageResourcesRule.swift",
        "Rules/MisplacedViewRule.swift",
        "Rules/RelativeToMarginRule.swift",
        "Rules/ReuseIdentifierRule.swift",
        "Rules/StackViewBackgroundColorRule.swift",
        "Rules/StoryboardControllerId.swift",
        "Rules/UseBaseClassRule.swift",
        "Rules/UseTraitCollections.swift",
        "Rules/ViewAsDeviceRule.swift",
        "Utils/Glob.swift",
        "Utils/LintCache.swift",
        "Utils/ViewName.swift",
        "Validator.swift",
        "Version.swift",
        "Violation.swift"
      ],
      "type" : "library"
    },
    {
      "c99name" : "IBLinterFrontend",
      "module_type" : "SwiftTarget",
      "name" : "IBLinterFrontend",
      "path" : "Sources/IBLinterFrontend",
      "product_memberships" : [
        "iblinter",
        "IBLinterFrontend"
      ],
      "sources" : [
        "Commands/ValidateCommand.swift",
        "Commands/VersionCommand.swift",
        "IBLinter.swift"
      ],
      "target_dependencies" : [
        "IBLinterKit"
      ],
      "type" : "library"
    },
    {
      "c99name" : "IBLinter",
      "module_type" : "SwiftTarget",
      "name" : "IBLinter",
      "path" : "Sources/IBLinter",
      "product_memberships" : [
        "iblinter"
      ],
      "sources" : [
        "main.swift"
      ],
      "target_dependencies" : [
        "IBLinterFrontend"
      ],
      "type" : "executable"
    }
  ],
  "tools_version" : "5.0"
}
{
  "workspace" : {
    "name" : "spi-builder-workspace",
    "schemes" : [
      "iblinter",
      "IBLinter-Package",
      "iblinter-tools",
      "IBLinterFrontend",
      "IBLinterKit"
    ]
  }
}
{
  "workspace" : {
    "name" : "spi-builder-workspace",
    "schemes" : [
      "iblinter",
      "IBLinter-Package",
      "iblinter-tools",
      "IBLinterFrontend",
      "IBLinterKit"
    ]
  }
}
Running build ...
env DEVELOPER_DIR=/Applications/Xcode-26.0.0-Beta.app xcrun xcodebuild -IDEClonedSourcePackagesDirPathOverride=$PWD/.dependencies -skipMacroValidation -skipPackagePluginValidation -derivedDataPath $PWD/.derivedData build -scheme IBLinter-Package -destination generic/platform=xrOS
Command line invocation:
    /Applications/Xcode-26.0.0-Beta.app/Contents/Developer/usr/bin/xcodebuild -IDEClonedSourcePackagesDirPathOverride=/Users/admin/builder/spi-builder-workspace/.dependencies -skipMacroValidation -skipPackagePluginValidation -derivedDataPath /Users/admin/builder/spi-builder-workspace/.derivedData build -scheme IBLinter-Package -destination generic/platform=xrOS
Resolve Package Graph
Resolved source packages:
  Yams: https://github.com/jpsim/Yams.git @ 6.0.1
  IBLinter: /Users/admin/builder/spi-builder-workspace
  XcodeProjKit: https://github.com/phimage/XcodeProjKit.git @ 2.3.0
  Quick: https://github.com/Quick/Quick.git @ 2.2.1
  Commandant: https://github.com/Carthage/Commandant.git @ 0.17.0
  SWXMLHash: https://github.com/drmohundro/SWXMLHash.git @ 7.0.2
  swift-argument-parser: https://github.com/apple/swift-argument-parser.git @ 1.5.1
  SourceKitten: https://github.com/jpsim/SourceKitten.git @ 0.37.2
  IBDecodable: https://github.com/IBDecodable/IBDecodable.git @ 0.6.1
  Nimble: https://github.com/Quick/Nimble.git @ 8.1.2
ComputePackagePrebuildTargetDependencyGraph
Prepare packages
CreateBuildRequest
SendProjectDescription
CreateBuildOperation
ComputeTargetDependencyGraph
note: Building targets in dependency order
note: Target dependency graph (21 targets)
    Target 'iblinter-tools' in project 'IBLinter'
        ➜ Explicit dependency on target 'IBLinterKit' in project 'IBLinter'
        ➜ Explicit dependency on target 'IBDecodable' in project 'IBDecodable'
        ➜ Explicit dependency on target 'Commandant' in project 'Commandant'
        ➜ Explicit dependency on target 'SourceKittenFramework' in project 'SourceKitten'
        ➜ Explicit dependency on target 'XcodeProjKit' in project 'XcodeProjKit'
    Target 'iblinter' in project 'IBLinter'
        ➜ Explicit dependency on target 'IBLinterKit' in project 'IBLinter'
        ➜ Explicit dependency on target 'IBLinterFrontend' in project 'IBLinter'
        ➜ Explicit dependency on target 'IBDecodable' in project 'IBDecodable'
        ➜ Explicit dependency on target 'Commandant' in project 'Commandant'
        ➜ Explicit dependency on target 'SourceKittenFramework' in project 'SourceKitten'
        ➜ Explicit dependency on target 'XcodeProjKit' in project 'XcodeProjKit'
    Target 'IBLinterKit' in project 'IBLinter'
        ➜ Explicit dependency on target 'IBLinterKit' in project 'IBLinter'
        ➜ Explicit dependency on target 'IBDecodable' in project 'IBDecodable'
        ➜ Explicit dependency on target 'Commandant' in project 'Commandant'
        ➜ Explicit dependency on target 'SourceKittenFramework' in project 'SourceKitten'
        ➜ Explicit dependency on target 'XcodeProjKit' in project 'XcodeProjKit'
    Target 'IBLinterFrontend' in project 'IBLinter'
        ➜ Explicit dependency on target 'IBLinterFrontend' in project 'IBLinter'
        ➜ Explicit dependency on target 'IBLinterKit' in project 'IBLinter'
        ➜ Explicit dependency on target 'IBDecodable' in project 'IBDecodable'
        ➜ Explicit dependency on target 'Commandant' in project 'Commandant'
        ➜ Explicit dependency on target 'SourceKittenFramework' in project 'SourceKitten'
        ➜ Explicit dependency on target 'XcodeProjKit' in project 'XcodeProjKit'
    Target 'IBLinterFrontend' in project 'IBLinter'
        ➜ Explicit dependency on target 'IBLinterKit' in project 'IBLinter'
        ➜ Explicit dependency on target 'IBDecodable' in project 'IBDecodable'
        ➜ Explicit dependency on target 'Commandant' in project 'Commandant'
        ➜ Explicit dependency on target 'SourceKittenFramework' in project 'SourceKitten'
        ➜ Explicit dependency on target 'XcodeProjKit' in project 'XcodeProjKit'
    Target 'IBLinterKit' in project 'IBLinter'
        ➜ Explicit dependency on target 'IBDecodable' in project 'IBDecodable'
        ➜ Explicit dependency on target 'Commandant' in project 'Commandant'
        ➜ Explicit dependency on target 'SourceKittenFramework' in project 'SourceKitten'
        ➜ Explicit dependency on target 'XcodeProjKit' in project 'XcodeProjKit'
    Target 'XcodeProjKit' in project 'XcodeProjKit'
        ➜ Explicit dependency on target 'XcodeProjKit' in project 'XcodeProjKit'
    Target 'XcodeProjKit' in project 'XcodeProjKit' (no dependencies)
    Target 'SourceKittenFramework' in project 'SourceKitten'
        ➜ Explicit dependency on target 'SourceKittenFramework' in project 'SourceKitten'
        ➜ Explicit dependency on target 'Clang_C' in project 'SourceKitten'
        ➜ Explicit dependency on target 'SourceKit' in project 'SourceKitten'
        ➜ Explicit dependency on target 'SWXMLHash' in project 'SWXMLHash'
        ➜ Explicit dependency on target 'Yams' in project 'Yams'
    Target 'SourceKittenFramework' in project 'SourceKitten'
        ➜ Explicit dependency on target 'Clang_C' in project 'SourceKitten'
        ➜ Explicit dependency on target 'SourceKit' in project 'SourceKitten'
        ➜ Explicit dependency on target 'SWXMLHash' in project 'SWXMLHash'
        ➜ Explicit dependency on target 'Yams' in project 'Yams'
    Target 'Yams' in project 'Yams'
        ➜ Explicit dependency on target 'Yams' in project 'Yams'
        ➜ Explicit dependency on target 'CYaml' in project 'Yams'
    Target 'Yams' in project 'Yams'
        ➜ Explicit dependency on target 'CYaml' in project 'Yams'
    Target 'CYaml' in project 'Yams' (no dependencies)
    Target 'SourceKit' in project 'SourceKitten' (no dependencies)
    Target 'Clang_C' in project 'SourceKitten' (no dependencies)
    Target 'Commandant' in project 'Commandant'
        ➜ Explicit dependency on target 'Commandant' in project 'Commandant'
    Target 'Commandant' in project 'Commandant' (no dependencies)
    Target 'IBDecodable' in project 'IBDecodable'
        ➜ Explicit dependency on target 'IBDecodable' in project 'IBDecodable'
        ➜ Explicit dependency on target 'SWXMLHash' in project 'SWXMLHash'
    Target 'IBDecodable' in project 'IBDecodable'
        ➜ Explicit dependency on target 'SWXMLHash' in project 'SWXMLHash'
    Target 'SWXMLHash' in project 'SWXMLHash'
        ➜ Explicit dependency on target 'SWXMLHash' in project 'SWXMLHash'
    Target 'SWXMLHash' in project 'SWXMLHash' (no dependencies)
GatherProvisioningInputs
CreateBuildDescription
ClangStatCache /Applications/Xcode-26.0.0-Beta.app/Contents/Developer/Toolchains/XcodeDefault.xctoolchain/usr/bin/clang-stat-cache /Applications/Xcode-26.0.0-Beta.app/Contents/Developer/Platforms/XROS.platform/Developer/SDKs/XROS26.0.sdk /Users/admin/builder/spi-builder-workspace/.derivedData/SDKStatCaches.noindex/xros26.0-23M5263k-63777232b7fc5220f33897c1cc69dbf5.sdkstatcache
    cd /Users/admin/builder/spi-builder-workspace/.swiftpm/xcode
    /Applications/Xcode-26.0.0-Beta.app/Contents/Developer/Toolchains/XcodeDefault.xctoolchain/usr/bin/clang-stat-cache /Applications/Xcode-26.0.0-Beta.app/Contents/Developer/Platforms/XROS.platform/Developer/SDKs/XROS26.0.sdk -o /Users/admin/builder/spi-builder-workspace/.derivedData/SDKStatCaches.noindex/xros26.0-23M5263k-63777232b7fc5220f33897c1cc69dbf5.sdkstatcache
SwiftDriver SWXMLHash normal arm64 com.apple.xcode.tools.swift.compiler (in target 'SWXMLHash' from project 'SWXMLHash')
    cd /Users/admin/builder/spi-builder-workspace/.swiftpm/xcode
    builtin-SwiftDriver -- /Applications/Xcode-26.0.0-Beta.app/Contents/Developer/Toolchains/XcodeDefault.xctoolchain/usr/bin/swiftc -module-name SWXMLHash -Onone -enforce-exclusivity\=checked @/Users/admin/builder/spi-builder-workspace/.derivedData/Build/Intermediates.noindex/SWXMLHash.build/Debug-xros/SWXMLHash.build/Objects-normal/arm64/SWXMLHash.SwiftFileList -DSWIFT_PACKAGE -DDEBUG -DSWIFT_MODULE_RESOURCE_BUNDLE_UNAVAILABLE -DXcode -plugin-path /Applications/Xcode-26.0.0-Beta.app/Contents/Developer/Toolchains/XcodeDefault.xctoolchain/usr/lib/swift/host/plugins/testing -enable-experimental-feature DebugDescriptionMacro -sdk /Applications/Xcode-26.0.0-Beta.app/Contents/Developer/Platforms/XROS.platform/Developer/SDKs/XROS26.0.sdk -target arm64-apple-xros1.0 -g -module-cache-path /Users/admin/builder/spi-builder-workspace/.derivedData/ModuleCache.noindex -Xfrontend -serialize-debugging-options -profile-coverage-mapping -profile-generate -enable-testing -suppress-warnings -index-store-path /Users/admin/builder/spi-builder-workspace/.derivedData/Index.noindex/DataStore -swift-version 5 -I /Users/admin/builder/spi-builder-workspace/.derivedData/Build/Products/Debug-xros -I /Applications/Xcode-26.0.0-Beta.app/Contents/Developer/Platforms/XROS.platform/Developer/usr/lib -F /Users/admin/builder/spi-builder-workspace/.derivedData/Build/Products/Debug-xros -F /Applications/Xcode-26.0.0-Beta.app/Contents/Developer/Platforms/XROS.platform/Developer/Library/Frameworks -F /Applications/Xcode-26.0.0-Beta.app/Contents/Developer/Platforms/XROS.platform/Developer/SDKs/XROS26.0.sdk/Developer/Library/Frameworks -c -j10 -enable-batch-mode -incremental -Xcc -ivfsstatcache -Xcc /Users/admin/builder/spi-builder-workspace/.derivedData/SDKStatCaches.noindex/xros26.0-23M5263k-63777232b7fc5220f33897c1cc69dbf5.sdkstatcache -output-file-map /Users/admin/builder/spi-builder-workspace/.derivedData/Build/Intermediates.noindex/SWXMLHash.build/Debug-xros/SWXMLHash.build/Objects-normal/arm64/SWXMLHash-OutputFileMap.json -use-frontend-parseable-output -save-temps -no-color-diagnostics -explicit-module-build -module-cache-path /Users/admin/builder/spi-builder-workspace/.derivedData/Build/Intermediates.noindex/SwiftExplicitPrecompiledModules -clang-scanner-module-cache-path /Users/admin/builder/spi-builder-workspace/.derivedData/ModuleCache.noindex -sdk-module-cache-path /Users/admin/builder/spi-builder-workspace/.derivedData/ModuleCache.noindex -serialize-diagnostics -emit-dependencies -emit-module -emit-module-path /Users/admin/builder/spi-builder-workspace/.derivedData/Build/Intermediates.noindex/SWXMLHash.build/Debug-xros/SWXMLHash.build/Objects-normal/arm64/SWXMLHash.swiftmodule -validate-clang-modules-once -clang-build-session-file /Users/admin/builder/spi-builder-workspace/.derivedData/ModuleCache.noindex/Session.modulevalidation -Xcc -I/Users/admin/builder/spi-builder-workspace/.derivedData/Build/Intermediates.noindex/SWXMLHash.build/Debug-xros/SWXMLHash.build/swift-overrides.hmap -emit-const-values -Xfrontend -const-gather-protocols-file -Xfrontend /Users/admin/builder/spi-builder-workspace/.derivedData/Build/Intermediates.noindex/SWXMLHash.build/Debug-xros/SWXMLHash.build/Objects-normal/arm64/SWXMLHash_const_extract_protocols.json -Xcc -I/Users/admin/builder/spi-builder-workspace/.derivedData/Build/Products/Debug-xros/include -Xcc -I/Users/admin/builder/spi-builder-workspace/.derivedData/Build/Intermediates.noindex/SWXMLHash.build/Debug-xros/SWXMLHash.build/DerivedSources-normal/arm64 -Xcc -I/Users/admin/builder/spi-builder-workspace/.derivedData/Build/Intermediates.noindex/SWXMLHash.build/Debug-xros/SWXMLHash.build/DerivedSources/arm64 -Xcc -I/Users/admin/builder/spi-builder-workspace/.derivedData/Build/Intermediates.noindex/SWXMLHash.build/Debug-xros/SWXMLHash.build/DerivedSources -Xcc -DSWIFT_PACKAGE -Xcc -DDEBUG\=1 -emit-objc-header -emit-objc-header-path /Users/admin/builder/spi-builder-workspace/.derivedData/Build/Intermediates.noindex/SWXMLHash.build/Debug-xros/SWXMLHash.build/Objects-normal/arm64/SWXMLHash-Swift.h -working-directory /Users/admin/builder/spi-builder-workspace/.swiftpm/xcode -experimental-emit-module-separately -disable-cmo
SwiftDriver Commandant normal arm64 com.apple.xcode.tools.swift.compiler (in target 'Commandant' from project 'Commandant')
    cd /Users/admin/builder/spi-builder-workspace/.swiftpm/xcode
    builtin-SwiftDriver -- /Applications/Xcode-26.0.0-Beta.app/Contents/Developer/Toolchains/XcodeDefault.xctoolchain/usr/bin/swiftc -module-name Commandant -Onone -enforce-exclusivity\=checked @/Users/admin/builder/spi-builder-workspace/.derivedData/Build/Intermediates.noindex/Commandant.build/Debug-xros/Commandant.build/Objects-normal/arm64/Commandant.SwiftFileList -DSWIFT_PACKAGE -DDEBUG -DSWIFT_MODULE_RESOURCE_BUNDLE_UNAVAILABLE -DXcode -plugin-path /Applications/Xcode-26.0.0-Beta.app/Contents/Developer/Toolchains/XcodeDefault.xctoolchain/usr/lib/swift/host/plugins/testing -enable-experimental-feature DebugDescriptionMacro -sdk /Applications/Xcode-26.0.0-Beta.app/Contents/Developer/Platforms/XROS.platform/Developer/SDKs/XROS26.0.sdk -target arm64-apple-xros1.0 -g -module-cache-path /Users/admin/builder/spi-builder-workspace/.derivedData/ModuleCache.noindex -Xfrontend -serialize-debugging-options -profile-coverage-mapping -profile-generate -enable-testing -suppress-warnings -index-store-path /Users/admin/builder/spi-builder-workspace/.derivedData/Index.noindex/DataStore -swift-version 5 -I /Users/admin/builder/spi-builder-workspace/.derivedData/Build/Products/Debug-xros -I /Applications/Xcode-26.0.0-Beta.app/Contents/Developer/Platforms/XROS.platform/Developer/usr/lib -F /Users/admin/builder/spi-builder-workspace/.derivedData/Build/Products/Debug-xros -F /Applications/Xcode-26.0.0-Beta.app/Contents/Developer/Platforms/XROS.platform/Developer/Library/Frameworks -F /Applications/Xcode-26.0.0-Beta.app/Contents/Developer/Platforms/XROS.platform/Developer/SDKs/XROS26.0.sdk/Developer/Library/Frameworks -c -j10 -enable-batch-mode -incremental -Xcc -ivfsstatcache -Xcc /Users/admin/builder/spi-builder-workspace/.derivedData/SDKStatCaches.noindex/xros26.0-23M5263k-63777232b7fc5220f33897c1cc69dbf5.sdkstatcache -output-file-map /Users/admin/builder/spi-builder-workspace/.derivedData/Build/Intermediates.noindex/Commandant.build/Debug-xros/Commandant.build/Objects-normal/arm64/Commandant-OutputFileMap.json -use-frontend-parseable-output -save-temps -no-color-diagnostics -explicit-module-build -module-cache-path /Users/admin/builder/spi-builder-workspace/.derivedData/Build/Intermediates.noindex/SwiftExplicitPrecompiledModules -clang-scanner-module-cache-path /Users/admin/builder/spi-builder-workspace/.derivedData/ModuleCache.noindex -sdk-module-cache-path /Users/admin/builder/spi-builder-workspace/.derivedData/ModuleCache.noindex -serialize-diagnostics -emit-dependencies -emit-module -emit-module-path /Users/admin/builder/spi-builder-workspace/.derivedData/Build/Intermediates.noindex/Commandant.build/Debug-xros/Commandant.build/Objects-normal/arm64/Commandant.swiftmodule -validate-clang-modules-once -clang-build-session-file /Users/admin/builder/spi-builder-workspace/.derivedData/ModuleCache.noindex/Session.modulevalidation -Xcc -I/Users/admin/builder/spi-builder-workspace/.derivedData/Build/Intermediates.noindex/Commandant.build/Debug-xros/Commandant.build/swift-overrides.hmap -emit-const-values -Xfrontend -const-gather-protocols-file -Xfrontend /Users/admin/builder/spi-builder-workspace/.derivedData/Build/Intermediates.noindex/Commandant.build/Debug-xros/Commandant.build/Objects-normal/arm64/Commandant_const_extract_protocols.json -Xcc -I/Users/admin/builder/spi-builder-workspace/.derivedData/Build/Products/Debug-xros/include -Xcc -I/Users/admin/builder/spi-builder-workspace/.derivedData/Build/Intermediates.noindex/Commandant.build/Debug-xros/Commandant.build/DerivedSources-normal/arm64 -Xcc -I/Users/admin/builder/spi-builder-workspace/.derivedData/Build/Intermediates.noindex/Commandant.build/Debug-xros/Commandant.build/DerivedSources/arm64 -Xcc -I/Users/admin/builder/spi-builder-workspace/.derivedData/Build/Intermediates.noindex/Commandant.build/Debug-xros/Commandant.build/DerivedSources -Xcc -DSWIFT_PACKAGE -Xcc -DDEBUG\=1 -emit-objc-header -emit-objc-header-path /Users/admin/builder/spi-builder-workspace/.derivedData/Build/Intermediates.noindex/Commandant.build/Debug-xros/Commandant.build/Objects-normal/arm64/Commandant-Swift.h -working-directory /Users/admin/builder/spi-builder-workspace/.swiftpm/xcode -experimental-emit-module-separately -disable-cmo
SwiftDriver Yams normal arm64 com.apple.xcode.tools.swift.compiler (in target 'Yams' from project 'Yams')
    cd /Users/admin/builder/spi-builder-workspace/.swiftpm/xcode
    builtin-SwiftDriver -- /Applications/Xcode-26.0.0-Beta.app/Contents/Developer/Toolchains/XcodeDefault.xctoolchain/usr/bin/swiftc -module-name Yams -Onone -enforce-exclusivity\=checked @/Users/admin/builder/spi-builder-workspace/.derivedData/Build/Intermediates.noindex/Yams.build/Debug-xros/Yams.build/Objects-normal/arm64/Yams.SwiftFileList -DSWIFT_PACKAGE -DDEBUG -DSWIFT_MODULE_RESOURCE_BUNDLE_UNAVAILABLE -DXcode -plugin-path /Applications/Xcode-26.0.0-Beta.app/Contents/Developer/Toolchains/XcodeDefault.xctoolchain/usr/lib/swift/host/plugins/testing -enable-experimental-feature DebugDescriptionMacro -sdk /Applications/Xcode-26.0.0-Beta.app/Contents/Developer/Platforms/XROS.platform/Developer/SDKs/XROS26.0.sdk -target arm64-apple-xros1.0 -g -module-cache-path /Users/admin/builder/spi-builder-workspace/.derivedData/ModuleCache.noindex -Xfrontend -serialize-debugging-options -profile-coverage-mapping -profile-generate -enable-testing -suppress-warnings -index-store-path /Users/admin/builder/spi-builder-workspace/.derivedData/Index.noindex/DataStore -swift-version 6 -I /Users/admin/builder/spi-builder-workspace/.derivedData/Build/Products/Debug-xros -I /Applications/Xcode-26.0.0-Beta.app/Contents/Developer/Platforms/XROS.platform/Developer/usr/lib -F /Users/admin/builder/spi-builder-workspace/.derivedData/Build/Products/Debug-xros/PackageFrameworks -F /Users/admin/builder/spi-builder-workspace/.derivedData/Build/Products/Debug-xros -F /Applications/Xcode-26.0.0-Beta.app/Contents/Developer/Platforms/XROS.platform/Developer/Library/Frameworks -F /Applications/Xcode-26.0.0-Beta.app/Contents/Developer/Platforms/XROS.platform/Developer/SDKs/XROS26.0.sdk/Developer/Library/Frameworks -c -j10 -enable-batch-mode -incremental -Xcc -ivfsstatcache -Xcc /Users/admin/builder/spi-builder-workspace/.derivedData/SDKStatCaches.noindex/xros26.0-23M5263k-63777232b7fc5220f33897c1cc69dbf5.sdkstatcache -output-file-map /Users/admin/builder/spi-builder-workspace/.derivedData/Build/Intermediates.noindex/Yams.build/Debug-xros/Yams.build/Objects-normal/arm64/Yams-OutputFileMap.json -use-frontend-parseable-output -save-temps -no-color-diagnostics -explicit-module-build -module-cache-path /Users/admin/builder/spi-builder-workspace/.derivedData/Build/Intermediates.noindex/SwiftExplicitPrecompiledModules -clang-scanner-module-cache-path /Users/admin/builder/spi-builder-workspace/.derivedData/ModuleCache.noindex -sdk-module-cache-path /Users/admin/builder/spi-builder-workspace/.derivedData/ModuleCache.noindex -serialize-diagnostics -emit-dependencies -emit-module -emit-module-path /Users/admin/builder/spi-builder-workspace/.derivedData/Build/Intermediates.noindex/Yams.build/Debug-xros/Yams.build/Objects-normal/arm64/Yams.swiftmodule -user-module-version 6.0.1 -validate-clang-modules-once -clang-build-session-file /Users/admin/builder/spi-builder-workspace/.derivedData/ModuleCache.noindex/Session.modulevalidation -package-name yams -Xcc -I/Users/admin/builder/spi-builder-workspace/.derivedData/Build/Intermediates.noindex/Yams.build/Debug-xros/Yams.build/swift-overrides.hmap -emit-const-values -Xfrontend -const-gather-protocols-file -Xfrontend /Users/admin/builder/spi-builder-workspace/.derivedData/Build/Intermediates.noindex/Yams.build/Debug-xros/Yams.build/Objects-normal/arm64/Yams_const_extract_protocols.json -Xcc -I/Users/admin/builder/spi-builder-workspace/.dependencies/checkouts/Yams/Sources/CYaml/include -Xcc -I/Users/admin/builder/spi-builder-workspace/.derivedData/Build/Products/Debug-xros/include -Xcc -I/Users/admin/builder/spi-builder-workspace/.derivedData/Build/Intermediates.noindex/Yams.build/Debug-xros/Yams.build/DerivedSources-normal/arm64 -Xcc -I/Users/admin/builder/spi-builder-workspace/.derivedData/Build/Intermediates.noindex/Yams.build/Debug-xros/Yams.build/DerivedSources/arm64 -Xcc -I/Users/admin/builder/spi-builder-workspace/.derivedData/Build/Intermediates.noindex/Yams.build/Debug-xros/Yams.build/DerivedSources -Xcc -DSWIFT_PACKAGE -Xcc -DDEBUG\=1 -Xcc -DYAML_DECLARE_STATIC -emit-objc-header -emit-objc-header-path /Users/admin/builder/spi-builder-workspace/.derivedData/Build/Intermediates.noindex/Yams.build/Debug-xros/Yams.build/Objects-normal/arm64/Yams-Swift.h -working-directory /Users/admin/builder/spi-builder-workspace/.swiftpm/xcode -experimental-emit-module-separately -disable-cmo
SwiftDriver IBDecodable normal arm64 com.apple.xcode.tools.swift.compiler (in target 'IBDecodable' from project 'IBDecodable')
    cd /Users/admin/builder/spi-builder-workspace/.swiftpm/xcode
    builtin-SwiftDriver -- /Applications/Xcode-26.0.0-Beta.app/Contents/Developer/Toolchains/XcodeDefault.xctoolchain/usr/bin/swiftc -module-name IBDecodable -Onone -enforce-exclusivity\=checked @/Users/admin/builder/spi-builder-workspace/.derivedData/Build/Intermediates.noindex/IBDecodable.build/Debug-xros/IBDecodable.build/Objects-normal/arm64/IBDecodable.SwiftFileList -DSWIFT_PACKAGE -DDEBUG -DSWIFT_MODULE_RESOURCE_BUNDLE_UNAVAILABLE -DXcode -plugin-path /Applications/Xcode-26.0.0-Beta.app/Contents/Developer/Toolchains/XcodeDefault.xctoolchain/usr/lib/swift/host/plugins/testing -enable-experimental-feature DebugDescriptionMacro -sdk /Applications/Xcode-26.0.0-Beta.app/Contents/Developer/Platforms/XROS.platform/Developer/SDKs/XROS26.0.sdk -target arm64-apple-xros1.0 -g -module-cache-path /Users/admin/builder/spi-builder-workspace/.derivedData/ModuleCache.noindex -Xfrontend -serialize-debugging-options -profile-coverage-mapping -profile-generate -enable-testing -suppress-warnings -index-store-path /Users/admin/builder/spi-builder-workspace/.derivedData/Index.noindex/DataStore -swift-version 4 -I /Users/admin/builder/spi-builder-workspace/.derivedData/Build/Products/Debug-xros -I /Applications/Xcode-26.0.0-Beta.app/Contents/Developer/Platforms/XROS.platform/Developer/usr/lib -F /Users/admin/builder/spi-builder-workspace/.derivedData/Build/Products/Debug-xros/PackageFrameworks -F /Users/admin/builder/spi-builder-workspace/.derivedData/Build/Products/Debug-xros -F /Applications/Xcode-26.0.0-Beta.app/Contents/Developer/Platforms/XROS.platform/Developer/Library/Frameworks -F /Applications/Xcode-26.0.0-Beta.app/Contents/Developer/Platforms/XROS.platform/Developer/SDKs/XROS26.0.sdk/Developer/Library/Frameworks -c -j10 -enable-batch-mode -incremental -Xcc -ivfsstatcache -Xcc /Users/admin/builder/spi-builder-workspace/.derivedData/SDKStatCaches.noindex/xros26.0-23M5263k-63777232b7fc5220f33897c1cc69dbf5.sdkstatcache -output-file-map /Users/admin/builder/spi-builder-workspace/.derivedData/Build/Intermediates.noindex/IBDecodable.build/Debug-xros/IBDecodable.build/Objects-normal/arm64/IBDecodable-OutputFileMap.json -use-frontend-parseable-output -save-temps -no-color-diagnostics -serialize-diagnostics -emit-dependencies -emit-module -emit-module-path /Users/admin/builder/spi-builder-workspace/.derivedData/Build/Intermediates.noindex/IBDecodable.build/Debug-xros/IBDecodable.build/Objects-normal/arm64/IBDecodable.swiftmodule -validate-clang-modules-once -clang-build-session-file /Users/admin/builder/spi-builder-workspace/.derivedData/ModuleCache.noindex/Session.modulevalidation -Xcc -I/Users/admin/builder/spi-builder-workspace/.derivedData/Build/Intermediates.noindex/IBDecodable.build/Debug-xros/IBDecodable.build/swift-overrides.hmap -emit-const-values -Xfrontend -const-gather-protocols-file -Xfrontend /Users/admin/builder/spi-builder-workspace/.derivedData/Build/Intermediates.noindex/IBDecodable.build/Debug-xros/IBDecodable.build/Objects-normal/arm64/IBDecodable_const_extract_protocols.json -Xcc -I/Users/admin/builder/spi-builder-workspace/.derivedData/Build/Products/Debug-xros/include -Xcc -I/Users/admin/builder/spi-builder-workspace/.derivedData/Build/Intermediates.noindex/IBDecodable.build/Debug-xros/IBDecodable.build/DerivedSources-normal/arm64 -Xcc -I/Users/admin/builder/spi-builder-workspace/.derivedData/Build/Intermediates.noindex/IBDecodable.build/Debug-xros/IBDecodable.build/DerivedSources/arm64 -Xcc -I/Users/admin/builder/spi-builder-workspace/.derivedData/Build/Intermediates.noindex/IBDecodable.build/Debug-xros/IBDecodable.build/DerivedSources -Xcc -DSWIFT_PACKAGE -Xcc -DDEBUG\=1 -emit-objc-header -emit-objc-header-path /Users/admin/builder/spi-builder-workspace/.derivedData/Build/Intermediates.noindex/IBDecodable.build/Debug-xros/IBDecodable.build/Objects-normal/arm64/IBDecodable-Swift.h -working-directory /Users/admin/builder/spi-builder-workspace/.swiftpm/xcode -experimental-emit-module-separately -disable-cmo
SwiftEmitModule normal arm64 Emitting\ module\ for\ IBDecodable (in target 'IBDecodable' from project 'IBDecodable')
EmitSwiftModule normal arm64 (in target 'IBDecodable' from project 'IBDecodable')
    cd /Users/admin/builder/spi-builder-workspace/.swiftpm/xcode

SwiftCompile normal arm64 Compiling\ IBError.swift,\ IBProtocol.swift,\ Accessibility.swift,\ AttributedString.swift,\ Classes.swift,\ Color.swift,\ Action.swift,\ AnyConnection.swift,\ Outlet.swift /Users/admin/builder/spi-builder-workspace/.dependencies/checkouts/IBDecodable/Sources/IBError.swift /Users/admin/builder/spi-builder-workspace/.dependencies/checkouts/IBDecodable/Sources/IBProtocol.swift /Users/admin/builder/spi-builder-workspace/.dependencies/checkouts/IBDecodable/Sources/Models/Accessibility.swift /Users/admin/builder/spi-builder-workspace/.dependencies/checkouts/IBDecodable/Sources/Models/AttributedString.swift /Users/admin/builder/spi-builder-workspace/.dependencies/checkouts/IBDecodable/Sources/Models/Classes.swift /Users/admin/builder/spi-builder-workspace/.dependencies/checkouts/IBDecodable/Sources/Models/Color.swift /Users/admin/builder/spi-builder-workspace/.dependencies/checkouts/IBDecodable/Sources/Models/Connections/Action.swift /Users/admin/builder/spi-builder-workspace/.dependencies/checkouts/IBDecodable/Sources/Models/Connections/AnyConnection.swift /Users/admin/builder/spi-builder-workspace/.dependencies/checkouts/IBDecodable/Sources/Models/Connections/Outlet.swift (in target 'IBDecodable' from project 'IBDecodable')
SwiftCompile normal arm64 /Users/admin/builder/spi-builder-workspace/.dependencies/checkouts/IBDecodable/Sources/IBError.swift (in target 'IBDecodable' from project 'IBDecodable')
    cd /Users/admin/builder/spi-builder-workspace/.swiftpm/xcode

SwiftCompile normal arm64 /Users/admin/builder/spi-builder-workspace/.dependencies/checkouts/IBDecodable/Sources/IBProtocol.swift (in target 'IBDecodable' from project 'IBDecodable')
    cd /Users/admin/builder/spi-builder-workspace/.swiftpm/xcode

SwiftCompile normal arm64 /Users/admin/builder/spi-builder-workspace/.dependencies/checkouts/IBDecodable/Sources/Models/Accessibility.swift (in target 'IBDecodable' from project 'IBDecodable')
    cd /Users/admin/builder/spi-builder-workspace/.swiftpm/xcode

SwiftCompile normal arm64 /Users/admin/builder/spi-builder-workspace/.dependencies/checkouts/IBDecodable/Sources/Models/AttributedString.swift (in target 'IBDecodable' from project 'IBDecodable')
    cd /Users/admin/builder/spi-builder-workspace/.swiftpm/xcode

SwiftCompile normal arm64 /Users/admin/builder/spi-builder-workspace/.dependencies/checkouts/IBDecodable/Sources/Models/Classes.swift (in target 'IBDecodable' from project 'IBDecodable')
    cd /Users/admin/builder/spi-builder-workspace/.swiftpm/xcode

SwiftCompile normal arm64 /Users/admin/builder/spi-builder-workspace/.dependencies/checkouts/IBDecodable/Sources/Models/Color.swift (in target 'IBDecodable' from project 'IBDecodable')
    cd /Users/admin/builder/spi-builder-workspace/.swiftpm/xcode

SwiftCompile normal arm64 /Users/admin/builder/spi-builder-workspace/.dependencies/checkouts/IBDecodable/Sources/Models/Connections/Action.swift (in target 'IBDecodable' from project 'IBDecodable')
    cd /Users/admin/builder/spi-builder-workspace/.swiftpm/xcode

SwiftCompile normal arm64 /Users/admin/builder/spi-builder-workspace/.dependencies/checkouts/IBDecodable/Sources/Models/Connections/AnyConnection.swift (in target 'IBDecodable' from project 'IBDecodable')
    cd /Users/admin/builder/spi-builder-workspace/.swiftpm/xcode

SwiftCompile normal arm64 /Users/admin/builder/spi-builder-workspace/.dependencies/checkouts/IBDecodable/Sources/Models/Connections/Outlet.swift (in target 'IBDecodable' from project 'IBDecodable')
    cd /Users/admin/builder/spi-builder-workspace/.swiftpm/xcode

SwiftCompile normal arm64 Compiling\ Button.swift,\ ControlProtocol.swift,\ DatePicker.swift,\ PageControl.swift,\ SegmentedControl.swift,\ Slider.swift,\ Stepper.swift,\ Switch.swift,\ TextField.swift /Users/admin/builder/spi-builder-workspace/.dependencies/checkouts/IBDecodable/Sources/Models/Views/Controls/Button.swift /Users/admin/builder/spi-builder-workspace/.dependencies/checkouts/IBDecodable/Sources/Models/Views/Controls/ControlProtocol.swift /Users/admin/builder/spi-builder-workspace/.dependencies/checkouts/IBDecodable/Sources/Models/Views/Controls/DatePicker.swift /Users/admin/builder/spi-builder-workspace/.dependencies/checkouts/IBDecodable/Sources/Models/Views/Controls/PageControl.swift /Users/admin/builder/spi-builder-workspace/.dependencies/checkouts/IBDecodable/Sources/Models/Views/Controls/SegmentedControl.swift /Users/admin/builder/spi-builder-workspace/.dependencies/checkouts/IBDecodable/Sources/Models/Views/Controls/Slider.swift /Users/admin/builder/spi-builder-workspace/.dependencies/checkouts/IBDecodable/Sources/Models/Views/Controls/Stepper.swift /Users/admin/builder/spi-builder-workspace/.dependencies/checkouts/IBDecodable/Sources/Models/Views/Controls/Switch.swift /Users/admin/builder/spi-builder-workspace/.dependencies/checkouts/IBDecodable/Sources/Models/Views/Controls/TextField.swift (in target 'IBDecodable' from project 'IBDecodable')
SwiftCompile normal arm64 /Users/admin/builder/spi-builder-workspace/.dependencies/checkouts/IBDecodable/Sources/Models/Views/Controls/Button.swift (in target 'IBDecodable' from project 'IBDecodable')
    cd /Users/admin/builder/spi-builder-workspace/.swiftpm/xcode

SwiftCompile normal arm64 /Users/admin/builder/spi-builder-workspace/.dependencies/checkouts/IBDecodable/Sources/Models/Views/Controls/ControlProtocol.swift (in target 'IBDecodable' from project 'IBDecodable')
    cd /Users/admin/builder/spi-builder-workspace/.swiftpm/xcode

SwiftCompile normal arm64 /Users/admin/builder/spi-builder-workspace/.dependencies/checkouts/IBDecodable/Sources/Models/Views/Controls/DatePicker.swift (in target 'IBDecodable' from project 'IBDecodable')
    cd /Users/admin/builder/spi-builder-workspace/.swiftpm/xcode

SwiftCompile normal arm64 /Users/admin/builder/spi-builder-workspace/.dependencies/checkouts/IBDecodable/Sources/Models/Views/Controls/PageControl.swift (in target 'IBDecodable' from project 'IBDecodable')
    cd /Users/admin/builder/spi-builder-workspace/.swiftpm/xcode

SwiftCompile normal arm64 /Users/admin/builder/spi-builder-workspace/.dependencies/checkouts/IBDecodable/Sources/Models/Views/Controls/SegmentedControl.swift (in target 'IBDecodable' from project 'IBDecodable')
    cd /Users/admin/builder/spi-builder-workspace/.swiftpm/xcode

SwiftCompile normal arm64 /Users/admin/builder/spi-builder-workspace/.dependencies/checkouts/IBDecodable/Sources/Models/Views/Controls/Slider.swift (in target 'IBDecodable' from project 'IBDecodable')
    cd /Users/admin/builder/spi-builder-workspace/.swiftpm/xcode

SwiftCompile normal arm64 /Users/admin/builder/spi-builder-workspace/.dependencies/checkouts/IBDecodable/Sources/Models/Views/Controls/Stepper.swift (in target 'IBDecodable' from project 'IBDecodable')
    cd /Users/admin/builder/spi-builder-workspace/.swiftpm/xcode

SwiftCompile normal arm64 /Users/admin/builder/spi-builder-workspace/.dependencies/checkouts/IBDecodable/Sources/Models/Views/Controls/Switch.swift (in target 'IBDecodable' from project 'IBDecodable')
    cd /Users/admin/builder/spi-builder-workspace/.swiftpm/xcode

SwiftCompile normal arm64 /Users/admin/builder/spi-builder-workspace/.dependencies/checkouts/IBDecodable/Sources/Models/Views/Controls/TextField.swift (in target 'IBDecodable' from project 'IBDecodable')
    cd /Users/admin/builder/spi-builder-workspace/.swiftpm/xcode

SwiftCompile normal arm64 Compiling\ OutletCollection.swift,\ Segue.swift,\ AnyViewController.swift,\ CollectionViewController.swift,\ AVPlayerViewController.swift,\ GLKViewController.swift,\ HostingController.swift,\ NavigationController.swift,\ PageViewController.swift /Users/admin/builder/spi-builder-workspace/.dependencies/checkouts/IBDecodable/Sources/Models/Connections/OutletCollection.swift /Users/admin/builder/spi-builder-workspace/.dependencies/checkouts/IBDecodable/Sources/Models/Connections/Segue.swift /Users/admin/builder/spi-builder-workspace/.dependencies/checkouts/IBDecodable/Sources/Models/Controllers/AnyViewController.swift /Users/admin/builder/spi-builder-workspace/.dependencies/checkouts/IBDecodable/Sources/Models/Controllers/CollectionViewController.swift /Users/admin/builder/spi-builder-workspace/.dependencies/checkouts/IBDecodable/Sources/Models/Controllers/Frameworks/AVPlayerViewController.swift /Users/admin/builder/spi-builder-workspace/.dependencies/checkouts/IBDecodable/Sources/Models/Controllers/Frameworks/GLKViewController.swift /Users/admin/builder/spi-builder-workspace/.dependencies/checkouts/IBDecodable/Sources/Models/Controllers/HostingController.swift /Users/admin/builder/spi-builder-workspace/.dependencies/checkouts/IBDecodable/Sources/Models/Controllers/NavigationController.swift /Users/admin/builder/spi-builder-workspace/.dependencies/checkouts/IBDecodable/Sources/Models/Controllers/PageViewController.swift (in target 'IBDecodable' from project 'IBDecodable')
SwiftCompile normal arm64 /Users/admin/builder/spi-builder-workspace/.dependencies/checkouts/IBDecodable/Sources/Models/Connections/OutletCollection.swift (in target 'IBDecodable' from project 'IBDecodable')
    cd /Users/admin/builder/spi-builder-workspace/.swiftpm/xcode

SwiftCompile normal arm64 /Users/admin/builder/spi-builder-workspace/.dependencies/checkouts/IBDecodable/Sources/Models/Connections/Segue.swift (in target 'IBDecodable' from project 'IBDecodable')
    cd /Users/admin/builder/spi-builder-workspace/.swiftpm/xcode

SwiftCompile normal arm64 /Users/admin/builder/spi-builder-workspace/.dependencies/checkouts/IBDecodable/Sources/Models/Controllers/AnyViewController.swift (in target 'IBDecodable' from project 'IBDecodable')
    cd /Users/admin/builder/spi-builder-workspace/.swiftpm/xcode

SwiftCompile normal arm64 /Users/admin/builder/spi-builder-workspace/.dependencies/checkouts/IBDecodable/Sources/Models/Controllers/CollectionViewController.swift (in target 'IBDecodable' from project 'IBDecodable')
    cd /Users/admin/builder/spi-builder-workspace/.swiftpm/xcode

SwiftCompile normal arm64 /Users/admin/builder/spi-builder-workspace/.dependencies/checkouts/IBDecodable/Sources/Models/Controllers/Frameworks/AVPlayerViewController.swift (in target 'IBDecodable' from project 'IBDecodable')
    cd /Users/admin/builder/spi-builder-workspace/.swiftpm/xcode

SwiftCompile normal arm64 /Users/admin/builder/spi-builder-workspace/.dependencies/checkouts/IBDecodable/Sources/Models/Controllers/Frameworks/GLKViewController.swift (in target 'IBDecodable' from project 'IBDecodable')
    cd /Users/admin/builder/spi-builder-workspace/.swiftpm/xcode

SwiftCompile normal arm64 /Users/admin/builder/spi-builder-workspace/.dependencies/checkouts/IBDecodable/Sources/Models/Controllers/HostingController.swift (in target 'IBDecodable' from project 'IBDecodable')
    cd /Users/admin/builder/spi-builder-workspace/.swiftpm/xcode

SwiftCompile normal arm64 /Users/admin/builder/spi-builder-workspace/.dependencies/checkouts/IBDecodable/Sources/Models/Controllers/NavigationController.swift (in target 'IBDecodable' from project 'IBDecodable')
    cd /Users/admin/builder/spi-builder-workspace/.swiftpm/xcode

SwiftCompile normal arm64 /Users/admin/builder/spi-builder-workspace/.dependencies/checkouts/IBDecodable/Sources/Models/Controllers/PageViewController.swift (in target 'IBDecodable' from project 'IBDecodable')
    cd /Users/admin/builder/spi-builder-workspace/.swiftpm/xcode

SwiftCompile normal arm64 Compiling\ View.swift,\ VisualEffectView.swift,\ InterfaceBuilderParser.swift,\ MapXMLIndexerContainer.swift,\ MappedCodingKey.swift,\ XMLDecodable.swift,\ XMLIndexer.swift,\ XMLIndexerContainer.swift /Users/admin/builder/spi-builder-workspace/.dependencies/checkouts/IBDecodable/Sources/Models/Views/View.swift /Users/admin/builder/spi-builder-workspace/.dependencies/checkouts/IBDecodable/Sources/Models/Views/VisualEffectView.swift /Users/admin/builder/spi-builder-workspace/.dependencies/checkouts/IBDecodable/Sources/Parsers/InterfaceBuilderParser.swift /Users/admin/builder/spi-builder-workspace/.dependencies/checkouts/IBDecodable/Sources/XMLDecodable/MapXMLIndexerContainer.swift /Users/admin/builder/spi-builder-workspace/.dependencies/checkouts/IBDecodable/Sources/XMLDecodable/MappedCodingKey.swift /Users/admin/builder/spi-builder-workspace/.dependencies/checkouts/IBDecodable/Sources/XMLDecodable/XMLDecodable.swift /Users/admin/builder/spi-builder-workspace/.dependencies/checkouts/IBDecodable/Sources/XMLDecodable/XMLIndexer.swift /Users/admin/builder/spi-builder-workspace/.dependencies/checkouts/IBDecodable/Sources/XMLDecodable/XMLIndexerContainer.swift (in target 'IBDecodable' from project 'IBDecodable')
SwiftCompile normal arm64 /Users/admin/builder/spi-builder-workspace/.dependencies/checkouts/IBDecodable/Sources/Models/Views/View.swift (in target 'IBDecodable' from project 'IBDecodable')
    cd /Users/admin/builder/spi-builder-workspace/.swiftpm/xcode

SwiftCompile normal arm64 /Users/admin/builder/spi-builder-workspace/.dependencies/checkouts/IBDecodable/Sources/Models/Views/VisualEffectView.swift (in target 'IBDecodable' from project 'IBDecodable')
    cd /Users/admin/builder/spi-builder-workspace/.swiftpm/xcode

SwiftCompile normal arm64 /Users/admin/builder/spi-builder-workspace/.dependencies/checkouts/IBDecodable/Sources/Parsers/InterfaceBuilderParser.swift (in target 'IBDecodable' from project 'IBDecodable')
    cd /Users/admin/builder/spi-builder-workspace/.swiftpm/xcode

SwiftCompile normal arm64 /Users/admin/builder/spi-builder-workspace/.dependencies/checkouts/IBDecodable/Sources/XMLDecodable/MapXMLIndexerContainer.swift (in target 'IBDecodable' from project 'IBDecodable')
    cd /Users/admin/builder/spi-builder-workspace/.swiftpm/xcode

SwiftCompile normal arm64 /Users/admin/builder/spi-builder-workspace/.dependencies/checkouts/IBDecodable/Sources/XMLDecodable/MappedCodingKey.swift (in target 'IBDecodable' from project 'IBDecodable')
    cd /Users/admin/builder/spi-builder-workspace/.swiftpm/xcode

SwiftCompile normal arm64 /Users/admin/builder/spi-builder-workspace/.dependencies/checkouts/IBDecodable/Sources/XMLDecodable/XMLDecodable.swift (in target 'IBDecodable' from project 'IBDecodable')
    cd /Users/admin/builder/spi-builder-workspace/.swiftpm/xcode

SwiftCompile normal arm64 /Users/admin/builder/spi-builder-workspace/.dependencies/checkouts/IBDecodable/Sources/XMLDecodable/XMLIndexer.swift (in target 'IBDecodable' from project 'IBDecodable')
    cd /Users/admin/builder/spi-builder-workspace/.swiftpm/xcode

SwiftCompile normal arm64 /Users/admin/builder/spi-builder-workspace/.dependencies/checkouts/IBDecodable/Sources/XMLDecodable/XMLIndexerContainer.swift (in target 'IBDecodable' from project 'IBDecodable')
    cd /Users/admin/builder/spi-builder-workspace/.swiftpm/xcode

SwiftCompile normal arm64 Compiling\ Geometry.swift,\ KeyCommand.swift,\ ModalPresentationStyle.swift,\ ModalTransitionStyle.swift,\ Primitive.swift,\ AnyResource.swift,\ Image.swift,\ NamedColor.swift,\ SystemColor.swift /Users/admin/builder/spi-builder-workspace/.dependencies/checkouts/IBDecodable/Sources/Models/Geometry.swift /Users/admin/builder/spi-builder-workspace/.dependencies/checkouts/IBDecodable/Sources/Models/KeyCommand.swift /Users/admin/builder/spi-builder-workspace/.dependencies/checkouts/IBDecodable/Sources/Models/ModalPresentationStyle.swift /Users/admin/builder/spi-builder-workspace/.dependencies/checkouts/IBDecodable/Sources/Models/ModalTransitionStyle.swift /Users/admin/builder/spi-builder-workspace/.dependencies/checkouts/IBDecodable/Sources/Models/Primitive.swift /Users/admin/builder/spi-builder-workspace/.dependencies/checkouts/IBDecodable/Sources/Models/Resources/AnyResource.swift /Users/admin/builder/spi-builder-workspace/.dependencies/checkouts/IBDecodable/Sources/Models/Resources/Image.swift /Users/admin/builder/spi-builder-workspace/.dependencies/checkouts/IBDecodable/Sources/Models/Resources/NamedColor.swift /Users/admin/builder/spi-builder-workspace/.dependencies/checkouts/IBDecodable/Sources/Models/Resources/SystemColor.swift (in target 'IBDecodable' from project 'IBDecodable')
SwiftCompile normal arm64 /Users/admin/builder/spi-builder-workspace/.dependencies/checkouts/IBDecodable/Sources/Models/Geometry.swift (in target 'IBDecodable' from project 'IBDecodable')
    cd /Users/admin/builder/spi-builder-workspace/.swiftpm/xcode

SwiftCompile normal arm64 /Users/admin/builder/spi-builder-workspace/.dependencies/checkouts/IBDecodable/Sources/Models/KeyCommand.swift (in target 'IBDecodable' from project 'IBDecodable')
    cd /Users/admin/builder/spi-builder-workspace/.swiftpm/xcode

SwiftCompile normal arm64 /Users/admin/builder/spi-builder-workspace/.dependencies/checkouts/IBDecodable/Sources/Models/ModalPresentationStyle.swift (in target 'IBDecodable' from project 'IBDecodable')
    cd /Users/admin/builder/spi-builder-workspace/.swiftpm/xcode

SwiftCompile normal arm64 /Users/admin/builder/spi-builder-workspace/.dependencies/checkouts/IBDecodable/Sources/Models/ModalTransitionStyle.swift (in target 'IBDecodable' from project 'IBDecodable')
    cd /Users/admin/builder/spi-builder-workspace/.swiftpm/xcode

SwiftCompile normal arm64 /Users/admin/builder/spi-builder-workspace/.dependencies/checkouts/IBDecodable/Sources/Models/Primitive.swift (in target 'IBDecodable' from project 'IBDecodable')
    cd /Users/admin/builder/spi-builder-workspace/.swiftpm/xcode

SwiftCompile normal arm64 /Users/admin/builder/spi-builder-workspace/.dependencies/checkouts/IBDecodable/Sources/Models/Resources/AnyResource.swift (in target 'IBDecodable' from project 'IBDecodable')
    cd /Users/admin/builder/spi-builder-workspace/.swiftpm/xcode

SwiftCompile normal arm64 /Users/admin/builder/spi-builder-workspace/.dependencies/checkouts/IBDecodable/Sources/Models/Resources/Image.swift (in target 'IBDecodable' from project 'IBDecodable')
    cd /Users/admin/builder/spi-builder-workspace/.swiftpm/xcode

SwiftCompile normal arm64 /Users/admin/builder/spi-builder-workspace/.dependencies/checkouts/IBDecodable/Sources/Models/Resources/NamedColor.swift (in target 'IBDecodable' from project 'IBDecodable')
    cd /Users/admin/builder/spi-builder-workspace/.swiftpm/xcode

SwiftCompile normal arm64 /Users/admin/builder/spi-builder-workspace/.dependencies/checkouts/IBDecodable/Sources/Models/Resources/SystemColor.swift (in target 'IBDecodable' from project 'IBDecodable')
    cd /Users/admin/builder/spi-builder-workspace/.swiftpm/xcode

SwiftCompile normal arm64 Compiling\ TextView.swift,\ ARSCNView.swift,\ ARSKView.swift,\ GLKView.swift,\ MTKView.swift,\ MapView.swift,\ SKView.swift,\ SceneKitView.swift,\ WKWebView.swift /Users/admin/builder/spi-builder-workspace/.dependencies/checkouts/IBDecodable/Sources/Models/Views/Controls/TextView.swift /Users/admin/builder/spi-builder-workspace/.dependencies/checkouts/IBDecodable/Sources/Models/Views/Frameworks/ARSCNView.swift /Users/admin/builder/spi-builder-workspace/.dependencies/checkouts/IBDecodable/Sources/Models/Views/Frameworks/ARSKView.swift /Users/admin/builder/spi-builder-workspace/.dependencies/checkouts/IBDecodable/Sources/Models/Views/Frameworks/GLKView.swift /Users/admin/builder/spi-builder-workspace/.dependencies/checkouts/IBDecodable/Sources/Models/Views/Frameworks/MTKView.swift /Users/admin/builder/spi-builder-workspace/.dependencies/checkouts/IBDecodable/Sources/Models/Views/Frameworks/MapView.swift /Users/admin/builder/spi-builder-workspace/.dependencies/checkouts/IBDecodable/Sources/Models/Views/Frameworks/SKView.swift /Users/admin/builder/spi-builder-workspace/.dependencies/checkouts/IBDecodable/Sources/Models/Views/Frameworks/SceneKitView.swift /Users/admin/builder/spi-builder-workspace/.dependencies/checkouts/IBDecodable/Sources/Models/Views/Frameworks/WKWebView.swift (in target 'IBDecodable' from project 'IBDecodable')
SwiftCompile normal arm64 /Users/admin/builder/spi-builder-workspace/.dependencies/checkouts/IBDecodable/Sources/Models/Views/Controls/TextView.swift (in target 'IBDecodable' from project 'IBDecodable')
    cd /Users/admin/builder/spi-builder-workspace/.swiftpm/xcode

SwiftCompile normal arm64 /Users/admin/builder/spi-builder-workspace/.dependencies/checkouts/IBDecodable/Sources/Models/Views/Frameworks/ARSCNView.swift (in target 'IBDecodable' from project 'IBDecodable')
    cd /Users/admin/builder/spi-builder-workspace/.swiftpm/xcode

SwiftCompile normal arm64 /Users/admin/builder/spi-builder-workspace/.dependencies/checkouts/IBDecodable/Sources/Models/Views/Frameworks/ARSKView.swift (in target 'IBDecodable' from project 'IBDecodable')
    cd /Users/admin/builder/spi-builder-workspace/.swiftpm/xcode

SwiftCompile normal arm64 /Users/admin/builder/spi-builder-workspace/.dependencies/checkouts/IBDecodable/Sources/Models/Views/Frameworks/GLKView.swift (in target 'IBDecodable' from project 'IBDecodable')
    cd /Users/admin/builder/spi-builder-workspace/.swiftpm/xcode

SwiftCompile normal arm64 /Users/admin/builder/spi-builder-workspace/.dependencies/checkouts/IBDecodable/Sources/Models/Views/Frameworks/MTKView.swift (in target 'IBDecodable' from project 'IBDecodable')
    cd /Users/admin/builder/spi-builder-workspace/.swiftpm/xcode

SwiftCompile normal arm64 /Users/admin/builder/spi-builder-workspace/.dependencies/checkouts/IBDecodable/Sources/Models/Views/Frameworks/MapView.swift (in target 'IBDecodable' from project 'IBDecodable')
    cd /Users/admin/builder/spi-builder-workspace/.swiftpm/xcode

SwiftCompile normal arm64 /Users/admin/builder/spi-builder-workspace/.dependencies/checkouts/IBDecodable/Sources/Models/Views/Frameworks/SKView.swift (in target 'IBDecodable' from project 'IBDecodable')
    cd /Users/admin/builder/spi-builder-workspace/.swiftpm/xcode

SwiftCompile normal arm64 /Users/admin/builder/spi-builder-workspace/.dependencies/checkouts/IBDecodable/Sources/Models/Views/Frameworks/SceneKitView.swift (in target 'IBDecodable' from project 'IBDecodable')
    cd /Users/admin/builder/spi-builder-workspace/.swiftpm/xcode

SwiftCompile normal arm64 /Users/admin/builder/spi-builder-workspace/.dependencies/checkouts/IBDecodable/Sources/Models/Views/Frameworks/WKWebView.swift (in target 'IBDecodable' from project 'IBDecodable')
    cd /Users/admin/builder/spi-builder-workspace/.swiftpm/xcode

SwiftCompile normal arm64 Compiling\ ImageView.swift,\ Label.swift,\ Picker.swift,\ ProgressView.swift,\ CollectionView.swift,\ ScrollView.swift,\ TableView.swift,\ StackView.swift /Users/admin/builder/spi-builder-workspace/.dependencies/checkouts/IBDecodable/Sources/Models/Views/ImageView.swift /Users/admin/builder/spi-builder-workspace/.dependencies/checkouts/IBDecodable/Sources/Models/Views/Label.swift /Users/admin/builder/spi-builder-workspace/.dependencies/checkouts/IBDecodable/Sources/Models/Views/Picker.swift /Users/admin/builder/spi-builder-workspace/.dependencies/checkouts/IBDecodable/Sources/Models/Views/ProgressView.swift /Users/admin/builder/spi-builder-workspace/.dependencies/checkouts/IBDecodable/Sources/Models/Views/ScrollViews/CollectionView.swift /Users/admin/builder/spi-builder-workspace/.dependencies/checkouts/IBDecodable/Sources/Models/Views/ScrollViews/ScrollView.swift /Users/admin/builder/spi-builder-workspace/.dependencies/checkouts/IBDecodable/Sources/Models/Views/ScrollViews/TableView.swift /Users/admin/builder/spi-builder-workspace/.dependencies/checkouts/IBDecodable/Sources/Models/Views/StackView.swift (in target 'IBDecodable' from project 'IBDecodable')
SwiftCompile normal arm64 /Users/admin/builder/spi-builder-workspace/.dependencies/checkouts/IBDecodable/Sources/Models/Views/ImageView.swift (in target 'IBDecodable' from project 'IBDecodable')
    cd /Users/admin/builder/spi-builder-workspace/.swiftpm/xcode

SwiftCompile normal arm64 /Users/admin/builder/spi-builder-workspace/.dependencies/checkouts/IBDecodable/Sources/Models/Views/Label.swift (in target 'IBDecodable' from project 'IBDecodable')
    cd /Users/admin/builder/spi-builder-workspace/.swiftpm/xcode

SwiftCompile normal arm64 /Users/admin/builder/spi-builder-workspace/.dependencies/checkouts/IBDecodable/Sources/Models/Views/Picker.swift (in target 'IBDecodable' from project 'IBDecodable')
    cd /Users/admin/builder/spi-builder-workspace/.swiftpm/xcode

SwiftCompile normal arm64 /Users/admin/builder/spi-builder-workspace/.dependencies/checkouts/IBDecodable/Sources/Models/Views/ProgressView.swift (in target 'IBDecodable' from project 'IBDecodable')
    cd /Users/admin/builder/spi-builder-workspace/.swiftpm/xcode

SwiftCompile normal arm64 /Users/admin/builder/spi-builder-workspace/.dependencies/checkouts/IBDecodable/Sources/Models/Views/ScrollViews/CollectionView.swift (in target 'IBDecodable' from project 'IBDecodable')
    cd /Users/admin/builder/spi-builder-workspace/.swiftpm/xcode

SwiftCompile normal arm64 /Users/admin/builder/spi-builder-workspace/.dependencies/checkouts/IBDecodable/Sources/Models/Views/ScrollViews/ScrollView.swift (in target 'IBDecodable' from project 'IBDecodable')
    cd /Users/admin/builder/spi-builder-workspace/.swiftpm/xcode

SwiftCompile normal arm64 /Users/admin/builder/spi-builder-workspace/.dependencies/checkouts/IBDecodable/Sources/Models/Views/ScrollViews/TableView.swift (in target 'IBDecodable' from project 'IBDecodable')
    cd /Users/admin/builder/spi-builder-workspace/.swiftpm/xcode

SwiftCompile normal arm64 /Users/admin/builder/spi-builder-workspace/.dependencies/checkouts/IBDecodable/Sources/Models/Views/StackView.swift (in target 'IBDecodable' from project 'IBDecodable')
    cd /Users/admin/builder/spi-builder-workspace/.swiftpm/xcode

SwiftEmitModule normal arm64 Emitting\ module\ for\ Commandant (in target 'Commandant' from project 'Commandant')
EmitSwiftModule normal arm64 (in target 'Commandant' from project 'Commandant')
    cd /Users/admin/builder/spi-builder-workspace/.swiftpm/xcode

SwiftCompile normal arm64 Compiling\ StringElement.swift,\ UserDefinedRuntimeAttribute.swift,\ Variation.swift,\ ActivityIndicatorView.swift,\ AnyView.swift,\ NavigationBar.swift,\ SearchBar.swift,\ TabBar.swift,\ Toolbar.swift /Users/admin/builder/spi-builder-workspace/.dependencies/checkouts/IBDecodable/Sources/Models/StringElement.swift /Users/admin/builder/spi-builder-workspace/.dependencies/checkouts/IBDecodable/Sources/Models/UserDefinedRuntimeAttribute.swift /Users/admin/builder/spi-builder-workspace/.dependencies/checkouts/IBDecodable/Sources/Models/Variation.swift /Users/admin/builder/spi-builder-workspace/.dependencies/checkouts/IBDecodable/Sources/Models/Views/ActivityIndicatorView.swift /Users/admin/builder/spi-builder-workspace/.dependencies/checkouts/IBDecodable/Sources/Models/Views/AnyView.swift /Users/admin/builder/spi-builder-workspace/.dependencies/checkouts/IBDecodable/Sources/Models/Views/Bar/NavigationBar.swift /Users/admin/builder/spi-builder-workspace/.dependencies/checkouts/IBDecodable/Sources/Models/Views/Bar/SearchBar.swift /Users/admin/builder/spi-builder-workspace/.dependencies/checkouts/IBDecodable/Sources/Models/Views/Bar/TabBar.swift /Users/admin/builder/spi-builder-workspace/.dependencies/checkouts/IBDecodable/Sources/Models/Views/Bar/Toolbar.swift (in target 'IBDecodable' from project 'IBDecodable')
SwiftCompile normal arm64 /Users/admin/builder/spi-builder-workspace/.dependencies/checkouts/IBDecodable/Sources/Models/StringElement.swift (in target 'IBDecodable' from project 'IBDecodable')
    cd /Users/admin/builder/spi-builder-workspace/.swiftpm/xcode

SwiftCompile normal arm64 /Users/admin/builder/spi-builder-workspace/.dependencies/checkouts/IBDecodable/Sources/Models/UserDefinedRuntimeAttribute.swift (in target 'IBDecodable' from project 'IBDecodable')
    cd /Users/admin/builder/spi-builder-workspace/.swiftpm/xcode

SwiftCompile normal arm64 /Users/admin/builder/spi-builder-workspace/.dependencies/checkouts/IBDecodable/Sources/Models/Variation.swift (in target 'IBDecodable' from project 'IBDecodable')
    cd /Users/admin/builder/spi-builder-workspace/.swiftpm/xcode

SwiftCompile normal arm64 /Users/admin/builder/spi-builder-workspace/.dependencies/checkouts/IBDecodable/Sources/Models/Views/ActivityIndicatorView.swift (in target 'IBDecodable' from project 'IBDecodable')
    cd /Users/admin/builder/spi-builder-workspace/.swiftpm/xcode

SwiftCompile normal arm64 /Users/admin/builder/spi-builder-workspace/.dependencies/checkouts/IBDecodable/Sources/Models/Views/AnyView.swift (in target 'IBDecodable' from project 'IBDecodable')
    cd /Users/admin/builder/spi-builder-workspace/.swiftpm/xcode

SwiftCompile normal arm64 /Users/admin/builder/spi-builder-workspace/.dependencies/checkouts/IBDecodable/Sources/Models/Views/Bar/NavigationBar.swift (in target 'IBDecodable' from project 'IBDecodable')
    cd /Users/admin/builder/spi-builder-workspace/.swiftpm/xcode

SwiftCompile normal arm64 /Users/admin/builder/spi-builder-workspace/.dependencies/checkouts/IBDecodable/Sources/Models/Views/Bar/SearchBar.swift (in target 'IBDecodable' from project 'IBDecodable')
    cd /Users/admin/builder/spi-builder-workspace/.swiftpm/xcode

SwiftCompile normal arm64 /Users/admin/builder/spi-builder-workspace/.dependencies/checkouts/IBDecodable/Sources/Models/Views/Bar/TabBar.swift (in target 'IBDecodable' from project 'IBDecodable')
    cd /Users/admin/builder/spi-builder-workspace/.swiftpm/xcode

SwiftCompile normal arm64 /Users/admin/builder/spi-builder-workspace/.dependencies/checkouts/IBDecodable/Sources/Models/Views/Bar/Toolbar.swift (in target 'IBDecodable' from project 'IBDecodable')
    cd /Users/admin/builder/spi-builder-workspace/.swiftpm/xcode

SwiftEmitModule normal arm64 Emitting\ module\ for\ Yams (in target 'Yams' from project 'Yams')
EmitSwiftModule normal arm64 (in target 'Yams' from project 'Yams')
    cd /Users/admin/builder/spi-builder-workspace/.swiftpm/xcode

SwiftEmitModule normal arm64 Emitting\ module\ for\ SWXMLHash (in target 'SWXMLHash' from project 'SWXMLHash')
EmitSwiftModule normal arm64 (in target 'SWXMLHash' from project 'SWXMLHash')
    cd /Users/admin/builder/spi-builder-workspace/.swiftpm/xcode

SwiftDriverJobDiscovery normal arm64 Emitting module for Yams (in target 'Yams' from project 'Yams')
SwiftDriver\ Compilation\ Requirements Yams normal arm64 com.apple.xcode.tools.swift.compiler (in target 'Yams' from project 'Yams')
    cd /Users/admin/builder/spi-builder-workspace/.swiftpm/xcode
    builtin-Swift-Compilation-Requirements -- /Applications/Xcode-26.0.0-Beta.app/Contents/Developer/Toolchains/XcodeDefault.xctoolchain/usr/bin/swiftc -module-name Yams -Onone -enforce-exclusivity\=checked @/Users/admin/builder/spi-builder-workspace/.derivedData/Build/Intermediates.noindex/Yams.build/Debug-xros/Yams.build/Objects-normal/arm64/Yams.SwiftFileList -DSWIFT_PACKAGE -DDEBUG -DSWIFT_MODULE_RESOURCE_BUNDLE_UNAVAILABLE -DXcode -plugin-path /Applications/Xcode-26.0.0-Beta.app/Contents/Developer/Toolchains/XcodeDefault.xctoolchain/usr/lib/swift/host/plugins/testing -enable-experimental-feature DebugDescriptionMacro -sdk /Applications/Xcode-26.0.0-Beta.app/Contents/Developer/Platforms/XROS.platform/Developer/SDKs/XROS26.0.sdk -target arm64-apple-xros1.0 -g -module-cache-path /Users/admin/builder/spi-builder-workspace/.derivedData/ModuleCache.noindex -Xfrontend -serialize-debugging-options -profile-coverage-mapping -profile-generate -enable-testing -suppress-warnings -index-store-path /Users/admin/builder/spi-builder-workspace/.derivedData/Index.noindex/DataStore -swift-version 6 -I /Users/admin/builder/spi-builder-workspace/.derivedData/Build/Products/Debug-xros -I /Applications/Xcode-26.0.0-Beta.app/Contents/Developer/Platforms/XROS.platform/Developer/usr/lib -F /Users/admin/builder/spi-builder-workspace/.derivedData/Build/Products/Debug-xros/PackageFrameworks -F /Users/admin/builder/spi-builder-workspace/.derivedData/Build/Products/Debug-xros -F /Applications/Xcode-26.0.0-Beta.app/Contents/Developer/Platforms/XROS.platform/Developer/Library/Frameworks -F /Applications/Xcode-26.0.0-Beta.app/Contents/Developer/Platforms/XROS.platform/Developer/SDKs/XROS26.0.sdk/Developer/Library/Frameworks -c -j10 -enable-batch-mode -incremental -Xcc -ivfsstatcache -Xcc /Users/admin/builder/spi-builder-workspace/.derivedData/SDKStatCaches.noindex/xros26.0-23M5263k-63777232b7fc5220f33897c1cc69dbf5.sdkstatcache -output-file-map /Users/admin/builder/spi-builder-workspace/.derivedData/Build/Intermediates.noindex/Yams.build/Debug-xros/Yams.build/Objects-normal/arm64/Yams-OutputFileMap.json -use-frontend-parseable-output -save-temps -no-color-diagnostics -explicit-module-build -module-cache-path /Users/admin/builder/spi-builder-workspace/.derivedData/Build/Intermediates.noindex/SwiftExplicitPrecompiledModules -clang-scanner-module-cache-path /Users/admin/builder/spi-builder-workspace/.derivedData/ModuleCache.noindex -sdk-module-cache-path /Users/admin/builder/spi-builder-workspace/.derivedData/ModuleCache.noindex -serialize-diagnostics -emit-dependencies -emit-module -emit-module-path /Users/admin/builder/spi-builder-workspace/.derivedData/Build/Intermediates.noindex/Yams.build/Debug-xros/Yams.build/Objects-normal/arm64/Yams.swiftmodule -user-module-version 6.0.1 -validate-clang-modules-once -clang-build-session-file /Users/admin/builder/spi-builder-workspace/.derivedData/ModuleCache.noindex/Session.modulevalidation -package-name yams -Xcc -I/Users/admin/builder/spi-builder-workspace/.derivedData/Build/Intermediates.noindex/Yams.build/Debug-xros/Yams.build/swift-overrides.hmap -emit-const-values -Xfrontend -const-gather-protocols-file -Xfrontend /Users/admin/builder/spi-builder-workspace/.derivedData/Build/Intermediates.noindex/Yams.build/Debug-xros/Yams.build/Objects-normal/arm64/Yams_const_extract_protocols.json -Xcc -I/Users/admin/builder/spi-builder-workspace/.dependencies/checkouts/Yams/Sources/CYaml/include -Xcc -I/Users/admin/builder/spi-builder-workspace/.derivedData/Build/Products/Debug-xros/include -Xcc -I/Users/admin/builder/spi-builder-workspace/.derivedData/Build/Intermediates.noindex/Yams.build/Debug-xros/Yams.build/DerivedSources-normal/arm64 -Xcc -I/Users/admin/builder/spi-builder-workspace/.derivedData/Build/Intermediates.noindex/Yams.build/Debug-xros/Yams.build/DerivedSources/arm64 -Xcc -I/Users/admin/builder/spi-builder-workspace/.derivedData/Build/Intermediates.noindex/Yams.build/Debug-xros/Yams.build/DerivedSources -Xcc -DSWIFT_PACKAGE -Xcc -DDEBUG\=1 -Xcc -DYAML_DECLARE_STATIC -emit-objc-header -emit-objc-header-path /Users/admin/builder/spi-builder-workspace/.derivedData/Build/Intermediates.noindex/Yams.build/Debug-xros/Yams.build/Objects-normal/arm64/Yams-Swift.h -working-directory /Users/admin/builder/spi-builder-workspace/.swiftpm/xcode -experimental-emit-module-separately -disable-cmo
SwiftCompile normal arm64 Compiling\ RedundancyAliasingStrategy.swift,\ Representer.swift /Users/admin/builder/spi-builder-workspace/.dependencies/checkouts/Yams/Sources/Yams/RedundancyAliasingStrategy.swift /Users/admin/builder/spi-builder-workspace/.dependencies/checkouts/Yams/Sources/Yams/Representer.swift (in target 'Yams' from project 'Yams')
SwiftCompile normal arm64 /Users/admin/builder/spi-builder-workspace/.dependencies/checkouts/Yams/Sources/Yams/RedundancyAliasingStrategy.swift (in target 'Yams' from project 'Yams')
    cd /Users/admin/builder/spi-builder-workspace/.swiftpm/xcode

SwiftCompile normal arm64 /Users/admin/builder/spi-builder-workspace/.dependencies/checkouts/Yams/Sources/Yams/Representer.swift (in target 'Yams' from project 'Yams')
    cd /Users/admin/builder/spi-builder-workspace/.swiftpm/xcode

SwiftMergeGeneratedHeaders /Users/admin/builder/spi-builder-workspace/.derivedData/Build/Intermediates.noindex/GeneratedModuleMaps-xros/Yams-Swift.h /Users/admin/builder/spi-builder-workspace/.derivedData/Build/Intermediates.noindex/Yams.build/Debug-xros/Yams.build/Objects-normal/arm64/Yams-Swift.h (in target 'Yams' from project 'Yams')
    cd /Users/admin/builder/spi-builder-workspace/.dependencies/checkouts/Yams
    builtin-swiftHeaderTool -arch arm64 /Users/admin/builder/spi-builder-workspace/.derivedData/Build/Intermediates.noindex/Yams.build/Debug-xros/Yams.build/Objects-normal/arm64/Yams-Swift.h -o /Users/admin/builder/spi-builder-workspace/.derivedData/Build/Intermediates.noindex/GeneratedModuleMaps-xros/Yams-Swift.h
SwiftDriverJobDiscovery normal arm64 Compiling RedundancyAliasingStrategy.swift, Representer.swift (in target 'Yams' from project 'Yams')
Copy /Users/admin/builder/spi-builder-workspace/.derivedData/Build/Products/Debug-xros/Yams.swiftmodule/arm64-apple-xros.swiftmodule /Users/admin/builder/spi-builder-workspace/.derivedData/Build/Intermediates.noindex/Yams.build/Debug-xros/Yams.build/Objects-normal/arm64/Yams.swiftmodule (in target 'Yams' from project 'Yams')
    cd /Users/admin/builder/spi-builder-workspace/.dependencies/checkouts/Yams
    builtin-copy -exclude .DS_Store -exclude CVS -exclude .svn -exclude .git -exclude .hg -resolve-src-symlinks -rename /Users/admin/builder/spi-builder-workspace/.derivedData/Build/Intermediates.noindex/Yams.build/Debug-xros/Yams.build/Objects-normal/arm64/Yams.swiftmodule /Users/admin/builder/spi-builder-workspace/.derivedData/Build/Products/Debug-xros/Yams.swiftmodule/arm64-apple-xros.swiftmodule
Copy /Users/admin/builder/spi-builder-workspace/.derivedData/Build/Products/Debug-xros/Yams.swiftmodule/arm64-apple-xros.swiftdoc /Users/admin/builder/spi-builder-workspace/.derivedData/Build/Intermediates.noindex/Yams.build/Debug-xros/Yams.build/Objects-normal/arm64/Yams.swiftdoc (in target 'Yams' from project 'Yams')
    cd /Users/admin/builder/spi-builder-workspace/.dependencies/checkouts/Yams
    builtin-copy -exclude .DS_Store -exclude CVS -exclude .svn -exclude .git -exclude .hg -resolve-src-symlinks -rename /Users/admin/builder/spi-builder-workspace/.derivedData/Build/Intermediates.noindex/Yams.build/Debug-xros/Yams.build/Objects-normal/arm64/Yams.swiftdoc /Users/admin/builder/spi-builder-workspace/.derivedData/Build/Products/Debug-xros/Yams.swiftmodule/arm64-apple-xros.swiftdoc
Copy /Users/admin/builder/spi-builder-workspace/.derivedData/Build/Products/Debug-xros/Yams.swiftmodule/arm64-apple-xros.abi.json /Users/admin/builder/spi-builder-workspace/.derivedData/Build/Intermediates.noindex/Yams.build/Debug-xros/Yams.build/Objects-normal/arm64/Yams.abi.json (in target 'Yams' from project 'Yams')
    cd /Users/admin/builder/spi-builder-workspace/.dependencies/checkouts/Yams
    builtin-copy -exclude .DS_Store -exclude CVS -exclude .svn -exclude .git -exclude .hg -resolve-src-symlinks -rename /Users/admin/builder/spi-builder-workspace/.derivedData/Build/Intermediates.noindex/Yams.build/Debug-xros/Yams.build/Objects-normal/arm64/Yams.abi.json /Users/admin/builder/spi-builder-workspace/.derivedData/Build/Products/Debug-xros/Yams.swiftmodule/arm64-apple-xros.abi.json
Copy /Users/admin/builder/spi-builder-workspace/.derivedData/Build/Products/Debug-xros/Yams.swiftmodule/Project/arm64-apple-xros.swiftsourceinfo /Users/admin/builder/spi-builder-workspace/.derivedData/Build/Intermediates.noindex/Yams.build/Debug-xros/Yams.build/Objects-normal/arm64/Yams.swiftsourceinfo (in target 'Yams' from project 'Yams')
    cd /Users/admin/builder/spi-builder-workspace/.dependencies/checkouts/Yams
    builtin-copy -exclude .DS_Store -exclude CVS -exclude .svn -exclude .git -exclude .hg -resolve-src-symlinks -rename /Users/admin/builder/spi-builder-workspace/.derivedData/Build/Intermediates.noindex/Yams.build/Debug-xros/Yams.build/Objects-normal/arm64/Yams.swiftsourceinfo /Users/admin/builder/spi-builder-workspace/.derivedData/Build/Products/Debug-xros/Yams.swiftmodule/Project/arm64-apple-xros.swiftsourceinfo
SwiftCompile normal arm64 Compiling\ Encoder.swift,\ Mark.swift /Users/admin/builder/spi-builder-workspace/.dependencies/checkouts/Yams/Sources/Yams/Encoder.swift /Users/admin/builder/spi-builder-workspace/.dependencies/checkouts/Yams/Sources/Yams/Mark.swift (in target 'Yams' from project 'Yams')
SwiftCompile normal arm64 /Users/admin/builder/spi-builder-workspace/.dependencies/checkouts/Yams/Sources/Yams/Encoder.swift (in target 'Yams' from project 'Yams')
    cd /Users/admin/builder/spi-builder-workspace/.swiftpm/xcode

SwiftCompile normal arm64 /Users/admin/builder/spi-builder-workspace/.dependencies/checkouts/Yams/Sources/Yams/Mark.swift (in target 'Yams' from project 'Yams')
    cd /Users/admin/builder/spi-builder-workspace/.swiftpm/xcode

SwiftCompile normal arm64 Compiling\ Node.swift,\ Parser.swift /Users/admin/builder/spi-builder-workspace/.dependencies/checkouts/Yams/Sources/Yams/Node.swift /Users/admin/builder/spi-builder-workspace/.dependencies/checkouts/Yams/Sources/Yams/Parser.swift (in target 'Yams' from project 'Yams')
SwiftCompile normal arm64 /Users/admin/builder/spi-builder-workspace/.dependencies/checkouts/Yams/Sources/Yams/Node.swift (in target 'Yams' from project 'Yams')
    cd /Users/admin/builder/spi-builder-workspace/.swiftpm/xcode

SwiftCompile normal arm64 /Users/admin/builder/spi-builder-workspace/.dependencies/checkouts/Yams/Sources/Yams/Parser.swift (in target 'Yams' from project 'Yams')
    cd /Users/admin/builder/spi-builder-workspace/.swiftpm/xcode

SwiftDriverJobDiscovery normal arm64 Compiling Encoder.swift, Mark.swift (in target 'Yams' from project 'Yams')
SwiftCompile normal arm64 Compiling\ Decoder.swift,\ Emitter.swift /Users/admin/builder/spi-builder-workspace/.dependencies/checkouts/Yams/Sources/Yams/Decoder.swift /Users/admin/builder/spi-builder-workspace/.dependencies/checkouts/Yams/Sources/Yams/Emitter.swift (in target 'Yams' from project 'Yams')
SwiftCompile normal arm64 /Users/admin/builder/spi-builder-workspace/.dependencies/checkouts/Yams/Sources/Yams/Decoder.swift (in target 'Yams' from project 'Yams')
    cd /Users/admin/builder/spi-builder-workspace/.swiftpm/xcode

SwiftCompile normal arm64 /Users/admin/builder/spi-builder-workspace/.dependencies/checkouts/Yams/Sources/Yams/Emitter.swift (in target 'Yams' from project 'Yams')
    cd /Users/admin/builder/spi-builder-workspace/.swiftpm/xcode

SwiftDriverJobDiscovery normal arm64 Compiling Geometry.swift, KeyCommand.swift, ModalPresentationStyle.swift, ModalTransitionStyle.swift, Primitive.swift, AnyResource.swift, Image.swift, NamedColor.swift, SystemColor.swift (in target 'IBDecodable' from project 'IBDecodable')
SwiftCompile normal arm64 Compiling\ Resolver.swift,\ String+Yams.swift /Users/admin/builder/spi-builder-workspace/.dependencies/checkouts/Yams/Sources/Yams/Resolver.swift /Users/admin/builder/spi-builder-workspace/.dependencies/checkouts/Yams/Sources/Yams/String+Yams.swift (in target 'Yams' from project 'Yams')
SwiftCompile normal arm64 /Users/admin/builder/spi-builder-workspace/.dependencies/checkouts/Yams/Sources/Yams/Resolver.swift (in target 'Yams' from project 'Yams')
    cd /Users/admin/builder/spi-builder-workspace/.swiftpm/xcode

SwiftCompile normal arm64 /Users/admin/builder/spi-builder-workspace/.dependencies/checkouts/Yams/Sources/Yams/String+Yams.swift (in target 'Yams' from project 'Yams')
    cd /Users/admin/builder/spi-builder-workspace/.swiftpm/xcode

SwiftDriverJobDiscovery normal arm64 Compiling View.swift, VisualEffectView.swift, InterfaceBuilderParser.swift, MapXMLIndexerContainer.swift, MappedCodingKey.swift, XMLDecodable.swift, XMLIndexer.swift, XMLIndexerContainer.swift (in target 'IBDecodable' from project 'IBDecodable')
SwiftCompile normal arm64 Compiling\ Node.Alias.swift,\ Node.Mapping.swift /Users/admin/builder/spi-builder-workspace/.dependencies/checkouts/Yams/Sources/Yams/Node.Alias.swift /Users/admin/builder/spi-builder-workspace/.dependencies/checkouts/Yams/Sources/Yams/Node.Mapping.swift (in target 'Yams' from project 'Yams')
SwiftCompile normal arm64 /Users/admin/builder/spi-builder-workspace/.dependencies/checkouts/Yams/Sources/Yams/Node.Alias.swift (in target 'Yams' from project 'Yams')
    cd /Users/admin/builder/spi-builder-workspace/.swiftpm/xcode

SwiftCompile normal arm64 /Users/admin/builder/spi-builder-workspace/.dependencies/checkouts/Yams/Sources/Yams/Node.Mapping.swift (in target 'Yams' from project 'Yams')
    cd /Users/admin/builder/spi-builder-workspace/.swiftpm/xcode

SwiftDriverJobDiscovery normal arm64 Compiling IBError.swift, IBProtocol.swift, Accessibility.swift, AttributedString.swift, Classes.swift, Color.swift, Action.swift, AnyConnection.swift, Outlet.swift (in target 'IBDecodable' from project 'IBDecodable')
SwiftCompile normal arm64 Compiling\ AliasDereferencingStrategy.swift,\ Anchor.swift,\ Constructor.swift /Users/admin/builder/spi-builder-workspace/.dependencies/checkouts/Yams/Sources/Yams/AliasDereferencingStrategy.swift /Users/admin/builder/spi-builder-workspace/.dependencies/checkouts/Yams/Sources/Yams/Anchor.swift /Users/admin/builder/spi-builder-workspace/.dependencies/checkouts/Yams/Sources/Yams/Constructor.swift (in target 'Yams' from project 'Yams')
SwiftCompile normal arm64 /Users/admin/builder/spi-builder-workspace/.dependencies/checkouts/Yams/Sources/Yams/AliasDereferencingStrategy.swift (in target 'Yams' from project 'Yams')
    cd /Users/admin/builder/spi-builder-workspace/.swiftpm/xcode

SwiftCompile normal arm64 /Users/admin/builder/spi-builder-workspace/.dependencies/checkouts/Yams/Sources/Yams/Anchor.swift (in target 'Yams' from project 'Yams')
    cd /Users/admin/builder/spi-builder-workspace/.swiftpm/xcode

SwiftCompile normal arm64 /Users/admin/builder/spi-builder-workspace/.dependencies/checkouts/Yams/Sources/Yams/Constructor.swift (in target 'Yams' from project 'Yams')
    cd /Users/admin/builder/spi-builder-workspace/.swiftpm/xcode

SwiftDriverJobDiscovery normal arm64 Emitting module for IBDecodable (in target 'IBDecodable' from project 'IBDecodable')
SwiftDriver\ Compilation\ Requirements IBDecodable normal arm64 com.apple.xcode.tools.swift.compiler (in target 'IBDecodable' from project 'IBDecodable')
    cd /Users/admin/builder/spi-builder-workspace/.swiftpm/xcode
    builtin-Swift-Compilation-Requirements -- /Applications/Xcode-26.0.0-Beta.app/Contents/Developer/Toolchains/XcodeDefault.xctoolchain/usr/bin/swiftc -module-name IBDecodable -Onone -enforce-exclusivity\=checked @/Users/admin/builder/spi-builder-workspace/.derivedData/Build/Intermediates.noindex/IBDecodable.build/Debug-xros/IBDecodable.build/Objects-normal/arm64/IBDecodable.SwiftFileList -DSWIFT_PACKAGE -DDEBUG -DSWIFT_MODULE_RESOURCE_BUNDLE_UNAVAILABLE -DXcode -plugin-path /Applications/Xcode-26.0.0-Beta.app/Contents/Developer/Toolchains/XcodeDefault.xctoolchain/usr/lib/swift/host/plugins/testing -enable-experimental-feature DebugDescriptionMacro -sdk /Applications/Xcode-26.0.0-Beta.app/Contents/Developer/Platforms/XROS.platform/Developer/SDKs/XROS26.0.sdk -target arm64-apple-xros1.0 -g -module-cache-path /Users/admin/builder/spi-builder-workspace/.derivedData/ModuleCache.noindex -Xfrontend -serialize-debugging-options -profile-coverage-mapping -profile-generate -enable-testing -suppress-warnings -index-store-path /Users/admin/builder/spi-builder-workspace/.derivedData/Index.noindex/DataStore -swift-version 4 -I /Users/admin/builder/spi-builder-workspace/.derivedData/Build/Products/Debug-xros -I /Applications/Xcode-26.0.0-Beta.app/Contents/Developer/Platforms/XROS.platform/Developer/usr/lib -F /Users/admin/builder/spi-builder-workspace/.derivedData/Build/Products/Debug-xros/PackageFrameworks -F /Users/admin/builder/spi-builder-workspace/.derivedData/Build/Products/Debug-xros -F /Applications/Xcode-26.0.0-Beta.app/Contents/Developer/Platforms/XROS.platform/Developer/Library/Frameworks -F /Applications/Xcode-26.0.0-Beta.app/Contents/Developer/Platforms/XROS.platform/Developer/SDKs/XROS26.0.sdk/Developer/Library/Frameworks -c -j10 -enable-batch-mode -incremental -Xcc -ivfsstatcache -Xcc /Users/admin/builder/spi-builder-workspace/.derivedData/SDKStatCaches.noindex/xros26.0-23M5263k-63777232b7fc5220f33897c1cc69dbf5.sdkstatcache -output-file-map /Users/admin/builder/spi-builder-workspace/.derivedData/Build/Intermediates.noindex/IBDecodable.build/Debug-xros/IBDecodable.build/Objects-normal/arm64/IBDecodable-OutputFileMap.json -use-frontend-parseable-output -save-temps -no-color-diagnostics -serialize-diagnostics -emit-dependencies -emit-module -emit-module-path /Users/admin/builder/spi-builder-workspace/.derivedData/Build/Intermediates.noindex/IBDecodable.build/Debug-xros/IBDecodable.build/Objects-normal/arm64/IBDecodable.swiftmodule -validate-clang-modules-once -clang-build-session-file /Users/admin/builder/spi-builder-workspace/.derivedData/ModuleCache.noindex/Session.modulevalidation -Xcc -I/Users/admin/builder/spi-builder-workspace/.derivedData/Build/Intermediates.noindex/IBDecodable.build/Debug-xros/IBDecodable.build/swift-overrides.hmap -emit-const-values -Xfrontend -const-gather-protocols-file -Xfrontend /Users/admin/builder/spi-builder-workspace/.derivedData/Build/Intermediates.noindex/IBDecodable.build/Debug-xros/IBDecodable.build/Objects-normal/arm64/IBDecodable_const_extract_protocols.json -Xcc -I/Users/admin/builder/spi-builder-workspace/.derivedData/Build/Products/Debug-xros/include -Xcc -I/Users/admin/builder/spi-builder-workspace/.derivedData/Build/Intermediates.noindex/IBDecodable.build/Debug-xros/IBDecodable.build/DerivedSources-normal/arm64 -Xcc -I/Users/admin/builder/spi-builder-workspace/.derivedData/Build/Intermediates.noindex/IBDecodable.build/Debug-xros/IBDecodable.build/DerivedSources/arm64 -Xcc -I/Users/admin/builder/spi-builder-workspace/.derivedData/Build/Intermediates.noindex/IBDecodable.build/Debug-xros/IBDecodable.build/DerivedSources -Xcc -DSWIFT_PACKAGE -Xcc -DDEBUG\=1 -emit-objc-header -emit-objc-header-path /Users/admin/builder/spi-builder-workspace/.derivedData/Build/Intermediates.noindex/IBDecodable.build/Debug-xros/IBDecodable.build/Objects-normal/arm64/IBDecodable-Swift.h -working-directory /Users/admin/builder/spi-builder-workspace/.swiftpm/xcode -experimental-emit-module-separately -disable-cmo
SwiftDriverJobDiscovery normal arm64 Compiling Resolver.swift, String+Yams.swift (in target 'Yams' from project 'Yams')
SwiftCompile normal arm64 Compiling\ Node.Scalar.swift,\ Node.Sequence.swift /Users/admin/builder/spi-builder-workspace/.dependencies/checkouts/Yams/Sources/Yams/Node.Scalar.swift /Users/admin/builder/spi-builder-workspace/.dependencies/checkouts/Yams/Sources/Yams/Node.Sequence.swift (in target 'Yams' from project 'Yams')
SwiftCompile normal arm64 /Users/admin/builder/spi-builder-workspace/.dependencies/checkouts/Yams/Sources/Yams/Node.Scalar.swift (in target 'Yams' from project 'Yams')
    cd /Users/admin/builder/spi-builder-workspace/.swiftpm/xcode

SwiftCompile normal arm64 /Users/admin/builder/spi-builder-workspace/.dependencies/checkouts/Yams/Sources/Yams/Node.Sequence.swift (in target 'Yams' from project 'Yams')
    cd /Users/admin/builder/spi-builder-workspace/.swiftpm/xcode

SwiftMergeGeneratedHeaders /Users/admin/builder/spi-builder-workspace/.derivedData/Build/Intermediates.noindex/GeneratedModuleMaps-xros/IBDecodable-Swift.h /Users/admin/builder/spi-builder-workspace/.derivedData/Build/Intermediates.noindex/IBDecodable.build/Debug-xros/IBDecodable.build/Objects-normal/arm64/IBDecodable-Swift.h (in target 'IBDecodable' from project 'IBDecodable')
    cd /Users/admin/builder/spi-builder-workspace/.dependencies/checkouts/IBDecodable
    builtin-swiftHeaderTool -arch arm64 /Users/admin/builder/spi-builder-workspace/.derivedData/Build/Intermediates.noindex/IBDecodable.build/Debug-xros/IBDecodable.build/Objects-normal/arm64/IBDecodable-Swift.h -o /Users/admin/builder/spi-builder-workspace/.derivedData/Build/Intermediates.noindex/GeneratedModuleMaps-xros/IBDecodable-Swift.h
SwiftDriverJobDiscovery normal arm64 Compiling Node.swift, Parser.swift (in target 'Yams' from project 'Yams')
Copy /Users/admin/builder/spi-builder-workspace/.derivedData/Build/Products/Debug-xros/IBDecodable.swiftmodule/arm64-apple-xros.swiftmodule /Users/admin/builder/spi-builder-workspace/.derivedData/Build/Intermediates.noindex/IBDecodable.build/Debug-xros/IBDecodable.build/Objects-normal/arm64/IBDecodable.swiftmodule (in target 'IBDecodable' from project 'IBDecodable')
    cd /Users/admin/builder/spi-builder-workspace/.dependencies/checkouts/IBDecodable
    builtin-copy -exclude .DS_Store -exclude CVS -exclude .svn -exclude .git -exclude .hg -resolve-src-symlinks -rename /Users/admin/builder/spi-builder-workspace/.derivedData/Build/Intermediates.noindex/IBDecodable.build/Debug-xros/IBDecodable.build/Objects-normal/arm64/IBDecodable.swiftmodule /Users/admin/builder/spi-builder-workspace/.derivedData/Build/Products/Debug-xros/IBDecodable.swiftmodule/arm64-apple-xros.swiftmodule
Copy /Users/admin/builder/spi-builder-workspace/.derivedData/Build/Products/Debug-xros/IBDecodable.swiftmodule/arm64-apple-xros.swiftdoc /Users/admin/builder/spi-builder-workspace/.derivedData/Build/Intermediates.noindex/IBDecodable.build/Debug-xros/IBDecodable.build/Objects-normal/arm64/IBDecodable.swiftdoc (in target 'IBDecodable' from project 'IBDecodable')
    cd /Users/admin/builder/spi-builder-workspace/.dependencies/checkouts/IBDecodable
    builtin-copy -exclude .DS_Store -exclude CVS -exclude .svn -exclude .git -exclude .hg -resolve-src-symlinks -rename /Users/admin/builder/spi-builder-workspace/.derivedData/Build/Intermediates.noindex/IBDecodable.build/Debug-xros/IBDecodable.build/Objects-normal/arm64/IBDecodable.swiftdoc /Users/admin/builder/spi-builder-workspace/.derivedData/Build/Products/Debug-xros/IBDecodable.swiftmodule/arm64-apple-xros.swiftdoc
Copy /Users/admin/builder/spi-builder-workspace/.derivedData/Build/Products/Debug-xros/IBDecodable.swiftmodule/arm64-apple-xros.abi.json /Users/admin/builder/spi-builder-workspace/.derivedData/Build/Intermediates.noindex/IBDecodable.build/Debug-xros/IBDecodable.build/Objects-normal/arm64/IBDecodable.abi.json (in target 'IBDecodable' from project 'IBDecodable')
    cd /Users/admin/builder/spi-builder-workspace/.dependencies/checkouts/IBDecodable
    builtin-copy -exclude .DS_Store -exclude CVS -exclude .svn -exclude .git -exclude .hg -resolve-src-symlinks -rename /Users/admin/builder/spi-builder-workspace/.derivedData/Build/Intermediates.noindex/IBDecodable.build/Debug-xros/IBDecodable.build/Objects-normal/arm64/IBDecodable.abi.json /Users/admin/builder/spi-builder-workspace/.derivedData/Build/Products/Debug-xros/IBDecodable.swiftmodule/arm64-apple-xros.abi.json
Copy /Users/admin/builder/spi-builder-workspace/.derivedData/Build/Products/Debug-xros/IBDecodable.swiftmodule/Project/arm64-apple-xros.swiftsourceinfo /Users/admin/builder/spi-builder-workspace/.derivedData/Build/Intermediates.noindex/IBDecodable.build/Debug-xros/IBDecodable.build/Objects-normal/arm64/IBDecodable.swiftsourceinfo (in target 'IBDecodable' from project 'IBDecodable')
    cd /Users/admin/builder/spi-builder-workspace/.dependencies/checkouts/IBDecodable
    builtin-copy -exclude .DS_Store -exclude CVS -exclude .svn -exclude .git -exclude .hg -resolve-src-symlinks -rename /Users/admin/builder/spi-builder-workspace/.derivedData/Build/Intermediates.noindex/IBDecodable.build/Debug-xros/IBDecodable.build/Objects-normal/arm64/IBDecodable.swiftsourceinfo /Users/admin/builder/spi-builder-workspace/.derivedData/Build/Products/Debug-xros/IBDecodable.swiftmodule/Project/arm64-apple-xros.swiftsourceinfo
SwiftCompile normal arm64 Compiling\ YamlError.swift,\ YamlTagProviding.swift /Users/admin/builder/spi-builder-workspace/.dependencies/checkouts/Yams/Sources/Yams/YamlError.swift /Users/admin/builder/spi-builder-workspace/.dependencies/checkouts/Yams/Sources/Yams/YamlTagProviding.swift (in target 'Yams' from project 'Yams')
SwiftCompile normal arm64 /Users/admin/builder/spi-builder-workspace/.dependencies/checkouts/Yams/Sources/Yams/YamlError.swift (in target 'Yams' from project 'Yams')
    cd /Users/admin/builder/spi-builder-workspace/.swiftpm/xcode

SwiftCompile normal arm64 /Users/admin/builder/spi-builder-workspace/.dependencies/checkouts/Yams/Sources/Yams/YamlTagProviding.swift (in target 'Yams' from project 'Yams')
    cd /Users/admin/builder/spi-builder-workspace/.swiftpm/xcode

SwiftCompile normal arm64 Compiling\ Tag.swift,\ YamlAnchorProviding.swift /Users/admin/builder/spi-builder-workspace/.dependencies/checkouts/Yams/Sources/Yams/Tag.swift /Users/admin/builder/spi-builder-workspace/.dependencies/checkouts/Yams/Sources/Yams/YamlAnchorProviding.swift (in target 'Yams' from project 'Yams')
SwiftCompile normal arm64 /Users/admin/builder/spi-builder-workspace/.dependencies/checkouts/Yams/Sources/Yams/Tag.swift (in target 'Yams' from project 'Yams')
    cd /Users/admin/builder/spi-builder-workspace/.swiftpm/xcode

SwiftCompile normal arm64 /Users/admin/builder/spi-builder-workspace/.dependencies/checkouts/Yams/Sources/Yams/YamlAnchorProviding.swift (in target 'Yams' from project 'Yams')
    cd /Users/admin/builder/spi-builder-workspace/.swiftpm/xcode

SwiftDriverJobDiscovery normal arm64 Compiling OutletCollection.swift, Segue.swift, AnyViewController.swift, CollectionViewController.swift, AVPlayerViewController.swift, GLKViewController.swift, HostingController.swift, NavigationController.swift, PageViewController.swift (in target 'IBDecodable' from project 'IBDecodable')
SwiftCompile normal arm64 Compiling\ XMLAttributeDeserializable.swift /Users/admin/builder/spi-builder-workspace/.dependencies/checkouts/SWXMLHash/Source/Deserialization/XMLAttributeDeserializable.swift (in target 'SWXMLHash' from project 'SWXMLHash')
SwiftCompile normal arm64 /Users/admin/builder/spi-builder-workspace/.dependencies/checkouts/SWXMLHash/Source/Deserialization/XMLAttributeDeserializable.swift (in target 'SWXMLHash' from project 'SWXMLHash')
    cd /Users/admin/builder/spi-builder-workspace/.swiftpm/xcode

SwiftDriverJobDiscovery normal arm64 Compiling Node.Alias.swift, Node.Mapping.swift (in target 'Yams' from project 'Yams')
SwiftDriverJobDiscovery normal arm64 Compiling StringElement.swift, UserDefinedRuntimeAttribute.swift, Variation.swift, ActivityIndicatorView.swift, AnyView.swift, NavigationBar.swift, SearchBar.swift, TabBar.swift, Toolbar.swift (in target 'IBDecodable' from project 'IBDecodable')
SwiftCompile normal arm64 Compiling\ XMLIndexer+XMLDeserialization.swift /Users/admin/builder/spi-builder-workspace/.dependencies/checkouts/SWXMLHash/Source/Deserialization/XMLIndexer+XMLDeserialization.swift (in target 'SWXMLHash' from project 'SWXMLHash')
SwiftCompile normal arm64 /Users/admin/builder/spi-builder-workspace/.dependencies/checkouts/SWXMLHash/Source/Deserialization/XMLIndexer+XMLDeserialization.swift (in target 'SWXMLHash' from project 'SWXMLHash')
    cd /Users/admin/builder/spi-builder-workspace/.swiftpm/xcode

SwiftDriverJobDiscovery normal arm64 Compiling XMLAttributeDeserializable.swift (in target 'SWXMLHash' from project 'SWXMLHash')
SwiftCompile normal arm64 Compiling\ XMLElementDeserializable.swift /Users/admin/builder/spi-builder-workspace/.dependencies/checkouts/SWXMLHash/Source/Deserialization/XMLElementDeserializable.swift (in target 'SWXMLHash' from project 'SWXMLHash')
SwiftCompile normal arm64 /Users/admin/builder/spi-builder-workspace/.dependencies/checkouts/SWXMLHash/Source/Deserialization/XMLElementDeserializable.swift (in target 'SWXMLHash' from project 'SWXMLHash')
    cd /Users/admin/builder/spi-builder-workspace/.swiftpm/xcode

SwiftCompile normal arm64 Compiling\ IndexOp.swift,\ LazyXMLParser.swift /Users/admin/builder/spi-builder-workspace/.dependencies/checkouts/SWXMLHash/Source/IndexOp.swift /Users/admin/builder/spi-builder-workspace/.dependencies/checkouts/SWXMLHash/Source/LazyXMLParser.swift (in target 'SWXMLHash' from project 'SWXMLHash')
SwiftCompile normal arm64 /Users/admin/builder/spi-builder-workspace/.dependencies/checkouts/SWXMLHash/Source/IndexOp.swift (in target 'SWXMLHash' from project 'SWXMLHash')
    cd /Users/admin/builder/spi-builder-workspace/.swiftpm/xcode

SwiftCompile normal arm64 /Users/admin/builder/spi-builder-workspace/.dependencies/checkouts/SWXMLHash/Source/LazyXMLParser.swift (in target 'SWXMLHash' from project 'SWXMLHash')
    cd /Users/admin/builder/spi-builder-workspace/.swiftpm/xcode

SwiftDriverJobDiscovery normal arm64 Compiling Tag.swift, YamlAnchorProviding.swift (in target 'Yams' from project 'Yams')
SwiftCompile normal arm64 Compiling\ Double+XMLDeserialization.swift,\ Float+XMLDeserialization.swift /Users/admin/builder/spi-builder-workspace/.dependencies/checkouts/SWXMLHash/Source/DeserializationTypes/Double+XMLDeserialization.swift /Users/admin/builder/spi-builder-workspace/.dependencies/checkouts/SWXMLHash/Source/DeserializationTypes/Float+XMLDeserialization.swift (in target 'SWXMLHash' from project 'SWXMLHash')
SwiftCompile normal arm64 /Users/admin/builder/spi-builder-workspace/.dependencies/checkouts/SWXMLHash/Source/DeserializationTypes/Double+XMLDeserialization.swift (in target 'SWXMLHash' from project 'SWXMLHash')
    cd /Users/admin/builder/spi-builder-workspace/.swiftpm/xcode

SwiftCompile normal arm64 /Users/admin/builder/spi-builder-workspace/.dependencies/checkouts/SWXMLHash/Source/DeserializationTypes/Float+XMLDeserialization.swift (in target 'SWXMLHash' from project 'SWXMLHash')
    cd /Users/admin/builder/spi-builder-workspace/.swiftpm/xcode

SwiftDriverJobDiscovery normal arm64 Compiling XMLElementDeserializable.swift (in target 'SWXMLHash' from project 'SWXMLHash')
SwiftCompile normal arm64 Compiling\ Int+XMLDeserialization.swift,\ String+XMLDeserialization.swift /Users/admin/builder/spi-builder-workspace/.dependencies/checkouts/SWXMLHash/Source/DeserializationTypes/Int+XMLDeserialization.swift /Users/admin/builder/spi-builder-workspace/.dependencies/checkouts/SWXMLHash/Source/DeserializationTypes/String+XMLDeserialization.swift (in target 'SWXMLHash' from project 'SWXMLHash')
SwiftCompile normal arm64 /Users/admin/builder/spi-builder-workspace/.dependencies/checkouts/SWXMLHash/Source/DeserializationTypes/Int+XMLDeserialization.swift (in target 'SWXMLHash' from project 'SWXMLHash')
    cd /Users/admin/builder/spi-builder-workspace/.swiftpm/xcode

SwiftCompile normal arm64 /Users/admin/builder/spi-builder-workspace/.dependencies/checkouts/SWXMLHash/Source/DeserializationTypes/String+XMLDeserialization.swift (in target 'SWXMLHash' from project 'SWXMLHash')
    cd /Users/admin/builder/spi-builder-workspace/.swiftpm/xcode

SwiftDriverJobDiscovery normal arm64 Compiling Node.Scalar.swift, Node.Sequence.swift (in target 'Yams' from project 'Yams')
SwiftCompile normal arm64 Compiling\ XMLHashOptions.swift /Users/admin/builder/spi-builder-workspace/.dependencies/checkouts/SWXMLHash/Source/XMLHashOptions.swift (in target 'SWXMLHash' from project 'SWXMLHash')
SwiftCompile normal arm64 /Users/admin/builder/spi-builder-workspace/.dependencies/checkouts/SWXMLHash/Source/XMLHashOptions.swift (in target 'SWXMLHash' from project 'SWXMLHash')
    cd /Users/admin/builder/spi-builder-workspace/.swiftpm/xcode

SwiftDriverJobDiscovery normal arm64 Compiling YamlError.swift, YamlTagProviding.swift (in target 'Yams' from project 'Yams')
SwiftCompile normal arm64 Compiling\ String+Extensions.swift /Users/admin/builder/spi-builder-workspace/.dependencies/checkouts/SWXMLHash/Source/String+Extensions.swift (in target 'SWXMLHash' from project 'SWXMLHash')
SwiftCompile normal arm64 /Users/admin/builder/spi-builder-workspace/.dependencies/checkouts/SWXMLHash/Source/String+Extensions.swift (in target 'SWXMLHash' from project 'SWXMLHash')
    cd /Users/admin/builder/spi-builder-workspace/.swiftpm/xcode

SwiftDriverJobDiscovery normal arm64 Compiling Decoder.swift, Emitter.swift (in target 'Yams' from project 'Yams')
SwiftCompile normal arm64 Compiling\ XMLHash.swift /Users/admin/builder/spi-builder-workspace/.dependencies/checkouts/SWXMLHash/Source/XMLHash.swift (in target 'SWXMLHash' from project 'SWXMLHash')
SwiftCompile normal arm64 /Users/admin/builder/spi-builder-workspace/.dependencies/checkouts/SWXMLHash/Source/XMLHash.swift (in target 'SWXMLHash' from project 'SWXMLHash')
    cd /Users/admin/builder/spi-builder-workspace/.swiftpm/xcode

SwiftDriverJobDiscovery normal arm64 Compiling TextView.swift, ARSCNView.swift, ARSKView.swift, GLKView.swift, MTKView.swift, MapView.swift, SKView.swift, SceneKitView.swift, WKWebView.swift (in target 'IBDecodable' from project 'IBDecodable')
SwiftCompile normal arm64 Compiling\ IndexingError.swift,\ FullXMLParser.swift /Users/admin/builder/spi-builder-workspace/.dependencies/checkouts/SWXMLHash/Source/Errors/IndexingError.swift /Users/admin/builder/spi-builder-workspace/.dependencies/checkouts/SWXMLHash/Source/FullXMLParser.swift (in target 'SWXMLHash' from project 'SWXMLHash')
SwiftCompile normal arm64 /Users/admin/builder/spi-builder-workspace/.dependencies/checkouts/SWXMLHash/Source/Errors/IndexingError.swift (in target 'SWXMLHash' from project 'SWXMLHash')
    cd /Users/admin/builder/spi-builder-workspace/.swiftpm/xcode

SwiftCompile normal arm64 /Users/admin/builder/spi-builder-workspace/.dependencies/checkouts/SWXMLHash/Source/FullXMLParser.swift (in target 'SWXMLHash' from project 'SWXMLHash')
    cd /Users/admin/builder/spi-builder-workspace/.swiftpm/xcode

SwiftDriverJobDiscovery normal arm64 Compiling XMLIndexer+XMLDeserialization.swift (in target 'SWXMLHash' from project 'SWXMLHash')
SwiftCompile normal arm64 Compiling\ XMLElement.swift /Users/admin/builder/spi-builder-workspace/.dependencies/checkouts/SWXMLHash/Source/XMLElement.swift (in target 'SWXMLHash' from project 'SWXMLHash')
SwiftCompile normal arm64 /Users/admin/builder/spi-builder-workspace/.dependencies/checkouts/SWXMLHash/Source/XMLElement.swift (in target 'SWXMLHash' from project 'SWXMLHash')
    cd /Users/admin/builder/spi-builder-workspace/.swiftpm/xcode

SwiftDriverJobDiscovery normal arm64 Compiling Double+XMLDeserialization.swift, Float+XMLDeserialization.swift (in target 'SWXMLHash' from project 'SWXMLHash')
SwiftCompile normal arm64 Compiling\ XMLIndexer.swift /Users/admin/builder/spi-builder-workspace/.dependencies/checkouts/SWXMLHash/Source/XMLIndexer.swift (in target 'SWXMLHash' from project 'SWXMLHash')
SwiftCompile normal arm64 /Users/admin/builder/spi-builder-workspace/.dependencies/checkouts/SWXMLHash/Source/XMLIndexer.swift (in target 'SWXMLHash' from project 'SWXMLHash')
    cd /Users/admin/builder/spi-builder-workspace/.swiftpm/xcode

SwiftDriverJobDiscovery normal arm64 Compiling Int+XMLDeserialization.swift, String+XMLDeserialization.swift (in target 'SWXMLHash' from project 'SWXMLHash')
SwiftCompile normal arm64 Compiling\ XMLObjectDeserialization.swift /Users/admin/builder/spi-builder-workspace/.dependencies/checkouts/SWXMLHash/Source/Deserialization/XMLObjectDeserialization.swift (in target 'SWXMLHash' from project 'SWXMLHash')
SwiftCompile normal arm64 /Users/admin/builder/spi-builder-workspace/.dependencies/checkouts/SWXMLHash/Source/Deserialization/XMLObjectDeserialization.swift (in target 'SWXMLHash' from project 'SWXMLHash')
    cd /Users/admin/builder/spi-builder-workspace/.swiftpm/xcode

SwiftDriverJobDiscovery normal arm64 Compiling XMLHashOptions.swift (in target 'SWXMLHash' from project 'SWXMLHash')
SwiftCompile normal arm64 Compiling\ XMLDeserializationError.swift /Users/admin/builder/spi-builder-workspace/.dependencies/checkouts/SWXMLHash/Source/Errors/XMLDeserializationError.swift (in target 'SWXMLHash' from project 'SWXMLHash')
SwiftCompile normal arm64 /Users/admin/builder/spi-builder-workspace/.dependencies/checkouts/SWXMLHash/Source/Errors/XMLDeserializationError.swift (in target 'SWXMLHash' from project 'SWXMLHash')
    cd /Users/admin/builder/spi-builder-workspace/.swiftpm/xcode

SwiftDriverJobDiscovery normal arm64 Compiling IndexOp.swift, LazyXMLParser.swift (in target 'SWXMLHash' from project 'SWXMLHash')
SwiftCompile normal arm64 Compiling\ XMLValueDeserialization.swift,\ Bool+XMLDeserialization.swift /Users/admin/builder/spi-builder-workspace/.dependencies/checkouts/SWXMLHash/Source/Deserialization/XMLValueDeserialization.swift /Users/admin/builder/spi-builder-workspace/.dependencies/checkouts/SWXMLHash/Source/DeserializationTypes/Bool+XMLDeserialization.swift (in target 'SWXMLHash' from project 'SWXMLHash')
SwiftCompile normal arm64 /Users/admin/builder/spi-builder-workspace/.dependencies/checkouts/SWXMLHash/Source/Deserialization/XMLValueDeserialization.swift (in target 'SWXMLHash' from project 'SWXMLHash')
    cd /Users/admin/builder/spi-builder-workspace/.swiftpm/xcode

SwiftCompile normal arm64 /Users/admin/builder/spi-builder-workspace/.dependencies/checkouts/SWXMLHash/Source/DeserializationTypes/Bool+XMLDeserialization.swift (in target 'SWXMLHash' from project 'SWXMLHash')
    cd /Users/admin/builder/spi-builder-workspace/.swiftpm/xcode

SwiftDriverJobDiscovery normal arm64 Compiling XMLHash.swift (in target 'SWXMLHash' from project 'SWXMLHash')
SwiftDriverJobDiscovery normal arm64 Compiling Button.swift, ControlProtocol.swift, DatePicker.swift, PageControl.swift, SegmentedControl.swift, Slider.swift, Stepper.swift, Switch.swift, TextField.swift (in target 'IBDecodable' from project 'IBDecodable')
SwiftCompile normal arm64 Compiling\ Placeholder.swift,\ Scene.swift,\ SearchDisplayController.swift,\ StoryboardDocument.swift,\ TargetRuntime.swift,\ XibDocument.swift,\ InterfaceBuilderFile.swift,\ StoryboardFile.swift,\ XibFile.swift /Users/admin/builder/spi-builder-workspace/.dependencies/checkouts/IBDecodable/Sources/Models/Documents/Placeholder.swift /Users/admin/builder/spi-builder-workspace/.dependencies/checkouts/IBDecodable/Sources/Models/Documents/Scene.swift /Users/admin/builder/spi-builder-workspace/.dependencies/checkouts/IBDecodable/Sources/Models/Documents/SearchDisplayController.swift /Users/admin/builder/spi-builder-workspace/.dependencies/checkouts/IBDecodable/Sources/Models/Documents/StoryboardDocument.swift /Users/admin/builder/spi-builder-workspace/.dependencies/checkouts/IBDecodable/Sources/Models/Documents/TargetRuntime.swift /Users/admin/builder/spi-builder-workspace/.dependencies/checkouts/IBDecodable/Sources/Models/Documents/XibDocument.swift /Users/admin/builder/spi-builder-workspace/.dependencies/checkouts/IBDecodable/Sources/Models/Files/InterfaceBuilderFile.swift /Users/admin/builder/spi-builder-workspace/.dependencies/checkouts/IBDecodable/Sources/Models/Files/StoryboardFile.swift /Users/admin/builder/spi-builder-workspace/.dependencies/checkouts/IBDecodable/Sources/Models/Files/XibFile.swift (in target 'IBDecodable' from project 'IBDecodable')
SwiftCompile normal arm64 /Users/admin/builder/spi-builder-workspace/.dependencies/checkouts/IBDecodable/Sources/Models/Documents/Placeholder.swift (in target 'IBDecodable' from project 'IBDecodable')
    cd /Users/admin/builder/spi-builder-workspace/.swiftpm/xcode

SwiftCompile normal arm64 /Users/admin/builder/spi-builder-workspace/.dependencies/checkouts/IBDecodable/Sources/Models/Documents/Scene.swift (in target 'IBDecodable' from project 'IBDecodable')
    cd /Users/admin/builder/spi-builder-workspace/.swiftpm/xcode

SwiftCompile normal arm64 /Users/admin/builder/spi-builder-workspace/.dependencies/checkouts/IBDecodable/Sources/Models/Documents/SearchDisplayController.swift (in target 'IBDecodable' from project 'IBDecodable')
    cd /Users/admin/builder/spi-builder-workspace/.swiftpm/xcode

SwiftCompile normal arm64 /Users/admin/builder/spi-builder-workspace/.dependencies/checkouts/IBDecodable/Sources/Models/Documents/StoryboardDocument.swift (in target 'IBDecodable' from project 'IBDecodable')
    cd /Users/admin/builder/spi-builder-workspace/.swiftpm/xcode

SwiftCompile normal arm64 /Users/admin/builder/spi-builder-workspace/.dependencies/checkouts/IBDecodable/Sources/Models/Documents/TargetRuntime.swift (in target 'IBDecodable' from project 'IBDecodable')
    cd /Users/admin/builder/spi-builder-workspace/.swiftpm/xcode

SwiftCompile normal arm64 /Users/admin/builder/spi-builder-workspace/.dependencies/checkouts/IBDecodable/Sources/Models/Documents/XibDocument.swift (in target 'IBDecodable' from project 'IBDecodable')
    cd /Users/admin/builder/spi-builder-workspace/.swiftpm/xcode

SwiftCompile normal arm64 /Users/admin/builder/spi-builder-workspace/.dependencies/checkouts/IBDecodable/Sources/Models/Files/InterfaceBuilderFile.swift (in target 'IBDecodable' from project 'IBDecodable')
    cd /Users/admin/builder/spi-builder-workspace/.swiftpm/xcode

SwiftCompile normal arm64 /Users/admin/builder/spi-builder-workspace/.dependencies/checkouts/IBDecodable/Sources/Models/Files/StoryboardFile.swift (in target 'IBDecodable' from project 'IBDecodable')
    cd /Users/admin/builder/spi-builder-workspace/.swiftpm/xcode

SwiftCompile normal arm64 /Users/admin/builder/spi-builder-workspace/.dependencies/checkouts/IBDecodable/Sources/Models/Files/XibFile.swift (in target 'IBDecodable' from project 'IBDecodable')
    cd /Users/admin/builder/spi-builder-workspace/.swiftpm/xcode

SwiftCompile normal arm64 Compiling\ SplitViewController.swift,\ TabBarController.swift,\ TableViewController.swift,\ ViewController.swift,\ AnyDependency.swift,\ CustomObject.swift,\ Device.swift,\ Exit.swift,\ InterfaceBuilderDocument.swift /Users/admin/builder/spi-builder-workspace/.dependencies/checkouts/IBDecodable/Sources/Models/Controllers/SplitViewController.swift /Users/admin/builder/spi-builder-workspace/.dependencies/checkouts/IBDecodable/Sources/Models/Controllers/TabBarController.swift /Users/admin/builder/spi-builder-workspace/.dependencies/checkouts/IBDecodable/Sources/Models/Controllers/TableViewController.swift /Users/admin/builder/spi-builder-workspace/.dependencies/checkouts/IBDecodable/Sources/Models/Controllers/ViewController.swift /Users/admin/builder/spi-builder-workspace/.dependencies/checkouts/IBDecodable/Sources/Models/Documents/AnyDependency.swift /Users/admin/builder/spi-builder-workspace/.dependencies/checkouts/IBDecodable/Sources/Models/Documents/CustomObject.swift /Users/admin/builder/spi-builder-workspace/.dependencies/checkouts/IBDecodable/Sources/Models/Documents/Device.swift /Users/admin/builder/spi-builder-workspace/.dependencies/checkouts/IBDecodable/Sources/Models/Documents/Exit.swift /Users/admin/builder/spi-builder-workspace/.dependencies/checkouts/IBDecodable/Sources/Models/Documents/InterfaceBuilderDocument.swift (in target 'IBDecodable' from project 'IBDecodable')
SwiftCompile normal arm64 /Users/admin/builder/spi-builder-workspace/.dependencies/checkouts/IBDecodable/Sources/Models/Controllers/SplitViewController.swift (in target 'IBDecodable' from project 'IBDecodable')
    cd /Users/admin/builder/spi-builder-workspace/.swiftpm/xcode

SwiftCompile normal arm64 /Users/admin/builder/spi-builder-workspace/.dependencies/checkouts/IBDecodable/Sources/Models/Controllers/TabBarController.swift (in target 'IBDecodable' from project 'IBDecodable')
    cd /Users/admin/builder/spi-builder-workspace/.swiftpm/xcode

SwiftCompile normal arm64 /Users/admin/builder/spi-builder-workspace/.dependencies/checkouts/IBDecodable/Sources/Models/Controllers/TableViewController.swift (in target 'IBDecodable' from project 'IBDecodable')
    cd /Users/admin/builder/spi-builder-workspace/.swiftpm/xcode

SwiftCompile normal arm64 /Users/admin/builder/spi-builder-workspace/.dependencies/checkouts/IBDecodable/Sources/Models/Controllers/ViewController.swift (in target 'IBDecodable' from project 'IBDecodable')
    cd /Users/admin/builder/spi-builder-workspace/.swiftpm/xcode

SwiftCompile normal arm64 /Users/admin/builder/spi-builder-workspace/.dependencies/checkouts/IBDecodable/Sources/Models/Documents/AnyDependency.swift (in target 'IBDecodable' from project 'IBDecodable')
    cd /Users/admin/builder/spi-builder-workspace/.swiftpm/xcode

SwiftCompile normal arm64 /Users/admin/builder/spi-builder-workspace/.dependencies/checkouts/IBDecodable/Sources/Models/Documents/CustomObject.swift (in target 'IBDecodable' from project 'IBDecodable')
    cd /Users/admin/builder/spi-builder-workspace/.swiftpm/xcode

SwiftCompile normal arm64 /Users/admin/builder/spi-builder-workspace/.dependencies/checkouts/IBDecodable/Sources/Models/Documents/Device.swift (in target 'IBDecodable' from project 'IBDecodable')
    cd /Users/admin/builder/spi-builder-workspace/.swiftpm/xcode

SwiftCompile normal arm64 /Users/admin/builder/spi-builder-workspace/.dependencies/checkouts/IBDecodable/Sources/Models/Documents/Exit.swift (in target 'IBDecodable' from project 'IBDecodable')
    cd /Users/admin/builder/spi-builder-workspace/.swiftpm/xcode

SwiftCompile normal arm64 /Users/admin/builder/spi-builder-workspace/.dependencies/checkouts/IBDecodable/Sources/Models/Documents/InterfaceBuilderDocument.swift (in target 'IBDecodable' from project 'IBDecodable')
    cd /Users/admin/builder/spi-builder-workspace/.swiftpm/xcode

SwiftDriverJobDiscovery normal arm64 Compiling String+Extensions.swift (in target 'SWXMLHash' from project 'SWXMLHash')
SwiftDriverJobDiscovery normal arm64 Compiling XMLObjectDeserialization.swift (in target 'SWXMLHash' from project 'SWXMLHash')
SwiftCompile normal arm64 Compiling\ Command.swift /Users/admin/builder/spi-builder-workspace/.dependencies/checkouts/Commandant/Sources/Commandant/Command.swift (in target 'Commandant' from project 'Commandant')
Failed frontend command:
/Applications/Xcode-26.0.0-Beta.app/Contents/Developer/Toolchains/XcodeDefault.xctoolchain/usr/bin/swift-frontend -frontend -c /Users/admin/builder/spi-builder-workspace/.dependencies/checkouts/Commandant/Sources/Commandant/Argument.swift /Users/admin/builder/spi-builder-workspace/.dependencies/checkouts/Commandant/Sources/Commandant/ArgumentParser.swift /Users/admin/builder/spi-builder-workspace/.dependencies/checkouts/Commandant/Sources/Commandant/ArgumentProtocol.swift -primary-file /Users/admin/builder/spi-builder-workspace/.dependencies/checkouts/Commandant/Sources/Commandant/Command.swift /Users/admin/builder/spi-builder-workspace/.dependencies/checkouts/Commandant/Sources/Commandant/Errors.swift /Users/admin/builder/spi-builder-workspace/.dependencies/checkouts/Commandant/Sources/Commandant/HelpCommand.swift /Users/admin/builder/spi-builder-workspace/.dependencies/checkouts/Commandant/Sources/Commandant/Option.swift /Users/admin/builder/spi-builder-workspace/.dependencies/checkouts/Commandant/Sources/Commandant/OrderedSet.swift /Users/admin/builder/spi-builder-workspace/.dependencies/checkouts/Commandant/Sources/Commandant/Result+Additions.swift /Users/admin/builder/spi-builder-workspace/.dependencies/checkouts/Commandant/Sources/Commandant/Switch.swift -emit-dependencies-path /Users/admin/builder/spi-builder-workspace/.derivedData/Build/Intermediates.noindex/Commandant.build/Debug-xros/Commandant.build/Objects-normal/arm64/Command.d -emit-const-values-path /Users/admin/builder/spi-builder-workspace/.derivedData/Build/Intermediates.noindex/Commandant.build/Debug-xros/Commandant.build/Objects-normal/arm64/Command.swiftconstvalues -emit-reference-dependencies-path /Users/admin/builder/spi-builder-workspace/.derivedData/Build/Intermediates.noindex/Commandant.build/Debug-xros/Commandant.build/Objects-normal/arm64/Command.swiftdeps -serialize-diagnostics-path /Users/admin/builder/spi-builder-workspace/.derivedData/Build/Intermediates.noindex/Commandant.build/Debug-xros/Commandant.build/Objects-normal/arm64/Command.dia -target arm64-apple-xros1.0 -module-can-import-version Darwin 346 0 -load-resolved-plugin /Applications/Xcode-26.0.0-Beta.app/Contents/Developer/Platforms/XROS.platform/Developer/usr/lib/swift/host/plugins/libFoundationMacros.dylib\#/Applications/Xcode-26.0.0-Beta.app/Contents/Developer/Platforms/XROS.platform/Developer/usr/bin/swift-plugin-server\#FoundationMacros -load-resolved-plugin /Applications/Xcode-26.0.0-Beta.app/Contents/Developer/Platforms/XROS.platform/Developer/usr/lib/swift/host/plugins/libObservationMacros.dylib\#/Applications/Xcode-26.0.0-Beta.app/Contents/Developer/Platforms/XROS.platform/Developer/usr/bin/swift-plugin-server\#ObservationMacros -load-resolved-plugin /Applications/Xcode-26.0.0-Beta.app/Contents/Developer/Platforms/XROS.platform/Developer/usr/lib/swift/host/plugins/libSwiftMacros.dylib\#/Applications/Xcode-26.0.0-Beta.app/Contents/Developer/Platforms/XROS.platform/Developer/usr/bin/swift-plugin-server\#SwiftMacros -disable-implicit-swift-modules -Xcc -fno-implicit-modules -Xcc -fno-implicit-module-maps -explicit-swift-module-map-file /Users/admin/builder/spi-builder-workspace/.derivedData/Build/Intermediates.noindex/Commandant.build/Debug-xros/Commandant.build/Objects-normal/arm64/Commandant-dependencies-1.json -Xllvm -aarch64-use-tbi -enable-objc-interop -stack-check -sdk /Applications/Xcode-26.0.0-Beta.app/Contents/Developer/Platforms/XROS.platform/Developer/SDKs/XROS26.0.sdk -I /Users/admin/builder/spi-builder-workspace/.derivedData/Build/Products/Debug-xros -I /Applications/Xcode-26.0.0-Beta.app/Contents/Developer/Platforms/XROS.platform/Developer/usr/lib -F /Users/admin/builder/spi-builder-workspace/.derivedData/Build/Products/Debug-xros -F /Applications/Xcode-26.0.0-Beta.app/Contents/Developer/Platforms/XROS.platform/Developer/Library/Frameworks -F /Applications/Xcode-26.0.0-Beta.app/Contents/Developer/Platforms/XROS.platform/Developer/SDKs/XROS26.0.sdk/Developer/Library/Frameworks -no-color-diagnostics -Xcc -fno-color-diagnostics -enable-testing -g -debug-info-format\=dwarf -dwarf-version\=4 -module-cache-path /Users/admin/builder/spi-builder-workspace/.derivedData/Build/Intermediates.noindex/SwiftExplicitPrecompiledModules -suppress-warnings -profile-generate -profile-coverage-mapping -swift-version 5 -enforce-exclusivity\=checked -Onone -D SWIFT_PACKAGE -D DEBUG -D SWIFT_MODULE_RESOURCE_BUNDLE_UNAVAILABLE -D Xcode -serialize-debugging-options -const-gather-protocols-file /Users/admin/builder/spi-builder-workspace/.derivedData/Build/Intermediates.noindex/Commandant.build/Debug-xros/Commandant.build/Objects-normal/arm64/Commandant_const_extract_protocols.json -enable-experimental-feature DebugDescriptionMacro -empty-abi-descriptor -validate-clang-modules-once -clang-build-session-file /Users/admin/builder/spi-builder-workspace/.derivedData/ModuleCache.noindex/Session.modulevalidation -Xcc -working-directory -Xcc /Users/admin/builder/spi-builder-workspace/.swiftpm/xcode -enable-anonymous-context-mangled-names -file-compilation-dir /Users/admin/builder/spi-builder-workspace/.swiftpm/xcode -Xcc -ivfsstatcache -Xcc /Users/admin/builder/spi-builder-workspace/.derivedData/SDKStatCaches.noindex/xros26.0-23M5263k-63777232b7fc5220f33897c1cc69dbf5.sdkstatcache -Xcc -I/Users/admin/builder/spi-builder-workspace/.derivedData/Build/Intermediates.noindex/Commandant.build/Debug-xros/Commandant.build/swift-overrides.hmap -Xcc -I/Users/admin/builder/spi-builder-workspace/.derivedData/Build/Products/Debug-xros/include -Xcc -I/Users/admin/builder/spi-builder-workspace/.derivedData/Build/Intermediates.noindex/Commandant.build/Debug-xros/Commandant.build/DerivedSources-normal/arm64 -Xcc -I/Users/admin/builder/spi-builder-workspace/.derivedData/Build/Intermediates.noindex/Commandant.build/Debug-xros/Commandant.build/DerivedSources/arm64 -Xcc -I/Users/admin/builder/spi-builder-workspace/.derivedData/Build/Intermediates.noindex/Commandant.build/Debug-xros/Commandant.build/DerivedSources -Xcc -DSWIFT_PACKAGE -Xcc -DDEBUG\=1 -no-auto-bridging-header-chaining -module-name Commandant -frontend-parseable-output -disable-clang-spi -target-sdk-version 26.0 -target-sdk-name xros26.0 -clang-target arm64-apple-xros26.0 -o /Users/admin/builder/spi-builder-workspace/.derivedData/Build/Intermediates.noindex/Commandant.build/Debug-xros/Commandant.build/Objects-normal/arm64/Command.o -index-unit-output-path /Commandant.build/Debug-xros/Commandant.build/Objects-normal/arm64/Command.o -index-store-path /Users/admin/builder/spi-builder-workspace/.derivedData/Index.noindex/DataStore -index-system-modules
SwiftCompile normal arm64 /Users/admin/builder/spi-builder-workspace/.dependencies/checkouts/Commandant/Sources/Commandant/Command.swift (in target 'Commandant' from project 'Commandant')
    cd /Users/admin/builder/spi-builder-workspace/.swiftpm/xcode

/Users/admin/builder/spi-builder-workspace/.dependencies/checkouts/Commandant/Sources/Commandant/Command.swift:206:15: error: cannot find 'Process' in scope
                        let task = Process()
                                   ^~~~~~~
SwiftDriverJobDiscovery normal arm64 Compiling AliasDereferencingStrategy.swift, Anchor.swift, Constructor.swift (in target 'Yams' from project 'Yams')
SwiftCompile normal arm64 Compiling\ ArgumentProtocol.swift /Users/admin/builder/spi-builder-workspace/.dependencies/checkouts/Commandant/Sources/Commandant/ArgumentProtocol.swift (in target 'Commandant' from project 'Commandant')
SwiftCompile normal arm64 /Users/admin/builder/spi-builder-workspace/.dependencies/checkouts/Commandant/Sources/Commandant/ArgumentProtocol.swift (in target 'Commandant' from project 'Commandant')
    cd /Users/admin/builder/spi-builder-workspace/.swiftpm/xcode

SwiftDriverJobDiscovery normal arm64 Compiling XMLElement.swift (in target 'SWXMLHash' from project 'SWXMLHash')
SwiftDriver\ Compilation Yams normal arm64 com.apple.xcode.tools.swift.compiler (in target 'Yams' from project 'Yams')
    cd /Users/admin/builder/spi-builder-workspace/.swiftpm/xcode
    builtin-Swift-Compilation -- /Applications/Xcode-26.0.0-Beta.app/Contents/Developer/Toolchains/XcodeDefault.xctoolchain/usr/bin/swiftc -module-name Yams -Onone -enforce-exclusivity\=checked @/Users/admin/builder/spi-builder-workspace/.derivedData/Build/Intermediates.noindex/Yams.build/Debug-xros/Yams.build/Objects-normal/arm64/Yams.SwiftFileList -DSWIFT_PACKAGE -DDEBUG -DSWIFT_MODULE_RESOURCE_BUNDLE_UNAVAILABLE -DXcode -plugin-path /Applications/Xcode-26.0.0-Beta.app/Contents/Developer/Toolchains/XcodeDefault.xctoolchain/usr/lib/swift/host/plugins/testing -enable-experimental-feature DebugDescriptionMacro -sdk /Applications/Xcode-26.0.0-Beta.app/Contents/Developer/Platforms/XROS.platform/Developer/SDKs/XROS26.0.sdk -target arm64-apple-xros1.0 -g -module-cache-path /Users/admin/builder/spi-builder-workspace/.derivedData/ModuleCache.noindex -Xfrontend -serialize-debugging-options -profile-coverage-mapping -profile-generate -enable-testing -suppress-warnings -index-store-path /Users/admin/builder/spi-builder-workspace/.derivedData/Index.noindex/DataStore -swift-version 6 -I /Users/admin/builder/spi-builder-workspace/.derivedData/Build/Products/Debug-xros -I /Applications/Xcode-26.0.0-Beta.app/Contents/Developer/Platforms/XROS.platform/Developer/usr/lib -F /Users/admin/builder/spi-builder-workspace/.derivedData/Build/Products/Debug-xros/PackageFrameworks -F /Users/admin/builder/spi-builder-workspace/.derivedData/Build/Products/Debug-xros -F /Applications/Xcode-26.0.0-Beta.app/Contents/Developer/Platforms/XROS.platform/Developer/Library/Frameworks -F /Applications/Xcode-26.0.0-Beta.app/Contents/Developer/Platforms/XROS.platform/Developer/SDKs/XROS26.0.sdk/Developer/Library/Frameworks -c -j10 -enable-batch-mode -incremental -Xcc -ivfsstatcache -Xcc /Users/admin/builder/spi-builder-workspace/.derivedData/SDKStatCaches.noindex/xros26.0-23M5263k-63777232b7fc5220f33897c1cc69dbf5.sdkstatcache -output-file-map /Users/admin/builder/spi-builder-workspace/.derivedData/Build/Intermediates.noindex/Yams.build/Debug-xros/Yams.build/Objects-normal/arm64/Yams-OutputFileMap.json -use-frontend-parseable-output -save-temps -no-color-diagnostics -explicit-module-build -module-cache-path /Users/admin/builder/spi-builder-workspace/.derivedData/Build/Intermediates.noindex/SwiftExplicitPrecompiledModules -clang-scanner-module-cache-path /Users/admin/builder/spi-builder-workspace/.derivedData/ModuleCache.noindex -sdk-module-cache-path /Users/admin/builder/spi-builder-workspace/.derivedData/ModuleCache.noindex -serialize-diagnostics -emit-dependencies -emit-module -emit-module-path /Users/admin/builder/spi-builder-workspace/.derivedData/Build/Intermediates.noindex/Yams.build/Debug-xros/Yams.build/Objects-normal/arm64/Yams.swiftmodule -user-module-version 6.0.1 -validate-clang-modules-once -clang-build-session-file /Users/admin/builder/spi-builder-workspace/.derivedData/ModuleCache.noindex/Session.modulevalidation -package-name yams -Xcc -I/Users/admin/builder/spi-builder-workspace/.derivedData/Build/Intermediates.noindex/Yams.build/Debug-xros/Yams.build/swift-overrides.hmap -emit-const-values -Xfrontend -const-gather-protocols-file -Xfrontend /Users/admin/builder/spi-builder-workspace/.derivedData/Build/Intermediates.noindex/Yams.build/Debug-xros/Yams.build/Objects-normal/arm64/Yams_const_extract_protocols.json -Xcc -I/Users/admin/builder/spi-builder-workspace/.dependencies/checkouts/Yams/Sources/CYaml/include -Xcc -I/Users/admin/builder/spi-builder-workspace/.derivedData/Build/Products/Debug-xros/include -Xcc -I/Users/admin/builder/spi-builder-workspace/.derivedData/Build/Intermediates.noindex/Yams.build/Debug-xros/Yams.build/DerivedSources-normal/arm64 -Xcc -I/Users/admin/builder/spi-builder-workspace/.derivedData/Build/Intermediates.noindex/Yams.build/Debug-xros/Yams.build/DerivedSources/arm64 -Xcc -I/Users/admin/builder/spi-builder-workspace/.derivedData/Build/Intermediates.noindex/Yams.build/Debug-xros/Yams.build/DerivedSources -Xcc -DSWIFT_PACKAGE -Xcc -DDEBUG\=1 -Xcc -DYAML_DECLARE_STATIC -emit-objc-header -emit-objc-header-path /Users/admin/builder/spi-builder-workspace/.derivedData/Build/Intermediates.noindex/Yams.build/Debug-xros/Yams.build/Objects-normal/arm64/Yams-Swift.h -working-directory /Users/admin/builder/spi-builder-workspace/.swiftpm/xcode -experimental-emit-module-separately -disable-cmo
SwiftCompile normal arm64 Compiling\ HelpCommand.swift /Users/admin/builder/spi-builder-workspace/.dependencies/checkouts/Commandant/Sources/Commandant/HelpCommand.swift (in target 'Commandant' from project 'Commandant')
SwiftCompile normal arm64 /Users/admin/builder/spi-builder-workspace/.dependencies/checkouts/Commandant/Sources/Commandant/HelpCommand.swift (in target 'Commandant' from project 'Commandant')
    cd /Users/admin/builder/spi-builder-workspace/.swiftpm/xcode

SwiftCompile normal arm64 Compiling\ Argument.swift /Users/admin/builder/spi-builder-workspace/.dependencies/checkouts/Commandant/Sources/Commandant/Argument.swift (in target 'Commandant' from project 'Commandant')
SwiftCompile normal arm64 /Users/admin/builder/spi-builder-workspace/.dependencies/checkouts/Commandant/Sources/Commandant/Argument.swift (in target 'Commandant' from project 'Commandant')
    cd /Users/admin/builder/spi-builder-workspace/.swiftpm/xcode

SwiftDriverJobDiscovery normal arm64 Compiling IndexingError.swift, FullXMLParser.swift (in target 'SWXMLHash' from project 'SWXMLHash')
SwiftCompile normal arm64 Compiling\ OrderedSet.swift /Users/admin/builder/spi-builder-workspace/.dependencies/checkouts/Commandant/Sources/Commandant/OrderedSet.swift (in target 'Commandant' from project 'Commandant')
SwiftCompile normal arm64 /Users/admin/builder/spi-builder-workspace/.dependencies/checkouts/Commandant/Sources/Commandant/OrderedSet.swift (in target 'Commandant' from project 'Commandant')
    cd /Users/admin/builder/spi-builder-workspace/.swiftpm/xcode

SwiftDriverJobDiscovery normal arm64 Compiling XMLDeserializationError.swift (in target 'SWXMLHash' from project 'SWXMLHash')
SwiftCompile normal arm64 Compiling\ Option.swift /Users/admin/builder/spi-builder-workspace/.dependencies/checkouts/Commandant/Sources/Commandant/Option.swift (in target 'Commandant' from project 'Commandant')
SwiftCompile normal arm64 /Users/admin/builder/spi-builder-workspace/.dependencies/checkouts/Commandant/Sources/Commandant/Option.swift (in target 'Commandant' from project 'Commandant')
    cd /Users/admin/builder/spi-builder-workspace/.swiftpm/xcode

SwiftDriverJobDiscovery normal arm64 Compiling XMLValueDeserialization.swift, Bool+XMLDeserialization.swift (in target 'SWXMLHash' from project 'SWXMLHash')
SwiftCompile normal arm64 Compiling\ Result+Additions.swift /Users/admin/builder/spi-builder-workspace/.dependencies/checkouts/Commandant/Sources/Commandant/Result+Additions.swift (in target 'Commandant' from project 'Commandant')
SwiftDriverJobDiscovery normal arm64 Compiling XMLIndexer.swift (in target 'SWXMLHash' from project 'SWXMLHash')
SwiftDriver\ Compilation SWXMLHash normal arm64 com.apple.xcode.tools.swift.compiler (in target 'SWXMLHash' from project 'SWXMLHash')
    cd /Users/admin/builder/spi-builder-workspace/.swiftpm/xcode
    builtin-Swift-Compilation -- /Applications/Xcode-26.0.0-Beta.app/Contents/Developer/Toolchains/XcodeDefault.xctoolchain/usr/bin/swiftc -module-name SWXMLHash -Onone -enforce-exclusivity\=checked @/Users/admin/builder/spi-builder-workspace/.derivedData/Build/Intermediates.noindex/SWXMLHash.build/Debug-xros/SWXMLHash.build/Objects-normal/arm64/SWXMLHash.SwiftFileList -DSWIFT_PACKAGE -DDEBUG -DSWIFT_MODULE_RESOURCE_BUNDLE_UNAVAILABLE -DXcode -plugin-path /Applications/Xcode-26.0.0-Beta.app/Contents/Developer/Toolchains/XcodeDefault.xctoolchain/usr/lib/swift/host/plugins/testing -enable-experimental-feature DebugDescriptionMacro -sdk /Applications/Xcode-26.0.0-Beta.app/Contents/Developer/Platforms/XROS.platform/Developer/SDKs/XROS26.0.sdk -target arm64-apple-xros1.0 -g -module-cache-path /Users/admin/builder/spi-builder-workspace/.derivedData/ModuleCache.noindex -Xfrontend -serialize-debugging-options -profile-coverage-mapping -profile-generate -enable-testing -suppress-warnings -index-store-path /Users/admin/builder/spi-builder-workspace/.derivedData/Index.noindex/DataStore -swift-version 5 -I /Users/admin/builder/spi-builder-workspace/.derivedData/Build/Products/Debug-xros -I /Applications/Xcode-26.0.0-Beta.app/Contents/Developer/Platforms/XROS.platform/Developer/usr/lib -F /Users/admin/builder/spi-builder-workspace/.derivedData/Build/Products/Debug-xros -F /Applications/Xcode-26.0.0-Beta.app/Contents/Developer/Platforms/XROS.platform/Developer/Library/Frameworks -F /Applications/Xcode-26.0.0-Beta.app/Contents/Developer/Platforms/XROS.platform/Developer/SDKs/XROS26.0.sdk/Developer/Library/Frameworks -c -j10 -enable-batch-mode -incremental -Xcc -ivfsstatcache -Xcc /Users/admin/builder/spi-builder-workspace/.derivedData/SDKStatCaches.noindex/xros26.0-23M5263k-63777232b7fc5220f33897c1cc69dbf5.sdkstatcache -output-file-map /Users/admin/builder/spi-builder-workspace/.derivedData/Build/Intermediates.noindex/SWXMLHash.build/Debug-xros/SWXMLHash.build/Objects-normal/arm64/SWXMLHash-OutputFileMap.json -use-frontend-parseable-output -save-temps -no-color-diagnostics -explicit-module-build -module-cache-path /Users/admin/builder/spi-builder-workspace/.derivedData/Build/Intermediates.noindex/SwiftExplicitPrecompiledModules -clang-scanner-module-cache-path /Users/admin/builder/spi-builder-workspace/.derivedData/ModuleCache.noindex -sdk-module-cache-path /Users/admin/builder/spi-builder-workspace/.derivedData/ModuleCache.noindex -serialize-diagnostics -emit-dependencies -emit-module -emit-module-path /Users/admin/builder/spi-builder-workspace/.derivedData/Build/Intermediates.noindex/SWXMLHash.build/Debug-xros/SWXMLHash.build/Objects-normal/arm64/SWXMLHash.swiftmodule -validate-clang-modules-once -clang-build-session-file /Users/admin/builder/spi-builder-workspace/.derivedData/ModuleCache.noindex/Session.modulevalidation -Xcc -I/Users/admin/builder/spi-builder-workspace/.derivedData/Build/Intermediates.noindex/SWXMLHash.build/Debug-xros/SWXMLHash.build/swift-overrides.hmap -emit-const-values -Xfrontend -const-gather-protocols-file -Xfrontend /Users/admin/builder/spi-builder-workspace/.derivedData/Build/Intermediates.noindex/SWXMLHash.build/Debug-xros/SWXMLHash.build/Objects-normal/arm64/SWXMLHash_const_extract_protocols.json -Xcc -I/Users/admin/builder/spi-builder-workspace/.derivedData/Build/Products/Debug-xros/include -Xcc -I/Users/admin/builder/spi-builder-workspace/.derivedData/Build/Intermediates.noindex/SWXMLHash.build/Debug-xros/SWXMLHash.build/DerivedSources-normal/arm64 -Xcc -I/Users/admin/builder/spi-builder-workspace/.derivedData/Build/Intermediates.noindex/SWXMLHash.build/Debug-xros/SWXMLHash.build/DerivedSources/arm64 -Xcc -I/Users/admin/builder/spi-builder-workspace/.derivedData/Build/Intermediates.noindex/SWXMLHash.build/Debug-xros/SWXMLHash.build/DerivedSources -Xcc -DSWIFT_PACKAGE -Xcc -DDEBUG\=1 -emit-objc-header -emit-objc-header-path /Users/admin/builder/spi-builder-workspace/.derivedData/Build/Intermediates.noindex/SWXMLHash.build/Debug-xros/SWXMLHash.build/Objects-normal/arm64/SWXMLHash-Swift.h -working-directory /Users/admin/builder/spi-builder-workspace/.swiftpm/xcode -experimental-emit-module-separately -disable-cmo
** BUILD FAILED **
The following build commands failed:
	SwiftCompile normal arm64 Compiling\ Command.swift /Users/admin/builder/spi-builder-workspace/.dependencies/checkouts/Commandant/Sources/Commandant/Command.swift (in target 'Commandant' from project 'Commandant')
	SwiftCompile normal arm64 /Users/admin/builder/spi-builder-workspace/.dependencies/checkouts/Commandant/Sources/Commandant/Command.swift (in target 'Commandant' from project 'Commandant')
	Building workspace spi-builder-workspace with scheme IBLinter-Package
(3 failures)
BUILD FAILURE 6.2 visionOS