Build Information
Failed to build EFColorPicker, reference 5.2.2 (706c84
), with Swift 6.1 for macOS (Xcode) using Xcode 16.3 on 26 Apr 2025 13:49:43 UTC.
Build Command
env DEVELOPER_DIR=/Applications/Xcode-16.3.0.app xcrun xcodebuild -IDEClonedSourcePackagesDirPathOverride=$PWD/.dependencies -skipMacroValidation -skipPackagePluginValidation -derivedDataPath $PWD/.derivedData build -scheme EFColorPicker -destination platform=macOS,arch=arm64
Build Log
========================================
RunAll
========================================
Builder version: 4.61.0
Interrupt handler set up.
========================================
Checkout
========================================
Clone URL: https://github.com/EFPrefix/EFColorPicker.git
Reference: 5.2.2
Initialized empty Git repository in /Users/admin/builder/spi-builder-workspace/.git/
From https://github.com/EFPrefix/EFColorPicker
* tag 5.2.2 -> FETCH_HEAD
HEAD is now at 706c841 5.2.2
Cloned https://github.com/EFPrefix/EFColorPicker.git
Revision (git rev-parse @):
706c8412c38df821d5bff2751e8961bc5fdd4154
SUCCESS checkout https://github.com/EFPrefix/EFColorPicker.git at 5.2.2
========================================
Build
========================================
Selected platform: macosXcodebuild
Swift version: 6.1
Building package at path: $PWD
https://github.com/EFPrefix/EFColorPicker.git
https://github.com/EFPrefix/EFColorPicker.git
{
"dependencies" : [
],
"manifest_display_name" : "EFColorPicker",
"name" : "EFColorPicker",
"path" : "/Users/admin/builder/spi-builder-workspace",
"platforms" : [
{
"name" : "ios",
"version" : "8.0"
}
],
"products" : [
{
"name" : "EFColorPicker",
"targets" : [
"EFColorPicker"
],
"type" : {
"library" : [
"automatic"
]
}
}
],
"targets" : [
{
"c99name" : "EFColorPicker",
"module_type" : "SwiftTarget",
"name" : "EFColorPicker",
"path" : "EFColorPicker",
"product_memberships" : [
"EFColorPicker"
],
"sources" : [
"Classes/EFColorComponentView.swift",
"Classes/EFColorSelectionView.swift",
"Classes/EFColorSelectionViewController.swift",
"Classes/EFColorUtils.swift",
"Classes/EFColorView.swift",
"Classes/EFColorWheelView.swift",
"Classes/EFControl.swift",
"Classes/EFHSBView.swift",
"Classes/EFRGBView.swift",
"Classes/EFSliderView.swift",
"Classes/EFThumbView.swift"
],
"type" : "library"
}
],
"tools_version" : "5.0"
}
Command line invocation:
/Applications/Xcode-16.3.0.app/Contents/Developer/usr/bin/xcodebuild -IDEClonedSourcePackagesDirPathOverride=/Users/admin/builder/spi-builder-workspace/.dependencies -resolvePackageDependencies
Resolve Package Graph
Resolved source packages:
EFColorPicker: /Users/admin/builder/spi-builder-workspace
resolved source packages: EFColorPicker
{
"dependencies" : [
],
"manifest_display_name" : "EFColorPicker",
"name" : "EFColorPicker",
"path" : "/Users/admin/builder/spi-builder-workspace",
"platforms" : [
{
"name" : "ios",
"version" : "8.0"
}
],
"products" : [
{
"name" : "EFColorPicker",
"targets" : [
"EFColorPicker"
],
"type" : {
"library" : [
"automatic"
]
}
}
],
"targets" : [
{
"c99name" : "EFColorPicker",
"module_type" : "SwiftTarget",
"name" : "EFColorPicker",
"path" : "EFColorPicker",
"product_memberships" : [
"EFColorPicker"
],
"sources" : [
"Classes/EFColorComponentView.swift",
"Classes/EFColorSelectionView.swift",
"Classes/EFColorSelectionViewController.swift",
"Classes/EFColorUtils.swift",
"Classes/EFColorView.swift",
"Classes/EFColorWheelView.swift",
"Classes/EFControl.swift",
"Classes/EFHSBView.swift",
"Classes/EFRGBView.swift",
"Classes/EFSliderView.swift",
"Classes/EFThumbView.swift"
],
"type" : "library"
}
],
"tools_version" : "5.0"
}
{
"workspace" : {
"name" : "spi-builder-workspace",
"schemes" : [
"EFColorPicker"
]
}
}
Running build ...
env DEVELOPER_DIR=/Applications/Xcode-16.3.0.app xcrun xcodebuild -IDEClonedSourcePackagesDirPathOverride=$PWD/.dependencies -skipMacroValidation -skipPackagePluginValidation -derivedDataPath $PWD/.derivedData build -scheme EFColorPicker -destination platform=macOS,arch=arm64 OTHER_SWIFT_FLAGS=-stats-output-dir .stats -strict-concurrency=complete -enable-upcoming-feature StrictConcurrency -enable-upcoming-feature DisableOutwardActorInference -enable-upcoming-feature GlobalActorIsolatedTypesUsability -enable-upcoming-feature InferSendableFromCaptures
Command line invocation:
/Applications/Xcode-16.3.0.app/Contents/Developer/usr/bin/xcodebuild -IDEClonedSourcePackagesDirPathOverride=/Users/admin/builder/spi-builder-workspace/.dependencies -skipMacroValidation -skipPackagePluginValidation -derivedDataPath /Users/admin/builder/spi-builder-workspace/.derivedData build -scheme EFColorPicker -destination platform=macOS,arch=arm64 "OTHER_SWIFT_FLAGS=-stats-output-dir .stats -strict-concurrency=complete -enable-upcoming-feature StrictConcurrency -enable-upcoming-feature DisableOutwardActorInference -enable-upcoming-feature GlobalActorIsolatedTypesUsability -enable-upcoming-feature InferSendableFromCaptures"
Build settings from command line:
OTHER_SWIFT_FLAGS = -stats-output-dir .stats -strict-concurrency=complete -enable-upcoming-feature StrictConcurrency -enable-upcoming-feature DisableOutwardActorInference -enable-upcoming-feature GlobalActorIsolatedTypesUsability -enable-upcoming-feature InferSendableFromCaptures
Resolve Package Graph
Resolved source packages:
EFColorPicker: /Users/admin/builder/spi-builder-workspace
ComputePackagePrebuildTargetDependencyGraph
Prepare packages
CreateBuildRequest
SendProjectDescription
CreateBuildOperation
ComputeTargetDependencyGraph
note: Building targets in dependency order
note: Target dependency graph (2 targets)
Target 'EFColorPicker' in project 'EFColorPicker'
➜ Explicit dependency on target 'EFColorPicker' in project 'EFColorPicker'
Target 'EFColorPicker' in project 'EFColorPicker' (no dependencies)
GatherProvisioningInputs
CreateBuildDescription
ExecuteExternalTool /Applications/Xcode-16.3.0.app/Contents/Developer/Toolchains/XcodeDefault.xctoolchain/usr/bin/clang -v -E -dM -isysroot /Applications/Xcode-16.3.0.app/Contents/Developer/Platforms/MacOSX.platform/Developer/SDKs/MacOSX15.4.sdk -x c -c /dev/null
ExecuteExternalTool /Applications/Xcode-16.3.0.app/Contents/Developer/Toolchains/XcodeDefault.xctoolchain/usr/bin/swiftc --version
ExecuteExternalTool /Applications/Xcode-16.3.0.app/Contents/Developer/Toolchains/XcodeDefault.xctoolchain/usr/bin/ld -version_details
Build description signature: e72fb6e456a8189082758d7037877996
Build description path: /Users/admin/builder/spi-builder-workspace/.derivedData/Build/Intermediates.noindex/XCBuildData/e72fb6e456a8189082758d7037877996.xcbuilddata
ClangStatCache /Applications/Xcode-16.3.0.app/Contents/Developer/Toolchains/XcodeDefault.xctoolchain/usr/bin/clang-stat-cache /Applications/Xcode-16.3.0.app/Contents/Developer/Platforms/MacOSX.platform/Developer/SDKs/MacOSX15.4.sdk /Users/admin/builder/spi-builder-workspace/.derivedData/SDKStatCaches.noindex/macosx15.4-24E241-8287b8f5db97e746a1562fbca0c9d29b.sdkstatcache
cd /Users/admin/builder/spi-builder-workspace/.swiftpm/xcode
/Applications/Xcode-16.3.0.app/Contents/Developer/Toolchains/XcodeDefault.xctoolchain/usr/bin/clang-stat-cache /Applications/Xcode-16.3.0.app/Contents/Developer/Platforms/MacOSX.platform/Developer/SDKs/MacOSX15.4.sdk -o /Users/admin/builder/spi-builder-workspace/.derivedData/SDKStatCaches.noindex/macosx15.4-24E241-8287b8f5db97e746a1562fbca0c9d29b.sdkstatcache
CreateBuildDirectory /Users/admin/builder/spi-builder-workspace/.derivedData/Build/Products
cd /Users/admin/builder/spi-builder-workspace/.swiftpm/xcode
builtin-create-build-directory /Users/admin/builder/spi-builder-workspace/.derivedData/Build/Products
CreateBuildDirectory /Users/admin/builder/spi-builder-workspace/.derivedData/Build/Intermediates.noindex
cd /Users/admin/builder/spi-builder-workspace/.swiftpm/xcode
builtin-create-build-directory /Users/admin/builder/spi-builder-workspace/.derivedData/Build/Intermediates.noindex
CreateBuildDirectory /Users/admin/builder/spi-builder-workspace/.derivedData/Build/Intermediates.noindex/EagerLinkingTBDs/Debug
cd /Users/admin/builder/spi-builder-workspace/.swiftpm/xcode
builtin-create-build-directory /Users/admin/builder/spi-builder-workspace/.derivedData/Build/Intermediates.noindex/EagerLinkingTBDs/Debug
CreateBuildDirectory /Users/admin/builder/spi-builder-workspace/.derivedData/Build/Products/Debug
cd /Users/admin/builder/spi-builder-workspace/.swiftpm/xcode
builtin-create-build-directory /Users/admin/builder/spi-builder-workspace/.derivedData/Build/Products/Debug
CreateBuildDirectory /Users/admin/builder/spi-builder-workspace/.derivedData/Build/Products/Debug/PackageFrameworks
cd /Users/admin/builder/spi-builder-workspace/.swiftpm/xcode
builtin-create-build-directory /Users/admin/builder/spi-builder-workspace/.derivedData/Build/Products/Debug/PackageFrameworks
WriteAuxiliaryFile /Users/admin/builder/spi-builder-workspace/.derivedData/Build/Intermediates.noindex/EFColorPicker.build/Debug/EFColorPicker.build/EFColorPicker.modulemap (in target 'EFColorPicker' from project 'EFColorPicker')
cd /Users/admin/builder/spi-builder-workspace
write-file /Users/admin/builder/spi-builder-workspace/.derivedData/Build/Intermediates.noindex/EFColorPicker.build/Debug/EFColorPicker.build/EFColorPicker.modulemap
WriteAuxiliaryFile /Users/admin/builder/spi-builder-workspace/.derivedData/Build/Intermediates.noindex/EFColorPicker.build/Debug/EFColorPicker.build/EFColorPicker.DependencyStaticMetadataFileList (in target 'EFColorPicker' from project 'EFColorPicker')
cd /Users/admin/builder/spi-builder-workspace
write-file /Users/admin/builder/spi-builder-workspace/.derivedData/Build/Intermediates.noindex/EFColorPicker.build/Debug/EFColorPicker.build/EFColorPicker.DependencyStaticMetadataFileList
WriteAuxiliaryFile /Users/admin/builder/spi-builder-workspace/.derivedData/Build/Intermediates.noindex/EFColorPicker.build/Debug/EFColorPicker.build/EFColorPicker.DependencyMetadataFileList (in target 'EFColorPicker' from project 'EFColorPicker')
cd /Users/admin/builder/spi-builder-workspace
write-file /Users/admin/builder/spi-builder-workspace/.derivedData/Build/Intermediates.noindex/EFColorPicker.build/Debug/EFColorPicker.build/EFColorPicker.DependencyMetadataFileList
WriteAuxiliaryFile /Users/admin/builder/spi-builder-workspace/.derivedData/Build/Intermediates.noindex/EFColorPicker.build/Debug/EFColorPicker.build/Objects-normal/arm64/EFColorPicker-OutputFileMap.json (in target 'EFColorPicker' from project 'EFColorPicker')
cd /Users/admin/builder/spi-builder-workspace
write-file /Users/admin/builder/spi-builder-workspace/.derivedData/Build/Intermediates.noindex/EFColorPicker.build/Debug/EFColorPicker.build/Objects-normal/arm64/EFColorPicker-OutputFileMap.json
WriteAuxiliaryFile /Users/admin/builder/spi-builder-workspace/.derivedData/Build/Intermediates.noindex/EFColorPicker.build/Debug/EFColorPicker.build/Objects-normal/arm64/EFColorPicker.SwiftConstValuesFileList (in target 'EFColorPicker' from project 'EFColorPicker')
cd /Users/admin/builder/spi-builder-workspace
write-file /Users/admin/builder/spi-builder-workspace/.derivedData/Build/Intermediates.noindex/EFColorPicker.build/Debug/EFColorPicker.build/Objects-normal/arm64/EFColorPicker.SwiftConstValuesFileList
WriteAuxiliaryFile /Users/admin/builder/spi-builder-workspace/.derivedData/Build/Intermediates.noindex/EFColorPicker.build/Debug/EFColorPicker.build/Objects-normal/arm64/EFColorPicker.LinkFileList (in target 'EFColorPicker' from project 'EFColorPicker')
cd /Users/admin/builder/spi-builder-workspace
write-file /Users/admin/builder/spi-builder-workspace/.derivedData/Build/Intermediates.noindex/EFColorPicker.build/Debug/EFColorPicker.build/Objects-normal/arm64/EFColorPicker.LinkFileList
WriteAuxiliaryFile /Users/admin/builder/spi-builder-workspace/.derivedData/Build/Intermediates.noindex/EFColorPicker.build/Debug/EFColorPicker.build/Objects-normal/arm64/EFColorPicker.SwiftFileList (in target 'EFColorPicker' from project 'EFColorPicker')
cd /Users/admin/builder/spi-builder-workspace
write-file /Users/admin/builder/spi-builder-workspace/.derivedData/Build/Intermediates.noindex/EFColorPicker.build/Debug/EFColorPicker.build/Objects-normal/arm64/EFColorPicker.SwiftFileList
WriteAuxiliaryFile /Users/admin/builder/spi-builder-workspace/.derivedData/Build/Intermediates.noindex/EFColorPicker.build/Debug/EFColorPicker.build/Objects-normal/arm64/EFColorPicker_const_extract_protocols.json (in target 'EFColorPicker' from project 'EFColorPicker')
cd /Users/admin/builder/spi-builder-workspace
write-file /Users/admin/builder/spi-builder-workspace/.derivedData/Build/Intermediates.noindex/EFColorPicker.build/Debug/EFColorPicker.build/Objects-normal/arm64/EFColorPicker_const_extract_protocols.json
Copy /Users/admin/builder/spi-builder-workspace/.derivedData/Build/Intermediates.noindex/GeneratedModuleMaps/EFColorPicker.modulemap /Users/admin/builder/spi-builder-workspace/.derivedData/Build/Intermediates.noindex/EFColorPicker.build/Debug/EFColorPicker.build/EFColorPicker.modulemap (in target 'EFColorPicker' from project 'EFColorPicker')
cd /Users/admin/builder/spi-builder-workspace
builtin-copy -exclude .DS_Store -exclude CVS -exclude .svn -exclude .git -exclude .hg -resolve-src-symlinks /Users/admin/builder/spi-builder-workspace/.derivedData/Build/Intermediates.noindex/EFColorPicker.build/Debug/EFColorPicker.build/EFColorPicker.modulemap /Users/admin/builder/spi-builder-workspace/.derivedData/Build/Intermediates.noindex/GeneratedModuleMaps
SwiftDriver EFColorPicker normal arm64 com.apple.xcode.tools.swift.compiler (in target 'EFColorPicker' from project 'EFColorPicker')
cd /Users/admin/builder/spi-builder-workspace/.swiftpm/xcode
builtin-SwiftDriver -- /Applications/Xcode-16.3.0.app/Contents/Developer/Toolchains/XcodeDefault.xctoolchain/usr/bin/swiftc -module-name EFColorPicker -Onone -enforce-exclusivity\=checked @/Users/admin/builder/spi-builder-workspace/.derivedData/Build/Intermediates.noindex/EFColorPicker.build/Debug/EFColorPicker.build/Objects-normal/arm64/EFColorPicker.SwiftFileList -DSWIFT_PACKAGE -DDEBUG -stats-output-dir .stats -strict-concurrency\=complete -enable-upcoming-feature StrictConcurrency -enable-upcoming-feature DisableOutwardActorInference -enable-upcoming-feature GlobalActorIsolatedTypesUsability -enable-upcoming-feature InferSendableFromCaptures -plugin-path /Applications/Xcode-16.3.0.app/Contents/Developer/Toolchains/XcodeDefault.xctoolchain/usr/lib/swift/host/plugins/testing -enable-experimental-feature DebugDescriptionMacro -sdk /Applications/Xcode-16.3.0.app/Contents/Developer/Platforms/MacOSX.platform/Developer/SDKs/MacOSX15.4.sdk -target arm64-apple-macos10.13 -g -module-cache-path /Users/admin/builder/spi-builder-workspace/.derivedData/ModuleCache.noindex -Xfrontend -serialize-debugging-options -enable-testing -index-store-path /Users/admin/builder/spi-builder-workspace/.derivedData/Index.noindex/DataStore -swift-version 5 -I /Users/admin/builder/spi-builder-workspace/.derivedData/Build/Products/Debug -I /Applications/Xcode-16.3.0.app/Contents/Developer/Platforms/MacOSX.platform/Developer/usr/lib -F /Users/admin/builder/spi-builder-workspace/.derivedData/Build/Products/Debug -F /Applications/Xcode-16.3.0.app/Contents/Developer/Platforms/MacOSX.platform/Developer/Library/Frameworks -c -j10 -enable-batch-mode -incremental -Xcc -ivfsstatcache -Xcc /Users/admin/builder/spi-builder-workspace/.derivedData/SDKStatCaches.noindex/macosx15.4-24E241-8287b8f5db97e746a1562fbca0c9d29b.sdkstatcache -output-file-map /Users/admin/builder/spi-builder-workspace/.derivedData/Build/Intermediates.noindex/EFColorPicker.build/Debug/EFColorPicker.build/Objects-normal/arm64/EFColorPicker-OutputFileMap.json -use-frontend-parseable-output -save-temps -no-color-diagnostics -serialize-diagnostics -emit-dependencies -emit-module -emit-module-path /Users/admin/builder/spi-builder-workspace/.derivedData/Build/Intermediates.noindex/EFColorPicker.build/Debug/EFColorPicker.build/Objects-normal/arm64/EFColorPicker.swiftmodule -validate-clang-modules-once -clang-build-session-file /Users/admin/builder/spi-builder-workspace/.derivedData/ModuleCache.noindex/Session.modulevalidation -Xcc -I/Users/admin/builder/spi-builder-workspace/.derivedData/Build/Intermediates.noindex/EFColorPicker.build/Debug/EFColorPicker.build/swift-overrides.hmap -emit-const-values -Xfrontend -const-gather-protocols-file -Xfrontend /Users/admin/builder/spi-builder-workspace/.derivedData/Build/Intermediates.noindex/EFColorPicker.build/Debug/EFColorPicker.build/Objects-normal/arm64/EFColorPicker_const_extract_protocols.json -Xcc -I/Users/admin/builder/spi-builder-workspace/.derivedData/Build/Products/Debug/include -Xcc -I/Users/admin/builder/spi-builder-workspace/.derivedData/Build/Intermediates.noindex/EFColorPicker.build/Debug/EFColorPicker.build/DerivedSources-normal/arm64 -Xcc -I/Users/admin/builder/spi-builder-workspace/.derivedData/Build/Intermediates.noindex/EFColorPicker.build/Debug/EFColorPicker.build/DerivedSources/arm64 -Xcc -I/Users/admin/builder/spi-builder-workspace/.derivedData/Build/Intermediates.noindex/EFColorPicker.build/Debug/EFColorPicker.build/DerivedSources -Xcc -DSWIFT_PACKAGE -Xcc -DDEBUG\=1 -emit-objc-header -emit-objc-header-path /Users/admin/builder/spi-builder-workspace/.derivedData/Build/Intermediates.noindex/EFColorPicker.build/Debug/EFColorPicker.build/Objects-normal/arm64/EFColorPicker-Swift.h -working-directory /Users/admin/builder/spi-builder-workspace/.swiftpm/xcode -experimental-emit-module-separately -disable-cmo
SwiftCompile normal arm64 Compiling\ EFColorSelectionViewController.swift /Users/admin/builder/spi-builder-workspace/EFColorPicker/Classes/EFColorSelectionViewController.swift (in target 'EFColorPicker' from project 'EFColorPicker')
SwiftCompile normal arm64 /Users/admin/builder/spi-builder-workspace/EFColorPicker/Classes/EFColorSelectionViewController.swift (in target 'EFColorPicker' from project 'EFColorPicker')
cd /Users/admin/builder/spi-builder-workspace/.swiftpm/xcode
SwiftCompile normal arm64 Compiling\ EFControl.swift /Users/admin/builder/spi-builder-workspace/EFColorPicker/Classes/EFControl.swift (in target 'EFColorPicker' from project 'EFColorPicker')
SwiftCompile normal arm64 /Users/admin/builder/spi-builder-workspace/EFColorPicker/Classes/EFControl.swift (in target 'EFColorPicker' from project 'EFColorPicker')
cd /Users/admin/builder/spi-builder-workspace/.swiftpm/xcode
SwiftCompile normal arm64 Compiling\ EFColorComponentView.swift,\ EFColorSelectionView.swift /Users/admin/builder/spi-builder-workspace/EFColorPicker/Classes/EFColorComponentView.swift /Users/admin/builder/spi-builder-workspace/EFColorPicker/Classes/EFColorSelectionView.swift (in target 'EFColorPicker' from project 'EFColorPicker')
SwiftCompile normal arm64 /Users/admin/builder/spi-builder-workspace/EFColorPicker/Classes/EFColorComponentView.swift (in target 'EFColorPicker' from project 'EFColorPicker')
cd /Users/admin/builder/spi-builder-workspace/.swiftpm/xcode
SwiftCompile normal arm64 /Users/admin/builder/spi-builder-workspace/EFColorPicker/Classes/EFColorSelectionView.swift (in target 'EFColorPicker' from project 'EFColorPicker')
cd /Users/admin/builder/spi-builder-workspace/.swiftpm/xcode
SwiftCompile normal arm64 Compiling\ EFColorView.swift /Users/admin/builder/spi-builder-workspace/EFColorPicker/Classes/EFColorView.swift (in target 'EFColorPicker' from project 'EFColorPicker')
SwiftCompile normal arm64 /Users/admin/builder/spi-builder-workspace/EFColorPicker/Classes/EFColorView.swift (in target 'EFColorPicker' from project 'EFColorPicker')
cd /Users/admin/builder/spi-builder-workspace/.swiftpm/xcode
SwiftCompile normal arm64 Compiling\ EFColorUtils.swift /Users/admin/builder/spi-builder-workspace/EFColorPicker/Classes/EFColorUtils.swift (in target 'EFColorPicker' from project 'EFColorPicker')
SwiftCompile normal arm64 /Users/admin/builder/spi-builder-workspace/EFColorPicker/Classes/EFColorUtils.swift (in target 'EFColorPicker' from project 'EFColorPicker')
cd /Users/admin/builder/spi-builder-workspace/.swiftpm/xcode
SwiftCompile normal arm64 Compiling\ EFHSBView.swift /Users/admin/builder/spi-builder-workspace/EFColorPicker/Classes/EFHSBView.swift (in target 'EFColorPicker' from project 'EFColorPicker')
SwiftCompile normal arm64 /Users/admin/builder/spi-builder-workspace/EFColorPicker/Classes/EFHSBView.swift (in target 'EFColorPicker' from project 'EFColorPicker')
cd /Users/admin/builder/spi-builder-workspace/.swiftpm/xcode
SwiftCompile normal arm64 Compiling\ EFSliderView.swift /Users/admin/builder/spi-builder-workspace/EFColorPicker/Classes/EFSliderView.swift (in target 'EFColorPicker' from project 'EFColorPicker')
SwiftCompile normal arm64 /Users/admin/builder/spi-builder-workspace/EFColorPicker/Classes/EFSliderView.swift (in target 'EFColorPicker' from project 'EFColorPicker')
cd /Users/admin/builder/spi-builder-workspace/.swiftpm/xcode
SwiftCompile normal arm64 Compiling\ EFRGBView.swift /Users/admin/builder/spi-builder-workspace/EFColorPicker/Classes/EFRGBView.swift (in target 'EFColorPicker' from project 'EFColorPicker')
SwiftCompile normal arm64 /Users/admin/builder/spi-builder-workspace/EFColorPicker/Classes/EFRGBView.swift (in target 'EFColorPicker' from project 'EFColorPicker')
cd /Users/admin/builder/spi-builder-workspace/.swiftpm/xcode
SwiftEmitModule normal arm64 Emitting\ module\ for\ EFColorPicker (in target 'EFColorPicker' from project 'EFColorPicker')
Failed frontend command:
/Applications/Xcode-16.3.0.app/Contents/Developer/Toolchains/XcodeDefault.xctoolchain/usr/bin/swift-frontend -frontend -emit-module -experimental-skip-non-inlinable-function-bodies-without-types /Users/admin/builder/spi-builder-workspace/EFColorPicker/Classes/EFColorComponentView.swift /Users/admin/builder/spi-builder-workspace/EFColorPicker/Classes/EFColorSelectionView.swift /Users/admin/builder/spi-builder-workspace/EFColorPicker/Classes/EFColorSelectionViewController.swift /Users/admin/builder/spi-builder-workspace/EFColorPicker/Classes/EFColorUtils.swift /Users/admin/builder/spi-builder-workspace/EFColorPicker/Classes/EFColorView.swift /Users/admin/builder/spi-builder-workspace/EFColorPicker/Classes/EFColorWheelView.swift /Users/admin/builder/spi-builder-workspace/EFColorPicker/Classes/EFControl.swift /Users/admin/builder/spi-builder-workspace/EFColorPicker/Classes/EFHSBView.swift /Users/admin/builder/spi-builder-workspace/EFColorPicker/Classes/EFRGBView.swift /Users/admin/builder/spi-builder-workspace/EFColorPicker/Classes/EFSliderView.swift /Users/admin/builder/spi-builder-workspace/EFColorPicker/Classes/EFThumbView.swift -target arm64-apple-macos10.13 -Xllvm -aarch64-use-tbi -enable-objc-interop -sdk /Applications/Xcode-16.3.0.app/Contents/Developer/Platforms/MacOSX.platform/Developer/SDKs/MacOSX15.4.sdk -I /Users/admin/builder/spi-builder-workspace/.derivedData/Build/Products/Debug -I /Applications/Xcode-16.3.0.app/Contents/Developer/Platforms/MacOSX.platform/Developer/usr/lib -F /Users/admin/builder/spi-builder-workspace/.derivedData/Build/Products/Debug -F /Applications/Xcode-16.3.0.app/Contents/Developer/Platforms/MacOSX.platform/Developer/Library/Frameworks -no-color-diagnostics -enable-testing -g -debug-info-format\=dwarf -dwarf-version\=4 -module-cache-path /Users/admin/builder/spi-builder-workspace/.derivedData/ModuleCache.noindex -swift-version 5 -enforce-exclusivity\=checked -stats-output-dir /Users/admin/builder/spi-builder-workspace/.swiftpm/xcode/.stats -Onone -D SWIFT_PACKAGE -D DEBUG -serialize-debugging-options -const-gather-protocols-file /Users/admin/builder/spi-builder-workspace/.derivedData/Build/Intermediates.noindex/EFColorPicker.build/Debug/EFColorPicker.build/Objects-normal/arm64/EFColorPicker_const_extract_protocols.json -enable-upcoming-feature StrictConcurrency -enable-upcoming-feature DisableOutwardActorInference -enable-upcoming-feature GlobalActorIsolatedTypesUsability -enable-upcoming-feature InferSendableFromCaptures -enable-experimental-feature DebugDescriptionMacro -strict-concurrency\=complete -empty-abi-descriptor -plugin-path /Applications/Xcode-16.3.0.app/Contents/Developer/Toolchains/XcodeDefault.xctoolchain/usr/lib/swift/host/plugins/testing -validate-clang-modules-once -clang-build-session-file /Users/admin/builder/spi-builder-workspace/.derivedData/ModuleCache.noindex/Session.modulevalidation -Xcc -working-directory -Xcc /Users/admin/builder/spi-builder-workspace/.swiftpm/xcode -resource-dir /Applications/Xcode-16.3.0.app/Contents/Developer/Toolchains/XcodeDefault.xctoolchain/usr/lib/swift -enable-anonymous-context-mangled-names -file-compilation-dir /Users/admin/builder/spi-builder-workspace/.swiftpm/xcode -Xcc -ivfsstatcache -Xcc /Users/admin/builder/spi-builder-workspace/.derivedData/SDKStatCaches.noindex/macosx15.4-24E241-8287b8f5db97e746a1562fbca0c9d29b.sdkstatcache -Xcc -I/Users/admin/builder/spi-builder-workspace/.derivedData/Build/Intermediates.noindex/EFColorPicker.build/Debug/EFColorPicker.build/swift-overrides.hmap -Xcc -I/Users/admin/builder/spi-builder-workspace/.derivedData/Build/Products/Debug/include -Xcc -I/Users/admin/builder/spi-builder-workspace/.derivedData/Build/Intermediates.noindex/EFColorPicker.build/Debug/EFColorPicker.build/DerivedSources-normal/arm64 -Xcc -I/Users/admin/builder/spi-builder-workspace/.derivedData/Build/Intermediates.noindex/EFColorPicker.build/Debug/EFColorPicker.build/DerivedSources/arm64 -Xcc -I/Users/admin/builder/spi-builder-workspace/.derivedData/Build/Intermediates.noindex/EFColorPicker.build/Debug/EFColorPicker.build/DerivedSources -Xcc -DSWIFT_PACKAGE -Xcc -DDEBUG\=1 -module-name EFColorPicker -frontend-parseable-output -disable-clang-spi -target-sdk-version 15.4 -target-sdk-name macosx15.4 -external-plugin-path /Applications/Xcode-16.3.0.app/Contents/Developer/Platforms/MacOSX.platform/Developer/usr/lib/swift/host/plugins\#/Applications/Xcode-16.3.0.app/Contents/Developer/Platforms/MacOSX.platform/Developer/usr/bin/swift-plugin-server -external-plugin-path /Applications/Xcode-16.3.0.app/Contents/Developer/Platforms/MacOSX.platform/Developer/usr/local/lib/swift/host/plugins\#/Applications/Xcode-16.3.0.app/Contents/Developer/Platforms/MacOSX.platform/Developer/usr/bin/swift-plugin-server -in-process-plugin-server-path /Applications/Xcode-16.3.0.app/Contents/Developer/Toolchains/XcodeDefault.xctoolchain/usr/lib/swift/host/libSwiftInProcPluginServer.dylib -plugin-path /Applications/Xcode-16.3.0.app/Contents/Developer/Toolchains/XcodeDefault.xctoolchain/usr/lib/swift/host/plugins -plugin-path /Applications/Xcode-16.3.0.app/Contents/Developer/Toolchains/XcodeDefault.xctoolchain/usr/local/lib/swift/host/plugins -emit-module-doc-path /Users/admin/builder/spi-builder-workspace/.derivedData/Build/Intermediates.noindex/EFColorPicker.build/Debug/EFColorPicker.build/Objects-normal/arm64/EFColorPicker.swiftdoc -emit-module-source-info-path /Users/admin/builder/spi-builder-workspace/.derivedData/Build/Intermediates.noindex/EFColorPicker.build/Debug/EFColorPicker.build/Objects-normal/arm64/EFColorPicker.swiftsourceinfo -emit-objc-header-path /Users/admin/builder/spi-builder-workspace/.derivedData/Build/Intermediates.noindex/EFColorPicker.build/Debug/EFColorPicker.build/Objects-normal/arm64/EFColorPicker-Swift.h -serialize-diagnostics-path /Users/admin/builder/spi-builder-workspace/.derivedData/Build/Intermediates.noindex/EFColorPicker.build/Debug/EFColorPicker.build/Objects-normal/arm64/EFColorPicker-master-emit-module.dia -emit-dependencies-path /Users/admin/builder/spi-builder-workspace/.derivedData/Build/Intermediates.noindex/EFColorPicker.build/Debug/EFColorPicker.build/Objects-normal/arm64/EFColorPicker-master-emit-module.d -o /Users/admin/builder/spi-builder-workspace/.derivedData/Build/Intermediates.noindex/EFColorPicker.build/Debug/EFColorPicker.build/Objects-normal/arm64/EFColorPicker.swiftmodule -emit-abi-descriptor-path /Users/admin/builder/spi-builder-workspace/.derivedData/Build/Intermediates.noindex/EFColorPicker.build/Debug/EFColorPicker.build/Objects-normal/arm64/EFColorPicker.abi.json
EmitSwiftModule normal arm64 (in target 'EFColorPicker' from project 'EFColorPicker')
cd /Users/admin/builder/spi-builder-workspace/.swiftpm/xcode
/Users/admin/builder/spi-builder-workspace/EFColorPicker/Classes/EFColorComponentView.swift:27:8: error: no such module 'UIKit'
import UIKit
^
SwiftCompile normal arm64 Compiling\ EFThumbView.swift /Users/admin/builder/spi-builder-workspace/EFColorPicker/Classes/EFThumbView.swift (in target 'EFColorPicker' from project 'EFColorPicker')
SwiftCompile normal arm64 /Users/admin/builder/spi-builder-workspace/EFColorPicker/Classes/EFThumbView.swift (in target 'EFColorPicker' from project 'EFColorPicker')
cd /Users/admin/builder/spi-builder-workspace/.swiftpm/xcode
SwiftCompile normal arm64 Compiling\ EFColorWheelView.swift /Users/admin/builder/spi-builder-workspace/EFColorPicker/Classes/EFColorWheelView.swift (in target 'EFColorPicker' from project 'EFColorPicker')
Command SwiftCompile failed with a nonzero exit code
--- xcodebuild: WARNING: Using the first of multiple matching destinations:
{ platform:macOS, arch:arm64, id:62189eba0d0c91c5e3b82d2d4071a51401d73ffd, name:My Mac }
{ platform:macOS, arch:arm64, variant:Mac Catalyst, id:62189eba0d0c91c5e3b82d2d4071a51401d73ffd, name:My Mac }
{ platform:macOS, arch:arm64, variant:DriverKit, id:62189eba0d0c91c5e3b82d2d4071a51401d73ffd, name:My Mac }
{ platform:macOS, arch:arm64, variant:Designed for [iPad,iPhone], id:62189eba0d0c91c5e3b82d2d4071a51401d73ffd, name:My Mac }
** BUILD FAILED **
The following build commands failed:
SwiftEmitModule normal arm64 Emitting\ module\ for\ EFColorPicker (in target 'EFColorPicker' from project 'EFColorPicker')
EmitSwiftModule normal arm64 (in target 'EFColorPicker' from project 'EFColorPicker')
SwiftCompile normal arm64 Compiling\ EFColorWheelView.swift /Users/admin/builder/spi-builder-workspace/EFColorPicker/Classes/EFColorWheelView.swift (in target 'EFColorPicker' from project 'EFColorPicker')
Building workspace spi-builder-workspace with scheme EFColorPicker
(4 failures)
Command line invocation:
/Applications/Xcode-16.3.0.app/Contents/Developer/usr/bin/xcodebuild -IDEClonedSourcePackagesDirPathOverride=/Users/admin/builder/spi-builder-workspace/.dependencies -resolvePackageDependencies
Resolve Package Graph
Resolved source packages:
EFColorPicker: /Users/admin/builder/spi-builder-workspace
resolved source packages: EFColorPicker
{
"dependencies" : [
],
"manifest_display_name" : "EFColorPicker",
"name" : "EFColorPicker",
"path" : "/Users/admin/builder/spi-builder-workspace",
"platforms" : [
{
"name" : "ios",
"version" : "8.0"
}
],
"products" : [
{
"name" : "EFColorPicker",
"targets" : [
"EFColorPicker"
],
"type" : {
"library" : [
"automatic"
]
}
}
],
"targets" : [
{
"c99name" : "EFColorPicker",
"module_type" : "SwiftTarget",
"name" : "EFColorPicker",
"path" : "EFColorPicker",
"product_memberships" : [
"EFColorPicker"
],
"sources" : [
"Classes/EFColorComponentView.swift",
"Classes/EFColorSelectionView.swift",
"Classes/EFColorSelectionViewController.swift",
"Classes/EFColorUtils.swift",
"Classes/EFColorView.swift",
"Classes/EFColorWheelView.swift",
"Classes/EFControl.swift",
"Classes/EFHSBView.swift",
"Classes/EFRGBView.swift",
"Classes/EFSliderView.swift",
"Classes/EFThumbView.swift"
],
"type" : "library"
}
],
"tools_version" : "5.0"
}
{
"workspace" : {
"name" : "spi-builder-workspace",
"schemes" : [
"EFColorPicker"
]
}
}
Running build ...
env DEVELOPER_DIR=/Applications/Xcode-16.3.0.app xcrun xcodebuild -IDEClonedSourcePackagesDirPathOverride=$PWD/.dependencies -skipMacroValidation -skipPackagePluginValidation -derivedDataPath $PWD/.derivedData build -scheme EFColorPicker -destination platform=macOS,arch=arm64
Command line invocation:
/Applications/Xcode-16.3.0.app/Contents/Developer/usr/bin/xcodebuild -IDEClonedSourcePackagesDirPathOverride=/Users/admin/builder/spi-builder-workspace/.dependencies -skipMacroValidation -skipPackagePluginValidation -derivedDataPath /Users/admin/builder/spi-builder-workspace/.derivedData build -scheme EFColorPicker -destination platform=macOS,arch=arm64
Resolve Package Graph
Resolved source packages:
EFColorPicker: /Users/admin/builder/spi-builder-workspace
ComputePackagePrebuildTargetDependencyGraph
Prepare packages
CreateBuildRequest
SendProjectDescription
CreateBuildOperation
ComputeTargetDependencyGraph
note: Building targets in dependency order
note: Target dependency graph (2 targets)
Target 'EFColorPicker' in project 'EFColorPicker'
➜ Explicit dependency on target 'EFColorPicker' in project 'EFColorPicker'
Target 'EFColorPicker' in project 'EFColorPicker' (no dependencies)
GatherProvisioningInputs
CreateBuildDescription
ExecuteExternalTool /Applications/Xcode-16.3.0.app/Contents/Developer/Toolchains/XcodeDefault.xctoolchain/usr/bin/clang -v -E -dM -isysroot /Applications/Xcode-16.3.0.app/Contents/Developer/Platforms/MacOSX.platform/Developer/SDKs/MacOSX15.4.sdk -x c -c /dev/null
ExecuteExternalTool /Applications/Xcode-16.3.0.app/Contents/Developer/Toolchains/XcodeDefault.xctoolchain/usr/bin/swiftc --version
ExecuteExternalTool /Applications/Xcode-16.3.0.app/Contents/Developer/Toolchains/XcodeDefault.xctoolchain/usr/bin/ld -version_details
Build description signature: 5db4ad04402b58c8e6d5b38ed4745cf8
Build description path: /Users/admin/builder/spi-builder-workspace/.derivedData/Build/Intermediates.noindex/XCBuildData/5db4ad04402b58c8e6d5b38ed4745cf8.xcbuilddata
ClangStatCache /Applications/Xcode-16.3.0.app/Contents/Developer/Toolchains/XcodeDefault.xctoolchain/usr/bin/clang-stat-cache /Applications/Xcode-16.3.0.app/Contents/Developer/Platforms/MacOSX.platform/Developer/SDKs/MacOSX15.4.sdk /Users/admin/builder/spi-builder-workspace/.derivedData/SDKStatCaches.noindex/macosx15.4-24E241-8287b8f5db97e746a1562fbca0c9d29b.sdkstatcache
cd /Users/admin/builder/spi-builder-workspace/.swiftpm/xcode
/Applications/Xcode-16.3.0.app/Contents/Developer/Toolchains/XcodeDefault.xctoolchain/usr/bin/clang-stat-cache /Applications/Xcode-16.3.0.app/Contents/Developer/Platforms/MacOSX.platform/Developer/SDKs/MacOSX15.4.sdk -o /Users/admin/builder/spi-builder-workspace/.derivedData/SDKStatCaches.noindex/macosx15.4-24E241-8287b8f5db97e746a1562fbca0c9d29b.sdkstatcache
SwiftDriver EFColorPicker normal arm64 com.apple.xcode.tools.swift.compiler (in target 'EFColorPicker' from project 'EFColorPicker')
cd /Users/admin/builder/spi-builder-workspace/.swiftpm/xcode
builtin-SwiftDriver -- /Applications/Xcode-16.3.0.app/Contents/Developer/Toolchains/XcodeDefault.xctoolchain/usr/bin/swiftc -module-name EFColorPicker -Onone -enforce-exclusivity\=checked @/Users/admin/builder/spi-builder-workspace/.derivedData/Build/Intermediates.noindex/EFColorPicker.build/Debug/EFColorPicker.build/Objects-normal/arm64/EFColorPicker.SwiftFileList -DSWIFT_PACKAGE -DDEBUG -DXcode -plugin-path /Applications/Xcode-16.3.0.app/Contents/Developer/Toolchains/XcodeDefault.xctoolchain/usr/lib/swift/host/plugins/testing -enable-experimental-feature DebugDescriptionMacro -sdk /Applications/Xcode-16.3.0.app/Contents/Developer/Platforms/MacOSX.platform/Developer/SDKs/MacOSX15.4.sdk -target arm64-apple-macos10.13 -g -module-cache-path /Users/admin/builder/spi-builder-workspace/.derivedData/ModuleCache.noindex -Xfrontend -serialize-debugging-options -enable-testing -index-store-path /Users/admin/builder/spi-builder-workspace/.derivedData/Index.noindex/DataStore -swift-version 5 -I /Users/admin/builder/spi-builder-workspace/.derivedData/Build/Products/Debug -I /Applications/Xcode-16.3.0.app/Contents/Developer/Platforms/MacOSX.platform/Developer/usr/lib -F /Users/admin/builder/spi-builder-workspace/.derivedData/Build/Products/Debug -F /Applications/Xcode-16.3.0.app/Contents/Developer/Platforms/MacOSX.platform/Developer/Library/Frameworks -c -j10 -enable-batch-mode -incremental -Xcc -ivfsstatcache -Xcc /Users/admin/builder/spi-builder-workspace/.derivedData/SDKStatCaches.noindex/macosx15.4-24E241-8287b8f5db97e746a1562fbca0c9d29b.sdkstatcache -output-file-map /Users/admin/builder/spi-builder-workspace/.derivedData/Build/Intermediates.noindex/EFColorPicker.build/Debug/EFColorPicker.build/Objects-normal/arm64/EFColorPicker-OutputFileMap.json -use-frontend-parseable-output -save-temps -no-color-diagnostics -serialize-diagnostics -emit-dependencies -emit-module -emit-module-path /Users/admin/builder/spi-builder-workspace/.derivedData/Build/Intermediates.noindex/EFColorPicker.build/Debug/EFColorPicker.build/Objects-normal/arm64/EFColorPicker.swiftmodule -validate-clang-modules-once -clang-build-session-file /Users/admin/builder/spi-builder-workspace/.derivedData/ModuleCache.noindex/Session.modulevalidation -Xcc -I/Users/admin/builder/spi-builder-workspace/.derivedData/Build/Intermediates.noindex/EFColorPicker.build/Debug/EFColorPicker.build/swift-overrides.hmap -emit-const-values -Xfrontend -const-gather-protocols-file -Xfrontend /Users/admin/builder/spi-builder-workspace/.derivedData/Build/Intermediates.noindex/EFColorPicker.build/Debug/EFColorPicker.build/Objects-normal/arm64/EFColorPicker_const_extract_protocols.json -Xcc -I/Users/admin/builder/spi-builder-workspace/.derivedData/Build/Products/Debug/include -Xcc -I/Users/admin/builder/spi-builder-workspace/.derivedData/Build/Intermediates.noindex/EFColorPicker.build/Debug/EFColorPicker.build/DerivedSources-normal/arm64 -Xcc -I/Users/admin/builder/spi-builder-workspace/.derivedData/Build/Intermediates.noindex/EFColorPicker.build/Debug/EFColorPicker.build/DerivedSources/arm64 -Xcc -I/Users/admin/builder/spi-builder-workspace/.derivedData/Build/Intermediates.noindex/EFColorPicker.build/Debug/EFColorPicker.build/DerivedSources -Xcc -DSWIFT_PACKAGE -Xcc -DDEBUG\=1 -emit-objc-header -emit-objc-header-path /Users/admin/builder/spi-builder-workspace/.derivedData/Build/Intermediates.noindex/EFColorPicker.build/Debug/EFColorPicker.build/Objects-normal/arm64/EFColorPicker-Swift.h -working-directory /Users/admin/builder/spi-builder-workspace/.swiftpm/xcode -experimental-emit-module-separately -disable-cmo
SwiftCompile normal arm64 Compiling\ EFColorView.swift /Users/admin/builder/spi-builder-workspace/EFColorPicker/Classes/EFColorView.swift (in target 'EFColorPicker' from project 'EFColorPicker')
SwiftCompile normal arm64 /Users/admin/builder/spi-builder-workspace/EFColorPicker/Classes/EFColorView.swift (in target 'EFColorPicker' from project 'EFColorPicker')
cd /Users/admin/builder/spi-builder-workspace/.swiftpm/xcode
SwiftCompile normal arm64 Compiling\ EFControl.swift /Users/admin/builder/spi-builder-workspace/EFColorPicker/Classes/EFControl.swift (in target 'EFColorPicker' from project 'EFColorPicker')
SwiftCompile normal arm64 /Users/admin/builder/spi-builder-workspace/EFColorPicker/Classes/EFControl.swift (in target 'EFColorPicker' from project 'EFColorPicker')
cd /Users/admin/builder/spi-builder-workspace/.swiftpm/xcode
SwiftCompile normal arm64 Compiling\ EFHSBView.swift /Users/admin/builder/spi-builder-workspace/EFColorPicker/Classes/EFHSBView.swift (in target 'EFColorPicker' from project 'EFColorPicker')
SwiftCompile normal arm64 /Users/admin/builder/spi-builder-workspace/EFColorPicker/Classes/EFHSBView.swift (in target 'EFColorPicker' from project 'EFColorPicker')
cd /Users/admin/builder/spi-builder-workspace/.swiftpm/xcode
SwiftEmitModule normal arm64 Emitting\ module\ for\ EFColorPicker (in target 'EFColorPicker' from project 'EFColorPicker')
Failed frontend command:
/Applications/Xcode-16.3.0.app/Contents/Developer/Toolchains/XcodeDefault.xctoolchain/usr/bin/swift-frontend -frontend -emit-module -experimental-skip-non-inlinable-function-bodies-without-types /Users/admin/builder/spi-builder-workspace/EFColorPicker/Classes/EFColorComponentView.swift /Users/admin/builder/spi-builder-workspace/EFColorPicker/Classes/EFColorSelectionView.swift /Users/admin/builder/spi-builder-workspace/EFColorPicker/Classes/EFColorSelectionViewController.swift /Users/admin/builder/spi-builder-workspace/EFColorPicker/Classes/EFColorUtils.swift /Users/admin/builder/spi-builder-workspace/EFColorPicker/Classes/EFColorView.swift /Users/admin/builder/spi-builder-workspace/EFColorPicker/Classes/EFColorWheelView.swift /Users/admin/builder/spi-builder-workspace/EFColorPicker/Classes/EFControl.swift /Users/admin/builder/spi-builder-workspace/EFColorPicker/Classes/EFHSBView.swift /Users/admin/builder/spi-builder-workspace/EFColorPicker/Classes/EFRGBView.swift /Users/admin/builder/spi-builder-workspace/EFColorPicker/Classes/EFSliderView.swift /Users/admin/builder/spi-builder-workspace/EFColorPicker/Classes/EFThumbView.swift -target arm64-apple-macos10.13 -Xllvm -aarch64-use-tbi -enable-objc-interop -sdk /Applications/Xcode-16.3.0.app/Contents/Developer/Platforms/MacOSX.platform/Developer/SDKs/MacOSX15.4.sdk -I /Users/admin/builder/spi-builder-workspace/.derivedData/Build/Products/Debug -I /Applications/Xcode-16.3.0.app/Contents/Developer/Platforms/MacOSX.platform/Developer/usr/lib -F /Users/admin/builder/spi-builder-workspace/.derivedData/Build/Products/Debug -F /Applications/Xcode-16.3.0.app/Contents/Developer/Platforms/MacOSX.platform/Developer/Library/Frameworks -no-color-diagnostics -enable-testing -g -debug-info-format\=dwarf -dwarf-version\=4 -module-cache-path /Users/admin/builder/spi-builder-workspace/.derivedData/ModuleCache.noindex -swift-version 5 -enforce-exclusivity\=checked -Onone -D SWIFT_PACKAGE -D DEBUG -D Xcode -serialize-debugging-options -const-gather-protocols-file /Users/admin/builder/spi-builder-workspace/.derivedData/Build/Intermediates.noindex/EFColorPicker.build/Debug/EFColorPicker.build/Objects-normal/arm64/EFColorPicker_const_extract_protocols.json -enable-experimental-feature DebugDescriptionMacro -empty-abi-descriptor -plugin-path /Applications/Xcode-16.3.0.app/Contents/Developer/Toolchains/XcodeDefault.xctoolchain/usr/lib/swift/host/plugins/testing -validate-clang-modules-once -clang-build-session-file /Users/admin/builder/spi-builder-workspace/.derivedData/ModuleCache.noindex/Session.modulevalidation -Xcc -working-directory -Xcc /Users/admin/builder/spi-builder-workspace/.swiftpm/xcode -resource-dir /Applications/Xcode-16.3.0.app/Contents/Developer/Toolchains/XcodeDefault.xctoolchain/usr/lib/swift -enable-anonymous-context-mangled-names -file-compilation-dir /Users/admin/builder/spi-builder-workspace/.swiftpm/xcode -Xcc -ivfsstatcache -Xcc /Users/admin/builder/spi-builder-workspace/.derivedData/SDKStatCaches.noindex/macosx15.4-24E241-8287b8f5db97e746a1562fbca0c9d29b.sdkstatcache -Xcc -I/Users/admin/builder/spi-builder-workspace/.derivedData/Build/Intermediates.noindex/EFColorPicker.build/Debug/EFColorPicker.build/swift-overrides.hmap -Xcc -I/Users/admin/builder/spi-builder-workspace/.derivedData/Build/Products/Debug/include -Xcc -I/Users/admin/builder/spi-builder-workspace/.derivedData/Build/Intermediates.noindex/EFColorPicker.build/Debug/EFColorPicker.build/DerivedSources-normal/arm64 -Xcc -I/Users/admin/builder/spi-builder-workspace/.derivedData/Build/Intermediates.noindex/EFColorPicker.build/Debug/EFColorPicker.build/DerivedSources/arm64 -Xcc -I/Users/admin/builder/spi-builder-workspace/.derivedData/Build/Intermediates.noindex/EFColorPicker.build/Debug/EFColorPicker.build/DerivedSources -Xcc -DSWIFT_PACKAGE -Xcc -DDEBUG\=1 -module-name EFColorPicker -frontend-parseable-output -disable-clang-spi -target-sdk-version 15.4 -target-sdk-name macosx15.4 -external-plugin-path /Applications/Xcode-16.3.0.app/Contents/Developer/Platforms/MacOSX.platform/Developer/usr/lib/swift/host/plugins\#/Applications/Xcode-16.3.0.app/Contents/Developer/Platforms/MacOSX.platform/Developer/usr/bin/swift-plugin-server -external-plugin-path /Applications/Xcode-16.3.0.app/Contents/Developer/Platforms/MacOSX.platform/Developer/usr/local/lib/swift/host/plugins\#/Applications/Xcode-16.3.0.app/Contents/Developer/Platforms/MacOSX.platform/Developer/usr/bin/swift-plugin-server -in-process-plugin-server-path /Applications/Xcode-16.3.0.app/Contents/Developer/Toolchains/XcodeDefault.xctoolchain/usr/lib/swift/host/libSwiftInProcPluginServer.dylib -plugin-path /Applications/Xcode-16.3.0.app/Contents/Developer/Toolchains/XcodeDefault.xctoolchain/usr/lib/swift/host/plugins -plugin-path /Applications/Xcode-16.3.0.app/Contents/Developer/Toolchains/XcodeDefault.xctoolchain/usr/local/lib/swift/host/plugins -emit-module-doc-path /Users/admin/builder/spi-builder-workspace/.derivedData/Build/Intermediates.noindex/EFColorPicker.build/Debug/EFColorPicker.build/Objects-normal/arm64/EFColorPicker.swiftdoc -emit-module-source-info-path /Users/admin/builder/spi-builder-workspace/.derivedData/Build/Intermediates.noindex/EFColorPicker.build/Debug/EFColorPicker.build/Objects-normal/arm64/EFColorPicker.swiftsourceinfo -emit-objc-header-path /Users/admin/builder/spi-builder-workspace/.derivedData/Build/Intermediates.noindex/EFColorPicker.build/Debug/EFColorPicker.build/Objects-normal/arm64/EFColorPicker-Swift.h -serialize-diagnostics-path /Users/admin/builder/spi-builder-workspace/.derivedData/Build/Intermediates.noindex/EFColorPicker.build/Debug/EFColorPicker.build/Objects-normal/arm64/EFColorPicker-master-emit-module.dia -emit-dependencies-path /Users/admin/builder/spi-builder-workspace/.derivedData/Build/Intermediates.noindex/EFColorPicker.build/Debug/EFColorPicker.build/Objects-normal/arm64/EFColorPicker-master-emit-module.d -o /Users/admin/builder/spi-builder-workspace/.derivedData/Build/Intermediates.noindex/EFColorPicker.build/Debug/EFColorPicker.build/Objects-normal/arm64/EFColorPicker.swiftmodule -emit-abi-descriptor-path /Users/admin/builder/spi-builder-workspace/.derivedData/Build/Intermediates.noindex/EFColorPicker.build/Debug/EFColorPicker.build/Objects-normal/arm64/EFColorPicker.abi.json
EmitSwiftModule normal arm64 (in target 'EFColorPicker' from project 'EFColorPicker')
cd /Users/admin/builder/spi-builder-workspace/.swiftpm/xcode
/Users/admin/builder/spi-builder-workspace/EFColorPicker/Classes/EFColorComponentView.swift:27:8: error: no such module 'UIKit'
import UIKit
^
SwiftCompile normal arm64 Compiling\ EFThumbView.swift /Users/admin/builder/spi-builder-workspace/EFColorPicker/Classes/EFThumbView.swift (in target 'EFColorPicker' from project 'EFColorPicker')
SwiftCompile normal arm64 /Users/admin/builder/spi-builder-workspace/EFColorPicker/Classes/EFThumbView.swift (in target 'EFColorPicker' from project 'EFColorPicker')
cd /Users/admin/builder/spi-builder-workspace/.swiftpm/xcode
SwiftCompile normal arm64 Compiling\ EFColorUtils.swift /Users/admin/builder/spi-builder-workspace/EFColorPicker/Classes/EFColorUtils.swift (in target 'EFColorPicker' from project 'EFColorPicker')
SwiftCompile normal arm64 /Users/admin/builder/spi-builder-workspace/EFColorPicker/Classes/EFColorUtils.swift (in target 'EFColorPicker' from project 'EFColorPicker')
cd /Users/admin/builder/spi-builder-workspace/.swiftpm/xcode
SwiftCompile normal arm64 Compiling\ EFColorWheelView.swift /Users/admin/builder/spi-builder-workspace/EFColorPicker/Classes/EFColorWheelView.swift (in target 'EFColorPicker' from project 'EFColorPicker')
SwiftCompile normal arm64 /Users/admin/builder/spi-builder-workspace/EFColorPicker/Classes/EFColorWheelView.swift (in target 'EFColorPicker' from project 'EFColorPicker')
cd /Users/admin/builder/spi-builder-workspace/.swiftpm/xcode
SwiftCompile normal arm64 Compiling\ EFSliderView.swift /Users/admin/builder/spi-builder-workspace/EFColorPicker/Classes/EFSliderView.swift (in target 'EFColorPicker' from project 'EFColorPicker')
SwiftCompile normal arm64 /Users/admin/builder/spi-builder-workspace/EFColorPicker/Classes/EFSliderView.swift (in target 'EFColorPicker' from project 'EFColorPicker')
cd /Users/admin/builder/spi-builder-workspace/.swiftpm/xcode
SwiftCompile normal arm64 Compiling\ EFColorComponentView.swift,\ EFColorSelectionView.swift /Users/admin/builder/spi-builder-workspace/EFColorPicker/Classes/EFColorComponentView.swift /Users/admin/builder/spi-builder-workspace/EFColorPicker/Classes/EFColorSelectionView.swift (in target 'EFColorPicker' from project 'EFColorPicker')
SwiftCompile normal arm64 /Users/admin/builder/spi-builder-workspace/EFColorPicker/Classes/EFColorComponentView.swift (in target 'EFColorPicker' from project 'EFColorPicker')
cd /Users/admin/builder/spi-builder-workspace/.swiftpm/xcode
SwiftCompile normal arm64 /Users/admin/builder/spi-builder-workspace/EFColorPicker/Classes/EFColorSelectionView.swift (in target 'EFColorPicker' from project 'EFColorPicker')
cd /Users/admin/builder/spi-builder-workspace/.swiftpm/xcode
SwiftCompile normal arm64 Compiling\ EFColorSelectionViewController.swift /Users/admin/builder/spi-builder-workspace/EFColorPicker/Classes/EFColorSelectionViewController.swift (in target 'EFColorPicker' from project 'EFColorPicker')
SwiftCompile normal arm64 /Users/admin/builder/spi-builder-workspace/EFColorPicker/Classes/EFColorSelectionViewController.swift (in target 'EFColorPicker' from project 'EFColorPicker')
cd /Users/admin/builder/spi-builder-workspace/.swiftpm/xcode
SwiftCompile normal arm64 Compiling\ EFRGBView.swift /Users/admin/builder/spi-builder-workspace/EFColorPicker/Classes/EFRGBView.swift (in target 'EFColorPicker' from project 'EFColorPicker')
Command SwiftCompile failed with a nonzero exit code
--- xcodebuild: WARNING: Using the first of multiple matching destinations:
{ platform:macOS, arch:arm64, id:62189eba0d0c91c5e3b82d2d4071a51401d73ffd, name:My Mac }
{ platform:macOS, arch:arm64, variant:Mac Catalyst, id:62189eba0d0c91c5e3b82d2d4071a51401d73ffd, name:My Mac }
{ platform:macOS, arch:arm64, variant:DriverKit, id:62189eba0d0c91c5e3b82d2d4071a51401d73ffd, name:My Mac }
{ platform:macOS, arch:arm64, variant:Designed for [iPad,iPhone], id:62189eba0d0c91c5e3b82d2d4071a51401d73ffd, name:My Mac }
** BUILD FAILED **
The following build commands failed:
SwiftEmitModule normal arm64 Emitting\ module\ for\ EFColorPicker (in target 'EFColorPicker' from project 'EFColorPicker')
EmitSwiftModule normal arm64 (in target 'EFColorPicker' from project 'EFColorPicker')
SwiftCompile normal arm64 Compiling\ EFRGBView.swift /Users/admin/builder/spi-builder-workspace/EFColorPicker/Classes/EFRGBView.swift (in target 'EFColorPicker' from project 'EFColorPicker')
Building workspace spi-builder-workspace with scheme EFColorPicker
(4 failures)
BUILD FAILURE 6.1 macosXcodebuild