The Swift Package Index logo.Swift Package Index

Track the adoption of Swift 6 strict concurrency checks for data race safety. How many packages are Ready for Swift 6?

Build Information

Failed to build NVActivityIndicatorView, reference 5.2.0 (121455), with Swift 6.0 for tvOS using Xcode 16.2 on 30 Nov 2024 22:39:02 UTC.

Build Command

env DEVELOPER_DIR=/Applications/Xcode-16.1.0.app xcrun xcodebuild -IDEClonedSourcePackagesDirPathOverride=$PWD/.dependencies -skipMacroValidation -skipPackagePluginValidation -derivedDataPath $PWD/.derivedData build -scheme NVActivityIndicatorView-Package -destination generic/platform=tvOS OTHER_SWIFT_FLAGS=-stats-output-dir .stats -strict-concurrency=complete -enable-upcoming-feature StrictConcurrency -enable-upcoming-feature DisableOutwardActorInference -enable-upcoming-feature GlobalActorIsolatedTypesUsability -enable-upcoming-feature InferSendableFromCaptures

Build Log

   0.0000 (  0.0%)   0.0000 (  0.0%)   0.0000 (  0.0%)   0.0000 (  0.0%)  AST verification
   0.0000 (  0.0%)   0.0000 (  0.0%)   0.0000 (  0.0%)   0.0000 (  0.0%)  IsDefaultActorRequest
   0.0000 (  0.0%)   0.0000 (  0.0%)   0.0000 (  0.0%)   0.0000 (  0.0%)  CheckInconsistentAccessLevelOnImportSameFileRequest
   0.0000 (  0.0%)   0.0000 (  0.0%)   0.0000 (  0.0%)   0.0000 (  0.0%)  populate-source-file-class-member-cache
   0.0000 (  0.0%)   0.0000 (  0.0%)   0.0000 (  0.0%)   0.0000 (  0.0%)  perform-whole-module-type-checking
   0.0000 (  0.0%)   0.0000 (  0.0%)   0.0000 (  0.0%)   0.0000 (  0.0%)  ModuleImplicitImportsRequest
   0.0000 (  0.0%)   0.0000 (  0.0%)   0.0000 (  0.0%)   0.0000 (  0.0%)  SuperclassTypeRequest
   0.0000 (  0.0%)   0.0000 (  0.0%)   0.0000 (  0.0%)   0.0000 (  0.0%)  ExpandPreambleMacroRequest
   0.0000 (  0.0%)   0.0000 (  0.0%)   0.0000 (  0.0%)   0.0000 (  0.0%)  RequiresOpaqueModifyCoroutineRequest
   0.0000 (  0.0%)   0.0000 (  0.0%)   0.0000 (  0.0%)   0.0000 (  0.0%)  EnumRawTypeRequest
   0.0000 (  0.0%)   0.0000 (  0.0%)   0.0000 (  0.0%)   0.0000 (  0.0%)  PrimarySourceFilesRequest
   2.9532 (100.0%)  17.8121 (100.0%)  20.7653 (100.0%)  20.8935 (100.0%)  Total
===-------------------------------------------------------------------------===
                                Running Program
===-------------------------------------------------------------------------===
  Total Execution Time: 16.1286 seconds (16.5120 wall clock)
   ---User Time---   --System Time--   --User+System--   ---Wall Time---  --- Name ---
   2.1765 (100.0%)  13.9522 (100.0%)  16.1286 (100.0%)  16.5120 (100.0%)  Building Target
   2.1765 (100.0%)  13.9522 (100.0%)  16.1286 (100.0%)  16.5120 (100.0%)  Total
SwiftCompile normal arm64 /Users/admin/builder/spi-builder-workspace/Sources/Base/Animations/NVActivityIndicatorAnimationBallZigZagDeflect.swift (in target 'NVActivityIndicatorView' from project 'NVActivityIndicatorView')
    cd /Users/admin/builder/spi-builder-workspace
    /Applications/Xcode-16.1.0.app/Contents/Developer/Toolchains/XcodeDefault.xctoolchain/usr/bin/swift-frontend -c /Users/admin/builder/spi-builder-workspace/Sources/Base/Animations/NVActivityIndicatorAnimationAudioEqualizer.swift /Users/admin/builder/spi-builder-workspace/Sources/Base/Animations/NVActivityIndicatorAnimationBallBeat.swift /Users/admin/builder/spi-builder-workspace/Sources/Base/Animations/NVActivityIndicatorAnimationBallClipRotate.swift /Users/admin/builder/spi-builder-workspace/Sources/Base/Animations/NVActivityIndicatorAnimationBallClipRotateMultiple.swift /Users/admin/builder/spi-builder-workspace/Sources/Base/Animations/NVActivityIndicatorAnimationBallClipRotatePulse.swift /Users/admin/builder/spi-builder-workspace/Sources/Base/Animations/NVActivityIndicatorAnimationBallDoubleBounce.swift /Users/admin/builder/spi-builder-workspace/Sources/Base/Animations/NVActivityIndicatorAnimationBallGridBeat.swift /Users/admin/builder/spi-builder-workspace/Sources/Base/Animations/NVActivityIndicatorAnimationBallGridPulse.swift /Users/admin/builder/spi-builder-workspace/Sources/Base/Animations/NVActivityIndicatorAnimationBallPulse.swift /Users/admin/builder/spi-builder-workspace/Sources/Base/Animations/NVActivityIndicatorAnimationBallPulseRise.swift /Users/admin/builder/spi-builder-workspace/Sources/Base/Animations/NVActivityIndicatorAnimationBallPulseSync.swift /Users/admin/builder/spi-builder-workspace/Sources/Base/Animations/NVActivityIndicatorAnimationBallRotate.swift /Users/admin/builder/spi-builder-workspace/Sources/Base/Animations/NVActivityIndicatorAnimationBallRotateChase.swift /Users/admin/builder/spi-builder-workspace/Sources/Base/Animations/NVActivityIndicatorAnimationBallScale.swift /Users/admin/builder/spi-builder-workspace/Sources/Base/Animations/NVActivityIndicatorAnimationBallScaleMultiple.swift /Users/admin/builder/spi-builder-workspace/Sources/Base/Animations/NVActivityIndicatorAnimationBallScaleRipple.swift /Users/admin/builder/spi-builder-workspace/Sources/Base/Animations/NVActivityIndicatorAnimationBallScaleRippleMultiple.swift /Users/admin/builder/spi-builder-workspace/Sources/Base/Animations/NVActivityIndicatorAnimationBallSpinFadeLoader.swift /Users/admin/builder/spi-builder-workspace/Sources/Base/Animations/NVActivityIndicatorAnimationBallTrianglePath.swift /Users/admin/builder/spi-builder-workspace/Sources/Base/Animations/NVActivityIndicatorAnimationBallZigZag.swift -primary-file /Users/admin/builder/spi-builder-workspace/Sources/Base/Animations/NVActivityIndicatorAnimationBallZigZagDeflect.swift -primary-file /Users/admin/builder/spi-builder-workspace/Sources/Base/Animations/NVActivityIndicatorAnimationBlank.swift -primary-file /Users/admin/builder/spi-builder-workspace/Sources/Base/Animations/NVActivityIndicatorAnimationCircleStrokeSpin.swift -primary-file /Users/admin/builder/spi-builder-workspace/Sources/Base/Animations/NVActivityIndicatorAnimationCubeTransition.swift /Users/admin/builder/spi-builder-workspace/Sources/Base/Animations/NVActivityIndicatorAnimationLineScale.swift /Users/admin/builder/spi-builder-workspace/Sources/Base/Animations/NVActivityIndicatorAnimationLineScaleParty.swift /Users/admin/builder/spi-builder-workspace/Sources/Base/Animations/NVActivityIndicatorAnimationLineScalePulseOut.swift /Users/admin/builder/spi-builder-workspace/Sources/Base/Animations/NVActivityIndicatorAnimationLineScalePulseOutRapid.swift /Users/admin/builder/spi-builder-workspace/Sources/Base/Animations/NVActivityIndicatorAnimationLineSpinFadeLoader.swift /Users/admin/builder/spi-builder-workspace/Sources/Base/Animations/NVActivityIndicatorAnimationOrbit.swift /Users/admin/builder/spi-builder-workspace/Sources/Base/Animations/NVActivityIndicatorAnimationPacman.swift /Users/admin/builder/spi-builder-workspace/Sources/Base/Animations/NVActivityIndicatorAnimationSemiCircleSpin.swift /Users/admin/builder/spi-builder-workspace/Sources/Base/Animations/NVActivityIndicatorAnimationSquareSpin.swift /Users/admin/builder/spi-builder-workspace/Sources/Base/Animations/NVActivityIndicatorAnimationTriangleSkewSpin.swift /Users/admin/builder/spi-builder-workspace/Sources/Base/NVActivityIndicatorAnimationDelegate.swift /Users/admin/builder/spi-builder-workspace/Sources/Base/NVActivityIndicatorShape.swift /Users/admin/builder/spi-builder-workspace/Sources/Base/NVActivityIndicatorView.swift -supplementary-output-file-map /Users/admin/builder/spi-builder-workspace/.derivedData/Build/Intermediates.noindex/NVActivityIndicatorView.build/Debug-appletvos/NVActivityIndicatorView.build/Objects-normal/arm64/supplementaryOutputs-6 -target arm64-apple-tvos12.0 -Xllvm -aarch64-use-tbi -enable-objc-interop -sdk /Applications/Xcode-16.1.0.app/Contents/Developer/Platforms/AppleTVOS.platform/Developer/SDKs/AppleTVOS18.1.sdk -I /Users/admin/builder/spi-builder-workspace/.derivedData/Build/Products/Debug-appletvos -F /Users/admin/builder/spi-builder-workspace/.derivedData/Build/Products/Debug-appletvos -F /Applications/Xcode-16.1.0.app/Contents/Developer/Platforms/AppleTVOS.platform/Developer/Library/Frameworks -no-color-diagnostics -enable-testing -g -debug-info-format\=dwarf -dwarf-version\=4 -module-cache-path /Users/admin/builder/spi-builder-workspace/.derivedData/ModuleCache.noindex -swift-version 5 -enforce-exclusivity\=checked -stats-output-dir /Users/admin/builder/spi-builder-workspace/.stats -Onone -D SWIFT_PACKAGE -D DEBUG -serialize-debugging-options -const-gather-protocols-file /Users/admin/builder/spi-builder-workspace/.derivedData/Build/Intermediates.noindex/NVActivityIndicatorView.build/Debug-appletvos/NVActivityIndicatorView.build/Objects-normal/arm64/NVActivityIndicatorView_const_extract_protocols.json -enable-experimental-feature DebugDescriptionMacro -enable-experimental-feature OpaqueTypeErasure -enable-upcoming-feature StrictConcurrency -enable-upcoming-feature DisableOutwardActorInference -enable-upcoming-feature GlobalActorIsolatedTypesUsability -enable-upcoming-feature InferSendableFromCaptures -enable-bare-slash-regex -strict-concurrency\=complete -empty-abi-descriptor -validate-clang-modules-once -clang-build-session-file /Users/admin/builder/spi-builder-workspace/.derivedData/ModuleCache.noindex/Session.modulevalidation -Xcc -working-directory -Xcc /Users/admin/builder/spi-builder-workspace -resource-dir /Applications/Xcode-16.1.0.app/Contents/Developer/Toolchains/XcodeDefault.xctoolchain/usr/lib/swift -enable-anonymous-context-mangled-names -file-compilation-dir /Users/admin/builder/spi-builder-workspace -Xcc -D_LIBCPP_HARDENING_MODE\=_LIBCPP_HARDENING_MODE_DEBUG -Xcc -ivfsstatcache -Xcc /Users/admin/builder/spi-builder-workspace/.derivedData/SDKStatCaches.noindex/appletvos18.1-22J572-e7fdd8cf9ffd4d4af20823079b51a726.sdkstatcache -Xcc -I/Users/admin/builder/spi-builder-workspace/.derivedData/Build/Intermediates.noindex/NVActivityIndicatorView.build/Debug-appletvos/NVActivityIndicatorView.build/swift-overrides.hmap -Xcc -I/Users/admin/builder/spi-builder-workspace/.derivedData/Build/Products/Debug-appletvos/include -Xcc -I/Users/admin/builder/spi-builder-workspace/.derivedData/Build/Intermediates.noindex/NVActivityIndicatorView.build/Debug-appletvos/NVActivityIndicatorView.build/DerivedSources-normal/arm64 -Xcc -I/Users/admin/builder/spi-builder-workspace/.derivedData/Build/Intermediates.noindex/NVActivityIndicatorView.build/Debug-appletvos/NVActivityIndicatorView.build/DerivedSources/arm64 -Xcc -I/Users/admin/builder/spi-builder-workspace/.derivedData/Build/Intermediates.noindex/NVActivityIndicatorView.build/Debug-appletvos/NVActivityIndicatorView.build/DerivedSources -Xcc -DSWIFT_PACKAGE\=1 -Xcc -DDEBUG\=1 -module-name NVActivityIndicatorView -frontend-parseable-output -disable-clang-spi -target-sdk-version 18.1 -target-sdk-name appletvos18.1 -external-plugin-path /Applications/Xcode-16.1.0.app/Contents/Developer/Platforms/AppleTVOS.platform/Developer/usr/lib/swift/host/plugins\#/Applications/Xcode-16.1.0.app/Contents/Developer/Platforms/AppleTVOS.platform/Developer/usr/bin/swift-plugin-server -external-plugin-path /Applications/Xcode-16.1.0.app/Contents/Developer/Platforms/AppleTVOS.platform/Developer/usr/local/lib/swift/host/plugins\#/Applications/Xcode-16.1.0.app/Contents/Developer/Platforms/AppleTVOS.platform/Developer/usr/bin/swift-plugin-server -plugin-path /Applications/Xcode-16.1.0.app/Contents/Developer/Toolchains/XcodeDefault.xctoolchain/usr/lib/swift/host/plugins -plugin-path /Applications/Xcode-16.1.0.app/Contents/Developer/Toolchains/XcodeDefault.xctoolchain/usr/local/lib/swift/host/plugins -o /Users/admin/builder/spi-builder-workspace/.derivedData/Build/Intermediates.noindex/NVActivityIndicatorView.build/Debug-appletvos/NVActivityIndicatorView.build/Objects-normal/arm64/NVActivityIndicatorAnimationBallZigZagDeflect.o -o /Users/admin/builder/spi-builder-workspace/.derivedData/Build/Intermediates.noindex/NVActivityIndicatorView.build/Debug-appletvos/NVActivityIndicatorView.build/Objects-normal/arm64/NVActivityIndicatorAnimationBlank.o -o /Users/admin/builder/spi-builder-workspace/.derivedData/Build/Intermediates.noindex/NVActivityIndicatorView.build/Debug-appletvos/NVActivityIndicatorView.build/Objects-normal/arm64/NVActivityIndicatorAnimationCircleStrokeSpin.o -o /Users/admin/builder/spi-builder-workspace/.derivedData/Build/Intermediates.noindex/NVActivityIndicatorView.build/Debug-appletvos/NVActivityIndicatorView.build/Objects-normal/arm64/NVActivityIndicatorAnimationCubeTransition.o -index-unit-output-path /NVActivityIndicatorView.build/Debug-appletvos/NVActivityIndicatorView.build/Objects-normal/arm64/NVActivityIndicatorAnimationBallZigZagDeflect.o -index-unit-output-path /NVActivityIndicatorView.build/Debug-appletvos/NVActivityIndicatorView.build/Objects-normal/arm64/NVActivityIndicatorAnimationBlank.o -index-unit-output-path /NVActivityIndicatorView.build/Debug-appletvos/NVActivityIndicatorView.build/Objects-normal/arm64/NVActivityIndicatorAnimationCircleStrokeSpin.o -index-unit-output-path /NVActivityIndicatorView.build/Debug-appletvos/NVActivityIndicatorView.build/Objects-normal/arm64/NVActivityIndicatorAnimationCubeTransition.o -index-store-path /Users/admin/builder/spi-builder-workspace/.derivedData/Index.noindex/DataStore -index-system-modules
SwiftCompile normal arm64 /Users/admin/builder/spi-builder-workspace/Sources/Base/Animations/NVActivityIndicatorAnimationBlank.swift (in target 'NVActivityIndicatorView' from project 'NVActivityIndicatorView')
    cd /Users/admin/builder/spi-builder-workspace
    /Applications/Xcode-16.1.0.app/Contents/Developer/Toolchains/XcodeDefault.xctoolchain/usr/bin/swift-frontend -c /Users/admin/builder/spi-builder-workspace/Sources/Base/Animations/NVActivityIndicatorAnimationAudioEqualizer.swift /Users/admin/builder/spi-builder-workspace/Sources/Base/Animations/NVActivityIndicatorAnimationBallBeat.swift /Users/admin/builder/spi-builder-workspace/Sources/Base/Animations/NVActivityIndicatorAnimationBallClipRotate.swift /Users/admin/builder/spi-builder-workspace/Sources/Base/Animations/NVActivityIndicatorAnimationBallClipRotateMultiple.swift /Users/admin/builder/spi-builder-workspace/Sources/Base/Animations/NVActivityIndicatorAnimationBallClipRotatePulse.swift /Users/admin/builder/spi-builder-workspace/Sources/Base/Animations/NVActivityIndicatorAnimationBallDoubleBounce.swift /Users/admin/builder/spi-builder-workspace/Sources/Base/Animations/NVActivityIndicatorAnimationBallGridBeat.swift /Users/admin/builder/spi-builder-workspace/Sources/Base/Animations/NVActivityIndicatorAnimationBallGridPulse.swift /Users/admin/builder/spi-builder-workspace/Sources/Base/Animations/NVActivityIndicatorAnimationBallPulse.swift /Users/admin/builder/spi-builder-workspace/Sources/Base/Animations/NVActivityIndicatorAnimationBallPulseRise.swift /Users/admin/builder/spi-builder-workspace/Sources/Base/Animations/NVActivityIndicatorAnimationBallPulseSync.swift /Users/admin/builder/spi-builder-workspace/Sources/Base/Animations/NVActivityIndicatorAnimationBallRotate.swift /Users/admin/builder/spi-builder-workspace/Sources/Base/Animations/NVActivityIndicatorAnimationBallRotateChase.swift /Users/admin/builder/spi-builder-workspace/Sources/Base/Animations/NVActivityIndicatorAnimationBallScale.swift /Users/admin/builder/spi-builder-workspace/Sources/Base/Animations/NVActivityIndicatorAnimationBallScaleMultiple.swift /Users/admin/builder/spi-builder-workspace/Sources/Base/Animations/NVActivityIndicatorAnimationBallScaleRipple.swift /Users/admin/builder/spi-builder-workspace/Sources/Base/Animations/NVActivityIndicatorAnimationBallScaleRippleMultiple.swift /Users/admin/builder/spi-builder-workspace/Sources/Base/Animations/NVActivityIndicatorAnimationBallSpinFadeLoader.swift /Users/admin/builder/spi-builder-workspace/Sources/Base/Animations/NVActivityIndicatorAnimationBallTrianglePath.swift /Users/admin/builder/spi-builder-workspace/Sources/Base/Animations/NVActivityIndicatorAnimationBallZigZag.swift -primary-file /Users/admin/builder/spi-builder-workspace/Sources/Base/Animations/NVActivityIndicatorAnimationBallZigZagDeflect.swift -primary-file /Users/admin/builder/spi-builder-workspace/Sources/Base/Animations/NVActivityIndicatorAnimationBlank.swift -primary-file /Users/admin/builder/spi-builder-workspace/Sources/Base/Animations/NVActivityIndicatorAnimationCircleStrokeSpin.swift -primary-file /Users/admin/builder/spi-builder-workspace/Sources/Base/Animations/NVActivityIndicatorAnimationCubeTransition.swift /Users/admin/builder/spi-builder-workspace/Sources/Base/Animations/NVActivityIndicatorAnimationLineScale.swift /Users/admin/builder/spi-builder-workspace/Sources/Base/Animations/NVActivityIndicatorAnimationLineScaleParty.swift /Users/admin/builder/spi-builder-workspace/Sources/Base/Animations/NVActivityIndicatorAnimationLineScalePulseOut.swift /Users/admin/builder/spi-builder-workspace/Sources/Base/Animations/NVActivityIndicatorAnimationLineScalePulseOutRapid.swift /Users/admin/builder/spi-builder-workspace/Sources/Base/Animations/NVActivityIndicatorAnimationLineSpinFadeLoader.swift /Users/admin/builder/spi-builder-workspace/Sources/Base/Animations/NVActivityIndicatorAnimationOrbit.swift /Users/admin/builder/spi-builder-workspace/Sources/Base/Animations/NVActivityIndicatorAnimationPacman.swift /Users/admin/builder/spi-builder-workspace/Sources/Base/Animations/NVActivityIndicatorAnimationSemiCircleSpin.swift /Users/admin/builder/spi-builder-workspace/Sources/Base/Animations/NVActivityIndicatorAnimationSquareSpin.swift /Users/admin/builder/spi-builder-workspace/Sources/Base/Animations/NVActivityIndicatorAnimationTriangleSkewSpin.swift /Users/admin/builder/spi-builder-workspace/Sources/Base/NVActivityIndicatorAnimationDelegate.swift /Users/admin/builder/spi-builder-workspace/Sources/Base/NVActivityIndicatorShape.swift /Users/admin/builder/spi-builder-workspace/Sources/Base/NVActivityIndicatorView.swift -supplementary-output-file-map /Users/admin/builder/spi-builder-workspace/.derivedData/Build/Intermediates.noindex/NVActivityIndicatorView.build/Debug-appletvos/NVActivityIndicatorView.build/Objects-normal/arm64/supplementaryOutputs-6 -target arm64-apple-tvos12.0 -Xllvm -aarch64-use-tbi -enable-objc-interop -sdk /Applications/Xcode-16.1.0.app/Contents/Developer/Platforms/AppleTVOS.platform/Developer/SDKs/AppleTVOS18.1.sdk -I /Users/admin/builder/spi-builder-workspace/.derivedData/Build/Products/Debug-appletvos -F /Users/admin/builder/spi-builder-workspace/.derivedData/Build/Products/Debug-appletvos -F /Applications/Xcode-16.1.0.app/Contents/Developer/Platforms/AppleTVOS.platform/Developer/Library/Frameworks -no-color-diagnostics -enable-testing -g -debug-info-format\=dwarf -dwarf-version\=4 -module-cache-path /Users/admin/builder/spi-builder-workspace/.derivedData/ModuleCache.noindex -swift-version 5 -enforce-exclusivity\=checked -stats-output-dir /Users/admin/builder/spi-builder-workspace/.stats -Onone -D SWIFT_PACKAGE -D DEBUG -serialize-debugging-options -const-gather-protocols-file /Users/admin/builder/spi-builder-workspace/.derivedData/Build/Intermediates.noindex/NVActivityIndicatorView.build/Debug-appletvos/NVActivityIndicatorView.build/Objects-normal/arm64/NVActivityIndicatorView_const_extract_protocols.json -enable-experimental-feature DebugDescriptionMacro -enable-experimental-feature OpaqueTypeErasure -enable-upcoming-feature StrictConcurrency -enable-upcoming-feature DisableOutwardActorInference -enable-upcoming-feature GlobalActorIsolatedTypesUsability -enable-upcoming-feature InferSendableFromCaptures -enable-bare-slash-regex -strict-concurrency\=complete -empty-abi-descriptor -validate-clang-modules-once -clang-build-session-file /Users/admin/builder/spi-builder-workspace/.derivedData/ModuleCache.noindex/Session.modulevalidation -Xcc -working-directory -Xcc /Users/admin/builder/spi-builder-workspace -resource-dir /Applications/Xcode-16.1.0.app/Contents/Developer/Toolchains/XcodeDefault.xctoolchain/usr/lib/swift -enable-anonymous-context-mangled-names -file-compilation-dir /Users/admin/builder/spi-builder-workspace -Xcc -D_LIBCPP_HARDENING_MODE\=_LIBCPP_HARDENING_MODE_DEBUG -Xcc -ivfsstatcache -Xcc /Users/admin/builder/spi-builder-workspace/.derivedData/SDKStatCaches.noindex/appletvos18.1-22J572-e7fdd8cf9ffd4d4af20823079b51a726.sdkstatcache -Xcc -I/Users/admin/builder/spi-builder-workspace/.derivedData/Build/Intermediates.noindex/NVActivityIndicatorView.build/Debug-appletvos/NVActivityIndicatorView.build/swift-overrides.hmap -Xcc -I/Users/admin/builder/spi-builder-workspace/.derivedData/Build/Products/Debug-appletvos/include -Xcc -I/Users/admin/builder/spi-builder-workspace/.derivedData/Build/Intermediates.noindex/NVActivityIndicatorView.build/Debug-appletvos/NVActivityIndicatorView.build/DerivedSources-normal/arm64 -Xcc -I/Users/admin/builder/spi-builder-workspace/.derivedData/Build/Intermediates.noindex/NVActivityIndicatorView.build/Debug-appletvos/NVActivityIndicatorView.build/DerivedSources/arm64 -Xcc -I/Users/admin/builder/spi-builder-workspace/.derivedData/Build/Intermediates.noindex/NVActivityIndicatorView.build/Debug-appletvos/NVActivityIndicatorView.build/DerivedSources -Xcc -DSWIFT_PACKAGE\=1 -Xcc -DDEBUG\=1 -module-name NVActivityIndicatorView -frontend-parseable-output -disable-clang-spi -target-sdk-version 18.1 -target-sdk-name appletvos18.1 -external-plugin-path /Applications/Xcode-16.1.0.app/Contents/Developer/Platforms/AppleTVOS.platform/Developer/usr/lib/swift/host/plugins\#/Applications/Xcode-16.1.0.app/Contents/Developer/Platforms/AppleTVOS.platform/Developer/usr/bin/swift-plugin-server -external-plugin-path /Applications/Xcode-16.1.0.app/Contents/Developer/Platforms/AppleTVOS.platform/Developer/usr/local/lib/swift/host/plugins\#/Applications/Xcode-16.1.0.app/Contents/Developer/Platforms/AppleTVOS.platform/Developer/usr/bin/swift-plugin-server -plugin-path /Applications/Xcode-16.1.0.app/Contents/Developer/Toolchains/XcodeDefault.xctoolchain/usr/lib/swift/host/plugins -plugin-path /Applications/Xcode-16.1.0.app/Contents/Developer/Toolchains/XcodeDefault.xctoolchain/usr/local/lib/swift/host/plugins -o /Users/admin/builder/spi-builder-workspace/.derivedData/Build/Intermediates.noindex/NVActivityIndicatorView.build/Debug-appletvos/NVActivityIndicatorView.build/Objects-normal/arm64/NVActivityIndicatorAnimationBallZigZagDeflect.o -o /Users/admin/builder/spi-builder-workspace/.derivedData/Build/Intermediates.noindex/NVActivityIndicatorView.build/Debug-appletvos/NVActivityIndicatorView.build/Objects-normal/arm64/NVActivityIndicatorAnimationBlank.o -o /Users/admin/builder/spi-builder-workspace/.derivedData/Build/Intermediates.noindex/NVActivityIndicatorView.build/Debug-appletvos/NVActivityIndicatorView.build/Objects-normal/arm64/NVActivityIndicatorAnimationCircleStrokeSpin.o -o /Users/admin/builder/spi-builder-workspace/.derivedData/Build/Intermediates.noindex/NVActivityIndicatorView.build/Debug-appletvos/NVActivityIndicatorView.build/Objects-normal/arm64/NVActivityIndicatorAnimationCubeTransition.o -index-unit-output-path /NVActivityIndicatorView.build/Debug-appletvos/NVActivityIndicatorView.build/Objects-normal/arm64/NVActivityIndicatorAnimationBallZigZagDeflect.o -index-unit-output-path /NVActivityIndicatorView.build/Debug-appletvos/NVActivityIndicatorView.build/Objects-normal/arm64/NVActivityIndicatorAnimationBlank.o -index-unit-output-path /NVActivityIndicatorView.build/Debug-appletvos/NVActivityIndicatorView.build/Objects-normal/arm64/NVActivityIndicatorAnimationCircleStrokeSpin.o -index-unit-output-path /NVActivityIndicatorView.build/Debug-appletvos/NVActivityIndicatorView.build/Objects-normal/arm64/NVActivityIndicatorAnimationCubeTransition.o -index-store-path /Users/admin/builder/spi-builder-workspace/.derivedData/Index.noindex/DataStore -index-system-modules
SwiftCompile normal arm64 /Users/admin/builder/spi-builder-workspace/Sources/Base/Animations/NVActivityIndicatorAnimationCircleStrokeSpin.swift (in target 'NVActivityIndicatorView' from project 'NVActivityIndicatorView')
    cd /Users/admin/builder/spi-builder-workspace
    /Applications/Xcode-16.1.0.app/Contents/Developer/Toolchains/XcodeDefault.xctoolchain/usr/bin/swift-frontend -c /Users/admin/builder/spi-builder-workspace/Sources/Base/Animations/NVActivityIndicatorAnimationAudioEqualizer.swift /Users/admin/builder/spi-builder-workspace/Sources/Base/Animations/NVActivityIndicatorAnimationBallBeat.swift /Users/admin/builder/spi-builder-workspace/Sources/Base/Animations/NVActivityIndicatorAnimationBallClipRotate.swift /Users/admin/builder/spi-builder-workspace/Sources/Base/Animations/NVActivityIndicatorAnimationBallClipRotateMultiple.swift /Users/admin/builder/spi-builder-workspace/Sources/Base/Animations/NVActivityIndicatorAnimationBallClipRotatePulse.swift /Users/admin/builder/spi-builder-workspace/Sources/Base/Animations/NVActivityIndicatorAnimationBallDoubleBounce.swift /Users/admin/builder/spi-builder-workspace/Sources/Base/Animations/NVActivityIndicatorAnimationBallGridBeat.swift /Users/admin/builder/spi-builder-workspace/Sources/Base/Animations/NVActivityIndicatorAnimationBallGridPulse.swift /Users/admin/builder/spi-builder-workspace/Sources/Base/Animations/NVActivityIndicatorAnimationBallPulse.swift /Users/admin/builder/spi-builder-workspace/Sources/Base/Animations/NVActivityIndicatorAnimationBallPulseRise.swift /Users/admin/builder/spi-builder-workspace/Sources/Base/Animations/NVActivityIndicatorAnimationBallPulseSync.swift /Users/admin/builder/spi-builder-workspace/Sources/Base/Animations/NVActivityIndicatorAnimationBallRotate.swift /Users/admin/builder/spi-builder-workspace/Sources/Base/Animations/NVActivityIndicatorAnimationBallRotateChase.swift /Users/admin/builder/spi-builder-workspace/Sources/Base/Animations/NVActivityIndicatorAnimationBallScale.swift /Users/admin/builder/spi-builder-workspace/Sources/Base/Animations/NVActivityIndicatorAnimationBallScaleMultiple.swift /Users/admin/builder/spi-builder-workspace/Sources/Base/Animations/NVActivityIndicatorAnimationBallScaleRipple.swift /Users/admin/builder/spi-builder-workspace/Sources/Base/Animations/NVActivityIndicatorAnimationBallScaleRippleMultiple.swift /Users/admin/builder/spi-builder-workspace/Sources/Base/Animations/NVActivityIndicatorAnimationBallSpinFadeLoader.swift /Users/admin/builder/spi-builder-workspace/Sources/Base/Animations/NVActivityIndicatorAnimationBallTrianglePath.swift /Users/admin/builder/spi-builder-workspace/Sources/Base/Animations/NVActivityIndicatorAnimationBallZigZag.swift -primary-file /Users/admin/builder/spi-builder-workspace/Sources/Base/Animations/NVActivityIndicatorAnimationBallZigZagDeflect.swift -primary-file /Users/admin/builder/spi-builder-workspace/Sources/Base/Animations/NVActivityIndicatorAnimationBlank.swift -primary-file /Users/admin/builder/spi-builder-workspace/Sources/Base/Animations/NVActivityIndicatorAnimationCircleStrokeSpin.swift -primary-file /Users/admin/builder/spi-builder-workspace/Sources/Base/Animations/NVActivityIndicatorAnimationCubeTransition.swift /Users/admin/builder/spi-builder-workspace/Sources/Base/Animations/NVActivityIndicatorAnimationLineScale.swift /Users/admin/builder/spi-builder-workspace/Sources/Base/Animations/NVActivityIndicatorAnimationLineScaleParty.swift /Users/admin/builder/spi-builder-workspace/Sources/Base/Animations/NVActivityIndicatorAnimationLineScalePulseOut.swift /Users/admin/builder/spi-builder-workspace/Sources/Base/Animations/NVActivityIndicatorAnimationLineScalePulseOutRapid.swift /Users/admin/builder/spi-builder-workspace/Sources/Base/Animations/NVActivityIndicatorAnimationLineSpinFadeLoader.swift /Users/admin/builder/spi-builder-workspace/Sources/Base/Animations/NVActivityIndicatorAnimationOrbit.swift /Users/admin/builder/spi-builder-workspace/Sources/Base/Animations/NVActivityIndicatorAnimationPacman.swift /Users/admin/builder/spi-builder-workspace/Sources/Base/Animations/NVActivityIndicatorAnimationSemiCircleSpin.swift /Users/admin/builder/spi-builder-workspace/Sources/Base/Animations/NVActivityIndicatorAnimationSquareSpin.swift /Users/admin/builder/spi-builder-workspace/Sources/Base/Animations/NVActivityIndicatorAnimationTriangleSkewSpin.swift /Users/admin/builder/spi-builder-workspace/Sources/Base/NVActivityIndicatorAnimationDelegate.swift /Users/admin/builder/spi-builder-workspace/Sources/Base/NVActivityIndicatorShape.swift /Users/admin/builder/spi-builder-workspace/Sources/Base/NVActivityIndicatorView.swift -supplementary-output-file-map /Users/admin/builder/spi-builder-workspace/.derivedData/Build/Intermediates.noindex/NVActivityIndicatorView.build/Debug-appletvos/NVActivityIndicatorView.build/Objects-normal/arm64/supplementaryOutputs-6 -target arm64-apple-tvos12.0 -Xllvm -aarch64-use-tbi -enable-objc-interop -sdk /Applications/Xcode-16.1.0.app/Contents/Developer/Platforms/AppleTVOS.platform/Developer/SDKs/AppleTVOS18.1.sdk -I /Users/admin/builder/spi-builder-workspace/.derivedData/Build/Products/Debug-appletvos -F /Users/admin/builder/spi-builder-workspace/.derivedData/Build/Products/Debug-appletvos -F /Applications/Xcode-16.1.0.app/Contents/Developer/Platforms/AppleTVOS.platform/Developer/Library/Frameworks -no-color-diagnostics -enable-testing -g -debug-info-format\=dwarf -dwarf-version\=4 -module-cache-path /Users/admin/builder/spi-builder-workspace/.derivedData/ModuleCache.noindex -swift-version 5 -enforce-exclusivity\=checked -stats-output-dir /Users/admin/builder/spi-builder-workspace/.stats -Onone -D SWIFT_PACKAGE -D DEBUG -serialize-debugging-options -const-gather-protocols-file /Users/admin/builder/spi-builder-workspace/.derivedData/Build/Intermediates.noindex/NVActivityIndicatorView.build/Debug-appletvos/NVActivityIndicatorView.build/Objects-normal/arm64/NVActivityIndicatorView_const_extract_protocols.json -enable-experimental-feature DebugDescriptionMacro -enable-experimental-feature OpaqueTypeErasure -enable-upcoming-feature StrictConcurrency -enable-upcoming-feature DisableOutwardActorInference -enable-upcoming-feature GlobalActorIsolatedTypesUsability -enable-upcoming-feature InferSendableFromCaptures -enable-bare-slash-regex -strict-concurrency\=complete -empty-abi-descriptor -validate-clang-modules-once -clang-build-session-file /Users/admin/builder/spi-builder-workspace/.derivedData/ModuleCache.noindex/Session.modulevalidation -Xcc -working-directory -Xcc /Users/admin/builder/spi-builder-workspace -resource-dir /Applications/Xcode-16.1.0.app/Contents/Developer/Toolchains/XcodeDefault.xctoolchain/usr/lib/swift -enable-anonymous-context-mangled-names -file-compilation-dir /Users/admin/builder/spi-builder-workspace -Xcc -D_LIBCPP_HARDENING_MODE\=_LIBCPP_HARDENING_MODE_DEBUG -Xcc -ivfsstatcache -Xcc /Users/admin/builder/spi-builder-workspace/.derivedData/SDKStatCaches.noindex/appletvos18.1-22J572-e7fdd8cf9ffd4d4af20823079b51a726.sdkstatcache -Xcc -I/Users/admin/builder/spi-builder-workspace/.derivedData/Build/Intermediates.noindex/NVActivityIndicatorView.build/Debug-appletvos/NVActivityIndicatorView.build/swift-overrides.hmap -Xcc -I/Users/admin/builder/spi-builder-workspace/.derivedData/Build/Products/Debug-appletvos/include -Xcc -I/Users/admin/builder/spi-builder-workspace/.derivedData/Build/Intermediates.noindex/NVActivityIndicatorView.build/Debug-appletvos/NVActivityIndicatorView.build/DerivedSources-normal/arm64 -Xcc -I/Users/admin/builder/spi-builder-workspace/.derivedData/Build/Intermediates.noindex/NVActivityIndicatorView.build/Debug-appletvos/NVActivityIndicatorView.build/DerivedSources/arm64 -Xcc -I/Users/admin/builder/spi-builder-workspace/.derivedData/Build/Intermediates.noindex/NVActivityIndicatorView.build/Debug-appletvos/NVActivityIndicatorView.build/DerivedSources -Xcc -DSWIFT_PACKAGE\=1 -Xcc -DDEBUG\=1 -module-name NVActivityIndicatorView -frontend-parseable-output -disable-clang-spi -target-sdk-version 18.1 -target-sdk-name appletvos18.1 -external-plugin-path /Applications/Xcode-16.1.0.app/Contents/Developer/Platforms/AppleTVOS.platform/Developer/usr/lib/swift/host/plugins\#/Applications/Xcode-16.1.0.app/Contents/Developer/Platforms/AppleTVOS.platform/Developer/usr/bin/swift-plugin-server -external-plugin-path /Applications/Xcode-16.1.0.app/Contents/Developer/Platforms/AppleTVOS.platform/Developer/usr/local/lib/swift/host/plugins\#/Applications/Xcode-16.1.0.app/Contents/Developer/Platforms/AppleTVOS.platform/Developer/usr/bin/swift-plugin-server -plugin-path /Applications/Xcode-16.1.0.app/Contents/Developer/Toolchains/XcodeDefault.xctoolchain/usr/lib/swift/host/plugins -plugin-path /Applications/Xcode-16.1.0.app/Contents/Developer/Toolchains/XcodeDefault.xctoolchain/usr/local/lib/swift/host/plugins -o /Users/admin/builder/spi-builder-workspace/.derivedData/Build/Intermediates.noindex/NVActivityIndicatorView.build/Debug-appletvos/NVActivityIndicatorView.build/Objects-normal/arm64/NVActivityIndicatorAnimationBallZigZagDeflect.o -o /Users/admin/builder/spi-builder-workspace/.derivedData/Build/Intermediates.noindex/NVActivityIndicatorView.build/Debug-appletvos/NVActivityIndicatorView.build/Objects-normal/arm64/NVActivityIndicatorAnimationBlank.o -o /Users/admin/builder/spi-builder-workspace/.derivedData/Build/Intermediates.noindex/NVActivityIndicatorView.build/Debug-appletvos/NVActivityIndicatorView.build/Objects-normal/arm64/NVActivityIndicatorAnimationCircleStrokeSpin.o -o /Users/admin/builder/spi-builder-workspace/.derivedData/Build/Intermediates.noindex/NVActivityIndicatorView.build/Debug-appletvos/NVActivityIndicatorView.build/Objects-normal/arm64/NVActivityIndicatorAnimationCubeTransition.o -index-unit-output-path /NVActivityIndicatorView.build/Debug-appletvos/NVActivityIndicatorView.build/Objects-normal/arm64/NVActivityIndicatorAnimationBallZigZagDeflect.o -index-unit-output-path /NVActivityIndicatorView.build/Debug-appletvos/NVActivityIndicatorView.build/Objects-normal/arm64/NVActivityIndicatorAnimationBlank.o -index-unit-output-path /NVActivityIndicatorView.build/Debug-appletvos/NVActivityIndicatorView.build/Objects-normal/arm64/NVActivityIndicatorAnimationCircleStrokeSpin.o -index-unit-output-path /NVActivityIndicatorView.build/Debug-appletvos/NVActivityIndicatorView.build/Objects-normal/arm64/NVActivityIndicatorAnimationCubeTransition.o -index-store-path /Users/admin/builder/spi-builder-workspace/.derivedData/Index.noindex/DataStore -index-system-modules
SwiftCompile normal arm64 /Users/admin/builder/spi-builder-workspace/Sources/Base/Animations/NVActivityIndicatorAnimationCubeTransition.swift (in target 'NVActivityIndicatorView' from project 'NVActivityIndicatorView')
    cd /Users/admin/builder/spi-builder-workspace
    /Applications/Xcode-16.1.0.app/Contents/Developer/Toolchains/XcodeDefault.xctoolchain/usr/bin/swift-frontend -c /Users/admin/builder/spi-builder-workspace/Sources/Base/Animations/NVActivityIndicatorAnimationAudioEqualizer.swift /Users/admin/builder/spi-builder-workspace/Sources/Base/Animations/NVActivityIndicatorAnimationBallBeat.swift /Users/admin/builder/spi-builder-workspace/Sources/Base/Animations/NVActivityIndicatorAnimationBallClipRotate.swift /Users/admin/builder/spi-builder-workspace/Sources/Base/Animations/NVActivityIndicatorAnimationBallClipRotateMultiple.swift /Users/admin/builder/spi-builder-workspace/Sources/Base/Animations/NVActivityIndicatorAnimationBallClipRotatePulse.swift /Users/admin/builder/spi-builder-workspace/Sources/Base/Animations/NVActivityIndicatorAnimationBallDoubleBounce.swift /Users/admin/builder/spi-builder-workspace/Sources/Base/Animations/NVActivityIndicatorAnimationBallGridBeat.swift /Users/admin/builder/spi-builder-workspace/Sources/Base/Animations/NVActivityIndicatorAnimationBallGridPulse.swift /Users/admin/builder/spi-builder-workspace/Sources/Base/Animations/NVActivityIndicatorAnimationBallPulse.swift /Users/admin/builder/spi-builder-workspace/Sources/Base/Animations/NVActivityIndicatorAnimationBallPulseRise.swift /Users/admin/builder/spi-builder-workspace/Sources/Base/Animations/NVActivityIndicatorAnimationBallPulseSync.swift /Users/admin/builder/spi-builder-workspace/Sources/Base/Animations/NVActivityIndicatorAnimationBallRotate.swift /Users/admin/builder/spi-builder-workspace/Sources/Base/Animations/NVActivityIndicatorAnimationBallRotateChase.swift /Users/admin/builder/spi-builder-workspace/Sources/Base/Animations/NVActivityIndicatorAnimationBallScale.swift /Users/admin/builder/spi-builder-workspace/Sources/Base/Animations/NVActivityIndicatorAnimationBallScaleMultiple.swift /Users/admin/builder/spi-builder-workspace/Sources/Base/Animations/NVActivityIndicatorAnimationBallScaleRipple.swift /Users/admin/builder/spi-builder-workspace/Sources/Base/Animations/NVActivityIndicatorAnimationBallScaleRippleMultiple.swift /Users/admin/builder/spi-builder-workspace/Sources/Base/Animations/NVActivityIndicatorAnimationBallSpinFadeLoader.swift /Users/admin/builder/spi-builder-workspace/Sources/Base/Animations/NVActivityIndicatorAnimationBallTrianglePath.swift /Users/admin/builder/spi-builder-workspace/Sources/Base/Animations/NVActivityIndicatorAnimationBallZigZag.swift -primary-file /Users/admin/builder/spi-builder-workspace/Sources/Base/Animations/NVActivityIndicatorAnimationBallZigZagDeflect.swift -primary-file /Users/admin/builder/spi-builder-workspace/Sources/Base/Animations/NVActivityIndicatorAnimationBlank.swift -primary-file /Users/admin/builder/spi-builder-workspace/Sources/Base/Animations/NVActivityIndicatorAnimationCircleStrokeSpin.swift -primary-file /Users/admin/builder/spi-builder-workspace/Sources/Base/Animations/NVActivityIndicatorAnimationCubeTransition.swift /Users/admin/builder/spi-builder-workspace/Sources/Base/Animations/NVActivityIndicatorAnimationLineScale.swift /Users/admin/builder/spi-builder-workspace/Sources/Base/Animations/NVActivityIndicatorAnimationLineScaleParty.swift /Users/admin/builder/spi-builder-workspace/Sources/Base/Animations/NVActivityIndicatorAnimationLineScalePulseOut.swift /Users/admin/builder/spi-builder-workspace/Sources/Base/Animations/NVActivityIndicatorAnimationLineScalePulseOutRapid.swift /Users/admin/builder/spi-builder-workspace/Sources/Base/Animations/NVActivityIndicatorAnimationLineSpinFadeLoader.swift /Users/admin/builder/spi-builder-workspace/Sources/Base/Animations/NVActivityIndicatorAnimationOrbit.swift /Users/admin/builder/spi-builder-workspace/Sources/Base/Animations/NVActivityIndicatorAnimationPacman.swift /Users/admin/builder/spi-builder-workspace/Sources/Base/Animations/NVActivityIndicatorAnimationSemiCircleSpin.swift /Users/admin/builder/spi-builder-workspace/Sources/Base/Animations/NVActivityIndicatorAnimationSquareSpin.swift /Users/admin/builder/spi-builder-workspace/Sources/Base/Animations/NVActivityIndicatorAnimationTriangleSkewSpin.swift /Users/admin/builder/spi-builder-workspace/Sources/Base/NVActivityIndicatorAnimationDelegate.swift /Users/admin/builder/spi-builder-workspace/Sources/Base/NVActivityIndicatorShape.swift /Users/admin/builder/spi-builder-workspace/Sources/Base/NVActivityIndicatorView.swift -supplementary-output-file-map /Users/admin/builder/spi-builder-workspace/.derivedData/Build/Intermediates.noindex/NVActivityIndicatorView.build/Debug-appletvos/NVActivityIndicatorView.build/Objects-normal/arm64/supplementaryOutputs-6 -target arm64-apple-tvos12.0 -Xllvm -aarch64-use-tbi -enable-objc-interop -sdk /Applications/Xcode-16.1.0.app/Contents/Developer/Platforms/AppleTVOS.platform/Developer/SDKs/AppleTVOS18.1.sdk -I /Users/admin/builder/spi-builder-workspace/.derivedData/Build/Products/Debug-appletvos -F /Users/admin/builder/spi-builder-workspace/.derivedData/Build/Products/Debug-appletvos -F /Applications/Xcode-16.1.0.app/Contents/Developer/Platforms/AppleTVOS.platform/Developer/Library/Frameworks -no-color-diagnostics -enable-testing -g -debug-info-format\=dwarf -dwarf-version\=4 -module-cache-path /Users/admin/builder/spi-builder-workspace/.derivedData/ModuleCache.noindex -swift-version 5 -enforce-exclusivity\=checked -stats-output-dir /Users/admin/builder/spi-builder-workspace/.stats -Onone -D SWIFT_PACKAGE -D DEBUG -serialize-debugging-options -const-gather-protocols-file /Users/admin/builder/spi-builder-workspace/.derivedData/Build/Intermediates.noindex/NVActivityIndicatorView.build/Debug-appletvos/NVActivityIndicatorView.build/Objects-normal/arm64/NVActivityIndicatorView_const_extract_protocols.json -enable-experimental-feature DebugDescriptionMacro -enable-experimental-feature OpaqueTypeErasure -enable-upcoming-feature StrictConcurrency -enable-upcoming-feature DisableOutwardActorInference -enable-upcoming-feature GlobalActorIsolatedTypesUsability -enable-upcoming-feature InferSendableFromCaptures -enable-bare-slash-regex -strict-concurrency\=complete -empty-abi-descriptor -validate-clang-modules-once -clang-build-session-file /Users/admin/builder/spi-builder-workspace/.derivedData/ModuleCache.noindex/Session.modulevalidation -Xcc -working-directory -Xcc /Users/admin/builder/spi-builder-workspace -resource-dir /Applications/Xcode-16.1.0.app/Contents/Developer/Toolchains/XcodeDefault.xctoolchain/usr/lib/swift -enable-anonymous-context-mangled-names -file-compilation-dir /Users/admin/builder/spi-builder-workspace -Xcc -D_LIBCPP_HARDENING_MODE\=_LIBCPP_HARDENING_MODE_DEBUG -Xcc -ivfsstatcache -Xcc /Users/admin/builder/spi-builder-workspace/.derivedData/SDKStatCaches.noindex/appletvos18.1-22J572-e7fdd8cf9ffd4d4af20823079b51a726.sdkstatcache -Xcc -I/Users/admin/builder/spi-builder-workspace/.derivedData/Build/Intermediates.noindex/NVActivityIndicatorView.build/Debug-appletvos/NVActivityIndicatorView.build/swift-overrides.hmap -Xcc -I/Users/admin/builder/spi-builder-workspace/.derivedData/Build/Products/Debug-appletvos/include -Xcc -I/Users/admin/builder/spi-builder-workspace/.derivedData/Build/Intermediates.noindex/NVActivityIndicatorView.build/Debug-appletvos/NVActivityIndicatorView.build/DerivedSources-normal/arm64 -Xcc -I/Users/admin/builder/spi-builder-workspace/.derivedData/Build/Intermediates.noindex/NVActivityIndicatorView.build/Debug-appletvos/NVActivityIndicatorView.build/DerivedSources/arm64 -Xcc -I/Users/admin/builder/spi-builder-workspace/.derivedData/Build/Intermediates.noindex/NVActivityIndicatorView.build/Debug-appletvos/NVActivityIndicatorView.build/DerivedSources -Xcc -DSWIFT_PACKAGE\=1 -Xcc -DDEBUG\=1 -module-name NVActivityIndicatorView -frontend-parseable-output -disable-clang-spi -target-sdk-version 18.1 -target-sdk-name appletvos18.1 -external-plugin-path /Applications/Xcode-16.1.0.app/Contents/Developer/Platforms/AppleTVOS.platform/Developer/usr/lib/swift/host/plugins\#/Applications/Xcode-16.1.0.app/Contents/Developer/Platforms/AppleTVOS.platform/Developer/usr/bin/swift-plugin-server -external-plugin-path /Applications/Xcode-16.1.0.app/Contents/Developer/Platforms/AppleTVOS.platform/Developer/usr/local/lib/swift/host/plugins\#/Applications/Xcode-16.1.0.app/Contents/Developer/Platforms/AppleTVOS.platform/Developer/usr/bin/swift-plugin-server -plugin-path /Applications/Xcode-16.1.0.app/Contents/Developer/Toolchains/XcodeDefault.xctoolchain/usr/lib/swift/host/plugins -plugin-path /Applications/Xcode-16.1.0.app/Contents/Developer/Toolchains/XcodeDefault.xctoolchain/usr/local/lib/swift/host/plugins -o /Users/admin/builder/spi-builder-workspace/.derivedData/Build/Intermediates.noindex/NVActivityIndicatorView.build/Debug-appletvos/NVActivityIndicatorView.build/Objects-normal/arm64/NVActivityIndicatorAnimationBallZigZagDeflect.o -o /Users/admin/builder/spi-builder-workspace/.derivedData/Build/Intermediates.noindex/NVActivityIndicatorView.build/Debug-appletvos/NVActivityIndicatorView.build/Objects-normal/arm64/NVActivityIndicatorAnimationBlank.o -o /Users/admin/builder/spi-builder-workspace/.derivedData/Build/Intermediates.noindex/NVActivityIndicatorView.build/Debug-appletvos/NVActivityIndicatorView.build/Objects-normal/arm64/NVActivityIndicatorAnimationCircleStrokeSpin.o -o /Users/admin/builder/spi-builder-workspace/.derivedData/Build/Intermediates.noindex/NVActivityIndicatorView.build/Debug-appletvos/NVActivityIndicatorView.build/Objects-normal/arm64/NVActivityIndicatorAnimationCubeTransition.o -index-unit-output-path /NVActivityIndicatorView.build/Debug-appletvos/NVActivityIndicatorView.build/Objects-normal/arm64/NVActivityIndicatorAnimationBallZigZagDeflect.o -index-unit-output-path /NVActivityIndicatorView.build/Debug-appletvos/NVActivityIndicatorView.build/Objects-normal/arm64/NVActivityIndicatorAnimationBlank.o -index-unit-output-path /NVActivityIndicatorView.build/Debug-appletvos/NVActivityIndicatorView.build/Objects-normal/arm64/NVActivityIndicatorAnimationCircleStrokeSpin.o -index-unit-output-path /NVActivityIndicatorView.build/Debug-appletvos/NVActivityIndicatorView.build/Objects-normal/arm64/NVActivityIndicatorAnimationCubeTransition.o -index-store-path /Users/admin/builder/spi-builder-workspace/.derivedData/Index.noindex/DataStore -index-system-modules
SwiftDriverJobDiscovery normal arm64 Compiling NVActivityIndicatorAnimationSemiCircleSpin.swift, NVActivityIndicatorAnimationSquareSpin.swift, NVActivityIndicatorAnimationTriangleSkewSpin.swift (in target 'NVActivityIndicatorView' from project 'NVActivityIndicatorView')
SwiftDriver\ Compilation\ Requirements NVActivityIndicatorView normal arm64 com.apple.xcode.tools.swift.compiler (in target 'NVActivityIndicatorView' from project 'NVActivityIndicatorView')
    cd /Users/admin/builder/spi-builder-workspace
    builtin-Swift-Compilation-Requirements -- /Applications/Xcode-16.1.0.app/Contents/Developer/Toolchains/XcodeDefault.xctoolchain/usr/bin/swiftc -module-name NVActivityIndicatorView -Onone -enforce-exclusivity\=checked @/Users/admin/builder/spi-builder-workspace/.derivedData/Build/Intermediates.noindex/NVActivityIndicatorView.build/Debug-appletvos/NVActivityIndicatorView.build/Objects-normal/arm64/NVActivityIndicatorView.SwiftFileList -DSWIFT_PACKAGE -DDEBUG -stats-output-dir .stats -strict-concurrency\=complete -enable-upcoming-feature StrictConcurrency -enable-upcoming-feature DisableOutwardActorInference -enable-upcoming-feature GlobalActorIsolatedTypesUsability -enable-upcoming-feature InferSendableFromCaptures -enable-bare-slash-regex -enable-experimental-feature DebugDescriptionMacro -sdk /Applications/Xcode-16.1.0.app/Contents/Developer/Platforms/AppleTVOS.platform/Developer/SDKs/AppleTVOS18.1.sdk -target arm64-apple-tvos12.0 -g -module-cache-path /Users/admin/builder/spi-builder-workspace/.derivedData/ModuleCache.noindex -Xfrontend -serialize-debugging-options -enable-testing -index-store-path /Users/admin/builder/spi-builder-workspace/.derivedData/Index.noindex/DataStore -enable-experimental-feature OpaqueTypeErasure -Xcc -D_LIBCPP_HARDENING_MODE\=_LIBCPP_HARDENING_MODE_DEBUG -swift-version 5 -I /Users/admin/builder/spi-builder-workspace/.derivedData/Build/Products/Debug-appletvos -F /Users/admin/builder/spi-builder-workspace/.derivedData/Build/Products/Debug-appletvos -F /Applications/Xcode-16.1.0.app/Contents/Developer/Platforms/AppleTVOS.platform/Developer/Library/Frameworks -c -j10 -enable-batch-mode -incremental -Xcc -ivfsstatcache -Xcc /Users/admin/builder/spi-builder-workspace/.derivedData/SDKStatCaches.noindex/appletvos18.1-22J572-e7fdd8cf9ffd4d4af20823079b51a726.sdkstatcache -output-file-map /Users/admin/builder/spi-builder-workspace/.derivedData/Build/Intermediates.noindex/NVActivityIndicatorView.build/Debug-appletvos/NVActivityIndicatorView.build/Objects-normal/arm64/NVActivityIndicatorView-OutputFileMap.json -use-frontend-parseable-output -save-temps -no-color-diagnostics -serialize-diagnostics -emit-dependencies -emit-module -emit-module-path /Users/admin/builder/spi-builder-workspace/.derivedData/Build/Intermediates.noindex/NVActivityIndicatorView.build/Debug-appletvos/NVActivityIndicatorView.build/Objects-normal/arm64/NVActivityIndicatorView.swiftmodule -validate-clang-modules-once -clang-build-session-file /Users/admin/builder/spi-builder-workspace/.derivedData/ModuleCache.noindex/Session.modulevalidation -Xcc -I/Users/admin/builder/spi-builder-workspace/.derivedData/Build/Intermediates.noindex/NVActivityIndicatorView.build/Debug-appletvos/NVActivityIndicatorView.build/swift-overrides.hmap -emit-const-values -Xfrontend -const-gather-protocols-file -Xfrontend /Users/admin/builder/spi-builder-workspace/.derivedData/Build/Intermediates.noindex/NVActivityIndicatorView.build/Debug-appletvos/NVActivityIndicatorView.build/Objects-normal/arm64/NVActivityIndicatorView_const_extract_protocols.json -Xcc -I/Users/admin/builder/spi-builder-workspace/.derivedData/Build/Products/Debug-appletvos/include -Xcc -I/Users/admin/builder/spi-builder-workspace/.derivedData/Build/Intermediates.noindex/NVActivityIndicatorView.build/Debug-appletvos/NVActivityIndicatorView.build/DerivedSources-normal/arm64 -Xcc -I/Users/admin/builder/spi-builder-workspace/.derivedData/Build/Intermediates.noindex/NVActivityIndicatorView.build/Debug-appletvos/NVActivityIndicatorView.build/DerivedSources/arm64 -Xcc -I/Users/admin/builder/spi-builder-workspace/.derivedData/Build/Intermediates.noindex/NVActivityIndicatorView.build/Debug-appletvos/NVActivityIndicatorView.build/DerivedSources -Xcc -DSWIFT_PACKAGE\=1 -Xcc -DDEBUG\=1 -emit-objc-header -emit-objc-header-path /Users/admin/builder/spi-builder-workspace/.derivedData/Build/Intermediates.noindex/NVActivityIndicatorView.build/Debug-appletvos/NVActivityIndicatorView.build/Objects-normal/arm64/NVActivityIndicatorView-Swift.h -working-directory /Users/admin/builder/spi-builder-workspace -experimental-emit-module-separately -disable-cmo
SwiftMergeGeneratedHeaders /Users/admin/builder/spi-builder-workspace/.derivedData/Build/Products/Debug-appletvos/NVActivityIndicatorView.framework/Headers/NVActivityIndicatorView-Swift.h /Users/admin/builder/spi-builder-workspace/.derivedData/Build/Intermediates.noindex/NVActivityIndicatorView.build/Debug-appletvos/NVActivityIndicatorView.build/Objects-normal/arm64/NVActivityIndicatorView-Swift.h (in target 'NVActivityIndicatorView' from project 'NVActivityIndicatorView')
    cd /Users/admin/builder/spi-builder-workspace
    builtin-swiftHeaderTool -arch arm64 /Users/admin/builder/spi-builder-workspace/.derivedData/Build/Intermediates.noindex/NVActivityIndicatorView.build/Debug-appletvos/NVActivityIndicatorView.build/Objects-normal/arm64/NVActivityIndicatorView-Swift.h -o /Users/admin/builder/spi-builder-workspace/.derivedData/Build/Products/Debug-appletvos/NVActivityIndicatorView.framework/Headers/NVActivityIndicatorView-Swift.h
Copy /Users/admin/builder/spi-builder-workspace/.derivedData/Build/Products/Debug-appletvos/NVActivityIndicatorView.framework/Modules/NVActivityIndicatorView.swiftmodule/arm64-apple-tvos.swiftmodule /Users/admin/builder/spi-builder-workspace/.derivedData/Build/Intermediates.noindex/NVActivityIndicatorView.build/Debug-appletvos/NVActivityIndicatorView.build/Objects-normal/arm64/NVActivityIndicatorView.swiftmodule (in target 'NVActivityIndicatorView' from project 'NVActivityIndicatorView')
    cd /Users/admin/builder/spi-builder-workspace
    builtin-copy -exclude .DS_Store -exclude CVS -exclude .svn -exclude .git -exclude .hg -resolve-src-symlinks -rename /Users/admin/builder/spi-builder-workspace/.derivedData/Build/Intermediates.noindex/NVActivityIndicatorView.build/Debug-appletvos/NVActivityIndicatorView.build/Objects-normal/arm64/NVActivityIndicatorView.swiftmodule /Users/admin/builder/spi-builder-workspace/.derivedData/Build/Products/Debug-appletvos/NVActivityIndicatorView.framework/Modules/NVActivityIndicatorView.swiftmodule/arm64-apple-tvos.swiftmodule
Copy /Users/admin/builder/spi-builder-workspace/.derivedData/Build/Products/Debug-appletvos/NVActivityIndicatorView.framework/Modules/NVActivityIndicatorView.swiftmodule/arm64-apple-tvos.swiftdoc /Users/admin/builder/spi-builder-workspace/.derivedData/Build/Intermediates.noindex/NVActivityIndicatorView.build/Debug-appletvos/NVActivityIndicatorView.build/Objects-normal/arm64/NVActivityIndicatorView.swiftdoc (in target 'NVActivityIndicatorView' from project 'NVActivityIndicatorView')
    cd /Users/admin/builder/spi-builder-workspace
    builtin-copy -exclude .DS_Store -exclude CVS -exclude .svn -exclude .git -exclude .hg -resolve-src-symlinks -rename /Users/admin/builder/spi-builder-workspace/.derivedData/Build/Intermediates.noindex/NVActivityIndicatorView.build/Debug-appletvos/NVActivityIndicatorView.build/Objects-normal/arm64/NVActivityIndicatorView.swiftdoc /Users/admin/builder/spi-builder-workspace/.derivedData/Build/Products/Debug-appletvos/NVActivityIndicatorView.framework/Modules/NVActivityIndicatorView.swiftmodule/arm64-apple-tvos.swiftdoc
Copy /Users/admin/builder/spi-builder-workspace/.derivedData/Build/Products/Debug-appletvos/NVActivityIndicatorView.framework/Modules/NVActivityIndicatorView.swiftmodule/arm64-apple-tvos.abi.json /Users/admin/builder/spi-builder-workspace/.derivedData/Build/Intermediates.noindex/NVActivityIndicatorView.build/Debug-appletvos/NVActivityIndicatorView.build/Objects-normal/arm64/NVActivityIndicatorView.abi.json (in target 'NVActivityIndicatorView' from project 'NVActivityIndicatorView')
    cd /Users/admin/builder/spi-builder-workspace
    builtin-copy -exclude .DS_Store -exclude CVS -exclude .svn -exclude .git -exclude .hg -resolve-src-symlinks -rename /Users/admin/builder/spi-builder-workspace/.derivedData/Build/Intermediates.noindex/NVActivityIndicatorView.build/Debug-appletvos/NVActivityIndicatorView.build/Objects-normal/arm64/NVActivityIndicatorView.abi.json /Users/admin/builder/spi-builder-workspace/.derivedData/Build/Products/Debug-appletvos/NVActivityIndicatorView.framework/Modules/NVActivityIndicatorView.swiftmodule/arm64-apple-tvos.abi.json
Copy /Users/admin/builder/spi-builder-workspace/.derivedData/Build/Products/Debug-appletvos/NVActivityIndicatorView.framework/Modules/NVActivityIndicatorView.swiftmodule/Project/arm64-apple-tvos.swiftsourceinfo /Users/admin/builder/spi-builder-workspace/.derivedData/Build/Intermediates.noindex/NVActivityIndicatorView.build/Debug-appletvos/NVActivityIndicatorView.build/Objects-normal/arm64/NVActivityIndicatorView.swiftsourceinfo (in target 'NVActivityIndicatorView' from project 'NVActivityIndicatorView')
    cd /Users/admin/builder/spi-builder-workspace
    builtin-copy -exclude .DS_Store -exclude CVS -exclude .svn -exclude .git -exclude .hg -resolve-src-symlinks -rename /Users/admin/builder/spi-builder-workspace/.derivedData/Build/Intermediates.noindex/NVActivityIndicatorView.build/Debug-appletvos/NVActivityIndicatorView.build/Objects-normal/arm64/NVActivityIndicatorView.swiftsourceinfo /Users/admin/builder/spi-builder-workspace/.derivedData/Build/Products/Debug-appletvos/NVActivityIndicatorView.framework/Modules/NVActivityIndicatorView.swiftmodule/Project/arm64-apple-tvos.swiftsourceinfo
SwiftDriver NVActivityIndicatorViewExtended normal arm64 com.apple.xcode.tools.swift.compiler (in target 'NVActivityIndicatorViewExtended' from project 'NVActivityIndicatorView')
    cd /Users/admin/builder/spi-builder-workspace
    builtin-SwiftDriver -- /Applications/Xcode-16.1.0.app/Contents/Developer/Toolchains/XcodeDefault.xctoolchain/usr/bin/swiftc -module-name NVActivityIndicatorViewExtended -Onone -enforce-exclusivity\=checked @/Users/admin/builder/spi-builder-workspace/.derivedData/Build/Intermediates.noindex/NVActivityIndicatorView.build/Debug-appletvos/NVActivityIndicatorViewExtended.build/Objects-normal/arm64/NVActivityIndicatorViewExtended.SwiftFileList -DSWIFT_PACKAGE -DDEBUG -stats-output-dir .stats -strict-concurrency\=complete -enable-upcoming-feature StrictConcurrency -enable-upcoming-feature DisableOutwardActorInference -enable-upcoming-feature GlobalActorIsolatedTypesUsability -enable-upcoming-feature InferSendableFromCaptures -enable-bare-slash-regex -enable-experimental-feature DebugDescriptionMacro -sdk /Applications/Xcode-16.1.0.app/Contents/Developer/Platforms/AppleTVOS.platform/Developer/SDKs/AppleTVOS18.1.sdk -target arm64-apple-tvos12.0 -g -module-cache-path /Users/admin/builder/spi-builder-workspace/.derivedData/ModuleCache.noindex -Xfrontend -serialize-debugging-options -enable-testing -index-store-path /Users/admin/builder/spi-builder-workspace/.derivedData/Index.noindex/DataStore -enable-experimental-feature OpaqueTypeErasure -Xcc -D_LIBCPP_HARDENING_MODE\=_LIBCPP_HARDENING_MODE_DEBUG -swift-version 5 -I /Users/admin/builder/spi-builder-workspace/.derivedData/Build/Products/Debug-appletvos -F /Users/admin/builder/spi-builder-workspace/.derivedData/Build/Products/Debug-appletvos -F /Applications/Xcode-16.1.0.app/Contents/Developer/Platforms/AppleTVOS.platform/Developer/Library/Frameworks -c -j10 -enable-batch-mode -incremental -Xcc -ivfsstatcache -Xcc /Users/admin/builder/spi-builder-workspace/.derivedData/SDKStatCaches.noindex/appletvos18.1-22J572-e7fdd8cf9ffd4d4af20823079b51a726.sdkstatcache -output-file-map /Users/admin/builder/spi-builder-workspace/.derivedData/Build/Intermediates.noindex/NVActivityIndicatorView.build/Debug-appletvos/NVActivityIndicatorViewExtended.build/Objects-normal/arm64/NVActivityIndicatorViewExtended-OutputFileMap.json -use-frontend-parseable-output -save-temps -no-color-diagnostics -serialize-diagnostics -emit-dependencies -emit-module -emit-module-path /Users/admin/builder/spi-builder-workspace/.derivedData/Build/Intermediates.noindex/NVActivityIndicatorView.build/Debug-appletvos/NVActivityIndicatorViewExtended.build/Objects-normal/arm64/NVActivityIndicatorViewExtended.swiftmodule -validate-clang-modules-once -clang-build-session-file /Users/admin/builder/spi-builder-workspace/.derivedData/ModuleCache.noindex/Session.modulevalidation -Xcc -I/Users/admin/builder/spi-builder-workspace/.derivedData/Build/Intermediates.noindex/NVActivityIndicatorView.build/Debug-appletvos/NVActivityIndicatorViewExtended.build/swift-overrides.hmap -emit-const-values -Xfrontend -const-gather-protocols-file -Xfrontend /Users/admin/builder/spi-builder-workspace/.derivedData/Build/Intermediates.noindex/NVActivityIndicatorView.build/Debug-appletvos/NVActivityIndicatorViewExtended.build/Objects-normal/arm64/NVActivityIndicatorViewExtended_const_extract_protocols.json -Xcc -I/Users/admin/builder/spi-builder-workspace/.derivedData/Build/Products/Debug-appletvos/include -Xcc -I/Users/admin/builder/spi-builder-workspace/.derivedData/Build/Intermediates.noindex/NVActivityIndicatorView.build/Debug-appletvos/NVActivityIndicatorViewExtended.build/DerivedSources-normal/arm64 -Xcc -I/Users/admin/builder/spi-builder-workspace/.derivedData/Build/Intermediates.noindex/NVActivityIndicatorView.build/Debug-appletvos/NVActivityIndicatorViewExtended.build/DerivedSources/arm64 -Xcc -I/Users/admin/builder/spi-builder-workspace/.derivedData/Build/Intermediates.noindex/NVActivityIndicatorView.build/Debug-appletvos/NVActivityIndicatorViewExtended.build/DerivedSources -Xcc -DSWIFT_PACKAGE\=1 -Xcc -DDEBUG\=1 -emit-objc-header -emit-objc-header-path /Users/admin/builder/spi-builder-workspace/.derivedData/Build/Intermediates.noindex/NVActivityIndicatorView.build/Debug-appletvos/NVActivityIndicatorViewExtended.build/Objects-normal/arm64/NVActivityIndicatorViewExtended-Swift.h -working-directory /Users/admin/builder/spi-builder-workspace -experimental-emit-module-separately -disable-cmo
SwiftEmitModule normal arm64 Emitting\ module\ for\ NVActivityIndicatorViewExtended (in target 'NVActivityIndicatorViewExtended' from project 'NVActivityIndicatorView')
    cd /Users/admin/builder/spi-builder-workspace
    builtin-swiftTaskExecution -- /Applications/Xcode-16.1.0.app/Contents/Developer/Toolchains/XcodeDefault.xctoolchain/usr/bin/swift-frontend -frontend -emit-module -experimental-skip-non-inlinable-function-bodies-without-types /Users/admin/builder/spi-builder-workspace/Sources/Extended/NVActivityIndicatorPresenter.swift /Users/admin/builder/spi-builder-workspace/Sources/Extended/NVActivityIndicatorViewable.swift -target arm64-apple-tvos12.0 -Xllvm -aarch64-use-tbi -enable-objc-interop -sdk /Applications/Xcode-16.1.0.app/Contents/Developer/Platforms/AppleTVOS.platform/Developer/SDKs/AppleTVOS18.1.sdk -I /Users/admin/builder/spi-builder-workspace/.derivedData/Build/Products/Debug-appletvos -F /Users/admin/builder/spi-builder-workspace/.derivedData/Build/Products/Debug-appletvos -F /Applications/Xcode-16.1.0.app/Contents/Developer/Platforms/AppleTVOS.platform/Developer/Library/Frameworks -no-color-diagnostics -enable-testing -g -debug-info-format\=dwarf -dwarf-version\=4 -module-cache-path /Users/admin/builder/spi-builder-workspace/.derivedData/ModuleCache.noindex -swift-version 5 -enforce-exclusivity\=checked -stats-output-dir /Users/admin/builder/spi-builder-workspace/.stats -Onone -D SWIFT_PACKAGE -D DEBUG -serialize-debugging-options -const-gather-protocols-file /Users/admin/builder/spi-builder-workspace/.derivedData/Build/Intermediates.noindex/NVActivityIndicatorView.build/Debug-appletvos/NVActivityIndicatorViewExtended.build/Objects-normal/arm64/NVActivityIndicatorViewExtended_const_extract_protocols.json -enable-experimental-feature DebugDescriptionMacro -enable-experimental-feature OpaqueTypeErasure -enable-upcoming-feature StrictConcurrency -enable-upcoming-feature DisableOutwardActorInference -enable-upcoming-feature GlobalActorIsolatedTypesUsability -enable-upcoming-feature InferSendableFromCaptures -enable-bare-slash-regex -strict-concurrency\=complete -empty-abi-descriptor -validate-clang-modules-once -clang-build-session-file /Users/admin/builder/spi-builder-workspace/.derivedData/ModuleCache.noindex/Session.modulevalidation -Xcc -working-directory -Xcc /Users/admin/builder/spi-builder-workspace -resource-dir /Applications/Xcode-16.1.0.app/Contents/Developer/Toolchains/XcodeDefault.xctoolchain/usr/lib/swift -enable-anonymous-context-mangled-names -file-compilation-dir /Users/admin/builder/spi-builder-workspace -Xcc -D_LIBCPP_HARDENING_MODE\=_LIBCPP_HARDENING_MODE_DEBUG -Xcc -ivfsstatcache -Xcc /Users/admin/builder/spi-builder-workspace/.derivedData/SDKStatCaches.noindex/appletvos18.1-22J572-e7fdd8cf9ffd4d4af20823079b51a726.sdkstatcache -Xcc -I/Users/admin/builder/spi-builder-workspace/.derivedData/Build/Intermediates.noindex/NVActivityIndicatorView.build/Debug-appletvos/NVActivityIndicatorViewExtended.build/swift-overrides.hmap -Xcc -I/Users/admin/builder/spi-builder-workspace/.derivedData/Build/Products/Debug-appletvos/include -Xcc -I/Users/admin/builder/spi-builder-workspace/.derivedData/Build/Intermediates.noindex/NVActivityIndicatorView.build/Debug-appletvos/NVActivityIndicatorViewExtended.build/DerivedSources-normal/arm64 -Xcc -I/Users/admin/builder/spi-builder-workspace/.derivedData/Build/Intermediates.noindex/NVActivityIndicatorView.build/Debug-appletvos/NVActivityIndicatorViewExtended.build/DerivedSources/arm64 -Xcc -I/Users/admin/builder/spi-builder-workspace/.derivedData/Build/Intermediates.noindex/NVActivityIndicatorView.build/Debug-appletvos/NVActivityIndicatorViewExtended.build/DerivedSources -Xcc -DSWIFT_PACKAGE\=1 -Xcc -DDEBUG\=1 -module-name NVActivityIndicatorViewExtended -frontend-parseable-output -disable-clang-spi -target-sdk-version 18.1 -target-sdk-name appletvos18.1 -external-plugin-path /Applications/Xcode-16.1.0.app/Contents/Developer/Platforms/AppleTVOS.platform/Developer/usr/lib/swift/host/plugins\#/Applications/Xcode-16.1.0.app/Contents/Developer/Platforms/AppleTVOS.platform/Developer/usr/bin/swift-plugin-server -external-plugin-path /Applications/Xcode-16.1.0.app/Contents/Developer/Platforms/AppleTVOS.platform/Developer/usr/local/lib/swift/host/plugins\#/Applications/Xcode-16.1.0.app/Contents/Developer/Platforms/AppleTVOS.platform/Developer/usr/bin/swift-plugin-server -plugin-path /Applications/Xcode-16.1.0.app/Contents/Developer/Toolchains/XcodeDefault.xctoolchain/usr/lib/swift/host/plugins -plugin-path /Applications/Xcode-16.1.0.app/Contents/Developer/Toolchains/XcodeDefault.xctoolchain/usr/local/lib/swift/host/plugins -emit-module-doc-path /Users/admin/builder/spi-builder-workspace/.derivedData/Build/Intermediates.noindex/NVActivityIndicatorView.build/Debug-appletvos/NVActivityIndicatorViewExtended.build/Objects-normal/arm64/NVActivityIndicatorViewExtended.swiftdoc -emit-module-source-info-path /Users/admin/builder/spi-builder-workspace/.derivedData/Build/Intermediates.noindex/NVActivityIndicatorView.build/Debug-appletvos/NVActivityIndicatorViewExtended.build/Objects-normal/arm64/NVActivityIndicatorViewExtended.swiftsourceinfo -emit-objc-header-path /Users/admin/builder/spi-builder-workspace/.derivedData/Build/Intermediates.noindex/NVActivityIndicatorView.build/Debug-appletvos/NVActivityIndicatorViewExtended.build/Objects-normal/arm64/NVActivityIndicatorViewExtended-Swift.h -serialize-diagnostics-path /Users/admin/builder/spi-builder-workspace/.derivedData/Build/Intermediates.noindex/NVActivityIndicatorView.build/Debug-appletvos/NVActivityIndicatorViewExtended.build/Objects-normal/arm64/NVActivityIndicatorViewExtended-master-emit-module.dia -emit-dependencies-path /Users/admin/builder/spi-builder-workspace/.derivedData/Build/Intermediates.noindex/NVActivityIndicatorView.build/Debug-appletvos/NVActivityIndicatorViewExtended.build/Objects-normal/arm64/NVActivityIndicatorViewExtended-master-emit-module.d -o /Users/admin/builder/spi-builder-workspace/.derivedData/Build/Intermediates.noindex/NVActivityIndicatorView.build/Debug-appletvos/NVActivityIndicatorViewExtended.build/Objects-normal/arm64/NVActivityIndicatorViewExtended.swiftmodule -emit-abi-descriptor-path /Users/admin/builder/spi-builder-workspace/.derivedData/Build/Intermediates.noindex/NVActivityIndicatorView.build/Debug-appletvos/NVActivityIndicatorViewExtended.build/Objects-normal/arm64/NVActivityIndicatorViewExtended.abi.json
EmitSwiftModule normal arm64 (in target 'NVActivityIndicatorViewExtended' from project 'NVActivityIndicatorView')
    cd /Users/admin/builder/spi-builder-workspace
    /Applications/Xcode-16.1.0.app/Contents/Developer/Toolchains/XcodeDefault.xctoolchain/usr/bin/swift-frontend -emit-module -experimental-skip-non-inlinable-function-bodies-without-types /Users/admin/builder/spi-builder-workspace/Sources/Extended/NVActivityIndicatorPresenter.swift /Users/admin/builder/spi-builder-workspace/Sources/Extended/NVActivityIndicatorViewable.swift -target arm64-apple-tvos12.0 -Xllvm -aarch64-use-tbi -enable-objc-interop -sdk /Applications/Xcode-16.1.0.app/Contents/Developer/Platforms/AppleTVOS.platform/Developer/SDKs/AppleTVOS18.1.sdk -I /Users/admin/builder/spi-builder-workspace/.derivedData/Build/Products/Debug-appletvos -F /Users/admin/builder/spi-builder-workspace/.derivedData/Build/Products/Debug-appletvos -F /Applications/Xcode-16.1.0.app/Contents/Developer/Platforms/AppleTVOS.platform/Developer/Library/Frameworks -no-color-diagnostics -enable-testing -g -debug-info-format\=dwarf -dwarf-version\=4 -module-cache-path /Users/admin/builder/spi-builder-workspace/.derivedData/ModuleCache.noindex -swift-version 5 -enforce-exclusivity\=checked -stats-output-dir /Users/admin/builder/spi-builder-workspace/.stats -Onone -D SWIFT_PACKAGE -D DEBUG -serialize-debugging-options -const-gather-protocols-file /Users/admin/builder/spi-builder-workspace/.derivedData/Build/Intermediates.noindex/NVActivityIndicatorView.build/Debug-appletvos/NVActivityIndicatorViewExtended.build/Objects-normal/arm64/NVActivityIndicatorViewExtended_const_extract_protocols.json -enable-experimental-feature DebugDescriptionMacro -enable-experimental-feature OpaqueTypeErasure -enable-upcoming-feature StrictConcurrency -enable-upcoming-feature DisableOutwardActorInference -enable-upcoming-feature GlobalActorIsolatedTypesUsability -enable-upcoming-feature InferSendableFromCaptures -enable-bare-slash-regex -strict-concurrency\=complete -empty-abi-descriptor -validate-clang-modules-once -clang-build-session-file /Users/admin/builder/spi-builder-workspace/.derivedData/ModuleCache.noindex/Session.modulevalidation -Xcc -working-directory -Xcc /Users/admin/builder/spi-builder-workspace -resource-dir /Applications/Xcode-16.1.0.app/Contents/Developer/Toolchains/XcodeDefault.xctoolchain/usr/lib/swift -enable-anonymous-context-mangled-names -file-compilation-dir /Users/admin/builder/spi-builder-workspace -Xcc -D_LIBCPP_HARDENING_MODE\=_LIBCPP_HARDENING_MODE_DEBUG -Xcc -ivfsstatcache -Xcc /Users/admin/builder/spi-builder-workspace/.derivedData/SDKStatCaches.noindex/appletvos18.1-22J572-e7fdd8cf9ffd4d4af20823079b51a726.sdkstatcache -Xcc -I/Users/admin/builder/spi-builder-workspace/.derivedData/Build/Intermediates.noindex/NVActivityIndicatorView.build/Debug-appletvos/NVActivityIndicatorViewExtended.build/swift-overrides.hmap -Xcc -I/Users/admin/builder/spi-builder-workspace/.derivedData/Build/Products/Debug-appletvos/include -Xcc -I/Users/admin/builder/spi-builder-workspace/.derivedData/Build/Intermediates.noindex/NVActivityIndicatorView.build/Debug-appletvos/NVActivityIndicatorViewExtended.build/DerivedSources-normal/arm64 -Xcc -I/Users/admin/builder/spi-builder-workspace/.derivedData/Build/Intermediates.noindex/NVActivityIndicatorView.build/Debug-appletvos/NVActivityIndicatorViewExtended.build/DerivedSources/arm64 -Xcc -I/Users/admin/builder/spi-builder-workspace/.derivedData/Build/Intermediates.noindex/NVActivityIndicatorView.build/Debug-appletvos/NVActivityIndicatorViewExtended.build/DerivedSources -Xcc -DSWIFT_PACKAGE\=1 -Xcc -DDEBUG\=1 -module-name NVActivityIndicatorViewExtended -frontend-parseable-output -disable-clang-spi -target-sdk-version 18.1 -target-sdk-name appletvos18.1 -external-plugin-path /Applications/Xcode-16.1.0.app/Contents/Developer/Platforms/AppleTVOS.platform/Developer/usr/lib/swift/host/plugins\#/Applications/Xcode-16.1.0.app/Contents/Developer/Platforms/AppleTVOS.platform/Developer/usr/bin/swift-plugin-server -external-plugin-path /Applications/Xcode-16.1.0.app/Contents/Developer/Platforms/AppleTVOS.platform/Developer/usr/local/lib/swift/host/plugins\#/Applications/Xcode-16.1.0.app/Contents/Developer/Platforms/AppleTVOS.platform/Developer/usr/bin/swift-plugin-server -plugin-path /Applications/Xcode-16.1.0.app/Contents/Developer/Toolchains/XcodeDefault.xctoolchain/usr/lib/swift/host/plugins -plugin-path /Applications/Xcode-16.1.0.app/Contents/Developer/Toolchains/XcodeDefault.xctoolchain/usr/local/lib/swift/host/plugins -emit-module-doc-path /Users/admin/builder/spi-builder-workspace/.derivedData/Build/Intermediates.noindex/NVActivityIndicatorView.build/Debug-appletvos/NVActivityIndicatorViewExtended.build/Objects-normal/arm64/NVActivityIndicatorViewExtended.swiftdoc -emit-module-source-info-path /Users/admin/builder/spi-builder-workspace/.derivedData/Build/Intermediates.noindex/NVActivityIndicatorView.build/Debug-appletvos/NVActivityIndicatorViewExtended.build/Objects-normal/arm64/NVActivityIndicatorViewExtended.swiftsourceinfo -emit-objc-header-path /Users/admin/builder/spi-builder-workspace/.derivedData/Build/Intermediates.noindex/NVActivityIndicatorView.build/Debug-appletvos/NVActivityIndicatorViewExtended.build/Objects-normal/arm64/NVActivityIndicatorViewExtended-Swift.h -serialize-diagnostics-path /Users/admin/builder/spi-builder-workspace/.derivedData/Build/Intermediates.noindex/NVActivityIndicatorView.build/Debug-appletvos/NVActivityIndicatorViewExtended.build/Objects-normal/arm64/NVActivityIndicatorViewExtended-master-emit-module.dia -emit-dependencies-path /Users/admin/builder/spi-builder-workspace/.derivedData/Build/Intermediates.noindex/NVActivityIndicatorView.build/Debug-appletvos/NVActivityIndicatorViewExtended.build/Objects-normal/arm64/NVActivityIndicatorViewExtended-master-emit-module.d -o /Users/admin/builder/spi-builder-workspace/.derivedData/Build/Intermediates.noindex/NVActivityIndicatorView.build/Debug-appletvos/NVActivityIndicatorViewExtended.build/Objects-normal/arm64/NVActivityIndicatorViewExtended.swiftmodule -emit-abi-descriptor-path /Users/admin/builder/spi-builder-workspace/.derivedData/Build/Intermediates.noindex/NVActivityIndicatorView.build/Debug-appletvos/NVActivityIndicatorViewExtended.build/Objects-normal/arm64/NVActivityIndicatorViewExtended.abi.json
/Users/admin/builder/spi-builder-workspace/Sources/Extended/NVActivityIndicatorPresenter.swift:112:36: warning: 'NVActivityIndicatorPresenter' is deprecated
    func startAnimating(presenter: NVActivityIndicatorPresenter, _ fadeInAnimation: FadeInAnimation?)
                                   ^
/Users/admin/builder/spi-builder-workspace/Sources/Extended/NVActivityIndicatorPresenter.swift:113:35: warning: 'NVActivityIndicatorPresenter' is deprecated
    func stopAnimating(presenter: NVActivityIndicatorPresenter, _ fadeOutAnimation: FadeOutAnimation?)
                                  ^
/Users/admin/builder/spi-builder-workspace/Sources/Extended/NVActivityIndicatorPresenter.swift:117:36: warning: 'NVActivityIndicatorPresenter' is deprecated
    func startAnimating(presenter: NVActivityIndicatorPresenter, _ fadeInAnimation: FadeInAnimation?) {
                                   ^
/Users/admin/builder/spi-builder-workspace/Sources/Extended/NVActivityIndicatorPresenter.swift:125:35: warning: 'NVActivityIndicatorPresenter' is deprecated
    func stopAnimating(presenter: NVActivityIndicatorPresenter, _ fadeOutAnimation: FadeOutAnimation?) {
                                  ^
/Users/admin/builder/spi-builder-workspace/Sources/Extended/NVActivityIndicatorPresenter.swift:132:36: warning: 'NVActivityIndicatorPresenter' is deprecated
    func startAnimating(presenter: NVActivityIndicatorPresenter, _ fadeInAnimation: FadeInAnimation?) {
                                   ^
/Users/admin/builder/spi-builder-workspace/Sources/Extended/NVActivityIndicatorPresenter.swift:136:35: warning: 'NVActivityIndicatorPresenter' is deprecated
    func stopAnimating(presenter: NVActivityIndicatorPresenter, _ fadeOutAnimation: FadeOutAnimation?) {
                                  ^
/Users/admin/builder/spi-builder-workspace/Sources/Extended/NVActivityIndicatorPresenter.swift:149:36: warning: 'NVActivityIndicatorPresenter' is deprecated
    func startAnimating(presenter: NVActivityIndicatorPresenter, _ fadeInAnimation: FadeInAnimation?) {
                                   ^
/Users/admin/builder/spi-builder-workspace/Sources/Extended/NVActivityIndicatorPresenter.swift:156:35: warning: 'NVActivityIndicatorPresenter' is deprecated
    func stopAnimating(presenter: NVActivityIndicatorPresenter, _ fadeOutAnimation: FadeOutAnimation?) {
                                  ^
/Users/admin/builder/spi-builder-workspace/Sources/Extended/NVActivityIndicatorPresenter.swift:163:36: warning: 'NVActivityIndicatorPresenter' is deprecated
    func startAnimating(presenter: NVActivityIndicatorPresenter, _ fadeInAnimation: FadeInAnimation?) {
                                   ^
/Users/admin/builder/spi-builder-workspace/Sources/Extended/NVActivityIndicatorPresenter.swift:175:35: warning: 'NVActivityIndicatorPresenter' is deprecated
    func stopAnimating(presenter: NVActivityIndicatorPresenter, _ fadeOutAnimation: FadeOutAnimation?) {
                                  ^
/Users/admin/builder/spi-builder-workspace/Sources/Extended/NVActivityIndicatorPresenter.swift:208:17: warning: main actor-isolated default value in a nonisolated context; this is an error in the Swift 6 language mode
    private let messageLabel: UILabel = {
                ^
/Users/admin/builder/spi-builder-workspace/Sources/Extended/NVActivityIndicatorPresenter.swift:225:23: warning: static property 'sharedInstance' is not concurrency-safe because non-'Sendable' type 'NVActivityIndicatorPresenter' may have shared mutable state; this is an error in the Swift 6 language mode
    public static let sharedInstance = NVActivityIndicatorPresenter()
                      ^
/Users/admin/builder/spi-builder-workspace/Sources/Extended/NVActivityIndicatorPresenter.swift:182:20: note: class 'NVActivityIndicatorPresenter' does not conform to the 'Sendable' protocol
public final class NVActivityIndicatorPresenter {
                   ^
/Users/admin/builder/spi-builder-workspace/Sources/Extended/NVActivityIndicatorPresenter.swift:225:23: note: annotate 'sharedInstance' with '@MainActor' if property should only be accessed from the main actor
    public static let sharedInstance = NVActivityIndicatorPresenter()
                      ^
    @MainActor
/Users/admin/builder/spi-builder-workspace/Sources/Extended/NVActivityIndicatorPresenter.swift:225:23: note: disable concurrency-safety checks if accesses are protected by an external synchronization mechanism
    public static let sharedInstance = NVActivityIndicatorPresenter()
                      ^
    nonisolated(unsafe)
/Users/admin/builder/spi-builder-workspace/Sources/Extended/NVActivityIndicatorViewable.swift:72:9: error: main actor-isolated default value in a nonisolated context
        fadeInAnimation: FadeInAnimation? = NVActivityIndicatorView.DEFAULT_FADE_IN_ANIMATION) {
        ^
/Users/admin/builder/spi-builder-workspace/Sources/Extended/NVActivityIndicatorViewable.swift:92:26: error: main actor-isolated default value in a nonisolated context
    func stopAnimating(_ fadeOutAnimation: FadeOutAnimation? = NVActivityIndicatorView.DEFAULT_FADE_OUT_ANIMATION) {
                         ^
Error opening -stats-output-dir file '/Users/admin/builder/spi-builder-workspace/.stats/stats-1733006340604260-swift-frontend-NVActivityIndicatorViewExtended-all-arm64_apple_tvos12.0-swiftmodule-Onone-1016694233.json' for writing
===-------------------------------------------------------------------------===
                               Swift compilation
===-------------------------------------------------------------------------===
  Total Execution Time: 0.5464 seconds (0.5545 wall clock)
   ---User Time---   --System Time--   --User+System--   ---Wall Time---  --- Name ---
   0.0382 ( 12.1%)   0.0251 ( 10.9%)   0.0634 ( 11.6%)   0.0643 ( 11.6%)  perform-sema
   0.0382 ( 12.1%)   0.0251 ( 10.9%)   0.0633 ( 11.6%)   0.0642 ( 11.6%)  TypeCheckSourceFileRequest
   0.0382 ( 12.1%)   0.0251 ( 10.9%)   0.0633 ( 11.6%)   0.0642 ( 11.6%)  Type checking and Semantic analysis
   0.0377 ( 11.9%)   0.0243 ( 10.6%)   0.0620 ( 11.3%)   0.0626 ( 11.3%)  typecheck-decl
   0.0230 (  7.3%)   0.0300 ( 13.0%)   0.0530 (  9.7%)   0.0543 (  9.8%)  parse-and-resolve-imports
   0.0230 (  7.3%)   0.0297 ( 12.9%)   0.0527 (  9.6%)   0.0540 (  9.7%)  Import resolution
   0.0134 (  4.2%)   0.0086 (  3.7%)   0.0220 (  4.0%)   0.0223 (  4.0%)  ResolveValueWitnessesRequest
   0.0105 (  3.3%)   0.0054 (  2.4%)   0.0159 (  2.9%)   0.0162 (  2.9%)  UnqualifiedLookupRequest
   0.0103 (  3.2%)   0.0052 (  2.3%)   0.0155 (  2.8%)   0.0158 (  2.8%)  performUnqualifiedLookup
   0.0102 (  3.2%)   0.0050 (  2.2%)   0.0152 (  2.8%)   0.0152 (  2.7%)  typecheck-expr
   0.0071 (  2.2%)   0.0062 (  2.7%)   0.0133 (  2.4%)   0.0133 (  2.4%)  InterfaceTypeRequest
   0.0090 (  2.8%)   0.0039 (  1.7%)   0.0129 (  2.4%)   0.0132 (  2.4%)  LookupInModuleRequest
   0.0077 (  2.4%)   0.0041 (  1.8%)   0.0117 (  2.2%)   0.0118 (  2.1%)  QualifiedLookupRequest
   0.0071 (  2.2%)   0.0030 (  1.3%)   0.0101 (  1.8%)   0.0101 (  1.8%)  DirectLookupRequest
   0.0048 (  1.5%)   0.0028 (  1.2%)   0.0076 (  1.4%)   0.0077 (  1.4%)  ResolveTypeRequest
   0.0027 (  0.8%)   0.0028 (  1.2%)   0.0055 (  1.0%)   0.0057 (  1.0%)  import-clang-decl
   0.0031 (  1.0%)   0.0021 (  0.9%)   0.0053 (  1.0%)   0.0055 (  1.0%)  ModuleQualifiedLookupRequest
   0.0034 (  1.1%)   0.0018 (  0.8%)   0.0052 (  1.0%)   0.0052 (  0.9%)  PatternBindingEntryRequest
   0.0038 (  1.2%)   0.0013 (  0.5%)   0.0050 (  0.9%)   0.0050 (  0.9%)  build-rewrite-system
   0.0034 (  1.1%)   0.0014 (  0.6%)   0.0048 (  0.9%)   0.0048 (  0.9%)  LookupConformanceInModuleRequest
   0.0023 (  0.7%)   0.0011 (  0.5%)   0.0035 (  0.6%)   0.0035 (  0.6%)  OpaqueReadOwnershipRequest
   0.0017 (  0.5%)   0.0011 (  0.5%)   0.0029 (  0.5%)   0.0029 (  0.5%)  PatternTypeRequest
   0.0015 (  0.5%)   0.0014 (  0.6%)   0.0029 (  0.5%)   0.0029 (  0.5%)  DefaultArgumentExprRequest
   0.0013 (  0.4%)   0.0014 (  0.6%)   0.0027 (  0.5%)   0.0027 (  0.5%)  AttachedPropertyWrappersRequest
   0.0013 (  0.4%)   0.0012 (  0.5%)   0.0026 (  0.5%)   0.0026 (  0.5%)  ActorIsolationRequest
   0.0009 (  0.3%)   0.0016 (  0.7%)   0.0025 (  0.5%)   0.0025 (  0.4%)  load-stdlib
   0.0008 (  0.3%)   0.0006 (  0.2%)   0.0014 (  0.3%)   0.0014 (  0.3%)  GenericSignatureRequest
   0.0008 (  0.3%)   0.0005 (  0.2%)   0.0014 (  0.3%)   0.0014 (  0.2%)  precheck-expr
   0.0007 (  0.2%)   0.0006 (  0.3%)   0.0013 (  0.2%)   0.0013 (  0.2%)  PotentialMacroExpansionsInContextRequest
   0.0007 (  0.2%)   0.0004 (  0.2%)   0.0011 (  0.2%)   0.0011 (  0.2%)  InferredGenericSignatureRequest
   0.0006 (  0.2%)   0.0004 (  0.2%)   0.0009 (  0.2%)   0.0009 (  0.2%)  RequirementRequest
   0.0002 (  0.1%)   0.0005 (  0.2%)   0.0006 (  0.1%)   0.0007 (  0.1%)  IsFunctionBodySkippedRequest
   0.0004 (  0.1%)   0.0003 (  0.1%)   0.0007 (  0.1%)   0.0007 (  0.1%)  DefaultInitializerIsolation
   0.0003 (  0.1%)   0.0004 (  0.2%)   0.0006 (  0.1%)   0.0006 (  0.1%)  ABIMembersRequest
   0.0003 (  0.1%)   0.0003 (  0.1%)   0.0006 (  0.1%)   0.0006 (  0.1%)  ParseTopLevelDeclsRequest
   0.0003 (  0.1%)   0.0003 (  0.1%)   0.0006 (  0.1%)   0.0006 (  0.1%)  ParseSourceFileRequest
   0.0004 (  0.1%)   0.0002 (  0.1%)   0.0006 (  0.1%)   0.0006 (  0.1%)  SelfBoundsFromWhereClauseRequest
   0.0004 (  0.1%)   0.0002 (  0.1%)   0.0006 (  0.1%)   0.0006 (  0.1%)  ExpandMemberAttributeMacros
   0.0005 (  0.1%)   0.0001 (  0.0%)   0.0005 (  0.1%)   0.0005 (  0.1%)  DefaultTypeRequest
   0.0002 (  0.1%)   0.0001 (  0.1%)   0.0004 (  0.1%)   0.0005 (  0.1%)  CheckRedeclarationRequest
   0.0004 (  0.1%)   0.0001 (  0.0%)   0.0005 (  0.1%)   0.0005 (  0.1%)  ResolveImplicitMemberRequest
   0.0003 (  0.1%)   0.0002 (  0.1%)   0.0005 (  0.1%)   0.0005 (  0.1%)  RequirementSignatureRequest
   0.0002 (  0.1%)   0.0002 (  0.1%)   0.0004 (  0.1%)   0.0005 (  0.1%)  LookupAllConformancesInContextRequest
   0.0002 (  0.1%)   0.0002 (  0.1%)   0.0004 (  0.1%)   0.0004 (  0.1%)  StoredPropertiesRequest
   0.0004 (  0.1%)   0.0000 (  0.0%)   0.0004 (  0.1%)   0.0004 (  0.1%)  ResolveMacroRequest
   0.0003 (  0.1%)   0.0000 (  0.0%)   0.0004 (  0.1%)   0.0004 (  0.1%)  ExpandExtensionMacros
   0.0003 (  0.1%)   0.0000 (  0.0%)   0.0003 (  0.1%)   0.0003 (  0.1%)  ParseMembersRequest
   0.0002 (  0.1%)   0.0001 (  0.1%)   0.0003 (  0.1%)   0.0003 (  0.1%)  IsGetterMutatingRequest
   0.0001 (  0.0%)   0.0002 (  0.1%)   0.0003 (  0.1%)   0.0003 (  0.1%)  ValidatePrecedenceGroupRequest
   0.0001 (  0.0%)   0.0002 (  0.1%)   0.0003 (  0.1%)   0.0003 (  0.1%)  ExtendedNominalRequest
   0.0001 (  0.0%)   0.0002 (  0.1%)   0.0003 (  0.1%)   0.0003 (  0.1%)  LookupPrecedenceGroupRequest
   0.0001 (  0.0%)   0.0001 (  0.1%)   0.0003 (  0.0%)   0.0003 (  0.1%)  ExpandPeerMacroRequest
   0.0001 (  0.0%)   0.0001 (  0.1%)   0.0003 (  0.0%)   0.0003 (  0.0%)  InheritedDeclsReferencedRequest
   0.0002 (  0.1%)   0.0001 (  0.0%)   0.0003 (  0.1%)   0.0003 (  0.0%)  ObjCInterfaceAndImplementationRequest
   0.0002 (  0.0%)   0.0001 (  0.0%)   0.0002 (  0.0%)   0.0002 (  0.0%)  ProtocolDependenciesRequest
   0.0000 (  0.0%)   0.0002 (  0.1%)   0.0002 (  0.0%)   0.0002 (  0.0%)  HasDefaultInitRequest
   0.0002 (  0.0%)   0.0001 (  0.0%)   0.0002 (  0.0%)   0.0002 (  0.0%)  GlobalActorAttributeRequest
   0.0001 (  0.0%)   0.0001 (  0.0%)   0.0002 (  0.0%)   0.0002 (  0.0%)  GenericParamListRequest
   0.0001 (  0.0%)   0.0001 (  0.0%)   0.0002 (  0.0%)   0.0002 (  0.0%)  SynthesizeDefaultInitRequest
   0.0001 (  0.0%)   0.0001 (  0.0%)   0.0002 (  0.0%)   0.0002 (  0.0%)  FragileFunctionKindRequest
   0.0001 (  0.0%)   0.0001 (  0.0%)   0.0002 (  0.0%)   0.0002 (  0.0%)  IsDynamicRequest
   0.0001 (  0.0%)   0.0001 (  0.0%)   0.0002 (  0.0%)   0.0002 (  0.0%)  define-default-ctor
   0.0001 (  0.0%)   0.0001 (  0.0%)   0.0002 (  0.0%)   0.0002 (  0.0%)  LifetimeDependenceInfoRequest
   0.0001 (  0.0%)   0.0001 (  0.0%)   0.0002 (  0.0%)   0.0002 (  0.0%)  InheritedProtocolsRequest
   0.0001 (  0.0%)   0.0001 (  0.0%)   0.0002 (  0.0%)   0.0002 (  0.0%)  HasIsolatedSelfRequest
   0.0001 (  0.0%)   0.0001 (  0.0%)   0.0002 (  0.0%)   0.0002 (  0.0%)  AccessLevelRequest
   0.0001 (  0.0%)   0.0001 (  0.0%)   0.0002 (  0.0%)   0.0002 (  0.0%)  InheritsSuperclassInitializersRequest
   0.0001 (  0.0%)   0.0001 (  0.0%)   0.0001 (  0.0%)   0.0001 (  0.0%)  SPIGroupsRequest
   0.0001 (  0.0%)   0.0001 (  0.0%)   0.0001 (  0.0%)   0.0001 (  0.0%)  DefaultAndMaxAccessLevelRequest
   0.0001 (  0.0%)   0.0001 (  0.0%)   0.0001 (  0.0%)   0.0001 (  0.0%)  TypeDeclsFromWhereClauseRequest
   0.0001 (  0.0%)   0.0001 (  0.0%)   0.0001 (  0.0%)   0.0001 (  0.0%)  ImplicitKnownProtocolConformanceRequest
   0.0001 (  0.0%)   0.0000 (  0.0%)   0.0001 (  0.0%)   0.0001 (  0.0%)  CustomAttrNominalRequest
   0.0001 (  0.0%)   0.0000 (  0.0%)   0.0001 (  0.0%)   0.0001 (  0.0%)  load-all-members
   0.0001 (  0.0%)   0.0000 (  0.0%)   0.0001 (  0.0%)   0.0001 (  0.0%)  StructuralRequirementsRequest
   0.0001 (  0.0%)   0.0000 (  0.0%)   0.0001 (  0.0%)   0.0001 (  0.0%)  ProtocolRequirementsRequest
   0.0001 (  0.0%)   0.0000 (  0.0%)   0.0001 (  0.0%)   0.0001 (  0.0%)  StorageImplInfoRequest
   0.0001 (  0.0%)   0.0000 (  0.0%)   0.0001 (  0.0%)   0.0001 (  0.0%)  HasMemberwiseInitRequest
   0.0000 (  0.0%)   0.0000 (  0.0%)   0.0001 (  0.0%)   0.0001 (  0.0%)  IsActorRequest
   0.0001 (  0.0%)   0.0000 (  0.0%)   0.0001 (  0.0%)   0.0001 (  0.0%)  ExpandChildTypeRefinementContextsRequest
   0.0001 (  0.0%)   0.0000 (  0.0%)   0.0001 (  0.0%)   0.0001 (  0.0%)  InheritedTypeRequest
   0.0001 (  0.0%)   0.0000 (  0.0%)   0.0001 (  0.0%)   0.0001 (  0.0%)  IsObjCRequest
   0.0001 (  0.0%)   0.0000 (  0.0%)   0.0001 (  0.0%)   0.0001 (  0.0%)  HasInitAccessorRequest
   0.0000 (  0.0%)   0.0000 (  0.0%)   0.0001 (  0.0%)   0.0001 (  0.0%)  ConditionalRequirementsRequest
   0.0001 (  0.0%)   0.0000 (  0.0%)   0.0001 (  0.0%)   0.0001 (  0.0%)  HasUserDefinedDesignatedInitRequest
   0.0001 (  0.0%)   0.0000 (  0.0%)   0.0001 (  0.0%)   0.0001 (  0.0%)  ApplyAccessNoteRequest
   0.0000 (  0.0%)   0.0000 (  0.0%)   0.0001 (  0.0%)   0.0001 (  0.0%)  OverriddenDeclsRequest
   0.0000 (  0.0%)   0.0000 (  0.0%)   0.0001 (  0.0%)   0.0001 (  0.0%)  PatternBindingCheckedAndContextualizedInitRequest
   0.0000 (  0.0%)   0.0000 (  0.0%)   0.0001 (  0.0%)   0.0001 (  0.0%)  HasMissingDesignatedInitializersRequest
   0.0000 (  0.0%)   0.0000 (  0.0%)   0.0001 (  0.0%)   0.0001 (  0.0%)  HasSelfOrAssociatedTypeRequirementsRequest
   0.0000 (  0.0%)   0.0000 (  0.0%)   0.0001 (  0.0%)   0.0001 (  0.0%)  DynamicallyReplacedDeclRequest
   0.0000 (  0.0%)   0.0000 (  0.0%)   0.0000 (  0.0%)   0.0000 (  0.0%)  PropertyWrapperMutabilityRequest
   0.0000 (  0.0%)   0.0000 (  0.0%)   0.0000 (  0.0%)   0.0000 (  0.0%)  AssociatedConformanceRequest
   0.0000 (  0.0%)   0.0000 (  0.0%)   0.0000 (  0.0%)   0.0000 (  0.0%)  GlobalActorInstanceRequest
   0.0000 (  0.0%)   0.0000 (  0.0%)   0.0000 (  0.0%)   0.0000 (  0.0%)  AbstractGenericSignatureRequest
   0.0000 (  0.0%)   0.0000 (  0.0%)   0.0000 (  0.0%)   0.0000 (  0.0%)  HasDynamicMemberLookupAttributeRequest
   0.0000 (  0.0%)   0.0000 (  0.0%)   0.0000 (  0.0%)   0.0000 (  0.0%)  DirectPrecedenceGroupLookupRequest
   0.0000 (  0.0%)   0.0000 (  0.0%)   0.0000 (  0.0%)   0.0000 (  0.0%)  AttachedResultBuilderRequest
   0.0000 (  0.0%)   0.0000 (  0.0%)   0.0000 (  0.0%)   0.0000 (  0.0%)  IsImplicitlyUnwrappedOptionalRequest
   0.0000 (  0.0%)   0.0000 (  0.0%)   0.0000 (  0.0%)   0.0000 (  0.0%)  IsStaticRequest
   0.0000 (  0.0%)   0.0000 (  0.0%)   0.0000 (  0.0%)   0.0000 (  0.0%)  HasCircularRawValueRequest
   0.0000 (  0.0%)   0.0000 (  0.0%)   0.0000 (  0.0%)   0.0000 (  0.0%)  EnumRawTypeRequest
   0.0000 (  0.0%)   0.0000 (  0.0%)   0.0000 (  0.0%)   0.0000 (  0.0%)  ResultTypeRequest
   0.0000 (  0.0%)   0.0000 (  0.0%)   0.0000 (  0.0%)   0.0000 (  0.0%)  ParamSpecifierRequest
   0.0000 (  0.0%)   0.0000 (  0.0%)   0.0000 (  0.0%)   0.0000 (  0.0%)  SynthesizeAccessorRequest
   0.0000 (  0.0%)   0.0000 (  0.0%)   0.0000 (  0.0%)   0.0000 (  0.0%)  IsFinalRequest
   0.0000 (  0.0%)   0.0000 (  0.0%)   0.0000 (  0.0%)   0.0000 (  0.0%)  ClangCategoryLookupRequest
   0.0000 (  0.0%)   0.0000 (  0.0%)   0.0000 (  0.0%)   0.0000 (  0.0%)  IsDistributedActorRequest
   0.0000 (  0.0%)   0.0000 (  0.0%)   0.0000 (  0.0%)   0.0000 (  0.0%)  TypeAliasRequirementsRequest
   0.0000 (  0.0%)   0.0000 (  0.0%)   0.0000 (  0.0%)   0.0000 (  0.0%)  IsSetterMutatingRequest
   0.0000 (  0.0%)   0.0000 (  0.0%)   0.0000 (  0.0%)   0.0000 (  0.0%)  ExpandAccessorMacros
   0.0000 (  0.0%)   0.0000 (  0.0%)   0.0000 (  0.0%)   0.0000 (  0.0%)  InitAccessorPropertiesRequest
   0.0000 (  0.0%)   0.0000 (  0.0%)   0.0000 (  0.0%)   0.0000 (  0.0%)  RequiresOpaqueAccessorsRequest
   0.0000 (  0.0%)   0.0000 (  0.0%)   0.0000 (  0.0%)   0.0000 (  0.0%)  ResolvePatternRequest
   0.0000 (  0.0%)   0.0000 (  0.0%)   0.0000 (  0.0%)   0.0000 (  0.0%)  LocalTypeDeclsRequest
   0.0000 (  0.0%)   0.0000 (  0.0%)   0.0000 (  0.0%)   0.0000 (  0.0%)  HasCircularInheritedProtocolsRequest
   0.0000 (  0.0%)   0.0000 (  0.0%)   0.0000 (  0.0%)   0.0000 (  0.0%)  ExtendedTypeRequest
   0.0000 (  0.0%)   0.0000 (  0.0%)   0.0000 (  0.0%)   0.0000 (  0.0%)  SuperclassDeclRequest
   0.0000 (  0.0%)   0.0000 (  0.0%)   0.0000 (  0.0%)   0.0000 (  0.0%)  TypeCheckFunctionBodyRequest
   0.0000 (  0.0%)   0.0000 (  0.0%)   0.0000 (  0.0%)   0.0000 (  0.0%)  ConformanceAccessScopeRequest
   0.0000 (  0.0%)   0.0000 (  0.0%)   0.0000 (  0.0%)   0.0000 (  0.0%)  AllInheritedProtocolsRequest
   0.0000 (  0.0%)   0.0000 (  0.0%)   0.0000 (  0.0%)   0.0000 (  0.0%)  PropertyWrapperAuxiliaryVariablesRequest
   0.0000 (  0.0%)   0.0000 (  0.0%)   0.0000 (  0.0%)   0.0000 (  0.0%)  HasStorageRequest
   0.0000 (  0.0%)   0.0000 (  0.0%)   0.0000 (  0.0%)   0.0000 (  0.0%)  ClassAncestryFlagsRequest
   0.0000 (  0.0%)   0.0000 (  0.0%)   0.0000 (  0.0%)   0.0000 (  0.0%)  SimpleDidSetRequest
   0.0000 (  0.0%)   0.0000 (  0.0%)   0.0000 (  0.0%)   0.0000 (  0.0%)  RequiresOpaqueModifyCoroutineRequest
   0.0000 (  0.0%)   0.0000 (  0.0%)   0.0000 (  0.0%)   0.0000 (  0.0%)  CxxRecordSemantics
   0.0000 (  0.0%)   0.0000 (  0.0%)   0.0000 (  0.0%)   0.0000 (  0.0%)  SelfAccessKindRequest
   0.0000 (  0.0%)   0.0000 (  0.0%)   0.0000 (  0.0%)   0.0000 (  0.0%)  ParseAbstractFunctionBodyRequest
   0.0000 (  0.0%)   0.0000 (  0.0%)   0.0000 (  0.0%)   0.0000 (  0.0%)  CheckInconsistentImplementationOnlyImportsRequest
   0.0000 (  0.0%)   0.0000 (  0.0%)   0.0000 (  0.0%)   0.0000 (  0.0%)  PropertyWrapperInitializerInfoRequest
   0.0000 (  0.0%)   0.0000 (  0.0%)   0.0000 (  0.0%)   0.0000 (  0.0%)  ResolveTypeWitnessesRequest
   0.0000 (  0.0%)   0.0000 (  0.0%)   0.0000 (  0.0%)   0.0000 (  0.0%)  GetDestructorRequest
   0.0000 (  0.0%)   0.0000 (  0.0%)   0.0000 (  0.0%)   0.0000 (  0.0%)  DirectOperatorLookupRequest
   0.0000 (  0.0%)   0.0000 (  0.0%)   0.0000 (  0.0%)   0.0000 (  0.0%)  ExpandSynthesizedMemberMacroRequest
   0.0000 (  0.0%)   0.0000 (  0.0%)   0.0000 (  0.0%)   0.0000 (  0.0%)  CheckInconsistentWeakLinkedImportsRequest
   0.0000 (  0.0%)   0.0000 (  0.0%)   0.0000 (  0.0%)   0.0000 (  0.0%)  ProtocolRequiresClassRequest
   0.0000 (  0.0%)   0.0000 (  0.0%)   0.0000 (  0.0%)   0.0000 (  0.0%)  PolymorphicEffectKindRequest
   0.0000 (  0.0%)   0.0000 (  0.0%)   0.0000 (  0.0%)   0.0000 (  0.0%)  CheckInconsistentSPIOnlyImportsRequest
   0.0000 (  0.0%)   0.0000 (  0.0%)   0.0000 (  0.0%)   0.0000 (  0.0%)  source-file-populate-cache
   0.0000 (  0.0%)   0.0000 (  0.0%)   0.0000 (  0.0%)   0.0000 (  0.0%)  CheckInconsistentAccessLevelOnImportSameFileRequest
   0.0000 (  0.0%)   0.0000 (  0.0%)   0.0000 (  0.0%)   0.0000 (  0.0%)  AreAllStoredPropertiesDefaultInitableRequest
   0.0000 (  0.0%)   0.0000 (  0.0%)   0.0000 (  0.0%)   0.0000 (  0.0%)  module-populate-cache
   0.0000 (  0.0%)   0.0000 (  0.0%)   0.0000 (  0.0%)   0.0000 (  0.0%)  perform-whole-module-type-checking
   0.0000 (  0.0%)   0.0000 (  0.0%)   0.0000 (  0.0%)   0.0000 (  0.0%)  SynthesizeMainFunctionRequest
   0.0000 (  0.0%)   0.0000 (  0.0%)   0.0000 (  0.0%)   0.0000 (  0.0%)  InitKindRequest
   0.0000 (  0.0%)   0.0000 (  0.0%)   0.0000 (  0.0%)   0.0000 (  0.0%)  PreCheckReturnStmtRequest
   0.0000 (  0.0%)   0.0000 (  0.0%)   0.0000 (  0.0%)   0.0000 (  0.0%)  IsAccessorTransparentRequest
   0.0000 (  0.0%)   0.0000 (  0.0%)   0.0000 (  0.0%)   0.0000 (  0.0%)  SuppressesConformanceRequest
   0.0000 (  0.0%)   0.0000 (  0.0%)   0.0000 (  0.0%)   0.0000 (  0.0%)  PrimaryAssociatedTypesRequest
   0.0000 (  0.0%)   0.0000 (  0.0%)   0.0000 (  0.0%)   0.0000 (  0.0%)  ClosureEffectsRequest
   0.0000 (  0.0%)   0.0000 (  0.0%)   0.0000 (  0.0%)   0.0000 (  0.0%)  CheckInconsistentAccessLevelOnImport
   0.0000 (  0.0%)   0.0000 (  0.0%)   0.0000 (  0.0%)   0.0000 (  0.0%)  MemberwiseInitPropertiesRequest
   0.0000 (  0.0%)   0.0000 (  0.0%)   0.0000 (  0.0%)   0.0000 (  0.0%)  ModuleImplicitImportsRequest
   0.0000 (  0.0%)   0.0000 (  0.0%)   0.0000 (  0.0%)   0.0000 (  0.0%)  HasImportsMatchingFlagRequest
   0.0000 (  0.0%)   0.0000 (  0.0%)   0.0000 (  0.0%)   0.0000 (  0.0%)  ExistentialConformsToSelfRequest
   0.0000 (  0.0%)   0.0000 (  0.0%)   0.0000 (  0.0%)   0.0000 (  0.0%)  PreCheckClosureBodyRequest
   0.0000 (  0.0%)   0.0000 (  0.0%)   0.0000 (  0.0%)   0.0000 (  0.0%)  SetterAccessLevelRequest
   0.0000 (  0.0%)   0.0000 (  0.0%)   0.0000 (  0.0%)   0.0000 (  0.0%)  EnumRawValuesRequest
   0.0000 (  0.0%)   0.0000 (  0.0%)   0.0000 (  0.0%)   0.0000 (  0.0%)  AST verification
   0.0000 (  0.0%)   0.0000 (  0.0%)   0.0000 (  0.0%)   0.0000 (  0.0%)  PrimarySourceFilesRequest
   0.0000 (  0.0%)   0.0000 (  0.0%)   0.0000 (  0.0%)   0.0000 (  0.0%)  ClosureHasResultExprRequest
   0.0000 (  0.0%)   0.0000 (  0.0%)   0.0000 (  0.0%)   0.0000 (  0.0%)  SuperclassTypeRequest
   0.3165 (100.0%)   0.2299 (100.0%)   0.5464 (100.0%)   0.5545 (100.0%)  Total
===-------------------------------------------------------------------------===
                                Running Program
===-------------------------------------------------------------------------===
  Total Execution Time: 0.1211 seconds (0.1233 wall clock)
   ---User Time---   --System Time--   --User+System--   ---Wall Time---  --- Name ---
   0.0626 (100.0%)   0.0585 (100.0%)   0.1211 (100.0%)   0.1233 (100.0%)  Building Target
   0.0626 (100.0%)   0.0585 (100.0%)   0.1211 (100.0%)   0.1233 (100.0%)  Total
SwiftDriverJobDiscovery normal arm64 Compiling NVActivityIndicatorAnimationBallZigZagDeflect.swift, NVActivityIndicatorAnimationBlank.swift, NVActivityIndicatorAnimationCircleStrokeSpin.swift, NVActivityIndicatorAnimationCubeTransition.swift (in target 'NVActivityIndicatorView' from project 'NVActivityIndicatorView')
SwiftCompile normal arm64 Compiling\ NVActivityIndicatorPresenter.swift /Users/admin/builder/spi-builder-workspace/Sources/Extended/NVActivityIndicatorPresenter.swift (in target 'NVActivityIndicatorViewExtended' from project 'NVActivityIndicatorView')
    cd /Users/admin/builder/spi-builder-workspace
    builtin-swiftTaskExecution -- /Applications/Xcode-16.1.0.app/Contents/Developer/Toolchains/XcodeDefault.xctoolchain/usr/bin/swift-frontend -frontend -c -primary-file /Users/admin/builder/spi-builder-workspace/Sources/Extended/NVActivityIndicatorPresenter.swift /Users/admin/builder/spi-builder-workspace/Sources/Extended/NVActivityIndicatorViewable.swift -emit-dependencies-path /Users/admin/builder/spi-builder-workspace/.derivedData/Build/Intermediates.noindex/NVActivityIndicatorView.build/Debug-appletvos/NVActivityIndicatorViewExtended.build/Objects-normal/arm64/NVActivityIndicatorPresenter.d -emit-const-values-path /Users/admin/builder/spi-builder-workspace/.derivedData/Build/Intermediates.noindex/NVActivityIndicatorView.build/Debug-appletvos/NVActivityIndicatorViewExtended.build/Objects-normal/arm64/NVActivityIndicatorPresenter.swiftconstvalues -emit-reference-dependencies-path /Users/admin/builder/spi-builder-workspace/.derivedData/Build/Intermediates.noindex/NVActivityIndicatorView.build/Debug-appletvos/NVActivityIndicatorViewExtended.build/Objects-normal/arm64/NVActivityIndicatorPresenter.swiftdeps -serialize-diagnostics-path /Users/admin/builder/spi-builder-workspace/.derivedData/Build/Intermediates.noindex/NVActivityIndicatorView.build/Debug-appletvos/NVActivityIndicatorViewExtended.build/Objects-normal/arm64/NVActivityIndicatorPresenter.dia -target arm64-apple-tvos12.0 -Xllvm -aarch64-use-tbi -enable-objc-interop -sdk /Applications/Xcode-16.1.0.app/Contents/Developer/Platforms/AppleTVOS.platform/Developer/SDKs/AppleTVOS18.1.sdk -I /Users/admin/builder/spi-builder-workspace/.derivedData/Build/Products/Debug-appletvos -F /Users/admin/builder/spi-builder-workspace/.derivedData/Build/Products/Debug-appletvos -F /Applications/Xcode-16.1.0.app/Contents/Developer/Platforms/AppleTVOS.platform/Developer/Library/Frameworks -no-color-diagnostics -enable-testing -g -debug-info-format\=dwarf -dwarf-version\=4 -module-cache-path /Users/admin/builder/spi-builder-workspace/.derivedData/ModuleCache.noindex -swift-version 5 -enforce-exclusivity\=checked -stats-output-dir /Users/admin/builder/spi-builder-workspace/.stats -Onone -D SWIFT_PACKAGE -D DEBUG -serialize-debugging-options -const-gather-protocols-file /Users/admin/builder/spi-builder-workspace/.derivedData/Build/Intermediates.noindex/NVActivityIndicatorView.build/Debug-appletvos/NVActivityIndicatorViewExtended.build/Objects-normal/arm64/NVActivityIndicatorViewExtended_const_extract_protocols.json -enable-experimental-feature DebugDescriptionMacro -enable-experimental-feature OpaqueTypeErasure -enable-upcoming-feature StrictConcurrency -enable-upcoming-feature DisableOutwardActorInference -enable-upcoming-feature GlobalActorIsolatedTypesUsability -enable-upcoming-feature InferSendableFromCaptures -enable-bare-slash-regex -strict-concurrency\=complete -empty-abi-descriptor -validate-clang-modules-once -clang-build-session-file /Users/admin/builder/spi-builder-workspace/.derivedData/ModuleCache.noindex/Session.modulevalidation -Xcc -working-directory -Xcc /Users/admin/builder/spi-builder-workspace -resource-dir /Applications/Xcode-16.1.0.app/Contents/Developer/Toolchains/XcodeDefault.xctoolchain/usr/lib/swift -enable-anonymous-context-mangled-names -file-compilation-dir /Users/admin/builder/spi-builder-workspace -Xcc -D_LIBCPP_HARDENING_MODE\=_LIBCPP_HARDENING_MODE_DEBUG -Xcc -ivfsstatcache -Xcc /Users/admin/builder/spi-builder-workspace/.derivedData/SDKStatCaches.noindex/appletvos18.1-22J572-e7fdd8cf9ffd4d4af20823079b51a726.sdkstatcache -Xcc -I/Users/admin/builder/spi-builder-workspace/.derivedData/Build/Intermediates.noindex/NVActivityIndicatorView.build/Debug-appletvos/NVActivityIndicatorViewExtended.build/swift-overrides.hmap -Xcc -I/Users/admin/builder/spi-builder-workspace/.derivedData/Build/Products/Debug-appletvos/include -Xcc -I/Users/admin/builder/spi-builder-workspace/.derivedData/Build/Intermediates.noindex/NVActivityIndicatorView.build/Debug-appletvos/NVActivityIndicatorViewExtended.build/DerivedSources-normal/arm64 -Xcc -I/Users/admin/builder/spi-builder-workspace/.derivedData/Build/Intermediates.noindex/NVActivityIndicatorView.build/Debug-appletvos/NVActivityIndicatorViewExtended.build/DerivedSources/arm64 -Xcc -I/Users/admin/builder/spi-builder-workspace/.derivedData/Build/Intermediates.noindex/NVActivityIndicatorView.build/Debug-appletvos/NVActivityIndicatorViewExtended.build/DerivedSources -Xcc -DSWIFT_PACKAGE\=1 -Xcc -DDEBUG\=1 -module-name NVActivityIndicatorViewExtended -frontend-parseable-output -disable-clang-spi -target-sdk-version 18.1 -target-sdk-name appletvos18.1 -external-plugin-path /Applications/Xcode-16.1.0.app/Contents/Developer/Platforms/AppleTVOS.platform/Developer/usr/lib/swift/host/plugins\#/Applications/Xcode-16.1.0.app/Contents/Developer/Platforms/AppleTVOS.platform/Developer/usr/bin/swift-plugin-server -external-plugin-path /Applications/Xcode-16.1.0.app/Contents/Developer/Platforms/AppleTVOS.platform/Developer/usr/local/lib/swift/host/plugins\#/Applications/Xcode-16.1.0.app/Contents/Developer/Platforms/AppleTVOS.platform/Developer/usr/bin/swift-plugin-server -plugin-path /Applications/Xcode-16.1.0.app/Contents/Developer/Toolchains/XcodeDefault.xctoolchain/usr/lib/swift/host/plugins -plugin-path /Applications/Xcode-16.1.0.app/Contents/Developer/Toolchains/XcodeDefault.xctoolchain/usr/local/lib/swift/host/plugins -o /Users/admin/builder/spi-builder-workspace/.derivedData/Build/Intermediates.noindex/NVActivityIndicatorView.build/Debug-appletvos/NVActivityIndicatorViewExtended.build/Objects-normal/arm64/NVActivityIndicatorPresenter.o -index-unit-output-path /NVActivityIndicatorView.build/Debug-appletvos/NVActivityIndicatorViewExtended.build/Objects-normal/arm64/NVActivityIndicatorPresenter.o -index-store-path /Users/admin/builder/spi-builder-workspace/.derivedData/Index.noindex/DataStore -index-system-modules
SwiftCompile normal arm64 /Users/admin/builder/spi-builder-workspace/Sources/Extended/NVActivityIndicatorPresenter.swift (in target 'NVActivityIndicatorViewExtended' from project 'NVActivityIndicatorView')
    cd /Users/admin/builder/spi-builder-workspace
    /Applications/Xcode-16.1.0.app/Contents/Developer/Toolchains/XcodeDefault.xctoolchain/usr/bin/swift-frontend -c -primary-file /Users/admin/builder/spi-builder-workspace/Sources/Extended/NVActivityIndicatorPresenter.swift /Users/admin/builder/spi-builder-workspace/Sources/Extended/NVActivityIndicatorViewable.swift -emit-dependencies-path /Users/admin/builder/spi-builder-workspace/.derivedData/Build/Intermediates.noindex/NVActivityIndicatorView.build/Debug-appletvos/NVActivityIndicatorViewExtended.build/Objects-normal/arm64/NVActivityIndicatorPresenter.d -emit-const-values-path /Users/admin/builder/spi-builder-workspace/.derivedData/Build/Intermediates.noindex/NVActivityIndicatorView.build/Debug-appletvos/NVActivityIndicatorViewExtended.build/Objects-normal/arm64/NVActivityIndicatorPresenter.swiftconstvalues -emit-reference-dependencies-path /Users/admin/builder/spi-builder-workspace/.derivedData/Build/Intermediates.noindex/NVActivityIndicatorView.build/Debug-appletvos/NVActivityIndicatorViewExtended.build/Objects-normal/arm64/NVActivityIndicatorPresenter.swiftdeps -serialize-diagnostics-path /Users/admin/builder/spi-builder-workspace/.derivedData/Build/Intermediates.noindex/NVActivityIndicatorView.build/Debug-appletvos/NVActivityIndicatorViewExtended.build/Objects-normal/arm64/NVActivityIndicatorPresenter.dia -target arm64-apple-tvos12.0 -Xllvm -aarch64-use-tbi -enable-objc-interop -sdk /Applications/Xcode-16.1.0.app/Contents/Developer/Platforms/AppleTVOS.platform/Developer/SDKs/AppleTVOS18.1.sdk -I /Users/admin/builder/spi-builder-workspace/.derivedData/Build/Products/Debug-appletvos -F /Users/admin/builder/spi-builder-workspace/.derivedData/Build/Products/Debug-appletvos -F /Applications/Xcode-16.1.0.app/Contents/Developer/Platforms/AppleTVOS.platform/Developer/Library/Frameworks -no-color-diagnostics -enable-testing -g -debug-info-format\=dwarf -dwarf-version\=4 -module-cache-path /Users/admin/builder/spi-builder-workspace/.derivedData/ModuleCache.noindex -swift-version 5 -enforce-exclusivity\=checked -stats-output-dir /Users/admin/builder/spi-builder-workspace/.stats -Onone -D SWIFT_PACKAGE -D DEBUG -serialize-debugging-options -const-gather-protocols-file /Users/admin/builder/spi-builder-workspace/.derivedData/Build/Intermediates.noindex/NVActivityIndicatorView.build/Debug-appletvos/NVActivityIndicatorViewExtended.build/Objects-normal/arm64/NVActivityIndicatorViewExtended_const_extract_protocols.json -enable-experimental-feature DebugDescriptionMacro -enable-experimental-feature OpaqueTypeErasure -enable-upcoming-feature StrictConcurrency -enable-upcoming-feature DisableOutwardActorInference -enable-upcoming-feature GlobalActorIsolatedTypesUsability -enable-upcoming-feature InferSendableFromCaptures -enable-bare-slash-regex -strict-concurrency\=complete -empty-abi-descriptor -validate-clang-modules-once -clang-build-session-file /Users/admin/builder/spi-builder-workspace/.derivedData/ModuleCache.noindex/Session.modulevalidation -Xcc -working-directory -Xcc /Users/admin/builder/spi-builder-workspace -resource-dir /Applications/Xcode-16.1.0.app/Contents/Developer/Toolchains/XcodeDefault.xctoolchain/usr/lib/swift -enable-anonymous-context-mangled-names -file-compilation-dir /Users/admin/builder/spi-builder-workspace -Xcc -D_LIBCPP_HARDENING_MODE\=_LIBCPP_HARDENING_MODE_DEBUG -Xcc -ivfsstatcache -Xcc /Users/admin/builder/spi-builder-workspace/.derivedData/SDKStatCaches.noindex/appletvos18.1-22J572-e7fdd8cf9ffd4d4af20823079b51a726.sdkstatcache -Xcc -I/Users/admin/builder/spi-builder-workspace/.derivedData/Build/Intermediates.noindex/NVActivityIndicatorView.build/Debug-appletvos/NVActivityIndicatorViewExtended.build/swift-overrides.hmap -Xcc -I/Users/admin/builder/spi-builder-workspace/.derivedData/Build/Products/Debug-appletvos/include -Xcc -I/Users/admin/builder/spi-builder-workspace/.derivedData/Build/Intermediates.noindex/NVActivityIndicatorView.build/Debug-appletvos/NVActivityIndicatorViewExtended.build/DerivedSources-normal/arm64 -Xcc -I/Users/admin/builder/spi-builder-workspace/.derivedData/Build/Intermediates.noindex/NVActivityIndicatorView.build/Debug-appletvos/NVActivityIndicatorViewExtended.build/DerivedSources/arm64 -Xcc -I/Users/admin/builder/spi-builder-workspace/.derivedData/Build/Intermediates.noindex/NVActivityIndicatorView.build/Debug-appletvos/NVActivityIndicatorViewExtended.build/DerivedSources -Xcc -DSWIFT_PACKAGE\=1 -Xcc -DDEBUG\=1 -module-name NVActivityIndicatorViewExtended -frontend-parseable-output -disable-clang-spi -target-sdk-version 18.1 -target-sdk-name appletvos18.1 -external-plugin-path /Applications/Xcode-16.1.0.app/Contents/Developer/Platforms/AppleTVOS.platform/Developer/usr/lib/swift/host/plugins\#/Applications/Xcode-16.1.0.app/Contents/Developer/Platforms/AppleTVOS.platform/Developer/usr/bin/swift-plugin-server -external-plugin-path /Applications/Xcode-16.1.0.app/Contents/Developer/Platforms/AppleTVOS.platform/Developer/usr/local/lib/swift/host/plugins\#/Applications/Xcode-16.1.0.app/Contents/Developer/Platforms/AppleTVOS.platform/Developer/usr/bin/swift-plugin-server -plugin-path /Applications/Xcode-16.1.0.app/Contents/Developer/Toolchains/XcodeDefault.xctoolchain/usr/lib/swift/host/plugins -plugin-path /Applications/Xcode-16.1.0.app/Contents/Developer/Toolchains/XcodeDefault.xctoolchain/usr/local/lib/swift/host/plugins -o /Users/admin/builder/spi-builder-workspace/.derivedData/Build/Intermediates.noindex/NVActivityIndicatorView.build/Debug-appletvos/NVActivityIndicatorViewExtended.build/Objects-normal/arm64/NVActivityIndicatorPresenter.o -index-unit-output-path /NVActivityIndicatorView.build/Debug-appletvos/NVActivityIndicatorViewExtended.build/Objects-normal/arm64/NVActivityIndicatorPresenter.o -index-store-path /Users/admin/builder/spi-builder-workspace/.derivedData/Index.noindex/DataStore -index-system-modules
SwiftDriverJobDiscovery normal arm64 Compiling NVActivityIndicatorAnimationBallPulse.swift, NVActivityIndicatorAnimationBallPulseRise.swift, NVActivityIndicatorAnimationBallPulseSync.swift, NVActivityIndicatorAnimationBallRotate.swift (in target 'NVActivityIndicatorView' from project 'NVActivityIndicatorView')
SwiftCompile normal arm64 Compiling\ NVActivityIndicatorViewable.swift /Users/admin/builder/spi-builder-workspace/Sources/Extended/NVActivityIndicatorViewable.swift (in target 'NVActivityIndicatorViewExtended' from project 'NVActivityIndicatorView')
    cd /Users/admin/builder/spi-builder-workspace
    builtin-swiftTaskExecution -- /Applications/Xcode-16.1.0.app/Contents/Developer/Toolchains/XcodeDefault.xctoolchain/usr/bin/swift-frontend -frontend -c /Users/admin/builder/spi-builder-workspace/Sources/Extended/NVActivityIndicatorPresenter.swift -primary-file /Users/admin/builder/spi-builder-workspace/Sources/Extended/NVActivityIndicatorViewable.swift -emit-dependencies-path /Users/admin/builder/spi-builder-workspace/.derivedData/Build/Intermediates.noindex/NVActivityIndicatorView.build/Debug-appletvos/NVActivityIndicatorViewExtended.build/Objects-normal/arm64/NVActivityIndicatorViewable.d -emit-const-values-path /Users/admin/builder/spi-builder-workspace/.derivedData/Build/Intermediates.noindex/NVActivityIndicatorView.build/Debug-appletvos/NVActivityIndicatorViewExtended.build/Objects-normal/arm64/NVActivityIndicatorViewable.swiftconstvalues -emit-reference-dependencies-path /Users/admin/builder/spi-builder-workspace/.derivedData/Build/Intermediates.noindex/NVActivityIndicatorView.build/Debug-appletvos/NVActivityIndicatorViewExtended.build/Objects-normal/arm64/NVActivityIndicatorViewable.swiftdeps -serialize-diagnostics-path /Users/admin/builder/spi-builder-workspace/.derivedData/Build/Intermediates.noindex/NVActivityIndicatorView.build/Debug-appletvos/NVActivityIndicatorViewExtended.build/Objects-normal/arm64/NVActivityIndicatorViewable.dia -target arm64-apple-tvos12.0 -Xllvm -aarch64-use-tbi -enable-objc-interop -sdk /Applications/Xcode-16.1.0.app/Contents/Developer/Platforms/AppleTVOS.platform/Developer/SDKs/AppleTVOS18.1.sdk -I /Users/admin/builder/spi-builder-workspace/.derivedData/Build/Products/Debug-appletvos -F /Users/admin/builder/spi-builder-workspace/.derivedData/Build/Products/Debug-appletvos -F /Applications/Xcode-16.1.0.app/Contents/Developer/Platforms/AppleTVOS.platform/Developer/Library/Frameworks -no-color-diagnostics -enable-testing -g -debug-info-format\=dwarf -dwarf-version\=4 -module-cache-path /Users/admin/builder/spi-builder-workspace/.derivedData/ModuleCache.noindex -swift-version 5 -enforce-exclusivity\=checked -stats-output-dir /Users/admin/builder/spi-builder-workspace/.stats -Onone -D SWIFT_PACKAGE -D DEBUG -serialize-debugging-options -const-gather-protocols-file /Users/admin/builder/spi-builder-workspace/.derivedData/Build/Intermediates.noindex/NVActivityIndicatorView.build/Debug-appletvos/NVActivityIndicatorViewExtended.build/Objects-normal/arm64/NVActivityIndicatorViewExtended_const_extract_protocols.json -enable-experimental-feature DebugDescriptionMacro -enable-experimental-feature OpaqueTypeErasure -enable-upcoming-feature StrictConcurrency -enable-upcoming-feature DisableOutwardActorInference -enable-upcoming-feature GlobalActorIsolatedTypesUsability -enable-upcoming-feature InferSendableFromCaptures -enable-bare-slash-regex -strict-concurrency\=complete -empty-abi-descriptor -validate-clang-modules-once -clang-build-session-file /Users/admin/builder/spi-builder-workspace/.derivedData/ModuleCache.noindex/Session.modulevalidation -Xcc -working-directory -Xcc /Users/admin/builder/spi-builder-workspace -resource-dir /Applications/Xcode-16.1.0.app/Contents/Developer/Toolchains/XcodeDefault.xctoolchain/usr/lib/swift -enable-anonymous-context-mangled-names -file-compilation-dir /Users/admin/builder/spi-builder-workspace -Xcc -D_LIBCPP_HARDENING_MODE\=_LIBCPP_HARDENING_MODE_DEBUG -Xcc -ivfsstatcache -Xcc /Users/admin/builder/spi-builder-workspace/.derivedData/SDKStatCaches.noindex/appletvos18.1-22J572-e7fdd8cf9ffd4d4af20823079b51a726.sdkstatcache -Xcc -I/Users/admin/builder/spi-builder-workspace/.derivedData/Build/Intermediates.noindex/NVActivityIndicatorView.build/Debug-appletvos/NVActivityIndicatorViewExtended.build/swift-overrides.hmap -Xcc -I/Users/admin/builder/spi-builder-workspace/.derivedData/Build/Products/Debug-appletvos/include -Xcc -I/Users/admin/builder/spi-builder-workspace/.derivedData/Build/Intermediates.noindex/NVActivityIndicatorView.build/Debug-appletvos/NVActivityIndicatorViewExtended.build/DerivedSources-normal/arm64 -Xcc -I/Users/admin/builder/spi-builder-workspace/.derivedData/Build/Intermediates.noindex/NVActivityIndicatorView.build/Debug-appletvos/NVActivityIndicatorViewExtended.build/DerivedSources/arm64 -Xcc -I/Users/admin/builder/spi-builder-workspace/.derivedData/Build/Intermediates.noindex/NVActivityIndicatorView.build/Debug-appletvos/NVActivityIndicatorViewExtended.build/DerivedSources -Xcc -DSWIFT_PACKAGE\=1 -Xcc -DDEBUG\=1 -module-name NVActivityIndicatorViewExtended -frontend-parseable-output -disable-clang-spi -target-sdk-version 18.1 -target-sdk-name appletvos18.1 -external-plugin-path /Applications/Xcode-16.1.0.app/Contents/Developer/Platforms/AppleTVOS.platform/Developer/usr/lib/swift/host/plugins\#/Applications/Xcode-16.1.0.app/Contents/Developer/Platforms/AppleTVOS.platform/Developer/usr/bin/swift-plugin-server -external-plugin-path /Applications/Xcode-16.1.0.app/Contents/Developer/Platforms/AppleTVOS.platform/Developer/usr/local/lib/swift/host/plugins\#/Applications/Xcode-16.1.0.app/Contents/Developer/Platforms/AppleTVOS.platform/Developer/usr/bin/swift-plugin-server -plugin-path /Applications/Xcode-16.1.0.app/Contents/Developer/Toolchains/XcodeDefault.xctoolchain/usr/lib/swift/host/plugins -plugin-path /Applications/Xcode-16.1.0.app/Contents/Developer/Toolchains/XcodeDefault.xctoolchain/usr/local/lib/swift/host/plugins -o /Users/admin/builder/spi-builder-workspace/.derivedData/Build/Intermediates.noindex/NVActivityIndicatorView.build/Debug-appletvos/NVActivityIndicatorViewExtended.build/Objects-normal/arm64/NVActivityIndicatorViewable.o -index-unit-output-path /NVActivityIndicatorView.build/Debug-appletvos/NVActivityIndicatorViewExtended.build/Objects-normal/arm64/NVActivityIndicatorViewable.o -index-store-path /Users/admin/builder/spi-builder-workspace/.derivedData/Index.noindex/DataStore -index-system-modules
SwiftCompile normal arm64 /Users/admin/builder/spi-builder-workspace/Sources/Extended/NVActivityIndicatorViewable.swift (in target 'NVActivityIndicatorViewExtended' from project 'NVActivityIndicatorView')
    cd /Users/admin/builder/spi-builder-workspace
    /Applications/Xcode-16.1.0.app/Contents/Developer/Toolchains/XcodeDefault.xctoolchain/usr/bin/swift-frontend -c /Users/admin/builder/spi-builder-workspace/Sources/Extended/NVActivityIndicatorPresenter.swift -primary-file /Users/admin/builder/spi-builder-workspace/Sources/Extended/NVActivityIndicatorViewable.swift -emit-dependencies-path /Users/admin/builder/spi-builder-workspace/.derivedData/Build/Intermediates.noindex/NVActivityIndicatorView.build/Debug-appletvos/NVActivityIndicatorViewExtended.build/Objects-normal/arm64/NVActivityIndicatorViewable.d -emit-const-values-path /Users/admin/builder/spi-builder-workspace/.derivedData/Build/Intermediates.noindex/NVActivityIndicatorView.build/Debug-appletvos/NVActivityIndicatorViewExtended.build/Objects-normal/arm64/NVActivityIndicatorViewable.swiftconstvalues -emit-reference-dependencies-path /Users/admin/builder/spi-builder-workspace/.derivedData/Build/Intermediates.noindex/NVActivityIndicatorView.build/Debug-appletvos/NVActivityIndicatorViewExtended.build/Objects-normal/arm64/NVActivityIndicatorViewable.swiftdeps -serialize-diagnostics-path /Users/admin/builder/spi-builder-workspace/.derivedData/Build/Intermediates.noindex/NVActivityIndicatorView.build/Debug-appletvos/NVActivityIndicatorViewExtended.build/Objects-normal/arm64/NVActivityIndicatorViewable.dia -target arm64-apple-tvos12.0 -Xllvm -aarch64-use-tbi -enable-objc-interop -sdk /Applications/Xcode-16.1.0.app/Contents/Developer/Platforms/AppleTVOS.platform/Developer/SDKs/AppleTVOS18.1.sdk -I /Users/admin/builder/spi-builder-workspace/.derivedData/Build/Products/Debug-appletvos -F /Users/admin/builder/spi-builder-workspace/.derivedData/Build/Products/Debug-appletvos -F /Applications/Xcode-16.1.0.app/Contents/Developer/Platforms/AppleTVOS.platform/Developer/Library/Frameworks -no-color-diagnostics -enable-testing -g -debug-info-format\=dwarf -dwarf-version\=4 -module-cache-path /Users/admin/builder/spi-builder-workspace/.derivedData/ModuleCache.noindex -swift-version 5 -enforce-exclusivity\=checked -stats-output-dir /Users/admin/builder/spi-builder-workspace/.stats -Onone -D SWIFT_PACKAGE -D DEBUG -serialize-debugging-options -const-gather-protocols-file /Users/admin/builder/spi-builder-workspace/.derivedData/Build/Intermediates.noindex/NVActivityIndicatorView.build/Debug-appletvos/NVActivityIndicatorViewExtended.build/Objects-normal/arm64/NVActivityIndicatorViewExtended_const_extract_protocols.json -enable-experimental-feature DebugDescriptionMacro -enable-experimental-feature OpaqueTypeErasure -enable-upcoming-feature StrictConcurrency -enable-upcoming-feature DisableOutwardActorInference -enable-upcoming-feature GlobalActorIsolatedTypesUsability -enable-upcoming-feature InferSendableFromCaptures -enable-bare-slash-regex -strict-concurrency\=complete -empty-abi-descriptor -validate-clang-modules-once -clang-build-session-file /Users/admin/builder/spi-builder-workspace/.derivedData/ModuleCache.noindex/Session.modulevalidation -Xcc -working-directory -Xcc /Users/admin/builder/spi-builder-workspace -resource-dir /Applications/Xcode-16.1.0.app/Contents/Developer/Toolchains/XcodeDefault.xctoolchain/usr/lib/swift -enable-anonymous-context-mangled-names -file-compilation-dir /Users/admin/builder/spi-builder-workspace -Xcc -D_LIBCPP_HARDENING_MODE\=_LIBCPP_HARDENING_MODE_DEBUG -Xcc -ivfsstatcache -Xcc /Users/admin/builder/spi-builder-workspace/.derivedData/SDKStatCaches.noindex/appletvos18.1-22J572-e7fdd8cf9ffd4d4af20823079b51a726.sdkstatcache -Xcc -I/Users/admin/builder/spi-builder-workspace/.derivedData/Build/Intermediates.noindex/NVActivityIndicatorView.build/Debug-appletvos/NVActivityIndicatorViewExtended.build/swift-overrides.hmap -Xcc -I/Users/admin/builder/spi-builder-workspace/.derivedData/Build/Products/Debug-appletvos/include -Xcc -I/Users/admin/builder/spi-builder-workspace/.derivedData/Build/Intermediates.noindex/NVActivityIndicatorView.build/Debug-appletvos/NVActivityIndicatorViewExtended.build/DerivedSources-normal/arm64 -Xcc -I/Users/admin/builder/spi-builder-workspace/.derivedData/Build/Intermediates.noindex/NVActivityIndicatorView.build/Debug-appletvos/NVActivityIndicatorViewExtended.build/DerivedSources/arm64 -Xcc -I/Users/admin/builder/spi-builder-workspace/.derivedData/Build/Intermediates.noindex/NVActivityIndicatorView.build/Debug-appletvos/NVActivityIndicatorViewExtended.build/DerivedSources -Xcc -DSWIFT_PACKAGE\=1 -Xcc -DDEBUG\=1 -module-name NVActivityIndicatorViewExtended -frontend-parseable-output -disable-clang-spi -target-sdk-version 18.1 -target-sdk-name appletvos18.1 -external-plugin-path /Applications/Xcode-16.1.0.app/Contents/Developer/Platforms/AppleTVOS.platform/Developer/usr/lib/swift/host/plugins\#/Applications/Xcode-16.1.0.app/Contents/Developer/Platforms/AppleTVOS.platform/Developer/usr/bin/swift-plugin-server -external-plugin-path /Applications/Xcode-16.1.0.app/Contents/Developer/Platforms/AppleTVOS.platform/Developer/usr/local/lib/swift/host/plugins\#/Applications/Xcode-16.1.0.app/Contents/Developer/Platforms/AppleTVOS.platform/Developer/usr/bin/swift-plugin-server -plugin-path /Applications/Xcode-16.1.0.app/Contents/Developer/Toolchains/XcodeDefault.xctoolchain/usr/lib/swift/host/plugins -plugin-path /Applications/Xcode-16.1.0.app/Contents/Developer/Toolchains/XcodeDefault.xctoolchain/usr/local/lib/swift/host/plugins -o /Users/admin/builder/spi-builder-workspace/.derivedData/Build/Intermediates.noindex/NVActivityIndicatorView.build/Debug-appletvos/NVActivityIndicatorViewExtended.build/Objects-normal/arm64/NVActivityIndicatorViewable.o -index-unit-output-path /NVActivityIndicatorView.build/Debug-appletvos/NVActivityIndicatorViewExtended.build/Objects-normal/arm64/NVActivityIndicatorViewable.o -index-store-path /Users/admin/builder/spi-builder-workspace/.derivedData/Index.noindex/DataStore -index-system-modules
SwiftDriverJobDiscovery normal arm64 Compiling NVActivityIndicatorAnimationLineSpinFadeLoader.swift, NVActivityIndicatorAnimationOrbit.swift, NVActivityIndicatorAnimationPacman.swift (in target 'NVActivityIndicatorView' from project 'NVActivityIndicatorView')
SwiftDriverJobDiscovery normal arm64 Compiling NVActivityIndicatorAnimationBallRotateChase.swift, NVActivityIndicatorAnimationBallScale.swift, NVActivityIndicatorAnimationBallScaleMultiple.swift, NVActivityIndicatorAnimationBallScaleRipple.swift (in target 'NVActivityIndicatorView' from project 'NVActivityIndicatorView')
SwiftDriverJobDiscovery normal arm64 Compiling NVActivityIndicatorAnimationBallScaleRippleMultiple.swift, NVActivityIndicatorAnimationBallSpinFadeLoader.swift, NVActivityIndicatorAnimationBallTrianglePath.swift, NVActivityIndicatorAnimationBallZigZag.swift (in target 'NVActivityIndicatorView' from project 'NVActivityIndicatorView')
SwiftDriverJobDiscovery normal arm64 Compiling NVActivityIndicatorAnimationLineScale.swift, NVActivityIndicatorAnimationLineScaleParty.swift, NVActivityIndicatorAnimationLineScalePulseOut.swift, NVActivityIndicatorAnimationLineScalePulseOutRapid.swift (in target 'NVActivityIndicatorView' from project 'NVActivityIndicatorView')
SwiftDriverJobDiscovery normal arm64 Compiling NVActivityIndicatorAnimationAudioEqualizer.swift, NVActivityIndicatorAnimationBallBeat.swift, NVActivityIndicatorAnimationBallClipRotate.swift, NVActivityIndicatorAnimationBallClipRotateMultiple.swift (in target 'NVActivityIndicatorView' from project 'NVActivityIndicatorView')
SwiftDriverJobDiscovery normal arm64 Compiling NVActivityIndicatorAnimationBallClipRotatePulse.swift, NVActivityIndicatorAnimationBallDoubleBounce.swift, NVActivityIndicatorAnimationBallGridBeat.swift, NVActivityIndicatorAnimationBallGridPulse.swift (in target 'NVActivityIndicatorView' from project 'NVActivityIndicatorView')
SwiftDriverJobDiscovery normal arm64 Compiling NVActivityIndicatorAnimationDelegate.swift, NVActivityIndicatorShape.swift, NVActivityIndicatorView.swift (in target 'NVActivityIndicatorView' from project 'NVActivityIndicatorView')
SwiftDriver\ Compilation NVActivityIndicatorView normal arm64 com.apple.xcode.tools.swift.compiler (in target 'NVActivityIndicatorView' from project 'NVActivityIndicatorView')
    cd /Users/admin/builder/spi-builder-workspace
    builtin-Swift-Compilation -- /Applications/Xcode-16.1.0.app/Contents/Developer/Toolchains/XcodeDefault.xctoolchain/usr/bin/swiftc -module-name NVActivityIndicatorView -Onone -enforce-exclusivity\=checked @/Users/admin/builder/spi-builder-workspace/.derivedData/Build/Intermediates.noindex/NVActivityIndicatorView.build/Debug-appletvos/NVActivityIndicatorView.build/Objects-normal/arm64/NVActivityIndicatorView.SwiftFileList -DSWIFT_PACKAGE -DDEBUG -stats-output-dir .stats -strict-concurrency\=complete -enable-upcoming-feature StrictConcurrency -enable-upcoming-feature DisableOutwardActorInference -enable-upcoming-feature GlobalActorIsolatedTypesUsability -enable-upcoming-feature InferSendableFromCaptures -enable-bare-slash-regex -enable-experimental-feature DebugDescriptionMacro -sdk /Applications/Xcode-16.1.0.app/Contents/Developer/Platforms/AppleTVOS.platform/Developer/SDKs/AppleTVOS18.1.sdk -target arm64-apple-tvos12.0 -g -module-cache-path /Users/admin/builder/spi-builder-workspace/.derivedData/ModuleCache.noindex -Xfrontend -serialize-debugging-options -enable-testing -index-store-path /Users/admin/builder/spi-builder-workspace/.derivedData/Index.noindex/DataStore -enable-experimental-feature OpaqueTypeErasure -Xcc -D_LIBCPP_HARDENING_MODE\=_LIBCPP_HARDENING_MODE_DEBUG -swift-version 5 -I /Users/admin/builder/spi-builder-workspace/.derivedData/Build/Products/Debug-appletvos -F /Users/admin/builder/spi-builder-workspace/.derivedData/Build/Products/Debug-appletvos -F /Applications/Xcode-16.1.0.app/Contents/Developer/Platforms/AppleTVOS.platform/Developer/Library/Frameworks -c -j10 -enable-batch-mode -incremental -Xcc -ivfsstatcache -Xcc /Users/admin/builder/spi-builder-workspace/.derivedData/SDKStatCaches.noindex/appletvos18.1-22J572-e7fdd8cf9ffd4d4af20823079b51a726.sdkstatcache -output-file-map /Users/admin/builder/spi-builder-workspace/.derivedData/Build/Intermediates.noindex/NVActivityIndicatorView.build/Debug-appletvos/NVActivityIndicatorView.build/Objects-normal/arm64/NVActivityIndicatorView-OutputFileMap.json -use-frontend-parseable-output -save-temps -no-color-diagnostics -serialize-diagnostics -emit-dependencies -emit-module -emit-module-path /Users/admin/builder/spi-builder-workspace/.derivedData/Build/Intermediates.noindex/NVActivityIndicatorView.build/Debug-appletvos/NVActivityIndicatorView.build/Objects-normal/arm64/NVActivityIndicatorView.swiftmodule -validate-clang-modules-once -clang-build-session-file /Users/admin/builder/spi-builder-workspace/.derivedData/ModuleCache.noindex/Session.modulevalidation -Xcc -I/Users/admin/builder/spi-builder-workspace/.derivedData/Build/Intermediates.noindex/NVActivityIndicatorView.build/Debug-appletvos/NVActivityIndicatorView.build/swift-overrides.hmap -emit-const-values -Xfrontend -const-gather-protocols-file -Xfrontend /Users/admin/builder/spi-builder-workspace/.derivedData/Build/Intermediates.noindex/NVActivityIndicatorView.build/Debug-appletvos/NVActivityIndicatorView.build/Objects-normal/arm64/NVActivityIndicatorView_const_extract_protocols.json -Xcc -I/Users/admin/builder/spi-builder-workspace/.derivedData/Build/Products/Debug-appletvos/include -Xcc -I/Users/admin/builder/spi-builder-workspace/.derivedData/Build/Intermediates.noindex/NVActivityIndicatorView.build/Debug-appletvos/NVActivityIndicatorView.build/DerivedSources-normal/arm64 -Xcc -I/Users/admin/builder/spi-builder-workspace/.derivedData/Build/Intermediates.noindex/NVActivityIndicatorView.build/Debug-appletvos/NVActivityIndicatorView.build/DerivedSources/arm64 -Xcc -I/Users/admin/builder/spi-builder-workspace/.derivedData/Build/Intermediates.noindex/NVActivityIndicatorView.build/Debug-appletvos/NVActivityIndicatorView.build/DerivedSources -Xcc -DSWIFT_PACKAGE\=1 -Xcc -DDEBUG\=1 -emit-objc-header -emit-objc-header-path /Users/admin/builder/spi-builder-workspace/.derivedData/Build/Intermediates.noindex/NVActivityIndicatorView.build/Debug-appletvos/NVActivityIndicatorView.build/Objects-normal/arm64/NVActivityIndicatorView-Swift.h -working-directory /Users/admin/builder/spi-builder-workspace -experimental-emit-module-separately -disable-cmo
Ld /Users/admin/builder/spi-builder-workspace/.derivedData/Build/Products/Debug-appletvos/NVActivityIndicatorView.framework/NVActivityIndicatorView normal (in target 'NVActivityIndicatorView' from project 'NVActivityIndicatorView')
    cd /Users/admin/builder/spi-builder-workspace
    /Applications/Xcode-16.1.0.app/Contents/Developer/Toolchains/XcodeDefault.xctoolchain/usr/bin/clang -Xlinker -reproducible -target arm64-apple-tvos12.0 -dynamiclib -isysroot /Applications/Xcode-16.1.0.app/Contents/Developer/Platforms/AppleTVOS.platform/Developer/SDKs/AppleTVOS18.1.sdk -O0 -L/Users/admin/builder/spi-builder-workspace/.derivedData/Build/Intermediates.noindex/EagerLinkingTBDs/Debug-appletvos -L/Users/admin/builder/spi-builder-workspace/.derivedData/Build/Products/Debug-appletvos -F/Users/admin/builder/spi-builder-workspace/.derivedData/Build/Intermediates.noindex/EagerLinkingTBDs/Debug-appletvos -F/Users/admin/builder/spi-builder-workspace/.derivedData/Build/Products/Debug-appletvos -F/Applications/Xcode-16.1.0.app/Contents/Developer/Platforms/AppleTVOS.platform/Developer/Library/Frameworks -filelist /Users/admin/builder/spi-builder-workspace/.derivedData/Build/Intermediates.noindex/NVActivityIndicatorView.build/Debug-appletvos/NVActivityIndicatorView.build/Objects-normal/arm64/NVActivityIndicatorView.LinkFileList -install_name @rpath/NVActivityIndicatorView.framework/NVActivityIndicatorView -Xlinker -rpath -Xlinker /usr/lib/swift -Xlinker -rpath -Xlinker /Applications/Xcode-16.1.0.app/Contents/Developer/Toolchains/XcodeDefault.xctoolchain/usr/lib/swift/macosx -dead_strip -Xlinker -object_path_lto -Xlinker /Users/admin/builder/spi-builder-workspace/.derivedData/Build/Intermediates.noindex/NVActivityIndicatorView.build/Debug-appletvos/NVActivityIndicatorView.build/Objects-normal/arm64/NVActivityIndicatorView_lto.o -Xlinker -export_dynamic -Xlinker -no_deduplicate -fobjc-link-runtime -L/Applications/Xcode-16.1.0.app/Contents/Developer/Toolchains/XcodeDefault.xctoolchain/usr/lib/swift/appletvos -L/usr/lib/swift -Xlinker -add_ast_path -Xlinker /Users/admin/builder/spi-builder-workspace/.derivedData/Build/Intermediates.noindex/NVActivityIndicatorView.build/Debug-appletvos/NVActivityIndicatorView.build/Objects-normal/arm64/NVActivityIndicatorView.swiftmodule -Xlinker -dependency_info -Xlinker /Users/admin/builder/spi-builder-workspace/.derivedData/Build/Intermediates.noindex/NVActivityIndicatorView.build/Debug-appletvos/NVActivityIndicatorView.build/Objects-normal/arm64/NVActivityIndicatorView_dependency_info.dat -o /Users/admin/builder/spi-builder-workspace/.derivedData/Build/Products/Debug-appletvos/NVActivityIndicatorView.framework/NVActivityIndicatorView
** BUILD FAILED **
The following build commands failed:
	EmitSwiftModule normal arm64 (in target 'NVActivityIndicatorViewExtended' from project 'NVActivityIndicatorView')
	SwiftEmitModule normal arm64 Emitting\ module\ for\ NVActivityIndicatorViewExtended (in target 'NVActivityIndicatorViewExtended' from project 'NVActivityIndicatorView')
	Building project NVActivityIndicatorView with scheme NVActivityIndicatorView-Package
(3 failures)
Command line invocation:
    /Applications/Xcode-16.1.0.app/Contents/Developer/usr/bin/xcodebuild -IDEClonedSourcePackagesDirPathOverride=/Users/admin/builder/spi-builder-workspace/.dependencies -skipMacroValidation -skipPackagePluginValidation -derivedDataPath /Users/admin/builder/spi-builder-workspace/.derivedData build -scheme NVActivityIndicatorView-Package -destination generic/platform=tvOS "OTHER_SWIFT_FLAGS=-stats-output-dir .stats -strict-concurrency=complete -enable-upcoming-feature StrictConcurrency -enable-upcoming-feature DisableOutwardActorInference -enable-upcoming-feature GlobalActorIsolatedTypesUsability -enable-upcoming-feature InferSendableFromCaptures"
User defaults from command line:
    IDEClonedSourcePackagesDirPathOverride = /Users/admin/builder/spi-builder-workspace/.dependencies
    IDEDerivedDataPathOverride = /Users/admin/builder/spi-builder-workspace/.derivedData
    IDEPackageSupportUseBuiltinSCM = YES
Build settings from command line:
    OTHER_SWIFT_FLAGS = -stats-output-dir .stats -strict-concurrency=complete -enable-upcoming-feature StrictConcurrency -enable-upcoming-feature DisableOutwardActorInference -enable-upcoming-feature GlobalActorIsolatedTypesUsability -enable-upcoming-feature InferSendableFromCaptures
Prepare packages
ComputeTargetDependencyGraph
note: Building targets in dependency order
note: Target dependency graph (2 targets)
    Target 'NVActivityIndicatorViewExtended' in project 'NVActivityIndicatorView'
        ➜ Explicit dependency on target 'NVActivityIndicatorView' in project 'NVActivityIndicatorView'
    Target 'NVActivityIndicatorView' in project 'NVActivityIndicatorView' (no dependencies)
GatherProvisioningInputs
CreateBuildDescription
ClangStatCache /Applications/Xcode-16.1.0.app/Contents/Developer/Toolchains/XcodeDefault.xctoolchain/usr/bin/clang-stat-cache /Applications/Xcode-16.1.0.app/Contents/Developer/Platforms/AppleTVOS.platform/Developer/SDKs/AppleTVOS18.1.sdk /Users/admin/builder/spi-builder-workspace/.derivedData/SDKStatCaches.noindex/appletvos18.1-22J572-e7fdd8cf9ffd4d4af20823079b51a726.sdkstatcache
    cd /Users/admin/builder/spi-builder-workspace/NVActivityIndicatorView.xcodeproj
    /Applications/Xcode-16.1.0.app/Contents/Developer/Toolchains/XcodeDefault.xctoolchain/usr/bin/clang-stat-cache /Applications/Xcode-16.1.0.app/Contents/Developer/Platforms/AppleTVOS.platform/Developer/SDKs/AppleTVOS18.1.sdk -o /Users/admin/builder/spi-builder-workspace/.derivedData/SDKStatCaches.noindex/appletvos18.1-22J572-e7fdd8cf9ffd4d4af20823079b51a726.sdkstatcache
Ld /Users/admin/builder/spi-builder-workspace/.derivedData/Build/Products/Debug-appletvos/NVActivityIndicatorView.framework/NVActivityIndicatorView normal (in target 'NVActivityIndicatorView' from project 'NVActivityIndicatorView')
    cd /Users/admin/builder/spi-builder-workspace
    /Applications/Xcode-16.1.0.app/Contents/Developer/Toolchains/XcodeDefault.xctoolchain/usr/bin/clang -Xlinker -reproducible -target arm64-apple-tvos12.0 -dynamiclib -isysroot /Applications/Xcode-16.1.0.app/Contents/Developer/Platforms/AppleTVOS.platform/Developer/SDKs/AppleTVOS18.1.sdk -O0 -L/Users/admin/builder/spi-builder-workspace/.derivedData/Build/Intermediates.noindex/EagerLinkingTBDs/Debug-appletvos -L/Users/admin/builder/spi-builder-workspace/.derivedData/Build/Products/Debug-appletvos -F/Users/admin/builder/spi-builder-workspace/.derivedData/Build/Intermediates.noindex/EagerLinkingTBDs/Debug-appletvos -F/Users/admin/builder/spi-builder-workspace/.derivedData/Build/Products/Debug-appletvos -F/Applications/Xcode-16.1.0.app/Contents/Developer/Platforms/AppleTVOS.platform/Developer/Library/Frameworks -filelist /Users/admin/builder/spi-builder-workspace/.derivedData/Build/Intermediates.noindex/NVActivityIndicatorView.build/Debug-appletvos/NVActivityIndicatorView.build/Objects-normal/arm64/NVActivityIndicatorView.LinkFileList -install_name @rpath/NVActivityIndicatorView.framework/NVActivityIndicatorView -Xlinker -rpath -Xlinker /usr/lib/swift -Xlinker -rpath -Xlinker /Applications/Xcode-16.1.0.app/Contents/Developer/Toolchains/XcodeDefault.xctoolchain/usr/lib/swift/macosx -dead_strip -Xlinker -object_path_lto -Xlinker /Users/admin/builder/spi-builder-workspace/.derivedData/Build/Intermediates.noindex/NVActivityIndicatorView.build/Debug-appletvos/NVActivityIndicatorView.build/Objects-normal/arm64/NVActivityIndicatorView_lto.o -Xlinker -export_dynamic -Xlinker -no_deduplicate -fobjc-link-runtime -L/Applications/Xcode-16.1.0.app/Contents/Developer/Toolchains/XcodeDefault.xctoolchain/usr/lib/swift/appletvos -L/usr/lib/swift -Xlinker -add_ast_path -Xlinker /Users/admin/builder/spi-builder-workspace/.derivedData/Build/Intermediates.noindex/NVActivityIndicatorView.build/Debug-appletvos/NVActivityIndicatorView.build/Objects-normal/arm64/NVActivityIndicatorView.swiftmodule -Xlinker -dependency_info -Xlinker /Users/admin/builder/spi-builder-workspace/.derivedData/Build/Intermediates.noindex/NVActivityIndicatorView.build/Debug-appletvos/NVActivityIndicatorView.build/Objects-normal/arm64/NVActivityIndicatorView_dependency_info.dat -o /Users/admin/builder/spi-builder-workspace/.derivedData/Build/Products/Debug-appletvos/NVActivityIndicatorView.framework/NVActivityIndicatorView
SwiftDriver NVActivityIndicatorViewExtended normal arm64 com.apple.xcode.tools.swift.compiler (in target 'NVActivityIndicatorViewExtended' from project 'NVActivityIndicatorView')
    cd /Users/admin/builder/spi-builder-workspace
    builtin-SwiftDriver -- /Applications/Xcode-16.1.0.app/Contents/Developer/Toolchains/XcodeDefault.xctoolchain/usr/bin/swiftc -module-name NVActivityIndicatorViewExtended -Onone -enforce-exclusivity\=checked @/Users/admin/builder/spi-builder-workspace/.derivedData/Build/Intermediates.noindex/NVActivityIndicatorView.build/Debug-appletvos/NVActivityIndicatorViewExtended.build/Objects-normal/arm64/NVActivityIndicatorViewExtended.SwiftFileList -DSWIFT_PACKAGE -DDEBUG -stats-output-dir .stats -strict-concurrency\=complete -enable-upcoming-feature StrictConcurrency -enable-upcoming-feature DisableOutwardActorInference -enable-upcoming-feature GlobalActorIsolatedTypesUsability -enable-upcoming-feature InferSendableFromCaptures -enable-bare-slash-regex -enable-experimental-feature DebugDescriptionMacro -sdk /Applications/Xcode-16.1.0.app/Contents/Developer/Platforms/AppleTVOS.platform/Developer/SDKs/AppleTVOS18.1.sdk -target arm64-apple-tvos12.0 -g -module-cache-path /Users/admin/builder/spi-builder-workspace/.derivedData/ModuleCache.noindex -Xfrontend -serialize-debugging-options -enable-testing -index-store-path /Users/admin/builder/spi-builder-workspace/.derivedData/Index.noindex/DataStore -enable-experimental-feature OpaqueTypeErasure -Xcc -D_LIBCPP_HARDENING_MODE\=_LIBCPP_HARDENING_MODE_DEBUG -swift-version 5 -I /Users/admin/builder/spi-builder-workspace/.derivedData/Build/Products/Debug-appletvos -F /Users/admin/builder/spi-builder-workspace/.derivedData/Build/Products/Debug-appletvos -F /Applications/Xcode-16.1.0.app/Contents/Developer/Platforms/AppleTVOS.platform/Developer/Library/Frameworks -c -j10 -enable-batch-mode -incremental -Xcc -ivfsstatcache -Xcc /Users/admin/builder/spi-builder-workspace/.derivedData/SDKStatCaches.noindex/appletvos18.1-22J572-e7fdd8cf9ffd4d4af20823079b51a726.sdkstatcache -output-file-map /Users/admin/builder/spi-builder-workspace/.derivedData/Build/Intermediates.noindex/NVActivityIndicatorView.build/Debug-appletvos/NVActivityIndicatorViewExtended.build/Objects-normal/arm64/NVActivityIndicatorViewExtended-OutputFileMap.json -use-frontend-parseable-output -save-temps -no-color-diagnostics -serialize-diagnostics -emit-dependencies -emit-module -emit-module-path /Users/admin/builder/spi-builder-workspace/.derivedData/Build/Intermediates.noindex/NVActivityIndicatorView.build/Debug-appletvos/NVActivityIndicatorViewExtended.build/Objects-normal/arm64/NVActivityIndicatorViewExtended.swiftmodule -validate-clang-modules-once -clang-build-session-file /Users/admin/builder/spi-builder-workspace/.derivedData/ModuleCache.noindex/Session.modulevalidation -Xcc -I/Users/admin/builder/spi-builder-workspace/.derivedData/Build/Intermediates.noindex/NVActivityIndicatorView.build/Debug-appletvos/NVActivityIndicatorViewExtended.build/swift-overrides.hmap -emit-const-values -Xfrontend -const-gather-protocols-file -Xfrontend /Users/admin/builder/spi-builder-workspace/.derivedData/Build/Intermediates.noindex/NVActivityIndicatorView.build/Debug-appletvos/NVActivityIndicatorViewExtended.build/Objects-normal/arm64/NVActivityIndicatorViewExtended_const_extract_protocols.json -Xcc -I/Users/admin/builder/spi-builder-workspace/.derivedData/Build/Products/Debug-appletvos/include -Xcc -I/Users/admin/builder/spi-builder-workspace/.derivedData/Build/Intermediates.noindex/NVActivityIndicatorView.build/Debug-appletvos/NVActivityIndicatorViewExtended.build/DerivedSources-normal/arm64 -Xcc -I/Users/admin/builder/spi-builder-workspace/.derivedData/Build/Intermediates.noindex/NVActivityIndicatorView.build/Debug-appletvos/NVActivityIndicatorViewExtended.build/DerivedSources/arm64 -Xcc -I/Users/admin/builder/spi-builder-workspace/.derivedData/Build/Intermediates.noindex/NVActivityIndicatorView.build/Debug-appletvos/NVActivityIndicatorViewExtended.build/DerivedSources -Xcc -DSWIFT_PACKAGE\=1 -Xcc -DDEBUG\=1 -emit-objc-header -emit-objc-header-path /Users/admin/builder/spi-builder-workspace/.derivedData/Build/Intermediates.noindex/NVActivityIndicatorView.build/Debug-appletvos/NVActivityIndicatorViewExtended.build/Objects-normal/arm64/NVActivityIndicatorViewExtended-Swift.h -working-directory /Users/admin/builder/spi-builder-workspace -experimental-emit-module-separately -disable-cmo
SwiftEmitModule normal arm64 Emitting\ module\ for\ NVActivityIndicatorViewExtended (in target 'NVActivityIndicatorViewExtended' from project 'NVActivityIndicatorView')
    cd /Users/admin/builder/spi-builder-workspace
    builtin-swiftTaskExecution -- /Applications/Xcode-16.1.0.app/Contents/Developer/Toolchains/XcodeDefault.xctoolchain/usr/bin/swift-frontend -frontend -emit-module -experimental-skip-non-inlinable-function-bodies-without-types /Users/admin/builder/spi-builder-workspace/Sources/Extended/NVActivityIndicatorPresenter.swift /Users/admin/builder/spi-builder-workspace/Sources/Extended/NVActivityIndicatorViewable.swift -target arm64-apple-tvos12.0 -Xllvm -aarch64-use-tbi -enable-objc-interop -sdk /Applications/Xcode-16.1.0.app/Contents/Developer/Platforms/AppleTVOS.platform/Developer/SDKs/AppleTVOS18.1.sdk -I /Users/admin/builder/spi-builder-workspace/.derivedData/Build/Products/Debug-appletvos -F /Users/admin/builder/spi-builder-workspace/.derivedData/Build/Products/Debug-appletvos -F /Applications/Xcode-16.1.0.app/Contents/Developer/Platforms/AppleTVOS.platform/Developer/Library/Frameworks -no-color-diagnostics -enable-testing -g -debug-info-format\=dwarf -dwarf-version\=4 -module-cache-path /Users/admin/builder/spi-builder-workspace/.derivedData/ModuleCache.noindex -swift-version 5 -enforce-exclusivity\=checked -stats-output-dir /Users/admin/builder/spi-builder-workspace/.stats -Onone -D SWIFT_PACKAGE -D DEBUG -serialize-debugging-options -const-gather-protocols-file /Users/admin/builder/spi-builder-workspace/.derivedData/Build/Intermediates.noindex/NVActivityIndicatorView.build/Debug-appletvos/NVActivityIndicatorViewExtended.build/Objects-normal/arm64/NVActivityIndicatorViewExtended_const_extract_protocols.json -enable-experimental-feature DebugDescriptionMacro -enable-experimental-feature OpaqueTypeErasure -enable-upcoming-feature StrictConcurrency -enable-upcoming-feature DisableOutwardActorInference -enable-upcoming-feature GlobalActorIsolatedTypesUsability -enable-upcoming-feature InferSendableFromCaptures -enable-bare-slash-regex -strict-concurrency\=complete -empty-abi-descriptor -validate-clang-modules-once -clang-build-session-file /Users/admin/builder/spi-builder-workspace/.derivedData/ModuleCache.noindex/Session.modulevalidation -Xcc -working-directory -Xcc /Users/admin/builder/spi-builder-workspace -resource-dir /Applications/Xcode-16.1.0.app/Contents/Developer/Toolchains/XcodeDefault.xctoolchain/usr/lib/swift -enable-anonymous-context-mangled-names -file-compilation-dir /Users/admin/builder/spi-builder-workspace -Xcc -D_LIBCPP_HARDENING_MODE\=_LIBCPP_HARDENING_MODE_DEBUG -Xcc -ivfsstatcache -Xcc /Users/admin/builder/spi-builder-workspace/.derivedData/SDKStatCaches.noindex/appletvos18.1-22J572-e7fdd8cf9ffd4d4af20823079b51a726.sdkstatcache -Xcc -I/Users/admin/builder/spi-builder-workspace/.derivedData/Build/Intermediates.noindex/NVActivityIndicatorView.build/Debug-appletvos/NVActivityIndicatorViewExtended.build/swift-overrides.hmap -Xcc -I/Users/admin/builder/spi-builder-workspace/.derivedData/Build/Products/Debug-appletvos/include -Xcc -I/Users/admin/builder/spi-builder-workspace/.derivedData/Build/Intermediates.noindex/NVActivityIndicatorView.build/Debug-appletvos/NVActivityIndicatorViewExtended.build/DerivedSources-normal/arm64 -Xcc -I/Users/admin/builder/spi-builder-workspace/.derivedData/Build/Intermediates.noindex/NVActivityIndicatorView.build/Debug-appletvos/NVActivityIndicatorViewExtended.build/DerivedSources/arm64 -Xcc -I/Users/admin/builder/spi-builder-workspace/.derivedData/Build/Intermediates.noindex/NVActivityIndicatorView.build/Debug-appletvos/NVActivityIndicatorViewExtended.build/DerivedSources -Xcc -DSWIFT_PACKAGE\=1 -Xcc -DDEBUG\=1 -module-name NVActivityIndicatorViewExtended -frontend-parseable-output -disable-clang-spi -target-sdk-version 18.1 -target-sdk-name appletvos18.1 -external-plugin-path /Applications/Xcode-16.1.0.app/Contents/Developer/Platforms/AppleTVOS.platform/Developer/usr/lib/swift/host/plugins\#/Applications/Xcode-16.1.0.app/Contents/Developer/Platforms/AppleTVOS.platform/Developer/usr/bin/swift-plugin-server -external-plugin-path /Applications/Xcode-16.1.0.app/Contents/Developer/Platforms/AppleTVOS.platform/Developer/usr/local/lib/swift/host/plugins\#/Applications/Xcode-16.1.0.app/Contents/Developer/Platforms/AppleTVOS.platform/Developer/usr/bin/swift-plugin-server -plugin-path /Applications/Xcode-16.1.0.app/Contents/Developer/Toolchains/XcodeDefault.xctoolchain/usr/lib/swift/host/plugins -plugin-path /Applications/Xcode-16.1.0.app/Contents/Developer/Toolchains/XcodeDefault.xctoolchain/usr/local/lib/swift/host/plugins -emit-module-doc-path /Users/admin/builder/spi-builder-workspace/.derivedData/Build/Intermediates.noindex/NVActivityIndicatorView.build/Debug-appletvos/NVActivityIndicatorViewExtended.build/Objects-normal/arm64/NVActivityIndicatorViewExtended.swiftdoc -emit-module-source-info-path /Users/admin/builder/spi-builder-workspace/.derivedData/Build/Intermediates.noindex/NVActivityIndicatorView.build/Debug-appletvos/NVActivityIndicatorViewExtended.build/Objects-normal/arm64/NVActivityIndicatorViewExtended.swiftsourceinfo -emit-objc-header-path /Users/admin/builder/spi-builder-workspace/.derivedData/Build/Intermediates.noindex/NVActivityIndicatorView.build/Debug-appletvos/NVActivityIndicatorViewExtended.build/Objects-normal/arm64/NVActivityIndicatorViewExtended-Swift.h -serialize-diagnostics-path /Users/admin/builder/spi-builder-workspace/.derivedData/Build/Intermediates.noindex/NVActivityIndicatorView.build/Debug-appletvos/NVActivityIndicatorViewExtended.build/Objects-normal/arm64/NVActivityIndicatorViewExtended-master-emit-module.dia -emit-dependencies-path /Users/admin/builder/spi-builder-workspace/.derivedData/Build/Intermediates.noindex/NVActivityIndicatorView.build/Debug-appletvos/NVActivityIndicatorViewExtended.build/Objects-normal/arm64/NVActivityIndicatorViewExtended-master-emit-module.d -o /Users/admin/builder/spi-builder-workspace/.derivedData/Build/Intermediates.noindex/NVActivityIndicatorView.build/Debug-appletvos/NVActivityIndicatorViewExtended.build/Objects-normal/arm64/NVActivityIndicatorViewExtended.swiftmodule -emit-abi-descriptor-path /Users/admin/builder/spi-builder-workspace/.derivedData/Build/Intermediates.noindex/NVActivityIndicatorView.build/Debug-appletvos/NVActivityIndicatorViewExtended.build/Objects-normal/arm64/NVActivityIndicatorViewExtended.abi.json
EmitSwiftModule normal arm64 (in target 'NVActivityIndicatorViewExtended' from project 'NVActivityIndicatorView')
    cd /Users/admin/builder/spi-builder-workspace
    /Applications/Xcode-16.1.0.app/Contents/Developer/Toolchains/XcodeDefault.xctoolchain/usr/bin/swift-frontend -emit-module -experimental-skip-non-inlinable-function-bodies-without-types /Users/admin/builder/spi-builder-workspace/Sources/Extended/NVActivityIndicatorPresenter.swift /Users/admin/builder/spi-builder-workspace/Sources/Extended/NVActivityIndicatorViewable.swift -target arm64-apple-tvos12.0 -Xllvm -aarch64-use-tbi -enable-objc-interop -sdk /Applications/Xcode-16.1.0.app/Contents/Developer/Platforms/AppleTVOS.platform/Developer/SDKs/AppleTVOS18.1.sdk -I /Users/admin/builder/spi-builder-workspace/.derivedData/Build/Products/Debug-appletvos -F /Users/admin/builder/spi-builder-workspace/.derivedData/Build/Products/Debug-appletvos -F /Applications/Xcode-16.1.0.app/Contents/Developer/Platforms/AppleTVOS.platform/Developer/Library/Frameworks -no-color-diagnostics -enable-testing -g -debug-info-format\=dwarf -dwarf-version\=4 -module-cache-path /Users/admin/builder/spi-builder-workspace/.derivedData/ModuleCache.noindex -swift-version 5 -enforce-exclusivity\=checked -stats-output-dir /Users/admin/builder/spi-builder-workspace/.stats -Onone -D SWIFT_PACKAGE -D DEBUG -serialize-debugging-options -const-gather-protocols-file /Users/admin/builder/spi-builder-workspace/.derivedData/Build/Intermediates.noindex/NVActivityIndicatorView.build/Debug-appletvos/NVActivityIndicatorViewExtended.build/Objects-normal/arm64/NVActivityIndicatorViewExtended_const_extract_protocols.json -enable-experimental-feature DebugDescriptionMacro -enable-experimental-feature OpaqueTypeErasure -enable-upcoming-feature StrictConcurrency -enable-upcoming-feature DisableOutwardActorInference -enable-upcoming-feature GlobalActorIsolatedTypesUsability -enable-upcoming-feature InferSendableFromCaptures -enable-bare-slash-regex -strict-concurrency\=complete -empty-abi-descriptor -validate-clang-modules-once -clang-build-session-file /Users/admin/builder/spi-builder-workspace/.derivedData/ModuleCache.noindex/Session.modulevalidation -Xcc -working-directory -Xcc /Users/admin/builder/spi-builder-workspace -resource-dir /Applications/Xcode-16.1.0.app/Contents/Developer/Toolchains/XcodeDefault.xctoolchain/usr/lib/swift -enable-anonymous-context-mangled-names -file-compilation-dir /Users/admin/builder/spi-builder-workspace -Xcc -D_LIBCPP_HARDENING_MODE\=_LIBCPP_HARDENING_MODE_DEBUG -Xcc -ivfsstatcache -Xcc /Users/admin/builder/spi-builder-workspace/.derivedData/SDKStatCaches.noindex/appletvos18.1-22J572-e7fdd8cf9ffd4d4af20823079b51a726.sdkstatcache -Xcc -I/Users/admin/builder/spi-builder-workspace/.derivedData/Build/Intermediates.noindex/NVActivityIndicatorView.build/Debug-appletvos/NVActivityIndicatorViewExtended.build/swift-overrides.hmap -Xcc -I/Users/admin/builder/spi-builder-workspace/.derivedData/Build/Products/Debug-appletvos/include -Xcc -I/Users/admin/builder/spi-builder-workspace/.derivedData/Build/Intermediates.noindex/NVActivityIndicatorView.build/Debug-appletvos/NVActivityIndicatorViewExtended.build/DerivedSources-normal/arm64 -Xcc -I/Users/admin/builder/spi-builder-workspace/.derivedData/Build/Intermediates.noindex/NVActivityIndicatorView.build/Debug-appletvos/NVActivityIndicatorViewExtended.build/DerivedSources/arm64 -Xcc -I/Users/admin/builder/spi-builder-workspace/.derivedData/Build/Intermediates.noindex/NVActivityIndicatorView.build/Debug-appletvos/NVActivityIndicatorViewExtended.build/DerivedSources -Xcc -DSWIFT_PACKAGE\=1 -Xcc -DDEBUG\=1 -module-name NVActivityIndicatorViewExtended -frontend-parseable-output -disable-clang-spi -target-sdk-version 18.1 -target-sdk-name appletvos18.1 -external-plugin-path /Applications/Xcode-16.1.0.app/Contents/Developer/Platforms/AppleTVOS.platform/Developer/usr/lib/swift/host/plugins\#/Applications/Xcode-16.1.0.app/Contents/Developer/Platforms/AppleTVOS.platform/Developer/usr/bin/swift-plugin-server -external-plugin-path /Applications/Xcode-16.1.0.app/Contents/Developer/Platforms/AppleTVOS.platform/Developer/usr/local/lib/swift/host/plugins\#/Applications/Xcode-16.1.0.app/Contents/Developer/Platforms/AppleTVOS.platform/Developer/usr/bin/swift-plugin-server -plugin-path /Applications/Xcode-16.1.0.app/Contents/Developer/Toolchains/XcodeDefault.xctoolchain/usr/lib/swift/host/plugins -plugin-path /Applications/Xcode-16.1.0.app/Contents/Developer/Toolchains/XcodeDefault.xctoolchain/usr/local/lib/swift/host/plugins -emit-module-doc-path /Users/admin/builder/spi-builder-workspace/.derivedData/Build/Intermediates.noindex/NVActivityIndicatorView.build/Debug-appletvos/NVActivityIndicatorViewExtended.build/Objects-normal/arm64/NVActivityIndicatorViewExtended.swiftdoc -emit-module-source-info-path /Users/admin/builder/spi-builder-workspace/.derivedData/Build/Intermediates.noindex/NVActivityIndicatorView.build/Debug-appletvos/NVActivityIndicatorViewExtended.build/Objects-normal/arm64/NVActivityIndicatorViewExtended.swiftsourceinfo -emit-objc-header-path /Users/admin/builder/spi-builder-workspace/.derivedData/Build/Intermediates.noindex/NVActivityIndicatorView.build/Debug-appletvos/NVActivityIndicatorViewExtended.build/Objects-normal/arm64/NVActivityIndicatorViewExtended-Swift.h -serialize-diagnostics-path /Users/admin/builder/spi-builder-workspace/.derivedData/Build/Intermediates.noindex/NVActivityIndicatorView.build/Debug-appletvos/NVActivityIndicatorViewExtended.build/Objects-normal/arm64/NVActivityIndicatorViewExtended-master-emit-module.dia -emit-dependencies-path /Users/admin/builder/spi-builder-workspace/.derivedData/Build/Intermediates.noindex/NVActivityIndicatorView.build/Debug-appletvos/NVActivityIndicatorViewExtended.build/Objects-normal/arm64/NVActivityIndicatorViewExtended-master-emit-module.d -o /Users/admin/builder/spi-builder-workspace/.derivedData/Build/Intermediates.noindex/NVActivityIndicatorView.build/Debug-appletvos/NVActivityIndicatorViewExtended.build/Objects-normal/arm64/NVActivityIndicatorViewExtended.swiftmodule -emit-abi-descriptor-path /Users/admin/builder/spi-builder-workspace/.derivedData/Build/Intermediates.noindex/NVActivityIndicatorView.build/Debug-appletvos/NVActivityIndicatorViewExtended.build/Objects-normal/arm64/NVActivityIndicatorViewExtended.abi.json
SwiftCompile normal arm64 Compiling\ NVActivityIndicatorPresenter.swift /Users/admin/builder/spi-builder-workspace/Sources/Extended/NVActivityIndicatorPresenter.swift (in target 'NVActivityIndicatorViewExtended' from project 'NVActivityIndicatorView')
    cd /Users/admin/builder/spi-builder-workspace
    builtin-swiftTaskExecution -- /Applications/Xcode-16.1.0.app/Contents/Developer/Toolchains/XcodeDefault.xctoolchain/usr/bin/swift-frontend -frontend -c -primary-file /Users/admin/builder/spi-builder-workspace/Sources/Extended/NVActivityIndicatorPresenter.swift /Users/admin/builder/spi-builder-workspace/Sources/Extended/NVActivityIndicatorViewable.swift -emit-dependencies-path /Users/admin/builder/spi-builder-workspace/.derivedData/Build/Intermediates.noindex/NVActivityIndicatorView.build/Debug-appletvos/NVActivityIndicatorViewExtended.build/Objects-normal/arm64/NVActivityIndicatorPresenter.d -emit-const-values-path /Users/admin/builder/spi-builder-workspace/.derivedData/Build/Intermediates.noindex/NVActivityIndicatorView.build/Debug-appletvos/NVActivityIndicatorViewExtended.build/Objects-normal/arm64/NVActivityIndicatorPresenter.swiftconstvalues -emit-reference-dependencies-path /Users/admin/builder/spi-builder-workspace/.derivedData/Build/Intermediates.noindex/NVActivityIndicatorView.build/Debug-appletvos/NVActivityIndicatorViewExtended.build/Objects-normal/arm64/NVActivityIndicatorPresenter.swiftdeps -serialize-diagnostics-path /Users/admin/builder/spi-builder-workspace/.derivedData/Build/Intermediates.noindex/NVActivityIndicatorView.build/Debug-appletvos/NVActivityIndicatorViewExtended.build/Objects-normal/arm64/NVActivityIndicatorPresenter.dia -target arm64-apple-tvos12.0 -Xllvm -aarch64-use-tbi -enable-objc-interop -sdk /Applications/Xcode-16.1.0.app/Contents/Developer/Platforms/AppleTVOS.platform/Developer/SDKs/AppleTVOS18.1.sdk -I /Users/admin/builder/spi-builder-workspace/.derivedData/Build/Products/Debug-appletvos -F /Users/admin/builder/spi-builder-workspace/.derivedData/Build/Products/Debug-appletvos -F /Applications/Xcode-16.1.0.app/Contents/Developer/Platforms/AppleTVOS.platform/Developer/Library/Frameworks -no-color-diagnostics -enable-testing -g -debug-info-format\=dwarf -dwarf-version\=4 -module-cache-path /Users/admin/builder/spi-builder-workspace/.derivedData/ModuleCache.noindex -swift-version 5 -enforce-exclusivity\=checked -stats-output-dir /Users/admin/builder/spi-builder-workspace/.stats -Onone -D SWIFT_PACKAGE -D DEBUG -serialize-debugging-options -const-gather-protocols-file /Users/admin/builder/spi-builder-workspace/.derivedData/Build/Intermediates.noindex/NVActivityIndicatorView.build/Debug-appletvos/NVActivityIndicatorViewExtended.build/Objects-normal/arm64/NVActivityIndicatorViewExtended_const_extract_protocols.json -enable-experimental-feature DebugDescriptionMacro -enable-experimental-feature OpaqueTypeErasure -enable-upcoming-feature StrictConcurrency -enable-upcoming-feature DisableOutwardActorInference -enable-upcoming-feature GlobalActorIsolatedTypesUsability -enable-upcoming-feature InferSendableFromCaptures -enable-bare-slash-regex -strict-concurrency\=complete -empty-abi-descriptor -validate-clang-modules-once -clang-build-session-file /Users/admin/builder/spi-builder-workspace/.derivedData/ModuleCache.noindex/Session.modulevalidation -Xcc -working-directory -Xcc /Users/admin/builder/spi-builder-workspace -resource-dir /Applications/Xcode-16.1.0.app/Contents/Developer/Toolchains/XcodeDefault.xctoolchain/usr/lib/swift -enable-anonymous-context-mangled-names -file-compilation-dir /Users/admin/builder/spi-builder-workspace -Xcc -D_LIBCPP_HARDENING_MODE\=_LIBCPP_HARDENING_MODE_DEBUG -Xcc -ivfsstatcache -Xcc /Users/admin/builder/spi-builder-workspace/.derivedData/SDKStatCaches.noindex/appletvos18.1-22J572-e7fdd8cf9ffd4d4af20823079b51a726.sdkstatcache -Xcc -I/Users/admin/builder/spi-builder-workspace/.derivedData/Build/Intermediates.noindex/NVActivityIndicatorView.build/Debug-appletvos/NVActivityIndicatorViewExtended.build/swift-overrides.hmap -Xcc -I/Users/admin/builder/spi-builder-workspace/.derivedData/Build/Products/Debug-appletvos/include -Xcc -I/Users/admin/builder/spi-builder-workspace/.derivedData/Build/Intermediates.noindex/NVActivityIndicatorView.build/Debug-appletvos/NVActivityIndicatorViewExtended.build/DerivedSources-normal/arm64 -Xcc -I/Users/admin/builder/spi-builder-workspace/.derivedData/Build/Intermediates.noindex/NVActivityIndicatorView.build/Debug-appletvos/NVActivityIndicatorViewExtended.build/DerivedSources/arm64 -Xcc -I/Users/admin/builder/spi-builder-workspace/.derivedData/Build/Intermediates.noindex/NVActivityIndicatorView.build/Debug-appletvos/NVActivityIndicatorViewExtended.build/DerivedSources -Xcc -DSWIFT_PACKAGE\=1 -Xcc -DDEBUG\=1 -module-name NVActivityIndicatorViewExtended -frontend-parseable-output -disable-clang-spi -target-sdk-version 18.1 -target-sdk-name appletvos18.1 -external-plugin-path /Applications/Xcode-16.1.0.app/Contents/Developer/Platforms/AppleTVOS.platform/Developer/usr/lib/swift/host/plugins\#/Applications/Xcode-16.1.0.app/Contents/Developer/Platforms/AppleTVOS.platform/Developer/usr/bin/swift-plugin-server -external-plugin-path /Applications/Xcode-16.1.0.app/Contents/Developer/Platforms/AppleTVOS.platform/Developer/usr/local/lib/swift/host/plugins\#/Applications/Xcode-16.1.0.app/Contents/Developer/Platforms/AppleTVOS.platform/Developer/usr/bin/swift-plugin-server -plugin-path /Applications/Xcode-16.1.0.app/Contents/Developer/Toolchains/XcodeDefault.xctoolchain/usr/lib/swift/host/plugins -plugin-path /Applications/Xcode-16.1.0.app/Contents/Developer/Toolchains/XcodeDefault.xctoolchain/usr/local/lib/swift/host/plugins -o /Users/admin/builder/spi-builder-workspace/.derivedData/Build/Intermediates.noindex/NVActivityIndicatorView.build/Debug-appletvos/NVActivityIndicatorViewExtended.build/Objects-normal/arm64/NVActivityIndicatorPresenter.o -index-unit-output-path /NVActivityIndicatorView.build/Debug-appletvos/NVActivityIndicatorViewExtended.build/Objects-normal/arm64/NVActivityIndicatorPresenter.o -index-store-path /Users/admin/builder/spi-builder-workspace/.derivedData/Index.noindex/DataStore -index-system-modules
SwiftCompile normal arm64 /Users/admin/builder/spi-builder-workspace/Sources/Extended/NVActivityIndicatorPresenter.swift (in target 'NVActivityIndicatorViewExtended' from project 'NVActivityIndicatorView')
    cd /Users/admin/builder/spi-builder-workspace
    /Applications/Xcode-16.1.0.app/Contents/Developer/Toolchains/XcodeDefault.xctoolchain/usr/bin/swift-frontend -c -primary-file /Users/admin/builder/spi-builder-workspace/Sources/Extended/NVActivityIndicatorPresenter.swift /Users/admin/builder/spi-builder-workspace/Sources/Extended/NVActivityIndicatorViewable.swift -emit-dependencies-path /Users/admin/builder/spi-builder-workspace/.derivedData/Build/Intermediates.noindex/NVActivityIndicatorView.build/Debug-appletvos/NVActivityIndicatorViewExtended.build/Objects-normal/arm64/NVActivityIndicatorPresenter.d -emit-const-values-path /Users/admin/builder/spi-builder-workspace/.derivedData/Build/Intermediates.noindex/NVActivityIndicatorView.build/Debug-appletvos/NVActivityIndicatorViewExtended.build/Objects-normal/arm64/NVActivityIndicatorPresenter.swiftconstvalues -emit-reference-dependencies-path /Users/admin/builder/spi-builder-workspace/.derivedData/Build/Intermediates.noindex/NVActivityIndicatorView.build/Debug-appletvos/NVActivityIndicatorViewExtended.build/Objects-normal/arm64/NVActivityIndicatorPresenter.swiftdeps -serialize-diagnostics-path /Users/admin/builder/spi-builder-workspace/.derivedData/Build/Intermediates.noindex/NVActivityIndicatorView.build/Debug-appletvos/NVActivityIndicatorViewExtended.build/Objects-normal/arm64/NVActivityIndicatorPresenter.dia -target arm64-apple-tvos12.0 -Xllvm -aarch64-use-tbi -enable-objc-interop -sdk /Applications/Xcode-16.1.0.app/Contents/Developer/Platforms/AppleTVOS.platform/Developer/SDKs/AppleTVOS18.1.sdk -I /Users/admin/builder/spi-builder-workspace/.derivedData/Build/Products/Debug-appletvos -F /Users/admin/builder/spi-builder-workspace/.derivedData/Build/Products/Debug-appletvos -F /Applications/Xcode-16.1.0.app/Contents/Developer/Platforms/AppleTVOS.platform/Developer/Library/Frameworks -no-color-diagnostics -enable-testing -g -debug-info-format\=dwarf -dwarf-version\=4 -module-cache-path /Users/admin/builder/spi-builder-workspace/.derivedData/ModuleCache.noindex -swift-version 5 -enforce-exclusivity\=checked -stats-output-dir /Users/admin/builder/spi-builder-workspace/.stats -Onone -D SWIFT_PACKAGE -D DEBUG -serialize-debugging-options -const-gather-protocols-file /Users/admin/builder/spi-builder-workspace/.derivedData/Build/Intermediates.noindex/NVActivityIndicatorView.build/Debug-appletvos/NVActivityIndicatorViewExtended.build/Objects-normal/arm64/NVActivityIndicatorViewExtended_const_extract_protocols.json -enable-experimental-feature DebugDescriptionMacro -enable-experimental-feature OpaqueTypeErasure -enable-upcoming-feature StrictConcurrency -enable-upcoming-feature DisableOutwardActorInference -enable-upcoming-feature GlobalActorIsolatedTypesUsability -enable-upcoming-feature InferSendableFromCaptures -enable-bare-slash-regex -strict-concurrency\=complete -empty-abi-descriptor -validate-clang-modules-once -clang-build-session-file /Users/admin/builder/spi-builder-workspace/.derivedData/ModuleCache.noindex/Session.modulevalidation -Xcc -working-directory -Xcc /Users/admin/builder/spi-builder-workspace -resource-dir /Applications/Xcode-16.1.0.app/Contents/Developer/Toolchains/XcodeDefault.xctoolchain/usr/lib/swift -enable-anonymous-context-mangled-names -file-compilation-dir /Users/admin/builder/spi-builder-workspace -Xcc -D_LIBCPP_HARDENING_MODE\=_LIBCPP_HARDENING_MODE_DEBUG -Xcc -ivfsstatcache -Xcc /Users/admin/builder/spi-builder-workspace/.derivedData/SDKStatCaches.noindex/appletvos18.1-22J572-e7fdd8cf9ffd4d4af20823079b51a726.sdkstatcache -Xcc -I/Users/admin/builder/spi-builder-workspace/.derivedData/Build/Intermediates.noindex/NVActivityIndicatorView.build/Debug-appletvos/NVActivityIndicatorViewExtended.build/swift-overrides.hmap -Xcc -I/Users/admin/builder/spi-builder-workspace/.derivedData/Build/Products/Debug-appletvos/include -Xcc -I/Users/admin/builder/spi-builder-workspace/.derivedData/Build/Intermediates.noindex/NVActivityIndicatorView.build/Debug-appletvos/NVActivityIndicatorViewExtended.build/DerivedSources-normal/arm64 -Xcc -I/Users/admin/builder/spi-builder-workspace/.derivedData/Build/Intermediates.noindex/NVActivityIndicatorView.build/Debug-appletvos/NVActivityIndicatorViewExtended.build/DerivedSources/arm64 -Xcc -I/Users/admin/builder/spi-builder-workspace/.derivedData/Build/Intermediates.noindex/NVActivityIndicatorView.build/Debug-appletvos/NVActivityIndicatorViewExtended.build/DerivedSources -Xcc -DSWIFT_PACKAGE\=1 -Xcc -DDEBUG\=1 -module-name NVActivityIndicatorViewExtended -frontend-parseable-output -disable-clang-spi -target-sdk-version 18.1 -target-sdk-name appletvos18.1 -external-plugin-path /Applications/Xcode-16.1.0.app/Contents/Developer/Platforms/AppleTVOS.platform/Developer/usr/lib/swift/host/plugins\#/Applications/Xcode-16.1.0.app/Contents/Developer/Platforms/AppleTVOS.platform/Developer/usr/bin/swift-plugin-server -external-plugin-path /Applications/Xcode-16.1.0.app/Contents/Developer/Platforms/AppleTVOS.platform/Developer/usr/local/lib/swift/host/plugins\#/Applications/Xcode-16.1.0.app/Contents/Developer/Platforms/AppleTVOS.platform/Developer/usr/bin/swift-plugin-server -plugin-path /Applications/Xcode-16.1.0.app/Contents/Developer/Toolchains/XcodeDefault.xctoolchain/usr/lib/swift/host/plugins -plugin-path /Applications/Xcode-16.1.0.app/Contents/Developer/Toolchains/XcodeDefault.xctoolchain/usr/local/lib/swift/host/plugins -o /Users/admin/builder/spi-builder-workspace/.derivedData/Build/Intermediates.noindex/NVActivityIndicatorView.build/Debug-appletvos/NVActivityIndicatorViewExtended.build/Objects-normal/arm64/NVActivityIndicatorPresenter.o -index-unit-output-path /NVActivityIndicatorView.build/Debug-appletvos/NVActivityIndicatorViewExtended.build/Objects-normal/arm64/NVActivityIndicatorPresenter.o -index-store-path /Users/admin/builder/spi-builder-workspace/.derivedData/Index.noindex/DataStore -index-system-modules
SwiftCompile normal arm64 Compiling\ NVActivityIndicatorViewable.swift /Users/admin/builder/spi-builder-workspace/Sources/Extended/NVActivityIndicatorViewable.swift (in target 'NVActivityIndicatorViewExtended' from project 'NVActivityIndicatorView')
    cd /Users/admin/builder/spi-builder-workspace
    builtin-swiftTaskExecution -- /Applications/Xcode-16.1.0.app/Contents/Developer/Toolchains/XcodeDefault.xctoolchain/usr/bin/swift-frontend -frontend -c /Users/admin/builder/spi-builder-workspace/Sources/Extended/NVActivityIndicatorPresenter.swift -primary-file /Users/admin/builder/spi-builder-workspace/Sources/Extended/NVActivityIndicatorViewable.swift -emit-dependencies-path /Users/admin/builder/spi-builder-workspace/.derivedData/Build/Intermediates.noindex/NVActivityIndicatorView.build/Debug-appletvos/NVActivityIndicatorViewExtended.build/Objects-normal/arm64/NVActivityIndicatorViewable.d -emit-const-values-path /Users/admin/builder/spi-builder-workspace/.derivedData/Build/Intermediates.noindex/NVActivityIndicatorView.build/Debug-appletvos/NVActivityIndicatorViewExtended.build/Objects-normal/arm64/NVActivityIndicatorViewable.swiftconstvalues -emit-reference-dependencies-path /Users/admin/builder/spi-builder-workspace/.derivedData/Build/Intermediates.noindex/NVActivityIndicatorView.build/Debug-appletvos/NVActivityIndicatorViewExtended.build/Objects-normal/arm64/NVActivityIndicatorViewable.swiftdeps -serialize-diagnostics-path /Users/admin/builder/spi-builder-workspace/.derivedData/Build/Intermediates.noindex/NVActivityIndicatorView.build/Debug-appletvos/NVActivityIndicatorViewExtended.build/Objects-normal/arm64/NVActivityIndicatorViewable.dia -target arm64-apple-tvos12.0 -Xllvm -aarch64-use-tbi -enable-objc-interop -sdk /Applications/Xcode-16.1.0.app/Contents/Developer/Platforms/AppleTVOS.platform/Developer/SDKs/AppleTVOS18.1.sdk -I /Users/admin/builder/spi-builder-workspace/.derivedData/Build/Products/Debug-appletvos -F /Users/admin/builder/spi-builder-workspace/.derivedData/Build/Products/Debug-appletvos -F /Applications/Xcode-16.1.0.app/Contents/Developer/Platforms/AppleTVOS.platform/Developer/Library/Frameworks -no-color-diagnostics -enable-testing -g -debug-info-format\=dwarf -dwarf-version\=4 -module-cache-path /Users/admin/builder/spi-builder-workspace/.derivedData/ModuleCache.noindex -swift-version 5 -enforce-exclusivity\=checked -stats-output-dir /Users/admin/builder/spi-builder-workspace/.stats -Onone -D SWIFT_PACKAGE -D DEBUG -serialize-debugging-options -const-gather-protocols-file /Users/admin/builder/spi-builder-workspace/.derivedData/Build/Intermediates.noindex/NVActivityIndicatorView.build/Debug-appletvos/NVActivityIndicatorViewExtended.build/Objects-normal/arm64/NVActivityIndicatorViewExtended_const_extract_protocols.json -enable-experimental-feature DebugDescriptionMacro -enable-experimental-feature OpaqueTypeErasure -enable-upcoming-feature StrictConcurrency -enable-upcoming-feature DisableOutwardActorInference -enable-upcoming-feature GlobalActorIsolatedTypesUsability -enable-upcoming-feature InferSendableFromCaptures -enable-bare-slash-regex -strict-concurrency\=complete -empty-abi-descriptor -validate-clang-modules-once -clang-build-session-file /Users/admin/builder/spi-builder-workspace/.derivedData/ModuleCache.noindex/Session.modulevalidation -Xcc -working-directory -Xcc /Users/admin/builder/spi-builder-workspace -resource-dir /Applications/Xcode-16.1.0.app/Contents/Developer/Toolchains/XcodeDefault.xctoolchain/usr/lib/swift -enable-anonymous-context-mangled-names -file-compilation-dir /Users/admin/builder/spi-builder-workspace -Xcc -D_LIBCPP_HARDENING_MODE\=_LIBCPP_HARDENING_MODE_DEBUG -Xcc -ivfsstatcache -Xcc /Users/admin/builder/spi-builder-workspace/.derivedData/SDKStatCaches.noindex/appletvos18.1-22J572-e7fdd8cf9ffd4d4af20823079b51a726.sdkstatcache -Xcc -I/Users/admin/builder/spi-builder-workspace/.derivedData/Build/Intermediates.noindex/NVActivityIndicatorView.build/Debug-appletvos/NVActivityIndicatorViewExtended.build/swift-overrides.hmap -Xcc -I/Users/admin/builder/spi-builder-workspace/.derivedData/Build/Products/Debug-appletvos/include -Xcc -I/Users/admin/builder/spi-builder-workspace/.derivedData/Build/Intermediates.noindex/NVActivityIndicatorView.build/Debug-appletvos/NVActivityIndicatorViewExtended.build/DerivedSources-normal/arm64 -Xcc -I/Users/admin/builder/spi-builder-workspace/.derivedData/Build/Intermediates.noindex/NVActivityIndicatorView.build/Debug-appletvos/NVActivityIndicatorViewExtended.build/DerivedSources/arm64 -Xcc -I/Users/admin/builder/spi-builder-workspace/.derivedData/Build/Intermediates.noindex/NVActivityIndicatorView.build/Debug-appletvos/NVActivityIndicatorViewExtended.build/DerivedSources -Xcc -DSWIFT_PACKAGE\=1 -Xcc -DDEBUG\=1 -module-name NVActivityIndicatorViewExtended -frontend-parseable-output -disable-clang-spi -target-sdk-version 18.1 -target-sdk-name appletvos18.1 -external-plugin-path /Applications/Xcode-16.1.0.app/Contents/Developer/Platforms/AppleTVOS.platform/Developer/usr/lib/swift/host/plugins\#/Applications/Xcode-16.1.0.app/Contents/Developer/Platforms/AppleTVOS.platform/Developer/usr/bin/swift-plugin-server -external-plugin-path /Applications/Xcode-16.1.0.app/Contents/Developer/Platforms/AppleTVOS.platform/Developer/usr/local/lib/swift/host/plugins\#/Applications/Xcode-16.1.0.app/Contents/Developer/Platforms/AppleTVOS.platform/Developer/usr/bin/swift-plugin-server -plugin-path /Applications/Xcode-16.1.0.app/Contents/Developer/Toolchains/XcodeDefault.xctoolchain/usr/lib/swift/host/plugins -plugin-path /Applications/Xcode-16.1.0.app/Contents/Developer/Toolchains/XcodeDefault.xctoolchain/usr/local/lib/swift/host/plugins -o /Users/admin/builder/spi-builder-workspace/.derivedData/Build/Intermediates.noindex/NVActivityIndicatorView.build/Debug-appletvos/NVActivityIndicatorViewExtended.build/Objects-normal/arm64/NVActivityIndicatorViewable.o -index-unit-output-path /NVActivityIndicatorView.build/Debug-appletvos/NVActivityIndicatorViewExtended.build/Objects-normal/arm64/NVActivityIndicatorViewable.o -index-store-path /Users/admin/builder/spi-builder-workspace/.derivedData/Index.noindex/DataStore -index-system-modules
Error opening -stats-output-dir file '/Users/admin/builder/spi-builder-workspace/.stats/stats-1733006341928483-swift-frontend-NVActivityIndicatorViewExtended-NVActivityIndicatorViewable.swift-arm64_apple_tvos12.0-o-Onone-1287700591.json' for writing
===-------------------------------------------------------------------------===
                               Swift compilation
===-------------------------------------------------------------------------===
  Total Execution Time: 0.3736 seconds (0.3832 wall clock)
   ---User Time---   --System Time--   --User+System--   ---Wall Time---  --- Name ---
   0.0273 ( 16.5%)   0.0581 ( 27.9%)   0.0853 ( 22.8%)   0.0900 ( 23.5%)  parse-and-resolve-imports
   0.0272 ( 16.4%)   0.0580 ( 27.9%)   0.0852 ( 22.8%)   0.0899 ( 23.5%)  Import resolution
   0.0119 (  7.2%)   0.0097 (  4.7%)   0.0216 (  5.8%)   0.0216 (  5.6%)  perform-sema
   0.0119 (  7.2%)   0.0097 (  4.7%)   0.0216 (  5.8%)   0.0216 (  5.6%)  TypeCheckSourceFileRequest
   0.0119 (  7.2%)   0.0097 (  4.6%)   0.0215 (  5.8%)   0.0215 (  5.6%)  Type checking and Semantic analysis
   0.0101 (  6.1%)   0.0085 (  4.1%)   0.0186 (  5.0%)   0.0187 (  4.9%)  typecheck-decl
   0.0056 (  3.4%)   0.0049 (  2.4%)   0.0105 (  2.8%)   0.0105 (  2.7%)  ResolveTypeRequest
   0.0057 (  3.4%)   0.0048 (  2.3%)   0.0105 (  2.8%)   0.0105 (  2.7%)  UnqualifiedLookupRequest
   0.0056 (  3.4%)   0.0047 (  2.3%)   0.0103 (  2.8%)   0.0103 (  2.7%)  performUnqualifiedLookup
   0.0043 (  2.6%)   0.0036 (  1.7%)   0.0079 (  2.1%)   0.0079 (  2.1%)  QualifiedLookupRequest
   0.0037 (  2.3%)   0.0031 (  1.5%)   0.0068 (  1.8%)   0.0068 (  1.8%)  InterfaceTypeRequest
   0.0037 (  2.2%)   0.0025 (  1.2%)   0.0062 (  1.7%)   0.0062 (  1.6%)  typecheck-expr
   0.0033 (  2.0%)   0.0023 (  1.1%)   0.0056 (  1.5%)   0.0056 (  1.5%)  DirectLookupRequest
   0.0029 (  1.8%)   0.0027 (  1.3%)   0.0056 (  1.5%)   0.0056 (  1.5%)  GenericSignatureRequest
   0.0029 (  1.7%)   0.0026 (  1.3%)   0.0055 (  1.5%)   0.0055 (  1.4%)  InferredGenericSignatureRequest
   0.0027 (  1.6%)   0.0025 (  1.2%)   0.0052 (  1.4%)   0.0052 (  1.4%)  RequirementRequest
   0.0030 (  1.8%)   0.0020 (  1.0%)   0.0050 (  1.3%)   0.0049 (  1.3%)  LookupInModuleRequest
   0.0026 (  1.6%)   0.0017 (  0.8%)   0.0043 (  1.1%)   0.0043 (  1.1%)  TypeCheckFunctionBodyRequest
   0.0011 (  0.6%)   0.0027 (  1.3%)   0.0038 (  1.0%)   0.0039 (  1.0%)  load-stdlib
   0.0021 (  1.3%)   0.0015 (  0.7%)   0.0037 (  1.0%)   0.0037 (  1.0%)  DefaultArgumentExprRequest
   0.0021 (  1.3%)   0.0014 (  0.7%)   0.0035 (  0.9%)   0.0035 (  0.9%)  typecheck-stmt
   0.0019 (  1.2%)   0.0013 (  0.6%)   0.0032 (  0.9%)   0.0032 (  0.8%)  precheck-expr
   0.0013 (  0.8%)   0.0014 (  0.7%)   0.0027 (  0.7%)   0.0027 (  0.7%)  SelfBoundsFromWhereClauseRequest
   0.0010 (  0.6%)   0.0014 (  0.7%)   0.0024 (  0.6%)   0.0024 (  0.6%)  import-clang-decl
   0.0013 (  0.8%)   0.0009 (  0.4%)   0.0022 (  0.6%)   0.0022 (  0.6%)  PatternBindingEntryRequest
   0.0011 (  0.7%)   0.0009 (  0.4%)   0.0021 (  0.5%)   0.0020 (  0.5%)  LookupConformanceInModuleRequest
   0.0008 (  0.5%)   0.0007 (  0.4%)   0.0016 (  0.4%)   0.0016 (  0.4%)  ModuleQualifiedLookupRequest
   0.0008 (  0.5%)   0.0007 (  0.3%)   0.0014 (  0.4%)   0.0014 (  0.4%)  PotentialMacroExpansionsInContextRequest
   0.0004 (  0.2%)   0.0004 (  0.2%)   0.0008 (  0.2%)   0.0008 (  0.2%)  ActorIsolationRequest
   0.0005 (  0.3%)   0.0002 (  0.1%)   0.0006 (  0.2%)   0.0006 (  0.2%)  USRGenerationRequest
   0.0003 (  0.2%)   0.0002 (  0.1%)   0.0006 (  0.1%)   0.0005 (  0.1%)  NamingPatternRequest
   0.0002 (  0.1%)   0.0003 (  0.1%)   0.0005 (  0.1%)   0.0005 (  0.1%)  AccessLevelRequest
   0.0002 (  0.1%)   0.0003 (  0.1%)   0.0005 (  0.1%)   0.0005 (  0.1%)  DefaultAndMaxAccessLevelRequest
   0.0002 (  0.1%)   0.0003 (  0.1%)   0.0005 (  0.1%)   0.0005 (  0.1%)  TypeDeclsFromWhereClauseRequest
   0.0003 (  0.2%)   0.0001 (  0.1%)   0.0004 (  0.1%)   0.0004 (  0.1%)  ParseTopLevelDeclsRequest
   0.0003 (  0.2%)   0.0001 (  0.1%)   0.0004 (  0.1%)   0.0004 (  0.1%)  DefaultInitializerIsolation
   0.0003 (  0.2%)   0.0001 (  0.1%)   0.0004 (  0.1%)   0.0004 (  0.1%)  ParseSourceFileRequest
   0.0002 (  0.1%)   0.0001 (  0.1%)   0.0003 (  0.1%)   0.0003 (  0.1%)  CollectOverriddenDeclsRequest
   0.0002 (  0.1%)   0.0001 (  0.1%)   0.0003 (  0.1%)   0.0003 (  0.1%)  PatternTypeRequest
   0.0002 (  0.1%)   0.0001 (  0.1%)   0.0003 (  0.1%)   0.0003 (  0.1%)  RequirementSignatureRequest
   0.0002 (  0.1%)   0.0000 (  0.0%)   0.0002 (  0.1%)   0.0002 (  0.1%)  ParseMembersRequest
   0.0001 (  0.1%)   0.0001 (  0.0%)   0.0002 (  0.1%)   0.0002 (  0.1%)  ProvideDefaultImplForRequest
   0.0001 (  0.0%)   0.0001 (  0.1%)   0.0002 (  0.1%)   0.0002 (  0.1%)  InheritedProtocolsRequest
   0.0001 (  0.1%)   0.0001 (  0.0%)   0.0002 (  0.0%)   0.0002 (  0.0%)  ResolveImplicitMemberRequest
   0.0001 (  0.1%)   0.0001 (  0.0%)   0.0002 (  0.0%)   0.0002 (  0.0%)  ExpandMemberAttributeMacros
   0.0001 (  0.1%)   0.0000 (  0.0%)   0.0001 (  0.0%)   0.0001 (  0.0%)  build-rewrite-system
   0.0001 (  0.0%)   0.0001 (  0.0%)   0.0001 (  0.0%)   0.0001 (  0.0%)  AttachedPropertyWrappersRequest
   0.0001 (  0.0%)   0.0001 (  0.0%)   0.0001 (  0.0%)   0.0001 (  0.0%)  HasIsolatedSelfRequest
   0.0001 (  0.0%)   0.0001 (  0.0%)   0.0001 (  0.0%)   0.0001 (  0.0%)  ProtocolDependenciesRequest
   0.0001 (  0.1%)   0.0000 (  0.0%)   0.0001 (  0.0%)   0.0001 (  0.0%)  GlobalActorAttributeRequest
   0.0001 (  0.1%)   0.0000 (  0.0%)   0.0001 (  0.0%)   0.0001 (  0.0%)  IsNonUserModuleRequest
   0.0001 (  0.0%)   0.0001 (  0.0%)   0.0001 (  0.0%)   0.0001 (  0.0%)  StructuralRequirementsRequest
   0.0000 (  0.0%)   0.0001 (  0.0%)   0.0001 (  0.0%)   0.0001 (  0.0%)  SemanticDeclAttrsRequest
   0.0001 (  0.0%)   0.0000 (  0.0%)   0.0001 (  0.0%)   0.0001 (  0.0%)  OpaqueReadOwnershipRequest
   0.0001 (  0.0%)   0.0000 (  0.0%)   0.0001 (  0.0%)   0.0001 (  0.0%)  ResolveMacroRequest
   0.0001 (  0.0%)   0.0001 (  0.0%)   0.0001 (  0.0%)   0.0001 (  0.0%)  IsActorRequest
   0.0001 (  0.0%)   0.0000 (  0.0%)   0.0001 (  0.0%)   0.0001 (  0.0%)  ProtocolRequirementsRequest
   0.0001 (  0.0%)   0.0000 (  0.0%)   0.0001 (  0.0%)   0.0001 (  0.0%)  ABIMembersRequest
   0.0000 (  0.0%)   0.0000 (  0.0%)   0.0001 (  0.0%)   0.0001 (  0.0%)  ExtendedNominalRequest
   0.0001 (  0.0%)   0.0000 (  0.0%)   0.0001 (  0.0%)   0.0001 (  0.0%)  CheckRedeclarationRequest
   0.0000 (  0.0%)   0.0000 (  0.0%)   0.0001 (  0.0%)   0.0001 (  0.0%)  LocalDiscriminatorsRequest
   0.0000 (  0.0%)   0.0000 (  0.0%)   0.0001 (  0.0%)   0.0001 (  0.0%)  HasInitAccessorRequest
   0.0000 (  0.0%)   0.0000 (  0.0%)   0.0001 (  0.0%)   0.0001 (  0.0%)  IsGetterMutatingRequest
   0.0001 (  0.0%)   0.0000 (  0.0%)   0.0001 (  0.0%)   0.0001 (  0.0%)  ExpandChildTypeRefinementContextsRequest
   0.0000 (  0.0%)   0.0000 (  0.0%)   0.0001 (  0.0%)   0.0001 (  0.0%)  ExpandExtensionMacros
   0.0000 (  0.0%)   0.0000 (  0.0%)   0.0001 (  0.0%)   0.0001 (  0.0%)  FragileFunctionKindRequest
   0.0000 (  0.0%)   0.0000 (  0.0%)   0.0001 (  0.0%)   0.0001 (  0.0%)  HasDynamicMemberLookupAttributeRequest
   0.0000 (  0.0%)   0.0000 (  0.0%)   0.0001 (  0.0%)   0.0001 (  0.0%)  RequiresOpaqueAccessorsRequest
   0.0000 (  0.0%)   0.0000 (  0.0%)   0.0001 (  0.0%)   0.0001 (  0.0%)  GlobalActorInstanceRequest
   0.0000 (  0.0%)   0.0000 (  0.0%)   0.0001 (  0.0%)   0.0001 (  0.0%)  CallerSideDefaultArgExprRequest
   0.0000 (  0.0%)   0.0000 (  0.0%)   0.0000 (  0.0%)   0.0001 (  0.0%)  AbstractGenericSignatureRequest
   0.0000 (  0.0%)   0.0000 (  0.0%)   0.0000 (  0.0%)   0.0000 (  0.0%)  ExpandPeerMacroRequest
   0.0000 (  0.0%)   0.0000 (  0.0%)   0.0000 (  0.0%)   0.0000 (  0.0%)  CustomAttrNominalRequest
   0.0000 (  0.0%)   0.0000 (  0.0%)   0.0000 (  0.0%)   0.0000 (  0.0%)  StorageImplInfoRequest
   0.0000 (  0.0%)   0.0000 (  0.0%)   0.0000 (  0.0%)   0.0000 (  0.0%)  SPIGroupsRequest
   0.0000 (  0.0%)   0.0000 (  0.0%)   0.0000 (  0.0%)   0.0000 (  0.0%)  ParseAbstractFunctionBodyRequest
   0.0000 (  0.0%)   0.0000 (  0.0%)   0.0000 (  0.0%)   0.0000 (  0.0%)  HasDefaultInitRequest
   0.0000 (  0.0%)   0.0000 (  0.0%)   0.0000 (  0.0%)   0.0000 (  0.0%)  ExtendedTypeRequest
   0.0000 (  0.0%)   0.0000 (  0.0%)   0.0000 (  0.0%)   0.0000 (  0.0%)  IsDynamicRequest
   0.0000 (  0.0%)   0.0000 (  0.0%)   0.0000 (  0.0%)   0.0000 (  0.0%)  IsObjCRequest
   0.0000 (  0.0%)   0.0000 (  0.0%)   0.0000 (  0.0%)   0.0000 (  0.0%)  GenericParamListRequest
   0.0000 (  0.0%)   0.0000 (  0.0%)   0.0000 (  0.0%)   0.0000 (  0.0%)  PreCheckFunctionBodyRequest
   0.0000 (  0.0%)   0.0000 (  0.0%)   0.0000 (  0.0%)   0.0000 (  0.0%)  HasUserDefinedDesignatedInitRequest
   0.0000 (  0.0%)   0.0000 (  0.0%)   0.0000 (  0.0%)   0.0000 (  0.0%)  TypeAliasRequirementsRequest
   0.0000 (  0.0%)   0.0000 (  0.0%)   0.0000 (  0.0%)   0.0000 (  0.0%)  InheritedDeclsReferencedRequest
   0.0000 (  0.0%)   0.0000 (  0.0%)   0.0000 (  0.0%)   0.0000 (  0.0%)  PropertyWrapperAuxiliaryVariablesRequest
   0.0000 (  0.0%)   0.0000 (  0.0%)   0.0000 (  0.0%)   0.0000 (  0.0%)  PatternBindingCheckedAndContextualizedInitRequest
   0.0000 (  0.0%)   0.0000 (  0.0%)   0.0000 (  0.0%)   0.0000 (  0.0%)  OverriddenDeclsRequest
   0.0000 (  0.0%)   0.0000 (  0.0%)   0.0000 (  0.0%)   0.0000 (  0.0%)  ParamSpecifierRequest
   0.0000 (  0.0%)   0.0000 (  0.0%)   0.0000 (  0.0%)   0.0000 (  0.0%)  IsFinalRequest
   0.0000 (  0.0%)   0.0000 (  0.0%)   0.0000 (  0.0%)   0.0000 (  0.0%)  DynamicallyReplacedDeclRequest
   0.0000 (  0.0%)   0.0000 (  0.0%)   0.0000 (  0.0%)   0.0000 (  0.0%)  ConditionalRequirementsRequest
   0.0000 (  0.0%)   0.0000 (  0.0%)   0.0000 (  0.0%)   0.0000 (  0.0%)  IsFunctionBodySkippedRequest
   0.0000 (  0.0%)   0.0000 (  0.0%)   0.0000 (  0.0%)   0.0000 (  0.0%)  ApplyAccessNoteRequest
   0.0000 (  0.0%)   0.0000 (  0.0%)   0.0000 (  0.0%)   0.0000 (  0.0%)  LookupAllConformancesInContextRequest
   0.0000 (  0.0%)   0.0000 (  0.0%)   0.0000 (  0.0%)   0.0000 (  0.0%)  ImplicitKnownProtocolConformanceRequest
   0.0000 (  0.0%)   0.0000 (  0.0%)   0.0000 (  0.0%)   0.0000 (  0.0%)  IsImplicitlyUnwrappedOptionalRequest
   0.0000 (  0.0%)   0.0000 (  0.0%)   0.0000 (  0.0%)   0.0000 (  0.0%)  ResultBuilderTypeRequest
   0.0000 (  0.0%)   0.0000 (  0.0%)   0.0000 (  0.0%)   0.0000 (  0.0%)  AttachedResultBuilderRequest
   0.0000 (  0.0%)   0.0000 (  0.0%)   0.0000 (  0.0%)   0.0000 (  0.0%)  CheckInconsistentImplementationOnlyImportsRequest
   0.0000 (  0.0%)   0.0000 (  0.0%)   0.0000 (  0.0%)   0.0000 (  0.0%)  SynthesizeAccessorRequest
   0.0000 (  0.0%)   0.0000 (  0.0%)   0.0000 (  0.0%)   0.0000 (  0.0%)  RawCommentRequest
   0.0000 (  0.0%)   0.0000 (  0.0%)   0.0000 (  0.0%)   0.0000 (  0.0%)  InitKindRequest
   0.0000 (  0.0%)   0.0000 (  0.0%)   0.0000 (  0.0%)   0.0000 (  0.0%)  IsDistributedActorRequest
   0.0000 (  0.0%)   0.0000 (  0.0%)   0.0000 (  0.0%)   0.0000 (  0.0%)  HasStorageRequest
   0.0000 (  0.0%)   0.0000 (  0.0%)   0.0000 (  0.0%)   0.0000 (  0.0%)  ModuleImplicitImportsRequest
   0.0000 (  0.0%)   0.0000 (  0.0%)   0.0000 (  0.0%)   0.0000 (  0.0%)  AllInheritedProtocolsRequest
   0.0000 (  0.0%)   0.0000 (  0.0%)   0.0000 (  0.0%)   0.0000 (  0.0%)  CheckInconsistentWeakLinkedImportsRequest
   0.0000 (  0.0%)   0.0000 (  0.0%)   0.0000 (  0.0%)   0.0000 (  0.0%)  DefaultTypeRequest
   0.0000 (  0.0%)   0.0000 (  0.0%)   0.0000 (  0.0%)   0.0000 (  0.0%)  LocalTypeDeclsRequest
   0.0000 (  0.0%)   0.0000 (  0.0%)   0.0000 (  0.0%)   0.0000 (  0.0%)  SelfAccessKindRequest
   0.0000 (  0.0%)   0.0000 (  0.0%)   0.0000 (  0.0%)   0.0000 (  0.0%)  ExpandAccessorMacros
   0.0000 (  0.0%)   0.0000 (  0.0%)   0.0000 (  0.0%)   0.0000 (  0.0%)  SuperclassDeclRequest
   0.0000 (  0.0%)   0.0000 (  0.0%)   0.0000 (  0.0%)   0.0000 (  0.0%)  module-populate-cache
   0.0000 (  0.0%)   0.0000 (  0.0%)   0.0000 (  0.0%)   0.0000 (  0.0%)  HasCircularInheritedProtocolsRequest
   0.0000 (  0.0%)   0.0000 (  0.0%)   0.0000 (  0.0%)   0.0000 (  0.0%)  ResolvePatternRequest
   0.0000 (  0.0%)   0.0000 (  0.0%)   0.0000 (  0.0%)   0.0000 (  0.0%)  IsSetterMutatingRequest
   0.0000 (  0.0%)   0.0000 (  0.0%)   0.0000 (  0.0%)   0.0000 (  0.0%)  HasImportsMatchingFlagRequest
   0.0000 (  0.0%)   0.0000 (  0.0%)   0.0000 (  0.0%)   0.0000 (  0.0%)  LifetimeDependenceInfoRequest
   0.0000 (  0.0%)   0.0000 (  0.0%)   0.0000 (  0.0%)   0.0000 (  0.0%)  ExpandBodyMacroRequest
   0.0000 (  0.0%)   0.0000 (  0.0%)   0.0000 (  0.0%)   0.0000 (  0.0%)  ExistentialConformsToSelfRequest
   0.0000 (  0.0%)   0.0000 (  0.0%)   0.0000 (  0.0%)   0.0000 (  0.0%)  ResultTypeRequest
   0.0000 (  0.0%)   0.0000 (  0.0%)   0.0000 (  0.0%)   0.0000 (  0.0%)  ClassAncestryFlagsRequest
   0.0000 (  0.0%)   0.0000 (  0.0%)   0.0000 (  0.0%)   0.0000 (  0.0%)  PropertyWrapperMutabilityRequest
   0.0000 (  0.0%)   0.0000 (  0.0%)   0.0000 (  0.0%)   0.0000 (  0.0%)  PropertyWrapperInitializerInfoRequest
   0.0000 (  0.0%)   0.0000 (  0.0%)   0.0000 (  0.0%)   0.0000 (  0.0%)  ExpandPreambleMacroRequest
   0.0000 (  0.0%)   0.0000 (  0.0%)   0.0000 (  0.0%)   0.0000 (  0.0%)  perform-whole-module-type-checking
   0.0000 (  0.0%)   0.0000 (  0.0%)   0.0000 (  0.0%)   0.0000 (  0.0%)  IsStaticRequest
   0.0000 (  0.0%)   0.0000 (  0.0%)   0.0000 (  0.0%)   0.0000 (  0.0%)  CheckInconsistentSPIOnlyImportsRequest
   0.0000 (  0.0%)   0.0000 (  0.0%)   0.0000 (  0.0%)   0.0000 (  0.0%)  ObjCInterfaceAndImplementationRequest
   0.0000 (  0.0%)   0.0000 (  0.0%)   0.0000 (  0.0%)   0.0000 (  0.0%)  PreCheckReturnStmtRequest
   0.0000 (  0.0%)   0.0000 (  0.0%)   0.0000 (  0.0%)   0.0000 (  0.0%)  source-file-populate-cache
   0.0000 (  0.0%)   0.0000 (  0.0%)   0.0000 (  0.0%)   0.0000 (  0.0%)  CxxRecordSemantics
   0.0000 (  0.0%)   0.0000 (  0.0%)   0.0000 (  0.0%)   0.0000 (  0.0%)  CheckInconsistentAccessLevelOnImport
   0.0000 (  0.0%)   0.0000 (  0.0%)   0.0000 (  0.0%)   0.0000 (  0.0%)  CheckInconsistentAccessLevelOnImportSameFileRequest
   0.0000 (  0.0%)   0.0000 (  0.0%)   0.0000 (  0.0%)   0.0000 (  0.0%)  IsAccessorTransparentRequest
   0.0000 (  0.0%)   0.0000 (  0.0%)   0.0000 (  0.0%)   0.0000 (  0.0%)  PrimarySourceFilesRequest
   0.0000 (  0.0%)   0.0000 (  0.0%)   0.0000 (  0.0%)   0.0000 (  0.0%)  ExpandSynthesizedMemberMacroRequest
   0.0000 (  0.0%)   0.0000 (  0.0%)   0.0000 (  0.0%)   0.0000 (  0.0%)  RequiresOpaqueModifyCoroutineRequest
   0.0000 (  0.0%)   0.0000 (  0.0%)   0.0000 (  0.0%)   0.0000 (  0.0%)  SynthesizeMainFunctionRequest
   0.0000 (  0.0%)   0.0000 (  0.0%)   0.0000 (  0.0%)   0.0000 (  0.0%)  SimpleDidSetRequest
   0.0000 (  0.0%)   0.0000 (  0.0%)   0.0000 (  0.0%)   0.0000 (  0.0%)  PolymorphicEffectKindRequest
   0.0000 (  0.0%)   0.0000 (  0.0%)   0.0000 (  0.0%)   0.0000 (  0.0%)  SuperclassTypeRequest
   0.0000 (  0.0%)   0.0000 (  0.0%)   0.0000 (  0.0%)   0.0000 (  0.0%)  AST verification
   0.0000 (  0.0%)   0.0000 (  0.0%)   0.0000 (  0.0%)   0.0000 (  0.0%)  IsSingleValueStmtRequest
   0.0000 (  0.0%)   0.0000 (  0.0%)   0.0000 (  0.0%)   0.0000 (  0.0%)  PrimaryAssociatedTypesRequest
   0.1655 (100.0%)   0.2081 (100.0%)   0.3736 (100.0%)   0.3832 (100.0%)  Total
===-------------------------------------------------------------------------===
                                Running Program
===-------------------------------------------------------------------------===
  Total Execution Time: 0.1153 seconds (0.1201 wall clock)
   ---User Time---   --System Time--   --User+System--   ---Wall Time---  --- Name ---
   0.0420 (100.0%)   0.0733 (100.0%)   0.1153 (100.0%)   0.1201 (100.0%)  Building Target
   0.0420 (100.0%)   0.0733 (100.0%)   0.1153 (100.0%)   0.1201 (100.0%)  Total
SwiftCompile normal arm64 /Users/admin/builder/spi-builder-workspace/Sources/Extended/NVActivityIndicatorViewable.swift (in target 'NVActivityIndicatorViewExtended' from project 'NVActivityIndicatorView')
    cd /Users/admin/builder/spi-builder-workspace
    /Applications/Xcode-16.1.0.app/Contents/Developer/Toolchains/XcodeDefault.xctoolchain/usr/bin/swift-frontend -c /Users/admin/builder/spi-builder-workspace/Sources/Extended/NVActivityIndicatorPresenter.swift -primary-file /Users/admin/builder/spi-builder-workspace/Sources/Extended/NVActivityIndicatorViewable.swift -emit-dependencies-path /Users/admin/builder/spi-builder-workspace/.derivedData/Build/Intermediates.noindex/NVActivityIndicatorView.build/Debug-appletvos/NVActivityIndicatorViewExtended.build/Objects-normal/arm64/NVActivityIndicatorViewable.d -emit-const-values-path /Users/admin/builder/spi-builder-workspace/.derivedData/Build/Intermediates.noindex/NVActivityIndicatorView.build/Debug-appletvos/NVActivityIndicatorViewExtended.build/Objects-normal/arm64/NVActivityIndicatorViewable.swiftconstvalues -emit-reference-dependencies-path /Users/admin/builder/spi-builder-workspace/.derivedData/Build/Intermediates.noindex/NVActivityIndicatorView.build/Debug-appletvos/NVActivityIndicatorViewExtended.build/Objects-normal/arm64/NVActivityIndicatorViewable.swiftdeps -serialize-diagnostics-path /Users/admin/builder/spi-builder-workspace/.derivedData/Build/Intermediates.noindex/NVActivityIndicatorView.build/Debug-appletvos/NVActivityIndicatorViewExtended.build/Objects-normal/arm64/NVActivityIndicatorViewable.dia -target arm64-apple-tvos12.0 -Xllvm -aarch64-use-tbi -enable-objc-interop -sdk /Applications/Xcode-16.1.0.app/Contents/Developer/Platforms/AppleTVOS.platform/Developer/SDKs/AppleTVOS18.1.sdk -I /Users/admin/builder/spi-builder-workspace/.derivedData/Build/Products/Debug-appletvos -F /Users/admin/builder/spi-builder-workspace/.derivedData/Build/Products/Debug-appletvos -F /Applications/Xcode-16.1.0.app/Contents/Developer/Platforms/AppleTVOS.platform/Developer/Library/Frameworks -no-color-diagnostics -enable-testing -g -debug-info-format\=dwarf -dwarf-version\=4 -module-cache-path /Users/admin/builder/spi-builder-workspace/.derivedData/ModuleCache.noindex -swift-version 5 -enforce-exclusivity\=checked -stats-output-dir /Users/admin/builder/spi-builder-workspace/.stats -Onone -D SWIFT_PACKAGE -D DEBUG -serialize-debugging-options -const-gather-protocols-file /Users/admin/builder/spi-builder-workspace/.derivedData/Build/Intermediates.noindex/NVActivityIndicatorView.build/Debug-appletvos/NVActivityIndicatorViewExtended.build/Objects-normal/arm64/NVActivityIndicatorViewExtended_const_extract_protocols.json -enable-experimental-feature DebugDescriptionMacro -enable-experimental-feature OpaqueTypeErasure -enable-upcoming-feature StrictConcurrency -enable-upcoming-feature DisableOutwardActorInference -enable-upcoming-feature GlobalActorIsolatedTypesUsability -enable-upcoming-feature InferSendableFromCaptures -enable-bare-slash-regex -strict-concurrency\=complete -empty-abi-descriptor -validate-clang-modules-once -clang-build-session-file /Users/admin/builder/spi-builder-workspace/.derivedData/ModuleCache.noindex/Session.modulevalidation -Xcc -working-directory -Xcc /Users/admin/builder/spi-builder-workspace -resource-dir /Applications/Xcode-16.1.0.app/Contents/Developer/Toolchains/XcodeDefault.xctoolchain/usr/lib/swift -enable-anonymous-context-mangled-names -file-compilation-dir /Users/admin/builder/spi-builder-workspace -Xcc -D_LIBCPP_HARDENING_MODE\=_LIBCPP_HARDENING_MODE_DEBUG -Xcc -ivfsstatcache -Xcc /Users/admin/builder/spi-builder-workspace/.derivedData/SDKStatCaches.noindex/appletvos18.1-22J572-e7fdd8cf9ffd4d4af20823079b51a726.sdkstatcache -Xcc -I/Users/admin/builder/spi-builder-workspace/.derivedData/Build/Intermediates.noindex/NVActivityIndicatorView.build/Debug-appletvos/NVActivityIndicatorViewExtended.build/swift-overrides.hmap -Xcc -I/Users/admin/builder/spi-builder-workspace/.derivedData/Build/Products/Debug-appletvos/include -Xcc -I/Users/admin/builder/spi-builder-workspace/.derivedData/Build/Intermediates.noindex/NVActivityIndicatorView.build/Debug-appletvos/NVActivityIndicatorViewExtended.build/DerivedSources-normal/arm64 -Xcc -I/Users/admin/builder/spi-builder-workspace/.derivedData/Build/Intermediates.noindex/NVActivityIndicatorView.build/Debug-appletvos/NVActivityIndicatorViewExtended.build/DerivedSources/arm64 -Xcc -I/Users/admin/builder/spi-builder-workspace/.derivedData/Build/Intermediates.noindex/NVActivityIndicatorView.build/Debug-appletvos/NVActivityIndicatorViewExtended.build/DerivedSources -Xcc -DSWIFT_PACKAGE\=1 -Xcc -DDEBUG\=1 -module-name NVActivityIndicatorViewExtended -frontend-parseable-output -disable-clang-spi -target-sdk-version 18.1 -target-sdk-name appletvos18.1 -external-plugin-path /Applications/Xcode-16.1.0.app/Contents/Developer/Platforms/AppleTVOS.platform/Developer/usr/lib/swift/host/plugins\#/Applications/Xcode-16.1.0.app/Contents/Developer/Platforms/AppleTVOS.platform/Developer/usr/bin/swift-plugin-server -external-plugin-path /Applications/Xcode-16.1.0.app/Contents/Developer/Platforms/AppleTVOS.platform/Developer/usr/local/lib/swift/host/plugins\#/Applications/Xcode-16.1.0.app/Contents/Developer/Platforms/AppleTVOS.platform/Developer/usr/bin/swift-plugin-server -plugin-path /Applications/Xcode-16.1.0.app/Contents/Developer/Toolchains/XcodeDefault.xctoolchain/usr/lib/swift/host/plugins -plugin-path /Applications/Xcode-16.1.0.app/Contents/Developer/Toolchains/XcodeDefault.xctoolchain/usr/local/lib/swift/host/plugins -o /Users/admin/builder/spi-builder-workspace/.derivedData/Build/Intermediates.noindex/NVActivityIndicatorView.build/Debug-appletvos/NVActivityIndicatorViewExtended.build/Objects-normal/arm64/NVActivityIndicatorViewable.o -index-unit-output-path /NVActivityIndicatorView.build/Debug-appletvos/NVActivityIndicatorViewExtended.build/Objects-normal/arm64/NVActivityIndicatorViewable.o -index-store-path /Users/admin/builder/spi-builder-workspace/.derivedData/Index.noindex/DataStore -index-system-modules
/Users/admin/builder/spi-builder-workspace/Sources/Extended/NVActivityIndicatorViewable.swift:72:9: error: main actor-isolated default value in a nonisolated context
        fadeInAnimation: FadeInAnimation? = NVActivityIndicatorView.DEFAULT_FADE_IN_ANIMATION) {
        ^
/Users/admin/builder/spi-builder-workspace/Sources/Extended/NVActivityIndicatorViewable.swift:92:26: error: main actor-isolated default value in a nonisolated context
    func stopAnimating(_ fadeOutAnimation: FadeOutAnimation? = NVActivityIndicatorView.DEFAULT_FADE_OUT_ANIMATION) {
                         ^
/Users/admin/builder/spi-builder-workspace/Sources/Extended/NVActivityIndicatorPresenter.swift:225:23: warning: static property 'sharedInstance' is not concurrency-safe because non-'Sendable' type 'NVActivityIndicatorPresenter' may have shared mutable state; this is an error in the Swift 6 language mode
    public static let sharedInstance = NVActivityIndicatorPresenter()
                      ^
/Users/admin/builder/spi-builder-workspace/Sources/Extended/NVActivityIndicatorPresenter.swift:182:20: note: class 'NVActivityIndicatorPresenter' does not conform to the 'Sendable' protocol
public final class NVActivityIndicatorPresenter {
                   ^
/Users/admin/builder/spi-builder-workspace/Sources/Extended/NVActivityIndicatorPresenter.swift:225:23: note: annotate 'sharedInstance' with '@MainActor' if property should only be accessed from the main actor
    public static let sharedInstance = NVActivityIndicatorPresenter()
                      ^
    @MainActor
/Users/admin/builder/spi-builder-workspace/Sources/Extended/NVActivityIndicatorPresenter.swift:225:23: note: disable concurrency-safety checks if accesses are protected by an external synchronization mechanism
    public static let sharedInstance = NVActivityIndicatorPresenter()
                      ^
    nonisolated(unsafe)
ExtractAppIntentsMetadata (in target 'NVActivityIndicatorView' from project 'NVActivityIndicatorView')
    cd /Users/admin/builder/spi-builder-workspace
    /Applications/Xcode-16.1.0.app/Contents/Developer/Toolchains/XcodeDefault.xctoolchain/usr/bin/appintentsmetadataprocessor --output /Users/admin/builder/spi-builder-workspace/.derivedData/Build/Products/Debug-appletvos/NVActivityIndicatorView.framework --toolchain-dir /Applications/Xcode-16.1.0.app/Contents/Developer/Toolchains/XcodeDefault.xctoolchain --module-name NVActivityIndicatorView --sdk-root /Applications/Xcode-16.1.0.app/Contents/Developer/Platforms/AppleTVOS.platform/Developer/SDKs/AppleTVOS18.1.sdk --xcode-version 16B40 --platform-family tvOS --deployment-target 12.0 --bundle-identifier NVActivityIndicatorView --target-triple arm64-apple-tvos12.0 --binary-file /Users/admin/builder/spi-builder-workspace/.derivedData/Build/Products/Debug-appletvos/NVActivityIndicatorView.framework/NVActivityIndicatorView --dependency-file /Users/admin/builder/spi-builder-workspace/.derivedData/Build/Intermediates.noindex/NVActivityIndicatorView.build/Debug-appletvos/NVActivityIndicatorView.build/Objects-normal/arm64/NVActivityIndicatorView_dependency_info.dat --stringsdata-file /Users/admin/builder/spi-builder-workspace/.derivedData/Build/Intermediates.noindex/NVActivityIndicatorView.build/Debug-appletvos/NVActivityIndicatorView.build/Objects-normal/arm64/ExtractedAppShortcutsMetadata.stringsdata --source-file-list /Users/admin/builder/spi-builder-workspace/.derivedData/Build/Intermediates.noindex/NVActivityIndicatorView.build/Debug-appletvos/NVActivityIndicatorView.build/Objects-normal/arm64/NVActivityIndicatorView.SwiftFileList --metadata-file-list /Users/admin/builder/spi-builder-workspace/.derivedData/Build/Intermediates.noindex/NVActivityIndicatorView.build/Debug-appletvos/NVActivityIndicatorView.build/NVActivityIndicatorView.DependencyMetadataFileList --swift-const-vals-list /Users/admin/builder/spi-builder-workspace/.derivedData/Build/Intermediates.noindex/NVActivityIndicatorView.build/Debug-appletvos/NVActivityIndicatorView.build/Objects-normal/arm64/NVActivityIndicatorView.SwiftConstValuesFileList --compile-time-extraction --deployment-aware-processing --validate-assistant-intents
note: Metadata extraction skipped. No AppIntents.framework dependency found. (in target 'NVActivityIndicatorView' from project 'NVActivityIndicatorView')
GenerateTAPI /Users/admin/builder/spi-builder-workspace/.derivedData/Build/Intermediates.noindex/EagerLinkingTBDs/Debug-appletvos/NVActivityIndicatorView.framework/NVActivityIndicatorView.tbd (in target 'NVActivityIndicatorView' from project 'NVActivityIndicatorView')
    cd /Users/admin/builder/spi-builder-workspace
    /Applications/Xcode-16.1.0.app/Contents/Developer/Toolchains/XcodeDefault.xctoolchain/usr/bin/tapi stubify -isysroot /Applications/Xcode-16.1.0.app/Contents/Developer/Platforms/AppleTVOS.platform/Developer/SDKs/AppleTVOS18.1.sdk -F/Users/admin/builder/spi-builder-workspace/.derivedData/Build/Products/Debug-appletvos -F/Applications/Xcode-16.1.0.app/Contents/Developer/Platforms/AppleTVOS.platform/Developer/Library/Frameworks -L/Users/admin/builder/spi-builder-workspace/.derivedData/Build/Products/Debug-appletvos /Users/admin/builder/spi-builder-workspace/.derivedData/Build/Products/Debug-appletvos/NVActivityIndicatorView.framework/NVActivityIndicatorView -o /Users/admin/builder/spi-builder-workspace/.derivedData/Build/Intermediates.noindex/EagerLinkingTBDs/Debug-appletvos/NVActivityIndicatorView.framework/NVActivityIndicatorView.tbd
RegisterExecutionPolicyException /Users/admin/builder/spi-builder-workspace/.derivedData/Build/Products/Debug-appletvos/NVActivityIndicatorView.framework (in target 'NVActivityIndicatorView' from project 'NVActivityIndicatorView')
    cd /Users/admin/builder/spi-builder-workspace
    builtin-RegisterExecutionPolicyException /Users/admin/builder/spi-builder-workspace/.derivedData/Build/Products/Debug-appletvos/NVActivityIndicatorView.framework
Touch /Users/admin/builder/spi-builder-workspace/.derivedData/Build/Products/Debug-appletvos/NVActivityIndicatorView.framework (in target 'NVActivityIndicatorView' from project 'NVActivityIndicatorView')
    cd /Users/admin/builder/spi-builder-workspace
    /usr/bin/touch -c /Users/admin/builder/spi-builder-workspace/.derivedData/Build/Products/Debug-appletvos/NVActivityIndicatorView.framework
ProcessInfoPlistFile /Users/admin/builder/spi-builder-workspace/.derivedData/Build/Products/Debug-appletvos/NVActivityIndicatorViewExtended.framework/Info.plist /Users/admin/builder/spi-builder-workspace/NVActivityIndicatorView.xcodeproj/NVActivityIndicatorViewExtended_Info.plist (in target 'NVActivityIndicatorViewExtended' from project 'NVActivityIndicatorView')
    cd /Users/admin/builder/spi-builder-workspace
    builtin-infoPlistUtility /Users/admin/builder/spi-builder-workspace/NVActivityIndicatorView.xcodeproj/NVActivityIndicatorViewExtended_Info.plist -producttype com.apple.product-type.framework -expandbuildsettings -format binary -platform appletvos -o /Users/admin/builder/spi-builder-workspace/.derivedData/Build/Products/Debug-appletvos/NVActivityIndicatorViewExtended.framework/Info.plist
warning: TARGETED_DEVICE_FAMILY value (1,2) does not contain any device family values compatible with the tvOS platform. Please add the value '3' to the TARGETED_DEVICE_FAMILY build setting to indicate that this target supports the 'Apple TV' device family. (in target 'NVActivityIndicatorViewExtended' from project 'NVActivityIndicatorView')
** BUILD FAILED **
The following build commands failed:
	SwiftCompile normal arm64 Compiling\ NVActivityIndicatorViewable.swift /Users/admin/builder/spi-builder-workspace/Sources/Extended/NVActivityIndicatorViewable.swift (in target 'NVActivityIndicatorViewExtended' from project 'NVActivityIndicatorView')
	SwiftCompile normal arm64 /Users/admin/builder/spi-builder-workspace/Sources/Extended/NVActivityIndicatorViewable.swift (in target 'NVActivityIndicatorViewExtended' from project 'NVActivityIndicatorView')
	Building project NVActivityIndicatorView with scheme NVActivityIndicatorView-Package
(3 failures)
BUILD FAILURE 6.0 tvOS