The Swift Package Index logo.Swift Package Index

Track the adoption of Swift 6 strict concurrency checks for data race safety. How many packages are Ready for Swift 6?

Build Information

Failed to build Freedom, reference 2.4.1 (cc20ce), with Swift 6.1 for Linux on 25 Apr 2025 07:49:16 UTC.

Build Command

bash -c docker run --pull=always --rm -v "checkouts-4606859-2":/host -w "$PWD" registry.gitlab.com/finestructure/spi-images:basic-6.1-latest swift build --triple x86_64-unknown-linux-gnu 2>&1

Build Log

========================================
RunAll
========================================
Builder version: 4.61.0
Interrupt handler set up.
========================================
Checkout
========================================
Clone URL: https://github.com/ArtSabintsev/Freedom.git
Reference: 2.4.1
Initialized empty Git repository in /host/spi-builder-workspace/.git/
hint: Using 'master' as the name for the initial branch. This default branch name
hint: is subject to change. To configure the initial branch name to use in all
hint: of your new repositories, which will suppress this warning, call:
hint:
hint: 	git config --global init.defaultBranch <name>
hint:
hint: Names commonly chosen instead of 'master' are 'main', 'trunk' and
hint: 'development'. The just-created branch can be renamed via this command:
hint:
hint: 	git branch -m <name>
From https://github.com/ArtSabintsev/Freedom
 * tag               2.4.1      -> FETCH_HEAD
HEAD is now at cc20ce1 Updated podspec
Cloned https://github.com/ArtSabintsev/Freedom.git
Revision (git rev-parse @):
cc20ce10fc029e3fb63e84829760464276dd8ae9
SUCCESS checkout https://github.com/ArtSabintsev/Freedom.git at 2.4.1
========================================
Build
========================================
Selected platform:         linux
Swift version:             6.1
Building package at path:  $PWD
https://github.com/ArtSabintsev/Freedom.git
https://github.com/ArtSabintsev/Freedom.git
WARNING: environment variable SUPPRESS_SWIFT_6_FLAGS is not set
{
  "dependencies" : [
  ],
  "manifest_display_name" : "Freedom",
  "name" : "Freedom",
  "path" : "/host/spi-builder-workspace",
  "platforms" : [
    {
      "name" : "ios",
      "version" : "9.0"
    }
  ],
  "products" : [
    {
      "name" : "Freedom",
      "targets" : [
        "Freedom"
      ],
      "type" : {
        "library" : [
          "automatic"
        ]
      }
    }
  ],
  "swift_languages_versions" : [
    "5"
  ],
  "targets" : [
    {
      "c99name" : "Freedom",
      "module_type" : "SwiftTarget",
      "name" : "Freedom",
      "path" : "Sources",
      "product_memberships" : [
        "Freedom"
      ],
      "sources" : [
        "BraveFreedomActivity.swift",
        "ChromeFreedomActivity.swift",
        "DolphinFreedomActivity.swift",
        "FirefoxFocusFreedomActivity.swift",
        "FirefoxFreedomActivity.swift",
        "Freedom.swift",
        "FreedomActivating.swift",
        "FreedomURLComponentsExtension.swift",
        "FreedomURLExtension.swift",
        "SafariFreedomActivity.swift"
      ],
      "type" : "library"
    }
  ],
  "tools_version" : "5.1"
}
Running build ...
bash -c docker run --pull=always --rm -v "checkouts-4606859-2":/host -w "$PWD" registry.gitlab.com/finestructure/spi-images:basic-6.1-latest swift build --triple x86_64-unknown-linux-gnu -Xswiftc -Xfrontend -Xswiftc -stats-output-dir -Xswiftc -Xfrontend -Xswiftc .stats -Xswiftc -strict-concurrency=complete -Xswiftc -enable-upcoming-feature -Xswiftc StrictConcurrency -Xswiftc -enable-upcoming-feature -Xswiftc DisableOutwardActorInference -Xswiftc -enable-upcoming-feature -Xswiftc GlobalActorIsolatedTypesUsability -Xswiftc -enable-upcoming-feature -Xswiftc InferSendableFromCaptures 2>&1
basic-6.1-latest: Pulling from finestructure/spi-images
Digest: sha256:3bdcac04179f4ed3e5b8e9dbd6e74bbf5ebc0f4fde48bbaad7d1e5c757e65bcb
Status: Image is up to date for registry.gitlab.com/finestructure/spi-images:basic-6.1-latest
Building for debugging...
[0/2] Write sources
[1/2] Write swift-version-24593BA9C3E375BF.txt
[3/12] Compiling Freedom FreedomActivating.swift
/host/spi-builder-workspace/Sources/BraveFreedomActivity.swift:9:8: error: no such module 'UIKit'
  7 | //
  8 |
  9 | import UIKit
    |        `- error: no such module 'UIKit'
 10 |
 11 | final class BraveFreedomActivity: UIActivity, FreedomActivating {
[4/12] Compiling Freedom FirefoxFreedomActivity.swift
/host/spi-builder-workspace/Sources/BraveFreedomActivity.swift:9:8: error: no such module 'UIKit'
  7 | //
  8 |
  9 | import UIKit
    |        `- error: no such module 'UIKit'
 10 |
 11 | final class BraveFreedomActivity: UIActivity, FreedomActivating {
error: emit-module command failed with exit code 1 (use -v to see invocation)
[5/13] Emitting module Freedom
/host/spi-builder-workspace/Sources/BraveFreedomActivity.swift:9:8: error: no such module 'UIKit'
  7 | //
  8 |
  9 | import UIKit
    |        `- error: no such module 'UIKit'
 10 |
 11 | final class BraveFreedomActivity: UIActivity, FreedomActivating {
[6/13] Compiling Freedom DolphinFreedomActivity.swift
/host/spi-builder-workspace/Sources/BraveFreedomActivity.swift:9:8: error: no such module 'UIKit'
  7 | //
  8 |
  9 | import UIKit
    |        `- error: no such module 'UIKit'
 10 |
 11 | final class BraveFreedomActivity: UIActivity, FreedomActivating {
[7/13] Compiling Freedom FirefoxFocusFreedomActivity.swift
/host/spi-builder-workspace/Sources/BraveFreedomActivity.swift:9:8: error: no such module 'UIKit'
  7 | //
  8 |
  9 | import UIKit
    |        `- error: no such module 'UIKit'
 10 |
 11 | final class BraveFreedomActivity: UIActivity, FreedomActivating {
[8/13] Compiling Freedom BraveFreedomActivity.swift
/host/spi-builder-workspace/Sources/BraveFreedomActivity.swift:9:8: error: no such module 'UIKit'
  7 | //
  8 |
  9 | import UIKit
    |        `- error: no such module 'UIKit'
 10 |
 11 | final class BraveFreedomActivity: UIActivity, FreedomActivating {
[9/13] Compiling Freedom ChromeFreedomActivity.swift
/host/spi-builder-workspace/Sources/BraveFreedomActivity.swift:9:8: error: no such module 'UIKit'
  7 | //
  8 |
  9 | import UIKit
    |        `- error: no such module 'UIKit'
 10 |
 11 | final class BraveFreedomActivity: UIActivity, FreedomActivating {
[10/13] Compiling Freedom SafariFreedomActivity.swift
/host/spi-builder-workspace/Sources/BraveFreedomActivity.swift:9:8: error: no such module 'UIKit'
  7 | //
  8 |
  9 | import UIKit
    |        `- error: no such module 'UIKit'
 10 |
 11 | final class BraveFreedomActivity: UIActivity, FreedomActivating {
[11/13] Compiling Freedom FreedomURLExtension.swift
/host/spi-builder-workspace/Sources/BraveFreedomActivity.swift:9:8: error: no such module 'UIKit'
  7 | //
  8 |
  9 | import UIKit
    |        `- error: no such module 'UIKit'
 10 |
 11 | final class BraveFreedomActivity: UIActivity, FreedomActivating {
[12/13] Compiling Freedom Freedom.swift
/host/spi-builder-workspace/Sources/BraveFreedomActivity.swift:9:8: error: no such module 'UIKit'
  7 | //
  8 |
  9 | import UIKit
    |        `- error: no such module 'UIKit'
 10 |
 11 | final class BraveFreedomActivity: UIActivity, FreedomActivating {
[13/13] Compiling Freedom FreedomURLComponentsExtension.swift
/host/spi-builder-workspace/Sources/BraveFreedomActivity.swift:9:8: error: no such module 'UIKit'
  7 | //
  8 |
  9 | import UIKit
    |        `- error: no such module 'UIKit'
 10 |
 11 | final class BraveFreedomActivity: UIActivity, FreedomActivating {
Running build ...
bash -c docker run --pull=always --rm -v "checkouts-4606859-2":/host -w "$PWD" registry.gitlab.com/finestructure/spi-images:basic-6.1-latest swift build --triple x86_64-unknown-linux-gnu 2>&1
basic-6.1-latest: Pulling from finestructure/spi-images
Digest: sha256:3bdcac04179f4ed3e5b8e9dbd6e74bbf5ebc0f4fde48bbaad7d1e5c757e65bcb
Status: Image is up to date for registry.gitlab.com/finestructure/spi-images:basic-6.1-latest
[0/1] Planning build
Building for debugging...
[0/1] Write swift-version-24593BA9C3E375BF.txt
[2/11] Compiling Freedom FreedomActivating.swift
/host/spi-builder-workspace/Sources/BraveFreedomActivity.swift:9:8: error: no such module 'UIKit'
  7 | //
  8 |
  9 | import UIKit
    |        `- error: no such module 'UIKit'
 10 |
 11 | final class BraveFreedomActivity: UIActivity, FreedomActivating {
[3/12] Compiling Freedom FirefoxFreedomActivity.swift
/host/spi-builder-workspace/Sources/BraveFreedomActivity.swift:9:8: error: no such module 'UIKit'
  7 | //
  8 |
  9 | import UIKit
    |        `- error: no such module 'UIKit'
 10 |
 11 | final class BraveFreedomActivity: UIActivity, FreedomActivating {
[4/12] Compiling Freedom Freedom.swift
/host/spi-builder-workspace/Sources/BraveFreedomActivity.swift:9:8: error: no such module 'UIKit'
  7 | //
  8 |
  9 | import UIKit
    |        `- error: no such module 'UIKit'
 10 |
 11 | final class BraveFreedomActivity: UIActivity, FreedomActivating {
[5/12] Compiling Freedom BraveFreedomActivity.swift
/host/spi-builder-workspace/Sources/BraveFreedomActivity.swift:9:8: error: no such module 'UIKit'
  7 | //
  8 |
  9 | import UIKit
    |        `- error: no such module 'UIKit'
 10 |
 11 | final class BraveFreedomActivity: UIActivity, FreedomActivating {
[6/12] Compiling Freedom ChromeFreedomActivity.swift
/host/spi-builder-workspace/Sources/BraveFreedomActivity.swift:9:8: error: no such module 'UIKit'
  7 | //
  8 |
  9 | import UIKit
    |        `- error: no such module 'UIKit'
 10 |
 11 | final class BraveFreedomActivity: UIActivity, FreedomActivating {
[7/12] Compiling Freedom DolphinFreedomActivity.swift
/host/spi-builder-workspace/Sources/BraveFreedomActivity.swift:9:8: error: no such module 'UIKit'
  7 | //
  8 |
  9 | import UIKit
    |        `- error: no such module 'UIKit'
 10 |
 11 | final class BraveFreedomActivity: UIActivity, FreedomActivating {
[8/12] Compiling Freedom FirefoxFocusFreedomActivity.swift
/host/spi-builder-workspace/Sources/BraveFreedomActivity.swift:9:8: error: no such module 'UIKit'
  7 | //
  8 |
  9 | import UIKit
    |        `- error: no such module 'UIKit'
 10 |
 11 | final class BraveFreedomActivity: UIActivity, FreedomActivating {
error: emit-module command failed with exit code 1 (use -v to see invocation)
[9/12] Emitting module Freedom
/host/spi-builder-workspace/Sources/BraveFreedomActivity.swift:9:8: error: no such module 'UIKit'
  7 | //
  8 |
  9 | import UIKit
    |        `- error: no such module 'UIKit'
 10 |
 11 | final class BraveFreedomActivity: UIActivity, FreedomActivating {
[10/12] Compiling Freedom FreedomURLComponentsExtension.swift
/host/spi-builder-workspace/Sources/BraveFreedomActivity.swift:9:8: error: no such module 'UIKit'
  7 | //
  8 |
  9 | import UIKit
    |        `- error: no such module 'UIKit'
 10 |
 11 | final class BraveFreedomActivity: UIActivity, FreedomActivating {
[11/12] Compiling Freedom FreedomURLExtension.swift
/host/spi-builder-workspace/Sources/BraveFreedomActivity.swift:9:8: error: no such module 'UIKit'
  7 | //
  8 |
  9 | import UIKit
    |        `- error: no such module 'UIKit'
 10 |
 11 | final class BraveFreedomActivity: UIActivity, FreedomActivating {
[12/12] Compiling Freedom SafariFreedomActivity.swift
/host/spi-builder-workspace/Sources/BraveFreedomActivity.swift:9:8: error: no such module 'UIKit'
  7 | //
  8 |
  9 | import UIKit
    |        `- error: no such module 'UIKit'
 10 |
 11 | final class BraveFreedomActivity: UIActivity, FreedomActivating {
BUILD FAILURE 6.1 linux