The Swift Package Index logo.Swift Package Index

Track the adoption of Swift 6 strict concurrency checks for data race safety. How many packages are Ready for Swift 6?

Build Information

Failed to build RichText, reference main (18615d), with Swift 6.1 for iOS using Xcode 16.3 on 30 Apr 2025 06:27:12 UTC.

Build Command

env DEVELOPER_DIR=/Applications/Xcode-16.3.0.app xcrun xcodebuild -IDEClonedSourcePackagesDirPathOverride=$PWD/.dependencies -skipMacroValidation -skipPackagePluginValidation -derivedDataPath $PWD/.derivedData build -scheme RichText -destination generic/platform=iOS

Build Log

SwiftCompile normal arm64 /Users/admin/builder/spi-builder-workspace/.dependencies/checkouts/swift-collections/Sources/HashTreeCollections/HashNode/_HashNode+Subtree\ Removals.swift (in target 'HashTreeCollections' from project 'swift-collections')
    cd /Users/admin/builder/spi-builder-workspace/.swiftpm/xcode

SwiftCompile normal arm64 /Users/admin/builder/spi-builder-workspace/.dependencies/checkouts/swift-collections/Sources/HashTreeCollections/HashNode/_HashNode+UnsafeHandle.swift (in target 'HashTreeCollections' from project 'swift-collections')
    cd /Users/admin/builder/spi-builder-workspace/.swiftpm/xcode

SwiftCompile normal arm64 /Users/admin/builder/spi-builder-workspace/.dependencies/checkouts/swift-collections/Sources/HashTreeCollections/HashNode/_HashNode.swift (in target 'HashTreeCollections' from project 'swift-collections')
    cd /Users/admin/builder/spi-builder-workspace/.swiftpm/xcode

SwiftCompile normal arm64 /Users/admin/builder/spi-builder-workspace/.dependencies/checkouts/swift-collections/Sources/HashTreeCollections/HashNode/_HashNodeHeader.swift (in target 'HashTreeCollections' from project 'swift-collections')
    cd /Users/admin/builder/spi-builder-workspace/.swiftpm/xcode

SwiftCompile normal arm64 /Users/admin/builder/spi-builder-workspace/.dependencies/checkouts/swift-collections/Sources/HashTreeCollections/HashNode/_HashSlot.swift (in target 'HashTreeCollections' from project 'swift-collections')
    cd /Users/admin/builder/spi-builder-workspace/.swiftpm/xcode

SwiftCompile normal arm64 /Users/admin/builder/spi-builder-workspace/.dependencies/checkouts/swift-collections/Sources/HashTreeCollections/HashNode/_HashStack.swift (in target 'HashTreeCollections' from project 'swift-collections')
    cd /Users/admin/builder/spi-builder-workspace/.swiftpm/xcode

SwiftCompile normal arm64 /Users/admin/builder/spi-builder-workspace/.dependencies/checkouts/swift-collections/Sources/HashTreeCollections/HashNode/_HashTreeIterator.swift (in target 'HashTreeCollections' from project 'swift-collections')
    cd /Users/admin/builder/spi-builder-workspace/.swiftpm/xcode

SwiftCompile normal arm64 /Users/admin/builder/spi-builder-workspace/.dependencies/checkouts/swift-collections/Sources/HashTreeCollections/HashNode/_HashTreeStatistics.swift (in target 'HashTreeCollections' from project 'swift-collections')
    cd /Users/admin/builder/spi-builder-workspace/.swiftpm/xcode

SwiftCompile normal arm64 /Users/admin/builder/spi-builder-workspace/.dependencies/checkouts/swift-collections/Sources/HashTreeCollections/HashNode/_RawHashNode+UnsafeHandle.swift (in target 'HashTreeCollections' from project 'swift-collections')
    cd /Users/admin/builder/spi-builder-workspace/.swiftpm/xcode

SwiftDriverJobDiscovery normal arm64 Compiling OrderedSet+Hashable.swift, OrderedSet+Initializers.swift, OrderedSet+Insertions.swift, OrderedSet+Invariants.swift, OrderedSet+Partial MutableCollection.swift, OrderedSet+Partial RangeReplaceableCollection.swift (in target 'OrderedCollections' from project 'swift-collections')
SwiftCompile normal arm64 Compiling\ TreeDictionary+Sequence.swift,\ TreeDictionary+Values.swift,\ TreeDictionary.swift,\ TreeSet+Codable.swift,\ TreeSet+Collection.swift,\ TreeSet+CustomReflectable.swift,\ TreeSet+Debugging.swift,\ TreeSet+Descriptions.swift /Users/admin/builder/spi-builder-workspace/.dependencies/checkouts/swift-collections/Sources/HashTreeCollections/TreeDictionary/TreeDictionary+Sequence.swift /Users/admin/builder/spi-builder-workspace/.dependencies/checkouts/swift-collections/Sources/HashTreeCollections/TreeDictionary/TreeDictionary+Values.swift /Users/admin/builder/spi-builder-workspace/.dependencies/checkouts/swift-collections/Sources/HashTreeCollections/TreeDictionary/TreeDictionary.swift /Users/admin/builder/spi-builder-workspace/.dependencies/checkouts/swift-collections/Sources/HashTreeCollections/TreeSet/TreeSet+Codable.swift /Users/admin/builder/spi-builder-workspace/.dependencies/checkouts/swift-collections/Sources/HashTreeCollections/TreeSet/TreeSet+Collection.swift /Users/admin/builder/spi-builder-workspace/.dependencies/checkouts/swift-collections/Sources/HashTreeCollections/TreeSet/TreeSet+CustomReflectable.swift /Users/admin/builder/spi-builder-workspace/.dependencies/checkouts/swift-collections/Sources/HashTreeCollections/TreeSet/TreeSet+Debugging.swift /Users/admin/builder/spi-builder-workspace/.dependencies/checkouts/swift-collections/Sources/HashTreeCollections/TreeSet/TreeSet+Descriptions.swift (in target 'HashTreeCollections' from project 'swift-collections')
SwiftCompile normal arm64 /Users/admin/builder/spi-builder-workspace/.dependencies/checkouts/swift-collections/Sources/HashTreeCollections/TreeDictionary/TreeDictionary+Sequence.swift (in target 'HashTreeCollections' from project 'swift-collections')
    cd /Users/admin/builder/spi-builder-workspace/.swiftpm/xcode

SwiftCompile normal arm64 /Users/admin/builder/spi-builder-workspace/.dependencies/checkouts/swift-collections/Sources/HashTreeCollections/TreeDictionary/TreeDictionary+Values.swift (in target 'HashTreeCollections' from project 'swift-collections')
    cd /Users/admin/builder/spi-builder-workspace/.swiftpm/xcode

SwiftCompile normal arm64 /Users/admin/builder/spi-builder-workspace/.dependencies/checkouts/swift-collections/Sources/HashTreeCollections/TreeDictionary/TreeDictionary.swift (in target 'HashTreeCollections' from project 'swift-collections')
    cd /Users/admin/builder/spi-builder-workspace/.swiftpm/xcode

SwiftCompile normal arm64 /Users/admin/builder/spi-builder-workspace/.dependencies/checkouts/swift-collections/Sources/HashTreeCollections/TreeSet/TreeSet+Codable.swift (in target 'HashTreeCollections' from project 'swift-collections')
    cd /Users/admin/builder/spi-builder-workspace/.swiftpm/xcode

SwiftCompile normal arm64 /Users/admin/builder/spi-builder-workspace/.dependencies/checkouts/swift-collections/Sources/HashTreeCollections/TreeSet/TreeSet+Collection.swift (in target 'HashTreeCollections' from project 'swift-collections')
    cd /Users/admin/builder/spi-builder-workspace/.swiftpm/xcode

SwiftCompile normal arm64 /Users/admin/builder/spi-builder-workspace/.dependencies/checkouts/swift-collections/Sources/HashTreeCollections/TreeSet/TreeSet+CustomReflectable.swift (in target 'HashTreeCollections' from project 'swift-collections')
    cd /Users/admin/builder/spi-builder-workspace/.swiftpm/xcode

SwiftCompile normal arm64 /Users/admin/builder/spi-builder-workspace/.dependencies/checkouts/swift-collections/Sources/HashTreeCollections/TreeSet/TreeSet+Debugging.swift (in target 'HashTreeCollections' from project 'swift-collections')
    cd /Users/admin/builder/spi-builder-workspace/.swiftpm/xcode

SwiftCompile normal arm64 /Users/admin/builder/spi-builder-workspace/.dependencies/checkouts/swift-collections/Sources/HashTreeCollections/TreeSet/TreeSet+Descriptions.swift (in target 'HashTreeCollections' from project 'swift-collections')
    cd /Users/admin/builder/spi-builder-workspace/.swiftpm/xcode

SwiftDriverJobDiscovery normal arm64 Compiling OrderedDictionary+Elements.swift, OrderedDictionary+Equatable.swift, OrderedDictionary+ExpressibleByDictionaryLiteral.swift, OrderedDictionary+Hashable.swift, OrderedDictionary+Initializers.swift, OrderedDictionary+Invariants.swift (in target 'OrderedCollections' from project 'swift-collections')
SwiftCompile normal arm64 Compiling\ _RawHashNode.swift,\ _UnmanagedHashNode.swift,\ _UnsafePath.swift,\ TreeDictionary+Codable.swift,\ TreeDictionary+Collection.swift,\ TreeDictionary+CustomReflectable.swift,\ TreeDictionary+Debugging.swift,\ TreeDictionary+Descriptions.swift,\ TreeDictionary+Equatable.swift /Users/admin/builder/spi-builder-workspace/.dependencies/checkouts/swift-collections/Sources/HashTreeCollections/HashNode/_RawHashNode.swift /Users/admin/builder/spi-builder-workspace/.dependencies/checkouts/swift-collections/Sources/HashTreeCollections/HashNode/_UnmanagedHashNode.swift /Users/admin/builder/spi-builder-workspace/.dependencies/checkouts/swift-collections/Sources/HashTreeCollections/HashNode/_UnsafePath.swift /Users/admin/builder/spi-builder-workspace/.dependencies/checkouts/swift-collections/Sources/HashTreeCollections/TreeDictionary/TreeDictionary+Codable.swift /Users/admin/builder/spi-builder-workspace/.dependencies/checkouts/swift-collections/Sources/HashTreeCollections/TreeDictionary/TreeDictionary+Collection.swift /Users/admin/builder/spi-builder-workspace/.dependencies/checkouts/swift-collections/Sources/HashTreeCollections/TreeDictionary/TreeDictionary+CustomReflectable.swift /Users/admin/builder/spi-builder-workspace/.dependencies/checkouts/swift-collections/Sources/HashTreeCollections/TreeDictionary/TreeDictionary+Debugging.swift /Users/admin/builder/spi-builder-workspace/.dependencies/checkouts/swift-collections/Sources/HashTreeCollections/TreeDictionary/TreeDictionary+Descriptions.swift /Users/admin/builder/spi-builder-workspace/.dependencies/checkouts/swift-collections/Sources/HashTreeCollections/TreeDictionary/TreeDictionary+Equatable.swift (in target 'HashTreeCollections' from project 'swift-collections')
SwiftCompile normal arm64 /Users/admin/builder/spi-builder-workspace/.dependencies/checkouts/swift-collections/Sources/HashTreeCollections/HashNode/_RawHashNode.swift (in target 'HashTreeCollections' from project 'swift-collections')
    cd /Users/admin/builder/spi-builder-workspace/.swiftpm/xcode

SwiftCompile normal arm64 /Users/admin/builder/spi-builder-workspace/.dependencies/checkouts/swift-collections/Sources/HashTreeCollections/HashNode/_UnmanagedHashNode.swift (in target 'HashTreeCollections' from project 'swift-collections')
    cd /Users/admin/builder/spi-builder-workspace/.swiftpm/xcode

SwiftCompile normal arm64 /Users/admin/builder/spi-builder-workspace/.dependencies/checkouts/swift-collections/Sources/HashTreeCollections/HashNode/_UnsafePath.swift (in target 'HashTreeCollections' from project 'swift-collections')
    cd /Users/admin/builder/spi-builder-workspace/.swiftpm/xcode

SwiftCompile normal arm64 /Users/admin/builder/spi-builder-workspace/.dependencies/checkouts/swift-collections/Sources/HashTreeCollections/TreeDictionary/TreeDictionary+Codable.swift (in target 'HashTreeCollections' from project 'swift-collections')
    cd /Users/admin/builder/spi-builder-workspace/.swiftpm/xcode

SwiftCompile normal arm64 /Users/admin/builder/spi-builder-workspace/.dependencies/checkouts/swift-collections/Sources/HashTreeCollections/TreeDictionary/TreeDictionary+Collection.swift (in target 'HashTreeCollections' from project 'swift-collections')
    cd /Users/admin/builder/spi-builder-workspace/.swiftpm/xcode

SwiftCompile normal arm64 /Users/admin/builder/spi-builder-workspace/.dependencies/checkouts/swift-collections/Sources/HashTreeCollections/TreeDictionary/TreeDictionary+CustomReflectable.swift (in target 'HashTreeCollections' from project 'swift-collections')
    cd /Users/admin/builder/spi-builder-workspace/.swiftpm/xcode

SwiftCompile normal arm64 /Users/admin/builder/spi-builder-workspace/.dependencies/checkouts/swift-collections/Sources/HashTreeCollections/TreeDictionary/TreeDictionary+Debugging.swift (in target 'HashTreeCollections' from project 'swift-collections')
    cd /Users/admin/builder/spi-builder-workspace/.swiftpm/xcode

SwiftCompile normal arm64 /Users/admin/builder/spi-builder-workspace/.dependencies/checkouts/swift-collections/Sources/HashTreeCollections/TreeDictionary/TreeDictionary+Descriptions.swift (in target 'HashTreeCollections' from project 'swift-collections')
    cd /Users/admin/builder/spi-builder-workspace/.swiftpm/xcode

SwiftCompile normal arm64 /Users/admin/builder/spi-builder-workspace/.dependencies/checkouts/swift-collections/Sources/HashTreeCollections/TreeDictionary/TreeDictionary+Equatable.swift (in target 'HashTreeCollections' from project 'swift-collections')
    cd /Users/admin/builder/spi-builder-workspace/.swiftpm/xcode

SwiftDriverJobDiscovery normal arm64 Compiling TreeSet+SetAlgebra isStrictSuperset.swift, TreeSet+SetAlgebra isSubset.swift, TreeSet+SetAlgebra isSuperset.swift, TreeSet+SetAlgebra subtract.swift, TreeSet+SetAlgebra subtracting.swift, TreeSet+SetAlgebra symmetricDifference.swift, TreeSet+SetAlgebra union.swift, TreeSet.swift (in target 'HashTreeCollections' from project 'swift-collections')
SwiftCompile normal arm64 Compiling\ _HashNode+Structural\ isEqualSet.swift,\ _HashNode+Structural\ isSubset.swift,\ _HashNode+Structural\ mapValues.swift,\ _HashNode+Structural\ merge.swift,\ _HashNode+Structural\ subtracting.swift,\ _HashNode+Structural\ symmetricDifference.swift,\ _HashNode+Structural\ union.swift,\ _HashNode+Subtree\ Insertions.swift,\ _HashNode+Subtree\ Modify.swift /Users/admin/builder/spi-builder-workspace/.dependencies/checkouts/swift-collections/Sources/HashTreeCollections/HashNode/_HashNode+Structural\ isEqualSet.swift /Users/admin/builder/spi-builder-workspace/.dependencies/checkouts/swift-collections/Sources/HashTreeCollections/HashNode/_HashNode+Structural\ isSubset.swift /Users/admin/builder/spi-builder-workspace/.dependencies/checkouts/swift-collections/Sources/HashTreeCollections/HashNode/_HashNode+Structural\ mapValues.swift /Users/admin/builder/spi-builder-workspace/.dependencies/checkouts/swift-collections/Sources/HashTreeCollections/HashNode/_HashNode+Structural\ merge.swift /Users/admin/builder/spi-builder-workspace/.dependencies/checkouts/swift-collections/Sources/HashTreeCollections/HashNode/_HashNode+Structural\ subtracting.swift /Users/admin/builder/spi-builder-workspace/.dependencies/checkouts/swift-collections/Sources/HashTreeCollections/HashNode/_HashNode+Structural\ symmetricDifference.swift /Users/admin/builder/spi-builder-workspace/.dependencies/checkouts/swift-collections/Sources/HashTreeCollections/HashNode/_HashNode+Structural\ union.swift /Users/admin/builder/spi-builder-workspace/.dependencies/checkouts/swift-collections/Sources/HashTreeCollections/HashNode/_HashNode+Subtree\ Insertions.swift /Users/admin/builder/spi-builder-workspace/.dependencies/checkouts/swift-collections/Sources/HashTreeCollections/HashNode/_HashNode+Subtree\ Modify.swift (in target 'HashTreeCollections' from project 'swift-collections')
SwiftCompile normal arm64 /Users/admin/builder/spi-builder-workspace/.dependencies/checkouts/swift-collections/Sources/HashTreeCollections/HashNode/_HashNode+Structural\ isEqualSet.swift (in target 'HashTreeCollections' from project 'swift-collections')
    cd /Users/admin/builder/spi-builder-workspace/.swiftpm/xcode

SwiftCompile normal arm64 /Users/admin/builder/spi-builder-workspace/.dependencies/checkouts/swift-collections/Sources/HashTreeCollections/HashNode/_HashNode+Structural\ isSubset.swift (in target 'HashTreeCollections' from project 'swift-collections')
    cd /Users/admin/builder/spi-builder-workspace/.swiftpm/xcode

SwiftCompile normal arm64 /Users/admin/builder/spi-builder-workspace/.dependencies/checkouts/swift-collections/Sources/HashTreeCollections/HashNode/_HashNode+Structural\ mapValues.swift (in target 'HashTreeCollections' from project 'swift-collections')
    cd /Users/admin/builder/spi-builder-workspace/.swiftpm/xcode

SwiftCompile normal arm64 /Users/admin/builder/spi-builder-workspace/.dependencies/checkouts/swift-collections/Sources/HashTreeCollections/HashNode/_HashNode+Structural\ merge.swift (in target 'HashTreeCollections' from project 'swift-collections')
    cd /Users/admin/builder/spi-builder-workspace/.swiftpm/xcode

SwiftCompile normal arm64 /Users/admin/builder/spi-builder-workspace/.dependencies/checkouts/swift-collections/Sources/HashTreeCollections/HashNode/_HashNode+Structural\ subtracting.swift (in target 'HashTreeCollections' from project 'swift-collections')
    cd /Users/admin/builder/spi-builder-workspace/.swiftpm/xcode

SwiftCompile normal arm64 /Users/admin/builder/spi-builder-workspace/.dependencies/checkouts/swift-collections/Sources/HashTreeCollections/HashNode/_HashNode+Structural\ symmetricDifference.swift (in target 'HashTreeCollections' from project 'swift-collections')
    cd /Users/admin/builder/spi-builder-workspace/.swiftpm/xcode

SwiftCompile normal arm64 /Users/admin/builder/spi-builder-workspace/.dependencies/checkouts/swift-collections/Sources/HashTreeCollections/HashNode/_HashNode+Structural\ union.swift (in target 'HashTreeCollections' from project 'swift-collections')
    cd /Users/admin/builder/spi-builder-workspace/.swiftpm/xcode

SwiftCompile normal arm64 /Users/admin/builder/spi-builder-workspace/.dependencies/checkouts/swift-collections/Sources/HashTreeCollections/HashNode/_HashNode+Subtree\ Insertions.swift (in target 'HashTreeCollections' from project 'swift-collections')
    cd /Users/admin/builder/spi-builder-workspace/.swiftpm/xcode

SwiftCompile normal arm64 /Users/admin/builder/spi-builder-workspace/.dependencies/checkouts/swift-collections/Sources/HashTreeCollections/HashNode/_HashNode+Subtree\ Modify.swift (in target 'HashTreeCollections' from project 'swift-collections')
    cd /Users/admin/builder/spi-builder-workspace/.swiftpm/xcode

SwiftDriverJobDiscovery normal arm64 Emitting module for HashTreeCollections (in target 'HashTreeCollections' from project 'swift-collections')
SwiftDriver\ Compilation\ Requirements HashTreeCollections normal arm64 com.apple.xcode.tools.swift.compiler (in target 'HashTreeCollections' from project 'swift-collections')
    cd /Users/admin/builder/spi-builder-workspace/.swiftpm/xcode
    builtin-Swift-Compilation-Requirements -- /Applications/Xcode-16.3.0.app/Contents/Developer/Toolchains/XcodeDefault.xctoolchain/usr/bin/swiftc -module-name HashTreeCollections -Onone -enforce-exclusivity\=checked @/Users/admin/builder/spi-builder-workspace/.derivedData/Build/Intermediates.noindex/swift-collections.build/Debug-iphoneos/HashTreeCollections.build/Objects-normal/arm64/HashTreeCollections.SwiftFileList -DSWIFT_PACKAGE -DDEBUG -DCOLLECTIONS_RANDOMIZED_TESTING -DXcode -plugin-path /Applications/Xcode-16.3.0.app/Contents/Developer/Toolchains/XcodeDefault.xctoolchain/usr/lib/swift/host/plugins/testing -enable-experimental-feature DebugDescriptionMacro -sdk /Applications/Xcode-16.3.0.app/Contents/Developer/Platforms/iPhoneOS.platform/Developer/SDKs/iPhoneOS18.4.sdk -target arm64-apple-ios12.0 -g -module-cache-path /Users/admin/builder/spi-builder-workspace/.derivedData/ModuleCache.noindex -Xfrontend -serialize-debugging-options -enable-testing -suppress-warnings -index-store-path /Users/admin/builder/spi-builder-workspace/.derivedData/Index.noindex/DataStore -swift-version 5 -I /Users/admin/builder/spi-builder-workspace/.derivedData/Build/Products/Debug-iphoneos -I /Applications/Xcode-16.3.0.app/Contents/Developer/Platforms/iPhoneOS.platform/Developer/usr/lib -F /Users/admin/builder/spi-builder-workspace/.derivedData/Build/Products/Debug-iphoneos/PackageFrameworks -F /Users/admin/builder/spi-builder-workspace/.derivedData/Build/Products/Debug-iphoneos -F /Applications/Xcode-16.3.0.app/Contents/Developer/Platforms/iPhoneOS.platform/Developer/Library/Frameworks -F /Applications/Xcode-16.3.0.app/Contents/Developer/Platforms/iPhoneOS.platform/Developer/SDKs/iPhoneOS18.4.sdk/Developer/Library/Frameworks -c -j10 -enable-batch-mode -incremental -Xcc -ivfsstatcache -Xcc /Users/admin/builder/spi-builder-workspace/.derivedData/SDKStatCaches.noindex/iphoneos18.4-22E235-339d34bc69d7fc736c3220795c36f340.sdkstatcache -output-file-map /Users/admin/builder/spi-builder-workspace/.derivedData/Build/Intermediates.noindex/swift-collections.build/Debug-iphoneos/HashTreeCollections.build/Objects-normal/arm64/HashTreeCollections-OutputFileMap.json -use-frontend-parseable-output -save-temps -no-color-diagnostics -serialize-diagnostics -emit-dependencies -emit-module -emit-module-path /Users/admin/builder/spi-builder-workspace/.derivedData/Build/Intermediates.noindex/swift-collections.build/Debug-iphoneos/HashTreeCollections.build/Objects-normal/arm64/HashTreeCollections.swiftmodule -validate-clang-modules-once -clang-build-session-file /Users/admin/builder/spi-builder-workspace/.derivedData/ModuleCache.noindex/Session.modulevalidation -Xcc -I/Users/admin/builder/spi-builder-workspace/.derivedData/Build/Intermediates.noindex/swift-collections.build/Debug-iphoneos/HashTreeCollections.build/swift-overrides.hmap -emit-const-values -Xfrontend -const-gather-protocols-file -Xfrontend /Users/admin/builder/spi-builder-workspace/.derivedData/Build/Intermediates.noindex/swift-collections.build/Debug-iphoneos/HashTreeCollections.build/Objects-normal/arm64/HashTreeCollections_const_extract_protocols.json -Xcc -I/Users/admin/builder/spi-builder-workspace/.derivedData/Build/Products/Debug-iphoneos/include -Xcc -I/Users/admin/builder/spi-builder-workspace/.derivedData/Build/Intermediates.noindex/swift-collections.build/Debug-iphoneos/HashTreeCollections.build/DerivedSources-normal/arm64 -Xcc -I/Users/admin/builder/spi-builder-workspace/.derivedData/Build/Intermediates.noindex/swift-collections.build/Debug-iphoneos/HashTreeCollections.build/DerivedSources/arm64 -Xcc -I/Users/admin/builder/spi-builder-workspace/.derivedData/Build/Intermediates.noindex/swift-collections.build/Debug-iphoneos/HashTreeCollections.build/DerivedSources -Xcc -DSWIFT_PACKAGE -Xcc -DDEBUG\=1 -emit-objc-header -emit-objc-header-path /Users/admin/builder/spi-builder-workspace/.derivedData/Build/Intermediates.noindex/swift-collections.build/Debug-iphoneos/HashTreeCollections.build/Objects-normal/arm64/HashTreeCollections-Swift.h -working-directory /Users/admin/builder/spi-builder-workspace/.swiftpm/xcode -experimental-emit-module-separately -disable-cmo
SwiftDriverJobDiscovery normal arm64 Compiling _Hashtable+Header.swift, OrderedDictionary+Codable.swift, OrderedDictionary+CustomReflectable.swift, OrderedDictionary+Deprecations.swift, OrderedDictionary+Descriptions.swift, OrderedDictionary+Elements.SubSequence.swift (in target 'OrderedCollections' from project 'swift-collections')
SwiftCompile normal arm64 Compiling\ TreeSet+Equatable.swift,\ TreeSet+ExpressibleByArrayLiteral.swift,\ TreeSet+Extras.swift,\ TreeSet+Filter.swift,\ TreeSet+Hashable.swift,\ TreeSet+Sendable.swift,\ TreeSet+Sequence.swift,\ TreeSet+SetAlgebra\ Initializers.swift /Users/admin/builder/spi-builder-workspace/.dependencies/checkouts/swift-collections/Sources/HashTreeCollections/TreeSet/TreeSet+Equatable.swift /Users/admin/builder/spi-builder-workspace/.dependencies/checkouts/swift-collections/Sources/HashTreeCollections/TreeSet/TreeSet+ExpressibleByArrayLiteral.swift /Users/admin/builder/spi-builder-workspace/.dependencies/checkouts/swift-collections/Sources/HashTreeCollections/TreeSet/TreeSet+Extras.swift /Users/admin/builder/spi-builder-workspace/.dependencies/checkouts/swift-collections/Sources/HashTreeCollections/TreeSet/TreeSet+Filter.swift /Users/admin/builder/spi-builder-workspace/.dependencies/checkouts/swift-collections/Sources/HashTreeCollections/TreeSet/TreeSet+Hashable.swift /Users/admin/builder/spi-builder-workspace/.dependencies/checkouts/swift-collections/Sources/HashTreeCollections/TreeSet/TreeSet+Sendable.swift /Users/admin/builder/spi-builder-workspace/.dependencies/checkouts/swift-collections/Sources/HashTreeCollections/TreeSet/TreeSet+Sequence.swift /Users/admin/builder/spi-builder-workspace/.dependencies/checkouts/swift-collections/Sources/HashTreeCollections/TreeSet/TreeSet+SetAlgebra\ Initializers.swift (in target 'HashTreeCollections' from project 'swift-collections')
SwiftCompile normal arm64 /Users/admin/builder/spi-builder-workspace/.dependencies/checkouts/swift-collections/Sources/HashTreeCollections/TreeSet/TreeSet+Equatable.swift (in target 'HashTreeCollections' from project 'swift-collections')
    cd /Users/admin/builder/spi-builder-workspace/.swiftpm/xcode

SwiftCompile normal arm64 /Users/admin/builder/spi-builder-workspace/.dependencies/checkouts/swift-collections/Sources/HashTreeCollections/TreeSet/TreeSet+ExpressibleByArrayLiteral.swift (in target 'HashTreeCollections' from project 'swift-collections')
    cd /Users/admin/builder/spi-builder-workspace/.swiftpm/xcode

SwiftCompile normal arm64 /Users/admin/builder/spi-builder-workspace/.dependencies/checkouts/swift-collections/Sources/HashTreeCollections/TreeSet/TreeSet+Extras.swift (in target 'HashTreeCollections' from project 'swift-collections')
    cd /Users/admin/builder/spi-builder-workspace/.swiftpm/xcode

SwiftCompile normal arm64 /Users/admin/builder/spi-builder-workspace/.dependencies/checkouts/swift-collections/Sources/HashTreeCollections/TreeSet/TreeSet+Filter.swift (in target 'HashTreeCollections' from project 'swift-collections')
    cd /Users/admin/builder/spi-builder-workspace/.swiftpm/xcode

SwiftCompile normal arm64 /Users/admin/builder/spi-builder-workspace/.dependencies/checkouts/swift-collections/Sources/HashTreeCollections/TreeSet/TreeSet+Hashable.swift (in target 'HashTreeCollections' from project 'swift-collections')
    cd /Users/admin/builder/spi-builder-workspace/.swiftpm/xcode

SwiftCompile normal arm64 /Users/admin/builder/spi-builder-workspace/.dependencies/checkouts/swift-collections/Sources/HashTreeCollections/TreeSet/TreeSet+Sendable.swift (in target 'HashTreeCollections' from project 'swift-collections')
    cd /Users/admin/builder/spi-builder-workspace/.swiftpm/xcode

SwiftCompile normal arm64 /Users/admin/builder/spi-builder-workspace/.dependencies/checkouts/swift-collections/Sources/HashTreeCollections/TreeSet/TreeSet+Sequence.swift (in target 'HashTreeCollections' from project 'swift-collections')
    cd /Users/admin/builder/spi-builder-workspace/.swiftpm/xcode

SwiftCompile normal arm64 /Users/admin/builder/spi-builder-workspace/.dependencies/checkouts/swift-collections/Sources/HashTreeCollections/TreeSet/TreeSet+SetAlgebra\ Initializers.swift (in target 'HashTreeCollections' from project 'swift-collections')
    cd /Users/admin/builder/spi-builder-workspace/.swiftpm/xcode

Copy /Users/admin/builder/spi-builder-workspace/.derivedData/Build/Products/Debug-iphoneos/HashTreeCollections.swiftmodule/arm64-apple-ios.abi.json /Users/admin/builder/spi-builder-workspace/.derivedData/Build/Intermediates.noindex/swift-collections.build/Debug-iphoneos/HashTreeCollections.build/Objects-normal/arm64/HashTreeCollections.abi.json (in target 'HashTreeCollections' from project 'swift-collections')
    cd /Users/admin/builder/spi-builder-workspace/.dependencies/checkouts/swift-collections
    builtin-copy -exclude .DS_Store -exclude CVS -exclude .svn -exclude .git -exclude .hg -resolve-src-symlinks -rename /Users/admin/builder/spi-builder-workspace/.derivedData/Build/Intermediates.noindex/swift-collections.build/Debug-iphoneos/HashTreeCollections.build/Objects-normal/arm64/HashTreeCollections.abi.json /Users/admin/builder/spi-builder-workspace/.derivedData/Build/Products/Debug-iphoneos/HashTreeCollections.swiftmodule/arm64-apple-ios.abi.json
SwiftDriverJobDiscovery normal arm64 Compiling TreeSet+SetAlgebra basics.swift, TreeSet+SetAlgebra formIntersection.swift, TreeSet+SetAlgebra formSymmetricDifference.swift, TreeSet+SetAlgebra formUnion.swift, TreeSet+SetAlgebra intersection.swift, TreeSet+SetAlgebra isDisjoint.swift, TreeSet+SetAlgebra isEqualSet.swift, TreeSet+SetAlgebra isStrictSubset.swift (in target 'HashTreeCollections' from project 'swift-collections')
SwiftCompile normal arm64 Compiling\ Deque+Equatable.swift,\ Deque+ExpressibleByArrayLiteral.swift /Users/admin/builder/spi-builder-workspace/.dependencies/checkouts/swift-collections/Sources/DequeModule/Deque+Equatable.swift /Users/admin/builder/spi-builder-workspace/.dependencies/checkouts/swift-collections/Sources/DequeModule/Deque+ExpressibleByArrayLiteral.swift (in target 'DequeModule' from project 'swift-collections')
SwiftCompile normal arm64 /Users/admin/builder/spi-builder-workspace/.dependencies/checkouts/swift-collections/Sources/DequeModule/Deque+Equatable.swift (in target 'DequeModule' from project 'swift-collections')
    cd /Users/admin/builder/spi-builder-workspace/.swiftpm/xcode

SwiftCompile normal arm64 /Users/admin/builder/spi-builder-workspace/.dependencies/checkouts/swift-collections/Sources/DequeModule/Deque+ExpressibleByArrayLiteral.swift (in target 'DequeModule' from project 'swift-collections')
    cd /Users/admin/builder/spi-builder-workspace/.swiftpm/xcode

SwiftCompile normal arm64 Compiling\ BitSet+CustomDebugStringConvertible.swift,\ BitSet+CustomReflectable.swift,\ BitSet+CustomStringConvertible.swift,\ BitSet+Equatable.swift,\ BitSet+ExpressibleByArrayLiteral.swift,\ BitSet+Extras.swift /Users/admin/builder/spi-builder-workspace/.dependencies/checkouts/swift-collections/Sources/BitCollections/BitSet/BitSet+CustomDebugStringConvertible.swift /Users/admin/builder/spi-builder-workspace/.dependencies/checkouts/swift-collections/Sources/BitCollections/BitSet/BitSet+CustomReflectable.swift /Users/admin/builder/spi-builder-workspace/.dependencies/checkouts/swift-collections/Sources/BitCollections/BitSet/BitSet+CustomStringConvertible.swift /Users/admin/builder/spi-builder-workspace/.dependencies/checkouts/swift-collections/Sources/BitCollections/BitSet/BitSet+Equatable.swift /Users/admin/builder/spi-builder-workspace/.dependencies/checkouts/swift-collections/Sources/BitCollections/BitSet/BitSet+ExpressibleByArrayLiteral.swift /Users/admin/builder/spi-builder-workspace/.dependencies/checkouts/swift-collections/Sources/BitCollections/BitSet/BitSet+Extras.swift (in target 'BitCollections' from project 'swift-collections')
SwiftCompile normal arm64 /Users/admin/builder/spi-builder-workspace/.dependencies/checkouts/swift-collections/Sources/BitCollections/BitSet/BitSet+CustomDebugStringConvertible.swift (in target 'BitCollections' from project 'swift-collections')
    cd /Users/admin/builder/spi-builder-workspace/.swiftpm/xcode

SwiftCompile normal arm64 /Users/admin/builder/spi-builder-workspace/.dependencies/checkouts/swift-collections/Sources/BitCollections/BitSet/BitSet+CustomReflectable.swift (in target 'BitCollections' from project 'swift-collections')
    cd /Users/admin/builder/spi-builder-workspace/.swiftpm/xcode

SwiftCompile normal arm64 /Users/admin/builder/spi-builder-workspace/.dependencies/checkouts/swift-collections/Sources/BitCollections/BitSet/BitSet+CustomStringConvertible.swift (in target 'BitCollections' from project 'swift-collections')
    cd /Users/admin/builder/spi-builder-workspace/.swiftpm/xcode

SwiftCompile normal arm64 /Users/admin/builder/spi-builder-workspace/.dependencies/checkouts/swift-collections/Sources/BitCollections/BitSet/BitSet+Equatable.swift (in target 'BitCollections' from project 'swift-collections')
    cd /Users/admin/builder/spi-builder-workspace/.swiftpm/xcode

SwiftCompile normal arm64 /Users/admin/builder/spi-builder-workspace/.dependencies/checkouts/swift-collections/Sources/BitCollections/BitSet/BitSet+ExpressibleByArrayLiteral.swift (in target 'BitCollections' from project 'swift-collections')
    cd /Users/admin/builder/spi-builder-workspace/.swiftpm/xcode

SwiftCompile normal arm64 /Users/admin/builder/spi-builder-workspace/.dependencies/checkouts/swift-collections/Sources/BitCollections/BitSet/BitSet+Extras.swift (in target 'BitCollections' from project 'swift-collections')
    cd /Users/admin/builder/spi-builder-workspace/.swiftpm/xcode

SwiftDriverJobDiscovery normal arm64 Compiling TreeDictionary+ExpressibleByDictionaryLiteral.swift, TreeDictionary+Filter.swift, TreeDictionary+Hashable.swift, TreeDictionary+Initializers.swift, TreeDictionary+Keys.swift, TreeDictionary+MapValues.swift, TreeDictionary+Merge.swift, TreeDictionary+Sendable.swift (in target 'HashTreeCollections' from project 'swift-collections')
SwiftCompile normal arm64 Compiling\ BitSet.swift,\ Range+Utilities.swift,\ Slice+Utilities.swift,\ UInt+Tricks.swift,\ _Word.swift /Users/admin/builder/spi-builder-workspace/.dependencies/checkouts/swift-collections/Sources/BitCollections/BitSet/BitSet.swift /Users/admin/builder/spi-builder-workspace/.dependencies/checkouts/swift-collections/Sources/BitCollections/Shared/Range+Utilities.swift /Users/admin/builder/spi-builder-workspace/.dependencies/checkouts/swift-collections/Sources/BitCollections/Shared/Slice+Utilities.swift /Users/admin/builder/spi-builder-workspace/.dependencies/checkouts/swift-collections/Sources/BitCollections/Shared/UInt+Tricks.swift /Users/admin/builder/spi-builder-workspace/.dependencies/checkouts/swift-collections/Sources/BitCollections/Shared/_Word.swift (in target 'BitCollections' from project 'swift-collections')
SwiftCompile normal arm64 /Users/admin/builder/spi-builder-workspace/.dependencies/checkouts/swift-collections/Sources/BitCollections/BitSet/BitSet.swift (in target 'BitCollections' from project 'swift-collections')
    cd /Users/admin/builder/spi-builder-workspace/.swiftpm/xcode

SwiftCompile normal arm64 /Users/admin/builder/spi-builder-workspace/.dependencies/checkouts/swift-collections/Sources/BitCollections/Shared/Range+Utilities.swift (in target 'BitCollections' from project 'swift-collections')
    cd /Users/admin/builder/spi-builder-workspace/.swiftpm/xcode

SwiftCompile normal arm64 /Users/admin/builder/spi-builder-workspace/.dependencies/checkouts/swift-collections/Sources/BitCollections/Shared/Slice+Utilities.swift (in target 'BitCollections' from project 'swift-collections')
    cd /Users/admin/builder/spi-builder-workspace/.swiftpm/xcode

SwiftCompile normal arm64 /Users/admin/builder/spi-builder-workspace/.dependencies/checkouts/swift-collections/Sources/BitCollections/Shared/UInt+Tricks.swift (in target 'BitCollections' from project 'swift-collections')
    cd /Users/admin/builder/spi-builder-workspace/.swiftpm/xcode

SwiftCompile normal arm64 /Users/admin/builder/spi-builder-workspace/.dependencies/checkouts/swift-collections/Sources/BitCollections/Shared/_Word.swift (in target 'BitCollections' from project 'swift-collections')
    cd /Users/admin/builder/spi-builder-workspace/.swiftpm/xcode

SwiftDriverJobDiscovery normal arm64 Compiling Deque+Equatable.swift, Deque+ExpressibleByArrayLiteral.swift (in target 'DequeModule' from project 'swift-collections')
SwiftDriver\ Compilation DequeModule normal arm64 com.apple.xcode.tools.swift.compiler (in target 'DequeModule' from project 'swift-collections')
    cd /Users/admin/builder/spi-builder-workspace/.swiftpm/xcode
    builtin-Swift-Compilation -- /Applications/Xcode-16.3.0.app/Contents/Developer/Toolchains/XcodeDefault.xctoolchain/usr/bin/swiftc -module-name DequeModule -Onone -enforce-exclusivity\=checked @/Users/admin/builder/spi-builder-workspace/.derivedData/Build/Intermediates.noindex/swift-collections.build/Debug-iphoneos/DequeModule.build/Objects-normal/arm64/DequeModule.SwiftFileList -DSWIFT_PACKAGE -DDEBUG -DCOLLECTIONS_RANDOMIZED_TESTING -DXcode -plugin-path /Applications/Xcode-16.3.0.app/Contents/Developer/Toolchains/XcodeDefault.xctoolchain/usr/lib/swift/host/plugins/testing -enable-experimental-feature DebugDescriptionMacro -sdk /Applications/Xcode-16.3.0.app/Contents/Developer/Platforms/iPhoneOS.platform/Developer/SDKs/iPhoneOS18.4.sdk -target arm64-apple-ios12.0 -g -module-cache-path /Users/admin/builder/spi-builder-workspace/.derivedData/ModuleCache.noindex -Xfrontend -serialize-debugging-options -enable-testing -suppress-warnings -index-store-path /Users/admin/builder/spi-builder-workspace/.derivedData/Index.noindex/DataStore -swift-version 5 -I /Users/admin/builder/spi-builder-workspace/.derivedData/Build/Products/Debug-iphoneos -I /Applications/Xcode-16.3.0.app/Contents/Developer/Platforms/iPhoneOS.platform/Developer/usr/lib -F /Users/admin/builder/spi-builder-workspace/.derivedData/Build/Products/Debug-iphoneos/PackageFrameworks -F /Users/admin/builder/spi-builder-workspace/.derivedData/Build/Products/Debug-iphoneos -F /Applications/Xcode-16.3.0.app/Contents/Developer/Platforms/iPhoneOS.platform/Developer/Library/Frameworks -F /Applications/Xcode-16.3.0.app/Contents/Developer/Platforms/iPhoneOS.platform/Developer/SDKs/iPhoneOS18.4.sdk/Developer/Library/Frameworks -c -j10 -enable-batch-mode -incremental -Xcc -ivfsstatcache -Xcc /Users/admin/builder/spi-builder-workspace/.derivedData/SDKStatCaches.noindex/iphoneos18.4-22E235-339d34bc69d7fc736c3220795c36f340.sdkstatcache -output-file-map /Users/admin/builder/spi-builder-workspace/.derivedData/Build/Intermediates.noindex/swift-collections.build/Debug-iphoneos/DequeModule.build/Objects-normal/arm64/DequeModule-OutputFileMap.json -use-frontend-parseable-output -save-temps -no-color-diagnostics -serialize-diagnostics -emit-dependencies -emit-module -emit-module-path /Users/admin/builder/spi-builder-workspace/.derivedData/Build/Intermediates.noindex/swift-collections.build/Debug-iphoneos/DequeModule.build/Objects-normal/arm64/DequeModule.swiftmodule -validate-clang-modules-once -clang-build-session-file /Users/admin/builder/spi-builder-workspace/.derivedData/ModuleCache.noindex/Session.modulevalidation -Xcc -I/Users/admin/builder/spi-builder-workspace/.derivedData/Build/Intermediates.noindex/swift-collections.build/Debug-iphoneos/DequeModule.build/swift-overrides.hmap -emit-const-values -Xfrontend -const-gather-protocols-file -Xfrontend /Users/admin/builder/spi-builder-workspace/.derivedData/Build/Intermediates.noindex/swift-collections.build/Debug-iphoneos/DequeModule.build/Objects-normal/arm64/DequeModule_const_extract_protocols.json -Xcc -I/Users/admin/builder/spi-builder-workspace/.derivedData/Build/Products/Debug-iphoneos/include -Xcc -I/Users/admin/builder/spi-builder-workspace/.derivedData/Build/Intermediates.noindex/swift-collections.build/Debug-iphoneos/DequeModule.build/DerivedSources-normal/arm64 -Xcc -I/Users/admin/builder/spi-builder-workspace/.derivedData/Build/Intermediates.noindex/swift-collections.build/Debug-iphoneos/DequeModule.build/DerivedSources/arm64 -Xcc -I/Users/admin/builder/spi-builder-workspace/.derivedData/Build/Intermediates.noindex/swift-collections.build/Debug-iphoneos/DequeModule.build/DerivedSources -Xcc -DSWIFT_PACKAGE -Xcc -DDEBUG\=1 -emit-objc-header -emit-objc-header-path /Users/admin/builder/spi-builder-workspace/.derivedData/Build/Intermediates.noindex/swift-collections.build/Debug-iphoneos/DequeModule.build/Objects-normal/arm64/DequeModule-Swift.h -working-directory /Users/admin/builder/spi-builder-workspace/.swiftpm/xcode -experimental-emit-module-separately -disable-cmo
SwiftDriverJobDiscovery normal arm64 Compiling TreeSet+Equatable.swift, TreeSet+ExpressibleByArrayLiteral.swift, TreeSet+Extras.swift, TreeSet+Filter.swift, TreeSet+Hashable.swift, TreeSet+Sendable.swift, TreeSet+Sequence.swift, TreeSet+SetAlgebra Initializers.swift (in target 'HashTreeCollections' from project 'swift-collections')
SwiftCompile normal arm64 Compiling\ BitArray+Shifts.swift,\ BitArray+Testing.swift,\ BitArray._UnsafeHandle.swift,\ BitArray.swift,\ BitSet+BidirectionalCollection.swift,\ BitSet+Codable.swift /Users/admin/builder/spi-builder-workspace/.dependencies/checkouts/swift-collections/Sources/BitCollections/BitArray/BitArray+Shifts.swift /Users/admin/builder/spi-builder-workspace/.dependencies/checkouts/swift-collections/Sources/BitCollections/BitArray/BitArray+Testing.swift /Users/admin/builder/spi-builder-workspace/.dependencies/checkouts/swift-collections/Sources/BitCollections/BitArray/BitArray._UnsafeHandle.swift /Users/admin/builder/spi-builder-workspace/.dependencies/checkouts/swift-collections/Sources/BitCollections/BitArray/BitArray.swift /Users/admin/builder/spi-builder-workspace/.dependencies/checkouts/swift-collections/Sources/BitCollections/BitSet/BitSet+BidirectionalCollection.swift /Users/admin/builder/spi-builder-workspace/.dependencies/checkouts/swift-collections/Sources/BitCollections/BitSet/BitSet+Codable.swift (in target 'BitCollections' from project 'swift-collections')
SwiftCompile normal arm64 /Users/admin/builder/spi-builder-workspace/.dependencies/checkouts/swift-collections/Sources/BitCollections/BitArray/BitArray+Shifts.swift (in target 'BitCollections' from project 'swift-collections')
    cd /Users/admin/builder/spi-builder-workspace/.swiftpm/xcode

SwiftCompile normal arm64 /Users/admin/builder/spi-builder-workspace/.dependencies/checkouts/swift-collections/Sources/BitCollections/BitArray/BitArray+Testing.swift (in target 'BitCollections' from project 'swift-collections')
    cd /Users/admin/builder/spi-builder-workspace/.swiftpm/xcode

SwiftCompile normal arm64 /Users/admin/builder/spi-builder-workspace/.dependencies/checkouts/swift-collections/Sources/BitCollections/BitArray/BitArray._UnsafeHandle.swift (in target 'BitCollections' from project 'swift-collections')
    cd /Users/admin/builder/spi-builder-workspace/.swiftpm/xcode

SwiftCompile normal arm64 /Users/admin/builder/spi-builder-workspace/.dependencies/checkouts/swift-collections/Sources/BitCollections/BitArray/BitArray.swift (in target 'BitCollections' from project 'swift-collections')
    cd /Users/admin/builder/spi-builder-workspace/.swiftpm/xcode

SwiftCompile normal arm64 /Users/admin/builder/spi-builder-workspace/.dependencies/checkouts/swift-collections/Sources/BitCollections/BitSet/BitSet+BidirectionalCollection.swift (in target 'BitCollections' from project 'swift-collections')
    cd /Users/admin/builder/spi-builder-workspace/.swiftpm/xcode

SwiftCompile normal arm64 /Users/admin/builder/spi-builder-workspace/.dependencies/checkouts/swift-collections/Sources/BitCollections/BitSet/BitSet+Codable.swift (in target 'BitCollections' from project 'swift-collections')
    cd /Users/admin/builder/spi-builder-workspace/.swiftpm/xcode

SwiftCompile normal arm64 Compiling\ BitSet+SetAlgebra\ symmetricDifference.swift,\ BitSet+SetAlgebra\ union.swift,\ BitSet+Sorted\ Collection\ APIs.swift,\ BitSet.Counted.swift,\ BitSet.Index.swift,\ BitSet._UnsafeHandle.swift /Users/admin/builder/spi-builder-workspace/.dependencies/checkouts/swift-collections/Sources/BitCollections/BitSet/BitSet+SetAlgebra\ symmetricDifference.swift /Users/admin/builder/spi-builder-workspace/.dependencies/checkouts/swift-collections/Sources/BitCollections/BitSet/BitSet+SetAlgebra\ union.swift /Users/admin/builder/spi-builder-workspace/.dependencies/checkouts/swift-collections/Sources/BitCollections/BitSet/BitSet+Sorted\ Collection\ APIs.swift /Users/admin/builder/spi-builder-workspace/.dependencies/checkouts/swift-collections/Sources/BitCollections/BitSet/BitSet.Counted.swift /Users/admin/builder/spi-builder-workspace/.dependencies/checkouts/swift-collections/Sources/BitCollections/BitSet/BitSet.Index.swift /Users/admin/builder/spi-builder-workspace/.dependencies/checkouts/swift-collections/Sources/BitCollections/BitSet/BitSet._UnsafeHandle.swift (in target 'BitCollections' from project 'swift-collections')
SwiftCompile normal arm64 /Users/admin/builder/spi-builder-workspace/.dependencies/checkouts/swift-collections/Sources/BitCollections/BitSet/BitSet+SetAlgebra\ symmetricDifference.swift (in target 'BitCollections' from project 'swift-collections')
    cd /Users/admin/builder/spi-builder-workspace/.swiftpm/xcode

SwiftCompile normal arm64 /Users/admin/builder/spi-builder-workspace/.dependencies/checkouts/swift-collections/Sources/BitCollections/BitSet/BitSet+SetAlgebra\ union.swift (in target 'BitCollections' from project 'swift-collections')
    cd /Users/admin/builder/spi-builder-workspace/.swiftpm/xcode

SwiftCompile normal arm64 /Users/admin/builder/spi-builder-workspace/.dependencies/checkouts/swift-collections/Sources/BitCollections/BitSet/BitSet+Sorted\ Collection\ APIs.swift (in target 'BitCollections' from project 'swift-collections')
    cd /Users/admin/builder/spi-builder-workspace/.swiftpm/xcode

SwiftCompile normal arm64 /Users/admin/builder/spi-builder-workspace/.dependencies/checkouts/swift-collections/Sources/BitCollections/BitSet/BitSet.Counted.swift (in target 'BitCollections' from project 'swift-collections')
    cd /Users/admin/builder/spi-builder-workspace/.swiftpm/xcode

SwiftCompile normal arm64 /Users/admin/builder/spi-builder-workspace/.dependencies/checkouts/swift-collections/Sources/BitCollections/BitSet/BitSet.Index.swift (in target 'BitCollections' from project 'swift-collections')
    cd /Users/admin/builder/spi-builder-workspace/.swiftpm/xcode

SwiftCompile normal arm64 /Users/admin/builder/spi-builder-workspace/.dependencies/checkouts/swift-collections/Sources/BitCollections/BitSet/BitSet._UnsafeHandle.swift (in target 'BitCollections' from project 'swift-collections')
    cd /Users/admin/builder/spi-builder-workspace/.swiftpm/xcode

SwiftDriverJobDiscovery normal arm64 Compiling _HashTable+Bucket.swift, _HashTable+BucketIterator.swift, _HashTable+Constants.swift, _HashTable+CustomStringConvertible.swift, _HashTable+Testing.swift, _HashTable+UnsafeHandle.swift, _HashTable.swift (in target 'OrderedCollections' from project 'swift-collections')
SwiftCompile normal arm64 Compiling\ BitArray+Descriptions.swift,\ BitArray+Equatable.swift,\ BitArray+ExpressibleByArrayLiteral.swift,\ BitArray+ExpressibleByStringLiteral.swift,\ BitArray+Extras.swift,\ BitArray+Fill.swift /Users/admin/builder/spi-builder-workspace/.dependencies/checkouts/swift-collections/Sources/BitCollections/BitArray/BitArray+Descriptions.swift /Users/admin/builder/spi-builder-workspace/.dependencies/checkouts/swift-collections/Sources/BitCollections/BitArray/BitArray+Equatable.swift /Users/admin/builder/spi-builder-workspace/.dependencies/checkouts/swift-collections/Sources/BitCollections/BitArray/BitArray+ExpressibleByArrayLiteral.swift /Users/admin/builder/spi-builder-workspace/.dependencies/checkouts/swift-collections/Sources/BitCollections/BitArray/BitArray+ExpressibleByStringLiteral.swift /Users/admin/builder/spi-builder-workspace/.dependencies/checkouts/swift-collections/Sources/BitCollections/BitArray/BitArray+Extras.swift /Users/admin/builder/spi-builder-workspace/.dependencies/checkouts/swift-collections/Sources/BitCollections/BitArray/BitArray+Fill.swift (in target 'BitCollections' from project 'swift-collections')
SwiftCompile normal arm64 /Users/admin/builder/spi-builder-workspace/.dependencies/checkouts/swift-collections/Sources/BitCollections/BitArray/BitArray+Descriptions.swift (in target 'BitCollections' from project 'swift-collections')
    cd /Users/admin/builder/spi-builder-workspace/.swiftpm/xcode

SwiftCompile normal arm64 /Users/admin/builder/spi-builder-workspace/.dependencies/checkouts/swift-collections/Sources/BitCollections/BitArray/BitArray+Equatable.swift (in target 'BitCollections' from project 'swift-collections')
    cd /Users/admin/builder/spi-builder-workspace/.swiftpm/xcode

SwiftCompile normal arm64 /Users/admin/builder/spi-builder-workspace/.dependencies/checkouts/swift-collections/Sources/BitCollections/BitArray/BitArray+ExpressibleByArrayLiteral.swift (in target 'BitCollections' from project 'swift-collections')
    cd /Users/admin/builder/spi-builder-workspace/.swiftpm/xcode

SwiftCompile normal arm64 /Users/admin/builder/spi-builder-workspace/.dependencies/checkouts/swift-collections/Sources/BitCollections/BitArray/BitArray+ExpressibleByStringLiteral.swift (in target 'BitCollections' from project 'swift-collections')
    cd /Users/admin/builder/spi-builder-workspace/.swiftpm/xcode

SwiftCompile normal arm64 /Users/admin/builder/spi-builder-workspace/.dependencies/checkouts/swift-collections/Sources/BitCollections/BitArray/BitArray+Extras.swift (in target 'BitCollections' from project 'swift-collections')
    cd /Users/admin/builder/spi-builder-workspace/.swiftpm/xcode

SwiftCompile normal arm64 /Users/admin/builder/spi-builder-workspace/.dependencies/checkouts/swift-collections/Sources/BitCollections/BitArray/BitArray+Fill.swift (in target 'BitCollections' from project 'swift-collections')
    cd /Users/admin/builder/spi-builder-workspace/.swiftpm/xcode

SwiftDriverJobDiscovery normal arm64 Compiling TreeDictionary+Sequence.swift, TreeDictionary+Values.swift, TreeDictionary.swift, TreeSet+Codable.swift, TreeSet+Collection.swift, TreeSet+CustomReflectable.swift, TreeSet+Debugging.swift, TreeSet+Descriptions.swift (in target 'HashTreeCollections' from project 'swift-collections')
SwiftDriverJobDiscovery normal arm64 Compiling _HashNode+Lookups.swift, _HashNode+Primitive Insertions.swift, _HashNode+Primitive Removals.swift, _HashNode+Primitive Replacement.swift, _HashNode+Storage.swift, _HashNode+Structural compactMapValues.swift, _HashNode+Structural filter.swift, _HashNode+Structural intersection.swift, _HashNode+Structural isDisjoint.swift (in target 'HashTreeCollections' from project 'swift-collections')
SwiftDriver\ Compilation OrderedCollections normal arm64 com.apple.xcode.tools.swift.compiler (in target 'OrderedCollections' from project 'swift-collections')
    cd /Users/admin/builder/spi-builder-workspace/.swiftpm/xcode
    builtin-Swift-Compilation -- /Applications/Xcode-16.3.0.app/Contents/Developer/Toolchains/XcodeDefault.xctoolchain/usr/bin/swiftc -module-name OrderedCollections -Onone -enforce-exclusivity\=checked @/Users/admin/builder/spi-builder-workspace/.derivedData/Build/Intermediates.noindex/swift-collections.build/Debug-iphoneos/OrderedCollections.build/Objects-normal/arm64/OrderedCollections.SwiftFileList -DSWIFT_PACKAGE -DDEBUG -DCOLLECTIONS_RANDOMIZED_TESTING -DXcode -plugin-path /Applications/Xcode-16.3.0.app/Contents/Developer/Toolchains/XcodeDefault.xctoolchain/usr/lib/swift/host/plugins/testing -enable-experimental-feature DebugDescriptionMacro -sdk /Applications/Xcode-16.3.0.app/Contents/Developer/Platforms/iPhoneOS.platform/Developer/SDKs/iPhoneOS18.4.sdk -target arm64-apple-ios12.0 -g -module-cache-path /Users/admin/builder/spi-builder-workspace/.derivedData/ModuleCache.noindex -Xfrontend -serialize-debugging-options -enable-testing -suppress-warnings -index-store-path /Users/admin/builder/spi-builder-workspace/.derivedData/Index.noindex/DataStore -swift-version 5 -I /Users/admin/builder/spi-builder-workspace/.derivedData/Build/Products/Debug-iphoneos -I /Applications/Xcode-16.3.0.app/Contents/Developer/Platforms/iPhoneOS.platform/Developer/usr/lib -F /Users/admin/builder/spi-builder-workspace/.derivedData/Build/Products/Debug-iphoneos/PackageFrameworks -F /Users/admin/builder/spi-builder-workspace/.derivedData/Build/Products/Debug-iphoneos -F /Applications/Xcode-16.3.0.app/Contents/Developer/Platforms/iPhoneOS.platform/Developer/Library/Frameworks -F /Applications/Xcode-16.3.0.app/Contents/Developer/Platforms/iPhoneOS.platform/Developer/SDKs/iPhoneOS18.4.sdk/Developer/Library/Frameworks -c -j10 -enable-batch-mode -incremental -Xcc -ivfsstatcache -Xcc /Users/admin/builder/spi-builder-workspace/.derivedData/SDKStatCaches.noindex/iphoneos18.4-22E235-339d34bc69d7fc736c3220795c36f340.sdkstatcache -output-file-map /Users/admin/builder/spi-builder-workspace/.derivedData/Build/Intermediates.noindex/swift-collections.build/Debug-iphoneos/OrderedCollections.build/Objects-normal/arm64/OrderedCollections-OutputFileMap.json -use-frontend-parseable-output -save-temps -no-color-diagnostics -serialize-diagnostics -emit-dependencies -emit-module -emit-module-path /Users/admin/builder/spi-builder-workspace/.derivedData/Build/Intermediates.noindex/swift-collections.build/Debug-iphoneos/OrderedCollections.build/Objects-normal/arm64/OrderedCollections.swiftmodule -validate-clang-modules-once -clang-build-session-file /Users/admin/builder/spi-builder-workspace/.derivedData/ModuleCache.noindex/Session.modulevalidation -Xcc -I/Users/admin/builder/spi-builder-workspace/.derivedData/Build/Intermediates.noindex/swift-collections.build/Debug-iphoneos/OrderedCollections.build/swift-overrides.hmap -emit-const-values -Xfrontend -const-gather-protocols-file -Xfrontend /Users/admin/builder/spi-builder-workspace/.derivedData/Build/Intermediates.noindex/swift-collections.build/Debug-iphoneos/OrderedCollections.build/Objects-normal/arm64/OrderedCollections_const_extract_protocols.json -Xcc -I/Users/admin/builder/spi-builder-workspace/.derivedData/Build/Products/Debug-iphoneos/include -Xcc -I/Users/admin/builder/spi-builder-workspace/.derivedData/Build/Intermediates.noindex/swift-collections.build/Debug-iphoneos/OrderedCollections.build/DerivedSources-normal/arm64 -Xcc -I/Users/admin/builder/spi-builder-workspace/.derivedData/Build/Intermediates.noindex/swift-collections.build/Debug-iphoneos/OrderedCollections.build/DerivedSources/arm64 -Xcc -I/Users/admin/builder/spi-builder-workspace/.derivedData/Build/Intermediates.noindex/swift-collections.build/Debug-iphoneos/OrderedCollections.build/DerivedSources -Xcc -DSWIFT_PACKAGE -Xcc -DDEBUG\=1 -emit-objc-header -emit-objc-header-path /Users/admin/builder/spi-builder-workspace/.derivedData/Build/Intermediates.noindex/swift-collections.build/Debug-iphoneos/OrderedCollections.build/Objects-normal/arm64/OrderedCollections-Swift.h -working-directory /Users/admin/builder/spi-builder-workspace/.swiftpm/xcode -experimental-emit-module-separately -disable-cmo
SwiftCompile normal arm64 Compiling\ BitArray+BitwiseOperations.swift,\ BitArray+ChunkedBitsIterators.swift,\ BitArray+Codable.swift,\ BitArray+Collection.swift,\ BitArray+Copy.swift,\ BitArray+CustomReflectable.swift /Users/admin/builder/spi-builder-workspace/.dependencies/checkouts/swift-collections/Sources/BitCollections/BitArray/BitArray+BitwiseOperations.swift /Users/admin/builder/spi-builder-workspace/.dependencies/checkouts/swift-collections/Sources/BitCollections/BitArray/BitArray+ChunkedBitsIterators.swift /Users/admin/builder/spi-builder-workspace/.dependencies/checkouts/swift-collections/Sources/BitCollections/BitArray/BitArray+Codable.swift /Users/admin/builder/spi-builder-workspace/.dependencies/checkouts/swift-collections/Sources/BitCollections/BitArray/BitArray+Collection.swift /Users/admin/builder/spi-builder-workspace/.dependencies/checkouts/swift-collections/Sources/BitCollections/BitArray/BitArray+Copy.swift /Users/admin/builder/spi-builder-workspace/.dependencies/checkouts/swift-collections/Sources/BitCollections/BitArray/BitArray+CustomReflectable.swift (in target 'BitCollections' from project 'swift-collections')
SwiftCompile normal arm64 /Users/admin/builder/spi-builder-workspace/.dependencies/checkouts/swift-collections/Sources/BitCollections/BitArray/BitArray+BitwiseOperations.swift (in target 'BitCollections' from project 'swift-collections')
    cd /Users/admin/builder/spi-builder-workspace/.swiftpm/xcode

SwiftCompile normal arm64 /Users/admin/builder/spi-builder-workspace/.dependencies/checkouts/swift-collections/Sources/BitCollections/BitArray/BitArray+ChunkedBitsIterators.swift (in target 'BitCollections' from project 'swift-collections')
    cd /Users/admin/builder/spi-builder-workspace/.swiftpm/xcode

SwiftCompile normal arm64 /Users/admin/builder/spi-builder-workspace/.dependencies/checkouts/swift-collections/Sources/BitCollections/BitArray/BitArray+Codable.swift (in target 'BitCollections' from project 'swift-collections')
    cd /Users/admin/builder/spi-builder-workspace/.swiftpm/xcode

SwiftCompile normal arm64 /Users/admin/builder/spi-builder-workspace/.dependencies/checkouts/swift-collections/Sources/BitCollections/BitArray/BitArray+Collection.swift (in target 'BitCollections' from project 'swift-collections')
    cd /Users/admin/builder/spi-builder-workspace/.swiftpm/xcode

SwiftCompile normal arm64 /Users/admin/builder/spi-builder-workspace/.dependencies/checkouts/swift-collections/Sources/BitCollections/BitArray/BitArray+Copy.swift (in target 'BitCollections' from project 'swift-collections')
    cd /Users/admin/builder/spi-builder-workspace/.swiftpm/xcode

SwiftCompile normal arm64 /Users/admin/builder/spi-builder-workspace/.dependencies/checkouts/swift-collections/Sources/BitCollections/BitArray/BitArray+CustomReflectable.swift (in target 'BitCollections' from project 'swift-collections')
    cd /Users/admin/builder/spi-builder-workspace/.swiftpm/xcode

SwiftCompile normal arm64 Compiling\ BitSet+Hashable.swift,\ BitSet+Initializers.swift,\ BitSet+Invariants.swift,\ BitSet+Random.swift,\ BitSet+SetAlgebra\ basics.swift,\ BitSet+SetAlgebra\ conformance.swift /Users/admin/builder/spi-builder-workspace/.dependencies/checkouts/swift-collections/Sources/BitCollections/BitSet/BitSet+Hashable.swift /Users/admin/builder/spi-builder-workspace/.dependencies/checkouts/swift-collections/Sources/BitCollections/BitSet/BitSet+Initializers.swift /Users/admin/builder/spi-builder-workspace/.dependencies/checkouts/swift-collections/Sources/BitCollections/BitSet/BitSet+Invariants.swift /Users/admin/builder/spi-builder-workspace/.dependencies/checkouts/swift-collections/Sources/BitCollections/BitSet/BitSet+Random.swift /Users/admin/builder/spi-builder-workspace/.dependencies/checkouts/swift-collections/Sources/BitCollections/BitSet/BitSet+SetAlgebra\ basics.swift /Users/admin/builder/spi-builder-workspace/.dependencies/checkouts/swift-collections/Sources/BitCollections/BitSet/BitSet+SetAlgebra\ conformance.swift (in target 'BitCollections' from project 'swift-collections')
SwiftCompile normal arm64 /Users/admin/builder/spi-builder-workspace/.dependencies/checkouts/swift-collections/Sources/BitCollections/BitSet/BitSet+Hashable.swift (in target 'BitCollections' from project 'swift-collections')
    cd /Users/admin/builder/spi-builder-workspace/.swiftpm/xcode

SwiftCompile normal arm64 /Users/admin/builder/spi-builder-workspace/.dependencies/checkouts/swift-collections/Sources/BitCollections/BitSet/BitSet+Initializers.swift (in target 'BitCollections' from project 'swift-collections')
    cd /Users/admin/builder/spi-builder-workspace/.swiftpm/xcode

SwiftCompile normal arm64 /Users/admin/builder/spi-builder-workspace/.dependencies/checkouts/swift-collections/Sources/BitCollections/BitSet/BitSet+Invariants.swift (in target 'BitCollections' from project 'swift-collections')
    cd /Users/admin/builder/spi-builder-workspace/.swiftpm/xcode

SwiftCompile normal arm64 /Users/admin/builder/spi-builder-workspace/.dependencies/checkouts/swift-collections/Sources/BitCollections/BitSet/BitSet+Random.swift (in target 'BitCollections' from project 'swift-collections')
    cd /Users/admin/builder/spi-builder-workspace/.swiftpm/xcode

SwiftCompile normal arm64 /Users/admin/builder/spi-builder-workspace/.dependencies/checkouts/swift-collections/Sources/BitCollections/BitSet/BitSet+SetAlgebra\ basics.swift (in target 'BitCollections' from project 'swift-collections')
    cd /Users/admin/builder/spi-builder-workspace/.swiftpm/xcode

SwiftCompile normal arm64 /Users/admin/builder/spi-builder-workspace/.dependencies/checkouts/swift-collections/Sources/BitCollections/BitSet/BitSet+SetAlgebra\ conformance.swift (in target 'BitCollections' from project 'swift-collections')
    cd /Users/admin/builder/spi-builder-workspace/.swiftpm/xcode

SwiftDriverJobDiscovery normal arm64 Compiling BitSet+CustomDebugStringConvertible.swift, BitSet+CustomReflectable.swift, BitSet+CustomStringConvertible.swift, BitSet+Equatable.swift, BitSet+ExpressibleByArrayLiteral.swift, BitSet+Extras.swift (in target 'BitCollections' from project 'swift-collections')
SwiftCompile normal arm64 Compiling\ BitArray+Hashable.swift,\ BitArray+Initializers.swift,\ BitArray+Invariants.swift,\ BitArray+LosslessStringConvertible.swift,\ BitArray+RandomBits.swift,\ BitArray+RangeReplaceableCollection.swift /Users/admin/builder/spi-builder-workspace/.dependencies/checkouts/swift-collections/Sources/BitCollections/BitArray/BitArray+Hashable.swift /Users/admin/builder/spi-builder-workspace/.dependencies/checkouts/swift-collections/Sources/BitCollections/BitArray/BitArray+Initializers.swift /Users/admin/builder/spi-builder-workspace/.dependencies/checkouts/swift-collections/Sources/BitCollections/BitArray/BitArray+Invariants.swift /Users/admin/builder/spi-builder-workspace/.dependencies/checkouts/swift-collections/Sources/BitCollections/BitArray/BitArray+LosslessStringConvertible.swift /Users/admin/builder/spi-builder-workspace/.dependencies/checkouts/swift-collections/Sources/BitCollections/BitArray/BitArray+RandomBits.swift /Users/admin/builder/spi-builder-workspace/.dependencies/checkouts/swift-collections/Sources/BitCollections/BitArray/BitArray+RangeReplaceableCollection.swift (in target 'BitCollections' from project 'swift-collections')
SwiftCompile normal arm64 /Users/admin/builder/spi-builder-workspace/.dependencies/checkouts/swift-collections/Sources/BitCollections/BitArray/BitArray+Hashable.swift (in target 'BitCollections' from project 'swift-collections')
    cd /Users/admin/builder/spi-builder-workspace/.swiftpm/xcode

SwiftCompile normal arm64 /Users/admin/builder/spi-builder-workspace/.dependencies/checkouts/swift-collections/Sources/BitCollections/BitArray/BitArray+Initializers.swift (in target 'BitCollections' from project 'swift-collections')
    cd /Users/admin/builder/spi-builder-workspace/.swiftpm/xcode

SwiftCompile normal arm64 /Users/admin/builder/spi-builder-workspace/.dependencies/checkouts/swift-collections/Sources/BitCollections/BitArray/BitArray+Invariants.swift (in target 'BitCollections' from project 'swift-collections')
    cd /Users/admin/builder/spi-builder-workspace/.swiftpm/xcode

SwiftCompile normal arm64 /Users/admin/builder/spi-builder-workspace/.dependencies/checkouts/swift-collections/Sources/BitCollections/BitArray/BitArray+LosslessStringConvertible.swift (in target 'BitCollections' from project 'swift-collections')
    cd /Users/admin/builder/spi-builder-workspace/.swiftpm/xcode

SwiftCompile normal arm64 /Users/admin/builder/spi-builder-workspace/.dependencies/checkouts/swift-collections/Sources/BitCollections/BitArray/BitArray+RandomBits.swift (in target 'BitCollections' from project 'swift-collections')
    cd /Users/admin/builder/spi-builder-workspace/.swiftpm/xcode

SwiftCompile normal arm64 /Users/admin/builder/spi-builder-workspace/.dependencies/checkouts/swift-collections/Sources/BitCollections/BitArray/BitArray+RangeReplaceableCollection.swift (in target 'BitCollections' from project 'swift-collections')
    cd /Users/admin/builder/spi-builder-workspace/.swiftpm/xcode

SwiftDriverJobDiscovery normal arm64 Compiling BitSet.swift, Range+Utilities.swift, Slice+Utilities.swift, UInt+Tricks.swift, _Word.swift (in target 'BitCollections' from project 'swift-collections')
SwiftCompile normal arm64 Compiling\ BitSet+SetAlgebra\ formIntersection.swift,\ BitSet+SetAlgebra\ formSymmetricDifference.swift,\ BitSet+SetAlgebra\ formUnion.swift,\ BitSet+SetAlgebra\ intersection.swift,\ BitSet+SetAlgebra\ isDisjoint.swift,\ BitSet+SetAlgebra\ isEqualSet.swift /Users/admin/builder/spi-builder-workspace/.dependencies/checkouts/swift-collections/Sources/BitCollections/BitSet/BitSet+SetAlgebra\ formIntersection.swift /Users/admin/builder/spi-builder-workspace/.dependencies/checkouts/swift-collections/Sources/BitCollections/BitSet/BitSet+SetAlgebra\ formSymmetricDifference.swift /Users/admin/builder/spi-builder-workspace/.dependencies/checkouts/swift-collections/Sources/BitCollections/BitSet/BitSet+SetAlgebra\ formUnion.swift /Users/admin/builder/spi-builder-workspace/.dependencies/checkouts/swift-collections/Sources/BitCollections/BitSet/BitSet+SetAlgebra\ intersection.swift /Users/admin/builder/spi-builder-workspace/.dependencies/checkouts/swift-collections/Sources/BitCollections/BitSet/BitSet+SetAlgebra\ isDisjoint.swift /Users/admin/builder/spi-builder-workspace/.dependencies/checkouts/swift-collections/Sources/BitCollections/BitSet/BitSet+SetAlgebra\ isEqualSet.swift (in target 'BitCollections' from project 'swift-collections')
SwiftCompile normal arm64 /Users/admin/builder/spi-builder-workspace/.dependencies/checkouts/swift-collections/Sources/BitCollections/BitSet/BitSet+SetAlgebra\ formIntersection.swift (in target 'BitCollections' from project 'swift-collections')
    cd /Users/admin/builder/spi-builder-workspace/.swiftpm/xcode

SwiftCompile normal arm64 /Users/admin/builder/spi-builder-workspace/.dependencies/checkouts/swift-collections/Sources/BitCollections/BitSet/BitSet+SetAlgebra\ formSymmetricDifference.swift (in target 'BitCollections' from project 'swift-collections')
    cd /Users/admin/builder/spi-builder-workspace/.swiftpm/xcode

SwiftCompile normal arm64 /Users/admin/builder/spi-builder-workspace/.dependencies/checkouts/swift-collections/Sources/BitCollections/BitSet/BitSet+SetAlgebra\ formUnion.swift (in target 'BitCollections' from project 'swift-collections')
    cd /Users/admin/builder/spi-builder-workspace/.swiftpm/xcode

SwiftCompile normal arm64 /Users/admin/builder/spi-builder-workspace/.dependencies/checkouts/swift-collections/Sources/BitCollections/BitSet/BitSet+SetAlgebra\ intersection.swift (in target 'BitCollections' from project 'swift-collections')
    cd /Users/admin/builder/spi-builder-workspace/.swiftpm/xcode

SwiftCompile normal arm64 /Users/admin/builder/spi-builder-workspace/.dependencies/checkouts/swift-collections/Sources/BitCollections/BitSet/BitSet+SetAlgebra\ isDisjoint.swift (in target 'BitCollections' from project 'swift-collections')
    cd /Users/admin/builder/spi-builder-workspace/.swiftpm/xcode

SwiftCompile normal arm64 /Users/admin/builder/spi-builder-workspace/.dependencies/checkouts/swift-collections/Sources/BitCollections/BitSet/BitSet+SetAlgebra\ isEqualSet.swift (in target 'BitCollections' from project 'swift-collections')
    cd /Users/admin/builder/spi-builder-workspace/.swiftpm/xcode

SwiftDriverJobDiscovery normal arm64 Compiling _AncestorHashSlots.swift, _Bitmap.swift, _Bucket.swift, _Hash.swift, _HashLevel.swift, _HashNode+Builder.swift, _HashNode+Debugging.swift, _HashNode+Initializers.swift, _HashNode+Invariants.swift (in target 'HashTreeCollections' from project 'swift-collections')
SwiftDriver Collections normal arm64 com.apple.xcode.tools.swift.compiler (in target 'Collections' from project 'swift-collections')
    cd /Users/admin/builder/spi-builder-workspace/.swiftpm/xcode
    builtin-SwiftDriver -- /Applications/Xcode-16.3.0.app/Contents/Developer/Toolchains/XcodeDefault.xctoolchain/usr/bin/swiftc -module-name Collections -Onone -enforce-exclusivity\=checked @/Users/admin/builder/spi-builder-workspace/.derivedData/Build/Intermediates.noindex/swift-collections.build/Debug-iphoneos/Collections.build/Objects-normal/arm64/Collections.SwiftFileList -DSWIFT_PACKAGE -DDEBUG -DCOLLECTIONS_RANDOMIZED_TESTING -DXcode -plugin-path /Applications/Xcode-16.3.0.app/Contents/Developer/Toolchains/XcodeDefault.xctoolchain/usr/lib/swift/host/plugins/testing -enable-experimental-feature DebugDescriptionMacro -sdk /Applications/Xcode-16.3.0.app/Contents/Developer/Platforms/iPhoneOS.platform/Developer/SDKs/iPhoneOS18.4.sdk -target arm64-apple-ios12.0 -g -module-cache-path /Users/admin/builder/spi-builder-workspace/.derivedData/ModuleCache.noindex -Xfrontend -serialize-debugging-options -enable-testing -suppress-warnings -index-store-path /Users/admin/builder/spi-builder-workspace/.derivedData/Index.noindex/DataStore -swift-version 5 -I /Users/admin/builder/spi-builder-workspace/.derivedData/Build/Products/Debug-iphoneos -I /Applications/Xcode-16.3.0.app/Contents/Developer/Platforms/iPhoneOS.platform/Developer/usr/lib -F /Users/admin/builder/spi-builder-workspace/.derivedData/Build/Products/Debug-iphoneos/PackageFrameworks -F /Users/admin/builder/spi-builder-workspace/.derivedData/Build/Products/Debug-iphoneos/PackageFrameworks -F /Users/admin/builder/spi-builder-workspace/.derivedData/Build/Products/Debug-iphoneos/PackageFrameworks -F /Users/admin/builder/spi-builder-workspace/.derivedData/Build/Products/Debug-iphoneos/PackageFrameworks -F /Users/admin/builder/spi-builder-workspace/.derivedData/Build/Products/Debug-iphoneos/PackageFrameworks -F /Users/admin/builder/spi-builder-workspace/.derivedData/Build/Products/Debug-iphoneos/PackageFrameworks -F /Users/admin/builder/spi-builder-workspace/.derivedData/Build/Products/Debug-iphoneos/PackageFrameworks -F /Users/admin/builder/spi-builder-workspace/.derivedData/Build/Products/Debug-iphoneos -F /Applications/Xcode-16.3.0.app/Contents/Developer/Platforms/iPhoneOS.platform/Developer/Library/Frameworks -F /Applications/Xcode-16.3.0.app/Contents/Developer/Platforms/iPhoneOS.platform/Developer/SDKs/iPhoneOS18.4.sdk/Developer/Library/Frameworks -parse-as-library -c -j10 -enable-batch-mode -incremental -Xcc -ivfsstatcache -Xcc /Users/admin/builder/spi-builder-workspace/.derivedData/SDKStatCaches.noindex/iphoneos18.4-22E235-339d34bc69d7fc736c3220795c36f340.sdkstatcache -output-file-map /Users/admin/builder/spi-builder-workspace/.derivedData/Build/Intermediates.noindex/swift-collections.build/Debug-iphoneos/Collections.build/Objects-normal/arm64/Collections-OutputFileMap.json -use-frontend-parseable-output -save-temps -no-color-diagnostics -serialize-diagnostics -emit-dependencies -emit-module -emit-module-path /Users/admin/builder/spi-builder-workspace/.derivedData/Build/Intermediates.noindex/swift-collections.build/Debug-iphoneos/Collections.build/Objects-normal/arm64/Collections.swiftmodule -validate-clang-modules-once -clang-build-session-file /Users/admin/builder/spi-builder-workspace/.derivedData/ModuleCache.noindex/Session.modulevalidation -Xcc -I/Users/admin/builder/spi-builder-workspace/.derivedData/Build/Intermediates.noindex/swift-collections.build/Debug-iphoneos/Collections.build/swift-overrides.hmap -emit-const-values -Xfrontend -const-gather-protocols-file -Xfrontend /Users/admin/builder/spi-builder-workspace/.derivedData/Build/Intermediates.noindex/swift-collections.build/Debug-iphoneos/Collections.build/Objects-normal/arm64/Collections_const_extract_protocols.json -Xcc -I/Users/admin/builder/spi-builder-workspace/.derivedData/Build/Products/Debug-iphoneos/include -Xcc -I/Users/admin/builder/spi-builder-workspace/.derivedData/Build/Intermediates.noindex/swift-collections.build/Debug-iphoneos/Collections.build/DerivedSources-normal/arm64 -Xcc -I/Users/admin/builder/spi-builder-workspace/.derivedData/Build/Intermediates.noindex/swift-collections.build/Debug-iphoneos/Collections.build/DerivedSources/arm64 -Xcc -I/Users/admin/builder/spi-builder-workspace/.derivedData/Build/Intermediates.noindex/swift-collections.build/Debug-iphoneos/Collections.build/DerivedSources -Xcc -DSWIFT_PACKAGE -Xcc -DDEBUG\=1 -emit-objc-header -emit-objc-header-path /Users/admin/builder/spi-builder-workspace/.derivedData/Build/Intermediates.noindex/swift-collections.build/Debug-iphoneos/Collections.build/Objects-normal/arm64/Collections-Swift.h -working-directory /Users/admin/builder/spi-builder-workspace/.swiftpm/xcode -experimental-emit-module-separately -disable-cmo
SwiftDriverJobDiscovery normal arm64 Compiling _HashNode+Subtree Removals.swift, _HashNode+UnsafeHandle.swift, _HashNode.swift, _HashNodeHeader.swift, _HashSlot.swift, _HashStack.swift, _HashTreeIterator.swift, _HashTreeStatistics.swift, _RawHashNode+UnsafeHandle.swift (in target 'HashTreeCollections' from project 'swift-collections')
SwiftCompile normal arm64 Compiling\ BitSet+SetAlgebra\ isStrictSubset.swift,\ BitSet+SetAlgebra\ isStrictSuperset.swift,\ BitSet+SetAlgebra\ isSubset.swift,\ BitSet+SetAlgebra\ isSuperset.swift,\ BitSet+SetAlgebra\ subtract.swift,\ BitSet+SetAlgebra\ subtracting.swift /Users/admin/builder/spi-builder-workspace/.dependencies/checkouts/swift-collections/Sources/BitCollections/BitSet/BitSet+SetAlgebra\ isStrictSubset.swift /Users/admin/builder/spi-builder-workspace/.dependencies/checkouts/swift-collections/Sources/BitCollections/BitSet/BitSet+SetAlgebra\ isStrictSuperset.swift /Users/admin/builder/spi-builder-workspace/.dependencies/checkouts/swift-collections/Sources/BitCollections/BitSet/BitSet+SetAlgebra\ isSubset.swift /Users/admin/builder/spi-builder-workspace/.dependencies/checkouts/swift-collections/Sources/BitCollections/BitSet/BitSet+SetAlgebra\ isSuperset.swift /Users/admin/builder/spi-builder-workspace/.dependencies/checkouts/swift-collections/Sources/BitCollections/BitSet/BitSet+SetAlgebra\ subtract.swift /Users/admin/builder/spi-builder-workspace/.dependencies/checkouts/swift-collections/Sources/BitCollections/BitSet/BitSet+SetAlgebra\ subtracting.swift (in target 'BitCollections' from project 'swift-collections')
SwiftCompile normal arm64 /Users/admin/builder/spi-builder-workspace/.dependencies/checkouts/swift-collections/Sources/BitCollections/BitSet/BitSet+SetAlgebra\ isStrictSubset.swift (in target 'BitCollections' from project 'swift-collections')
    cd /Users/admin/builder/spi-builder-workspace/.swiftpm/xcode

SwiftCompile normal arm64 /Users/admin/builder/spi-builder-workspace/.dependencies/checkouts/swift-collections/Sources/BitCollections/BitSet/BitSet+SetAlgebra\ isStrictSuperset.swift (in target 'BitCollections' from project 'swift-collections')
    cd /Users/admin/builder/spi-builder-workspace/.swiftpm/xcode

SwiftCompile normal arm64 /Users/admin/builder/spi-builder-workspace/.dependencies/checkouts/swift-collections/Sources/BitCollections/BitSet/BitSet+SetAlgebra\ isSubset.swift (in target 'BitCollections' from project 'swift-collections')
    cd /Users/admin/builder/spi-builder-workspace/.swiftpm/xcode

SwiftCompile normal arm64 /Users/admin/builder/spi-builder-workspace/.dependencies/checkouts/swift-collections/Sources/BitCollections/BitSet/BitSet+SetAlgebra\ isSuperset.swift (in target 'BitCollections' from project 'swift-collections')
    cd /Users/admin/builder/spi-builder-workspace/.swiftpm/xcode

SwiftCompile normal arm64 /Users/admin/builder/spi-builder-workspace/.dependencies/checkouts/swift-collections/Sources/BitCollections/BitSet/BitSet+SetAlgebra\ subtract.swift (in target 'BitCollections' from project 'swift-collections')
    cd /Users/admin/builder/spi-builder-workspace/.swiftpm/xcode

SwiftCompile normal arm64 /Users/admin/builder/spi-builder-workspace/.dependencies/checkouts/swift-collections/Sources/BitCollections/BitSet/BitSet+SetAlgebra\ subtracting.swift (in target 'BitCollections' from project 'swift-collections')
    cd /Users/admin/builder/spi-builder-workspace/.swiftpm/xcode

SwiftEmitModule normal arm64 Emitting\ module\ for\ Collections (in target 'Collections' from project 'swift-collections')
SwiftCompile normal arm64 /Users/admin/builder/spi-builder-workspace/.dependencies/checkouts/swift-collections/Sources/Collections/Collections.swift (in target 'Collections' from project 'swift-collections')
    cd /Users/admin/builder/spi-builder-workspace/.swiftpm/xcode

SwiftDriverJobDiscovery normal arm64 Compiling _RawHashNode.swift, _UnmanagedHashNode.swift, _UnsafePath.swift, TreeDictionary+Codable.swift, TreeDictionary+Collection.swift, TreeDictionary+CustomReflectable.swift, TreeDictionary+Debugging.swift, TreeDictionary+Descriptions.swift, TreeDictionary+Equatable.swift (in target 'HashTreeCollections' from project 'swift-collections')
SwiftCompile normal arm64 Compiling\ Collections.swift /Users/admin/builder/spi-builder-workspace/.dependencies/checkouts/swift-collections/Sources/Collections/Collections.swift (in target 'Collections' from project 'swift-collections')
SwiftCompile normal arm64 /Users/admin/builder/spi-builder-workspace/.dependencies/checkouts/swift-collections/Sources/Collections/Collections.swift (in target 'Collections' from project 'swift-collections')
    cd /Users/admin/builder/spi-builder-workspace/.swiftpm/xcode

SwiftDriverJobDiscovery normal arm64 Compiling BitArray+Descriptions.swift, BitArray+Equatable.swift, BitArray+ExpressibleByArrayLiteral.swift, BitArray+ExpressibleByStringLiteral.swift, BitArray+Extras.swift, BitArray+Fill.swift (in target 'BitCollections' from project 'swift-collections')
SwiftDriverJobDiscovery normal arm64 Compiling BitSet+Hashable.swift, BitSet+Initializers.swift, BitSet+Invariants.swift, BitSet+Random.swift, BitSet+SetAlgebra basics.swift, BitSet+SetAlgebra conformance.swift (in target 'BitCollections' from project 'swift-collections')
ExtractAppIntentsMetadata (in target '_RopeModule' from project 'swift-collections')
    cd /Users/admin/builder/spi-builder-workspace/.dependencies/checkouts/swift-collections
    /Applications/Xcode-16.3.0.app/Contents/Developer/Toolchains/XcodeDefault.xctoolchain/usr/bin/appintentsmetadataprocessor --toolchain-dir /Applications/Xcode-16.3.0.app/Contents/Developer/Toolchains/XcodeDefault.xctoolchain --module-name _RopeModule --sdk-root /Applications/Xcode-16.3.0.app/Contents/Developer/Platforms/iPhoneOS.platform/Developer/SDKs/iPhoneOS18.4.sdk --xcode-version 16E140 --platform-family iOS --deployment-target 12.0 --bundle-identifier swift-collections.-RopeModule --output /Users/admin/builder/spi-builder-workspace/.derivedData/Build/Products/Debug-iphoneos/_RopeModule.appintents --target-triple arm64-apple-ios12.0 --binary-file /Users/admin/builder/spi-builder-workspace/.derivedData/Build/Products/Debug-iphoneos/_RopeModule.o --dependency-file /Users/admin/builder/spi-builder-workspace/.derivedData/Build/Intermediates.noindex/swift-collections.build/Debug-iphoneos/_RopeModule.build/Objects-normal/arm64/_RopeModule_dependency_info.dat --stringsdata-file /Users/admin/builder/spi-builder-workspace/.derivedData/Build/Intermediates.noindex/swift-collections.build/Debug-iphoneos/_RopeModule.build/Objects-normal/arm64/ExtractedAppShortcutsMetadata.stringsdata --source-file-list /Users/admin/builder/spi-builder-workspace/.derivedData/Build/Intermediates.noindex/swift-collections.build/Debug-iphoneos/_RopeModule.build/Objects-normal/arm64/_RopeModule.SwiftFileList --metadata-file-list /Users/admin/builder/spi-builder-workspace/.derivedData/Build/Intermediates.noindex/swift-collections.build/Debug-iphoneos/_RopeModule.build/_RopeModule.DependencyMetadataFileList --static-metadata-file-list /Users/admin/builder/spi-builder-workspace/.derivedData/Build/Intermediates.noindex/swift-collections.build/Debug-iphoneos/_RopeModule.build/_RopeModule.DependencyStaticMetadataFileList --swift-const-vals-list /Users/admin/builder/spi-builder-workspace/.derivedData/Build/Intermediates.noindex/swift-collections.build/Debug-iphoneos/_RopeModule.build/Objects-normal/arm64/_RopeModule.SwiftConstValuesFileList --force --compile-time-extraction --deployment-aware-processing --validate-assistant-intents --no-app-shortcuts-localization
2025-04-29 23:27:11.547 appintentsmetadataprocessor[1091:6047] Starting appintentsmetadataprocessor export
2025-04-29 23:27:11.586 appintentsmetadataprocessor[1091:6047] Extracted no relevant App Intents symbols, skipping writing output
ExtractAppIntentsMetadata (in target 'OrderedCollections' from project 'swift-collections')
    cd /Users/admin/builder/spi-builder-workspace/.dependencies/checkouts/swift-collections
    /Applications/Xcode-16.3.0.app/Contents/Developer/Toolchains/XcodeDefault.xctoolchain/usr/bin/appintentsmetadataprocessor --toolchain-dir /Applications/Xcode-16.3.0.app/Contents/Developer/Toolchains/XcodeDefault.xctoolchain --module-name OrderedCollections --sdk-root /Applications/Xcode-16.3.0.app/Contents/Developer/Platforms/iPhoneOS.platform/Developer/SDKs/iPhoneOS18.4.sdk --xcode-version 16E140 --platform-family iOS --deployment-target 12.0 --bundle-identifier swift-collections.OrderedCollections --output /Users/admin/builder/spi-builder-workspace/.derivedData/Build/Products/Debug-iphoneos/OrderedCollections.appintents --target-triple arm64-apple-ios12.0 --binary-file /Users/admin/builder/spi-builder-workspace/.derivedData/Build/Products/Debug-iphoneos/OrderedCollections.o --dependency-file /Users/admin/builder/spi-builder-workspace/.derivedData/Build/Intermediates.noindex/swift-collections.build/Debug-iphoneos/OrderedCollections.build/Objects-normal/arm64/OrderedCollections_dependency_info.dat --stringsdata-file /Users/admin/builder/spi-builder-workspace/.derivedData/Build/Intermediates.noindex/swift-collections.build/Debug-iphoneos/OrderedCollections.build/Objects-normal/arm64/ExtractedAppShortcutsMetadata.stringsdata --source-file-list /Users/admin/builder/spi-builder-workspace/.derivedData/Build/Intermediates.noindex/swift-collections.build/Debug-iphoneos/OrderedCollections.build/Objects-normal/arm64/OrderedCollections.SwiftFileList --metadata-file-list /Users/admin/builder/spi-builder-workspace/.derivedData/Build/Intermediates.noindex/swift-collections.build/Debug-iphoneos/OrderedCollections.build/OrderedCollections.DependencyMetadataFileList --static-metadata-file-list /Users/admin/builder/spi-builder-workspace/.derivedData/Build/Intermediates.noindex/swift-collections.build/Debug-iphoneos/OrderedCollections.build/OrderedCollections.DependencyStaticMetadataFileList --swift-const-vals-list /Users/admin/builder/spi-builder-workspace/.derivedData/Build/Intermediates.noindex/swift-collections.build/Debug-iphoneos/OrderedCollections.build/Objects-normal/arm64/OrderedCollections.SwiftConstValuesFileList --force --compile-time-extraction --deployment-aware-processing --validate-assistant-intents --no-app-shortcuts-localization
2025-04-29 23:27:11.552 appintentsmetadataprocessor[1092:6049] Starting appintentsmetadataprocessor export
2025-04-29 23:27:11.590 appintentsmetadataprocessor[1092:6049] Extracted no relevant App Intents symbols, skipping writing output
SwiftDriverJobDiscovery normal arm64 Emitting module for Collections (in target 'Collections' from project 'swift-collections')
SwiftDriver\ Compilation\ Requirements Collections normal arm64 com.apple.xcode.tools.swift.compiler (in target 'Collections' from project 'swift-collections')
    cd /Users/admin/builder/spi-builder-workspace/.swiftpm/xcode
    builtin-Swift-Compilation-Requirements -- /Applications/Xcode-16.3.0.app/Contents/Developer/Toolchains/XcodeDefault.xctoolchain/usr/bin/swiftc -module-name Collections -Onone -enforce-exclusivity\=checked @/Users/admin/builder/spi-builder-workspace/.derivedData/Build/Intermediates.noindex/swift-collections.build/Debug-iphoneos/Collections.build/Objects-normal/arm64/Collections.SwiftFileList -DSWIFT_PACKAGE -DDEBUG -DCOLLECTIONS_RANDOMIZED_TESTING -DXcode -plugin-path /Applications/Xcode-16.3.0.app/Contents/Developer/Toolchains/XcodeDefault.xctoolchain/usr/lib/swift/host/plugins/testing -enable-experimental-feature DebugDescriptionMacro -sdk /Applications/Xcode-16.3.0.app/Contents/Developer/Platforms/iPhoneOS.platform/Developer/SDKs/iPhoneOS18.4.sdk -target arm64-apple-ios12.0 -g -module-cache-path /Users/admin/builder/spi-builder-workspace/.derivedData/ModuleCache.noindex -Xfrontend -serialize-debugging-options -enable-testing -suppress-warnings -index-store-path /Users/admin/builder/spi-builder-workspace/.derivedData/Index.noindex/DataStore -swift-version 5 -I /Users/admin/builder/spi-builder-workspace/.derivedData/Build/Products/Debug-iphoneos -I /Applications/Xcode-16.3.0.app/Contents/Developer/Platforms/iPhoneOS.platform/Developer/usr/lib -F /Users/admin/builder/spi-builder-workspace/.derivedData/Build/Products/Debug-iphoneos/PackageFrameworks -F /Users/admin/builder/spi-builder-workspace/.derivedData/Build/Products/Debug-iphoneos/PackageFrameworks -F /Users/admin/builder/spi-builder-workspace/.derivedData/Build/Products/Debug-iphoneos/PackageFrameworks -F /Users/admin/builder/spi-builder-workspace/.derivedData/Build/Products/Debug-iphoneos/PackageFrameworks -F /Users/admin/builder/spi-builder-workspace/.derivedData/Build/Products/Debug-iphoneos/PackageFrameworks -F /Users/admin/builder/spi-builder-workspace/.derivedData/Build/Products/Debug-iphoneos/PackageFrameworks -F /Users/admin/builder/spi-builder-workspace/.derivedData/Build/Products/Debug-iphoneos/PackageFrameworks -F /Users/admin/builder/spi-builder-workspace/.derivedData/Build/Products/Debug-iphoneos -F /Applications/Xcode-16.3.0.app/Contents/Developer/Platforms/iPhoneOS.platform/Developer/Library/Frameworks -F /Applications/Xcode-16.3.0.app/Contents/Developer/Platforms/iPhoneOS.platform/Developer/SDKs/iPhoneOS18.4.sdk/Developer/Library/Frameworks -parse-as-library -c -j10 -enable-batch-mode -incremental -Xcc -ivfsstatcache -Xcc /Users/admin/builder/spi-builder-workspace/.derivedData/SDKStatCaches.noindex/iphoneos18.4-22E235-339d34bc69d7fc736c3220795c36f340.sdkstatcache -output-file-map /Users/admin/builder/spi-builder-workspace/.derivedData/Build/Intermediates.noindex/swift-collections.build/Debug-iphoneos/Collections.build/Objects-normal/arm64/Collections-OutputFileMap.json -use-frontend-parseable-output -save-temps -no-color-diagnostics -serialize-diagnostics -emit-dependencies -emit-module -emit-module-path /Users/admin/builder/spi-builder-workspace/.derivedData/Build/Intermediates.noindex/swift-collections.build/Debug-iphoneos/Collections.build/Objects-normal/arm64/Collections.swiftmodule -validate-clang-modules-once -clang-build-session-file /Users/admin/builder/spi-builder-workspace/.derivedData/ModuleCache.noindex/Session.modulevalidation -Xcc -I/Users/admin/builder/spi-builder-workspace/.derivedData/Build/Intermediates.noindex/swift-collections.build/Debug-iphoneos/Collections.build/swift-overrides.hmap -emit-const-values -Xfrontend -const-gather-protocols-file -Xfrontend /Users/admin/builder/spi-builder-workspace/.derivedData/Build/Intermediates.noindex/swift-collections.build/Debug-iphoneos/Collections.build/Objects-normal/arm64/Collections_const_extract_protocols.json -Xcc -I/Users/admin/builder/spi-builder-workspace/.derivedData/Build/Products/Debug-iphoneos/include -Xcc -I/Users/admin/builder/spi-builder-workspace/.derivedData/Build/Intermediates.noindex/swift-collections.build/Debug-iphoneos/Collections.build/DerivedSources-normal/arm64 -Xcc -I/Users/admin/builder/spi-builder-workspace/.derivedData/Build/Intermediates.noindex/swift-collections.build/Debug-iphoneos/Collections.build/DerivedSources/arm64 -Xcc -I/Users/admin/builder/spi-builder-workspace/.derivedData/Build/Intermediates.noindex/swift-collections.build/Debug-iphoneos/Collections.build/DerivedSources -Xcc -DSWIFT_PACKAGE -Xcc -DDEBUG\=1 -emit-objc-header -emit-objc-header-path /Users/admin/builder/spi-builder-workspace/.derivedData/Build/Intermediates.noindex/swift-collections.build/Debug-iphoneos/Collections.build/Objects-normal/arm64/Collections-Swift.h -working-directory /Users/admin/builder/spi-builder-workspace/.swiftpm/xcode -experimental-emit-module-separately -disable-cmo
SwiftDriverJobDiscovery normal arm64 Compiling Collections.swift (in target 'Collections' from project 'swift-collections')
ExtractAppIntentsMetadata (in target 'HeapModule' from project 'swift-collections')
    cd /Users/admin/builder/spi-builder-workspace/.dependencies/checkouts/swift-collections
    /Applications/Xcode-16.3.0.app/Contents/Developer/Toolchains/XcodeDefault.xctoolchain/usr/bin/appintentsmetadataprocessor --toolchain-dir /Applications/Xcode-16.3.0.app/Contents/Developer/Toolchains/XcodeDefault.xctoolchain --module-name HeapModule --sdk-root /Applications/Xcode-16.3.0.app/Contents/Developer/Platforms/iPhoneOS.platform/Developer/SDKs/iPhoneOS18.4.sdk --xcode-version 16E140 --platform-family iOS --deployment-target 12.0 --bundle-identifier swift-collections.HeapModule --output /Users/admin/builder/spi-builder-workspace/.derivedData/Build/Products/Debug-iphoneos/HeapModule.appintents --target-triple arm64-apple-ios12.0 --binary-file /Users/admin/builder/spi-builder-workspace/.derivedData/Build/Products/Debug-iphoneos/HeapModule.o --dependency-file /Users/admin/builder/spi-builder-workspace/.derivedData/Build/Intermediates.noindex/swift-collections.build/Debug-iphoneos/HeapModule.build/Objects-normal/arm64/HeapModule_dependency_info.dat --stringsdata-file /Users/admin/builder/spi-builder-workspace/.derivedData/Build/Intermediates.noindex/swift-collections.build/Debug-iphoneos/HeapModule.build/Objects-normal/arm64/ExtractedAppShortcutsMetadata.stringsdata --source-file-list /Users/admin/builder/spi-builder-workspace/.derivedData/Build/Intermediates.noindex/swift-collections.build/Debug-iphoneos/HeapModule.build/Objects-normal/arm64/HeapModule.SwiftFileList --metadata-file-list /Users/admin/builder/spi-builder-workspace/.derivedData/Build/Intermediates.noindex/swift-collections.build/Debug-iphoneos/HeapModule.build/HeapModule.DependencyMetadataFileList --static-metadata-file-list /Users/admin/builder/spi-builder-workspace/.derivedData/Build/Intermediates.noindex/swift-collections.build/Debug-iphoneos/HeapModule.build/HeapModule.DependencyStaticMetadataFileList --swift-const-vals-list /Users/admin/builder/spi-builder-workspace/.derivedData/Build/Intermediates.noindex/swift-collections.build/Debug-iphoneos/HeapModule.build/Objects-normal/arm64/HeapModule.SwiftConstValuesFileList --force --compile-time-extraction --deployment-aware-processing --validate-assistant-intents --no-app-shortcuts-localization
2025-04-29 23:27:11.557 appintentsmetadataprocessor[1093:6051] Starting appintentsmetadataprocessor export
2025-04-29 23:27:11.592 appintentsmetadataprocessor[1093:6051] Extracted no relevant App Intents symbols, skipping writing output
Copy /Users/admin/builder/spi-builder-workspace/.derivedData/Build/Products/Debug-iphoneos/Collections.swiftmodule/arm64-apple-ios.abi.json /Users/admin/builder/spi-builder-workspace/.derivedData/Build/Intermediates.noindex/swift-collections.build/Debug-iphoneos/Collections.build/Objects-normal/arm64/Collections.abi.json (in target 'Collections' from project 'swift-collections')
    cd /Users/admin/builder/spi-builder-workspace/.dependencies/checkouts/swift-collections
    builtin-copy -exclude .DS_Store -exclude CVS -exclude .svn -exclude .git -exclude .hg -resolve-src-symlinks -rename /Users/admin/builder/spi-builder-workspace/.derivedData/Build/Intermediates.noindex/swift-collections.build/Debug-iphoneos/Collections.build/Objects-normal/arm64/Collections.abi.json /Users/admin/builder/spi-builder-workspace/.derivedData/Build/Products/Debug-iphoneos/Collections.swiftmodule/arm64-apple-ios.abi.json
ExtractAppIntentsMetadata (in target 'DequeModule' from project 'swift-collections')
    cd /Users/admin/builder/spi-builder-workspace/.dependencies/checkouts/swift-collections
    /Applications/Xcode-16.3.0.app/Contents/Developer/Toolchains/XcodeDefault.xctoolchain/usr/bin/appintentsmetadataprocessor --toolchain-dir /Applications/Xcode-16.3.0.app/Contents/Developer/Toolchains/XcodeDefault.xctoolchain --module-name DequeModule --sdk-root /Applications/Xcode-16.3.0.app/Contents/Developer/Platforms/iPhoneOS.platform/Developer/SDKs/iPhoneOS18.4.sdk --xcode-version 16E140 --platform-family iOS --deployment-target 12.0 --bundle-identifier swift-collections.DequeModule --output /Users/admin/builder/spi-builder-workspace/.derivedData/Build/Products/Debug-iphoneos/DequeModule.appintents --target-triple arm64-apple-ios12.0 --binary-file /Users/admin/builder/spi-builder-workspace/.derivedData/Build/Products/Debug-iphoneos/DequeModule.o --dependency-file /Users/admin/builder/spi-builder-workspace/.derivedData/Build/Intermediates.noindex/swift-collections.build/Debug-iphoneos/DequeModule.build/Objects-normal/arm64/DequeModule_dependency_info.dat --stringsdata-file /Users/admin/builder/spi-builder-workspace/.derivedData/Build/Intermediates.noindex/swift-collections.build/Debug-iphoneos/DequeModule.build/Objects-normal/arm64/ExtractedAppShortcutsMetadata.stringsdata --source-file-list /Users/admin/builder/spi-builder-workspace/.derivedData/Build/Intermediates.noindex/swift-collections.build/Debug-iphoneos/DequeModule.build/Objects-normal/arm64/DequeModule.SwiftFileList --metadata-file-list /Users/admin/builder/spi-builder-workspace/.derivedData/Build/Intermediates.noindex/swift-collections.build/Debug-iphoneos/DequeModule.build/DequeModule.DependencyMetadataFileList --static-metadata-file-list /Users/admin/builder/spi-builder-workspace/.derivedData/Build/Intermediates.noindex/swift-collections.build/Debug-iphoneos/DequeModule.build/DequeModule.DependencyStaticMetadataFileList --swift-const-vals-list /Users/admin/builder/spi-builder-workspace/.derivedData/Build/Intermediates.noindex/swift-collections.build/Debug-iphoneos/DequeModule.build/Objects-normal/arm64/DequeModule.SwiftConstValuesFileList --force --compile-time-extraction --deployment-aware-processing --validate-assistant-intents --no-app-shortcuts-localization
2025-04-29 23:27:11.607 appintentsmetadataprocessor[1094:6079] Starting appintentsmetadataprocessor export
2025-04-29 23:27:11.645 appintentsmetadataprocessor[1094:6079] Extracted no relevant App Intents symbols, skipping writing output
SwiftDriver\ Compilation Collections normal arm64 com.apple.xcode.tools.swift.compiler (in target 'Collections' from project 'swift-collections')
    cd /Users/admin/builder/spi-builder-workspace/.swiftpm/xcode
    builtin-Swift-Compilation -- /Applications/Xcode-16.3.0.app/Contents/Developer/Toolchains/XcodeDefault.xctoolchain/usr/bin/swiftc -module-name Collections -Onone -enforce-exclusivity\=checked @/Users/admin/builder/spi-builder-workspace/.derivedData/Build/Intermediates.noindex/swift-collections.build/Debug-iphoneos/Collections.build/Objects-normal/arm64/Collections.SwiftFileList -DSWIFT_PACKAGE -DDEBUG -DCOLLECTIONS_RANDOMIZED_TESTING -DXcode -plugin-path /Applications/Xcode-16.3.0.app/Contents/Developer/Toolchains/XcodeDefault.xctoolchain/usr/lib/swift/host/plugins/testing -enable-experimental-feature DebugDescriptionMacro -sdk /Applications/Xcode-16.3.0.app/Contents/Developer/Platforms/iPhoneOS.platform/Developer/SDKs/iPhoneOS18.4.sdk -target arm64-apple-ios12.0 -g -module-cache-path /Users/admin/builder/spi-builder-workspace/.derivedData/ModuleCache.noindex -Xfrontend -serialize-debugging-options -enable-testing -suppress-warnings -index-store-path /Users/admin/builder/spi-builder-workspace/.derivedData/Index.noindex/DataStore -swift-version 5 -I /Users/admin/builder/spi-builder-workspace/.derivedData/Build/Products/Debug-iphoneos -I /Applications/Xcode-16.3.0.app/Contents/Developer/Platforms/iPhoneOS.platform/Developer/usr/lib -F /Users/admin/builder/spi-builder-workspace/.derivedData/Build/Products/Debug-iphoneos/PackageFrameworks -F /Users/admin/builder/spi-builder-workspace/.derivedData/Build/Products/Debug-iphoneos/PackageFrameworks -F /Users/admin/builder/spi-builder-workspace/.derivedData/Build/Products/Debug-iphoneos/PackageFrameworks -F /Users/admin/builder/spi-builder-workspace/.derivedData/Build/Products/Debug-iphoneos/PackageFrameworks -F /Users/admin/builder/spi-builder-workspace/.derivedData/Build/Products/Debug-iphoneos/PackageFrameworks -F /Users/admin/builder/spi-builder-workspace/.derivedData/Build/Products/Debug-iphoneos/PackageFrameworks -F /Users/admin/builder/spi-builder-workspace/.derivedData/Build/Products/Debug-iphoneos/PackageFrameworks -F /Users/admin/builder/spi-builder-workspace/.derivedData/Build/Products/Debug-iphoneos -F /Applications/Xcode-16.3.0.app/Contents/Developer/Platforms/iPhoneOS.platform/Developer/Library/Frameworks -F /Applications/Xcode-16.3.0.app/Contents/Developer/Platforms/iPhoneOS.platform/Developer/SDKs/iPhoneOS18.4.sdk/Developer/Library/Frameworks -parse-as-library -c -j10 -enable-batch-mode -incremental -Xcc -ivfsstatcache -Xcc /Users/admin/builder/spi-builder-workspace/.derivedData/SDKStatCaches.noindex/iphoneos18.4-22E235-339d34bc69d7fc736c3220795c36f340.sdkstatcache -output-file-map /Users/admin/builder/spi-builder-workspace/.derivedData/Build/Intermediates.noindex/swift-collections.build/Debug-iphoneos/Collections.build/Objects-normal/arm64/Collections-OutputFileMap.json -use-frontend-parseable-output -save-temps -no-color-diagnostics -serialize-diagnostics -emit-dependencies -emit-module -emit-module-path /Users/admin/builder/spi-builder-workspace/.derivedData/Build/Intermediates.noindex/swift-collections.build/Debug-iphoneos/Collections.build/Objects-normal/arm64/Collections.swiftmodule -validate-clang-modules-once -clang-build-session-file /Users/admin/builder/spi-builder-workspace/.derivedData/ModuleCache.noindex/Session.modulevalidation -Xcc -I/Users/admin/builder/spi-builder-workspace/.derivedData/Build/Intermediates.noindex/swift-collections.build/Debug-iphoneos/Collections.build/swift-overrides.hmap -emit-const-values -Xfrontend -const-gather-protocols-file -Xfrontend /Users/admin/builder/spi-builder-workspace/.derivedData/Build/Intermediates.noindex/swift-collections.build/Debug-iphoneos/Collections.build/Objects-normal/arm64/Collections_const_extract_protocols.json -Xcc -I/Users/admin/builder/spi-builder-workspace/.derivedData/Build/Products/Debug-iphoneos/include -Xcc -I/Users/admin/builder/spi-builder-workspace/.derivedData/Build/Intermediates.noindex/swift-collections.build/Debug-iphoneos/Collections.build/DerivedSources-normal/arm64 -Xcc -I/Users/admin/builder/spi-builder-workspace/.derivedData/Build/Intermediates.noindex/swift-collections.build/Debug-iphoneos/Collections.build/DerivedSources/arm64 -Xcc -I/Users/admin/builder/spi-builder-workspace/.derivedData/Build/Intermediates.noindex/swift-collections.build/Debug-iphoneos/Collections.build/DerivedSources -Xcc -DSWIFT_PACKAGE -Xcc -DDEBUG\=1 -emit-objc-header -emit-objc-header-path /Users/admin/builder/spi-builder-workspace/.derivedData/Build/Intermediates.noindex/swift-collections.build/Debug-iphoneos/Collections.build/Objects-normal/arm64/Collections-Swift.h -working-directory /Users/admin/builder/spi-builder-workspace/.swiftpm/xcode -experimental-emit-module-separately -disable-cmo
SwiftDriver SwiftSCAD normal arm64 com.apple.xcode.tools.swift.compiler (in target 'SwiftSCAD' from project 'SwiftSCAD')
    cd /Users/admin/builder/spi-builder-workspace/.swiftpm/xcode
    builtin-SwiftDriver -- /Applications/Xcode-16.3.0.app/Contents/Developer/Toolchains/XcodeDefault.xctoolchain/usr/bin/swiftc -module-name SwiftSCAD -Onone -enforce-exclusivity\=checked @/Users/admin/builder/spi-builder-workspace/.derivedData/Build/Intermediates.noindex/SwiftSCAD.build/Debug-iphoneos/SwiftSCAD.build/Objects-normal/arm64/SwiftSCAD.SwiftFileList -DSWIFT_PACKAGE -DDEBUG -DXcode -plugin-path /Applications/Xcode-16.3.0.app/Contents/Developer/Toolchains/XcodeDefault.xctoolchain/usr/lib/swift/host/plugins/testing -enable-experimental-feature DebugDescriptionMacro -sdk /Applications/Xcode-16.3.0.app/Contents/Developer/Platforms/iPhoneOS.platform/Developer/SDKs/iPhoneOS18.4.sdk -target arm64-apple-ios12.0 -g -module-cache-path /Users/admin/builder/spi-builder-workspace/.derivedData/ModuleCache.noindex -Xfrontend -serialize-debugging-options -enable-testing -suppress-warnings -index-store-path /Users/admin/builder/spi-builder-workspace/.derivedData/Index.noindex/DataStore -swift-version 6 -I /Users/admin/builder/spi-builder-workspace/.derivedData/Build/Products/Debug-iphoneos -I /Applications/Xcode-16.3.0.app/Contents/Developer/Platforms/iPhoneOS.platform/Developer/usr/lib -F /Users/admin/builder/spi-builder-workspace/.derivedData/Build/Products/Debug-iphoneos/PackageFrameworks -F /Users/admin/builder/spi-builder-workspace/.derivedData/Build/Products/Debug-iphoneos/PackageFrameworks -F /Users/admin/builder/spi-builder-workspace/.derivedData/Build/Products/Debug-iphoneos/PackageFrameworks -F /Users/admin/builder/spi-builder-workspace/.derivedData/Build/Products/Debug-iphoneos/PackageFrameworks -F /Users/admin/builder/spi-builder-workspace/.derivedData/Build/Products/Debug-iphoneos/PackageFrameworks -F /Users/admin/builder/spi-builder-workspace/.derivedData/Build/Products/Debug-iphoneos/PackageFrameworks -F /Users/admin/builder/spi-builder-workspace/.derivedData/Build/Products/Debug-iphoneos/PackageFrameworks -F /Users/admin/builder/spi-builder-workspace/.derivedData/Build/Products/Debug-iphoneos/PackageFrameworks -F /Users/admin/builder/spi-builder-workspace/.derivedData/Build/Products/Debug-iphoneos/PackageFrameworks -F /Users/admin/builder/spi-builder-workspace/.derivedData/Build/Products/Debug-iphoneos -F /Applications/Xcode-16.3.0.app/Contents/Developer/Platforms/iPhoneOS.platform/Developer/Library/Frameworks -F /Applications/Xcode-16.3.0.app/Contents/Developer/Platforms/iPhoneOS.platform/Developer/SDKs/iPhoneOS18.4.sdk/Developer/Library/Frameworks -c -j10 -enable-batch-mode -incremental -Xcc -ivfsstatcache -Xcc /Users/admin/builder/spi-builder-workspace/.derivedData/SDKStatCaches.noindex/iphoneos18.4-22E235-339d34bc69d7fc736c3220795c36f340.sdkstatcache -output-file-map /Users/admin/builder/spi-builder-workspace/.derivedData/Build/Intermediates.noindex/SwiftSCAD.build/Debug-iphoneos/SwiftSCAD.build/Objects-normal/arm64/SwiftSCAD-OutputFileMap.json -use-frontend-parseable-output -save-temps -no-color-diagnostics -serialize-diagnostics -emit-dependencies -emit-module -emit-module-path /Users/admin/builder/spi-builder-workspace/.derivedData/Build/Intermediates.noindex/SwiftSCAD.build/Debug-iphoneos/SwiftSCAD.build/Objects-normal/arm64/SwiftSCAD.swiftmodule -user-module-version 0.9.0 -validate-clang-modules-once -clang-build-session-file /Users/admin/builder/spi-builder-workspace/.derivedData/ModuleCache.noindex/Session.modulevalidation -package-name swiftscad -Xcc -I/Users/admin/builder/spi-builder-workspace/.derivedData/Build/Intermediates.noindex/SwiftSCAD.build/Debug-iphoneos/SwiftSCAD.build/swift-overrides.hmap -emit-const-values -Xfrontend -const-gather-protocols-file -Xfrontend /Users/admin/builder/spi-builder-workspace/.derivedData/Build/Intermediates.noindex/SwiftSCAD.build/Debug-iphoneos/SwiftSCAD.build/Objects-normal/arm64/SwiftSCAD_const_extract_protocols.json -Xcc -I/Users/admin/builder/spi-builder-workspace/.derivedData/Build/Products/Debug-iphoneos/include -Xcc -I/Users/admin/builder/spi-builder-workspace/.derivedData/Build/Intermediates.noindex/SwiftSCAD.build/Debug-iphoneos/SwiftSCAD.build/DerivedSources-normal/arm64 -Xcc -I/Users/admin/builder/spi-builder-workspace/.derivedData/Build/Intermediates.noindex/SwiftSCAD.build/Debug-iphoneos/SwiftSCAD.build/DerivedSources/arm64 -Xcc -I/Users/admin/builder/spi-builder-workspace/.derivedData/Build/Intermediates.noindex/SwiftSCAD.build/Debug-iphoneos/SwiftSCAD.build/DerivedSources -Xcc -DSWIFT_PACKAGE -Xcc -DDEBUG\=1 -emit-objc-header -emit-objc-header-path /Users/admin/builder/spi-builder-workspace/.derivedData/Build/Intermediates.noindex/SwiftSCAD.build/Debug-iphoneos/SwiftSCAD.build/Objects-normal/arm64/SwiftSCAD-Swift.h -working-directory /Users/admin/builder/spi-builder-workspace/.swiftpm/xcode -experimental-emit-module-separately -disable-cmo
RegisterExecutionPolicyException /Users/admin/builder/spi-builder-workspace/.derivedData/Build/Products/Debug-iphoneos/_RopeModule.o (in target '_RopeModule' from project 'swift-collections')
    cd /Users/admin/builder/spi-builder-workspace/.dependencies/checkouts/swift-collections
    builtin-RegisterExecutionPolicyException /Users/admin/builder/spi-builder-workspace/.derivedData/Build/Products/Debug-iphoneos/_RopeModule.o
RegisterExecutionPolicyException /Users/admin/builder/spi-builder-workspace/.derivedData/Build/Products/Debug-iphoneos/OrderedCollections.o (in target 'OrderedCollections' from project 'swift-collections')
    cd /Users/admin/builder/spi-builder-workspace/.dependencies/checkouts/swift-collections
    builtin-RegisterExecutionPolicyException /Users/admin/builder/spi-builder-workspace/.derivedData/Build/Products/Debug-iphoneos/OrderedCollections.o
SwiftDriverJobDiscovery normal arm64 Compiling BitSet+SetAlgebra symmetricDifference.swift, BitSet+SetAlgebra union.swift, BitSet+Sorted Collection APIs.swift, BitSet.Counted.swift, BitSet.Index.swift, BitSet._UnsafeHandle.swift (in target 'BitCollections' from project 'swift-collections')
SwiftDriverJobDiscovery normal arm64 Compiling BitSet+SetAlgebra formIntersection.swift, BitSet+SetAlgebra formSymmetricDifference.swift, BitSet+SetAlgebra formUnion.swift, BitSet+SetAlgebra intersection.swift, BitSet+SetAlgebra isDisjoint.swift, BitSet+SetAlgebra isEqualSet.swift (in target 'BitCollections' from project 'swift-collections')
SwiftDriverJobDiscovery normal arm64 Compiling BitSet+SetAlgebra isStrictSubset.swift, BitSet+SetAlgebra isStrictSuperset.swift, BitSet+SetAlgebra isSubset.swift, BitSet+SetAlgebra isSuperset.swift, BitSet+SetAlgebra subtract.swift, BitSet+SetAlgebra subtracting.swift (in target 'BitCollections' from project 'swift-collections')
RegisterExecutionPolicyException /Users/admin/builder/spi-builder-workspace/.derivedData/Build/Products/Debug-iphoneos/HeapModule.o (in target 'HeapModule' from project 'swift-collections')
    cd /Users/admin/builder/spi-builder-workspace/.dependencies/checkouts/swift-collections
    builtin-RegisterExecutionPolicyException /Users/admin/builder/spi-builder-workspace/.derivedData/Build/Products/Debug-iphoneos/HeapModule.o
SwiftDriverJobDiscovery normal arm64 Compiling BitArray+BitwiseOperations.swift, BitArray+ChunkedBitsIterators.swift, BitArray+Codable.swift, BitArray+Collection.swift, BitArray+Copy.swift, BitArray+CustomReflectable.swift (in target 'BitCollections' from project 'swift-collections')
SwiftDriverJobDiscovery normal arm64 Compiling BitArray+Shifts.swift, BitArray+Testing.swift, BitArray._UnsafeHandle.swift, BitArray.swift, BitSet+BidirectionalCollection.swift, BitSet+Codable.swift (in target 'BitCollections' from project 'swift-collections')
RegisterExecutionPolicyException /Users/admin/builder/spi-builder-workspace/.derivedData/Build/Products/Debug-iphoneos/DequeModule.o (in target 'DequeModule' from project 'swift-collections')
    cd /Users/admin/builder/spi-builder-workspace/.dependencies/checkouts/swift-collections
    builtin-RegisterExecutionPolicyException /Users/admin/builder/spi-builder-workspace/.derivedData/Build/Products/Debug-iphoneos/DequeModule.o
SwiftDriverJobDiscovery normal arm64 Compiling BitArray+Hashable.swift, BitArray+Initializers.swift, BitArray+Invariants.swift, BitArray+LosslessStringConvertible.swift, BitArray+RandomBits.swift, BitArray+RangeReplaceableCollection.swift (in target 'BitCollections' from project 'swift-collections')
SwiftDriver\ Compilation BitCollections normal arm64 com.apple.xcode.tools.swift.compiler (in target 'BitCollections' from project 'swift-collections')
    cd /Users/admin/builder/spi-builder-workspace/.swiftpm/xcode
    builtin-Swift-Compilation -- /Applications/Xcode-16.3.0.app/Contents/Developer/Toolchains/XcodeDefault.xctoolchain/usr/bin/swiftc -module-name BitCollections -Onone -enforce-exclusivity\=checked @/Users/admin/builder/spi-builder-workspace/.derivedData/Build/Intermediates.noindex/swift-collections.build/Debug-iphoneos/BitCollections.build/Objects-normal/arm64/BitCollections.SwiftFileList -DSWIFT_PACKAGE -DDEBUG -DCOLLECTIONS_RANDOMIZED_TESTING -DXcode -plugin-path /Applications/Xcode-16.3.0.app/Contents/Developer/Toolchains/XcodeDefault.xctoolchain/usr/lib/swift/host/plugins/testing -enable-experimental-feature DebugDescriptionMacro -sdk /Applications/Xcode-16.3.0.app/Contents/Developer/Platforms/iPhoneOS.platform/Developer/SDKs/iPhoneOS18.4.sdk -target arm64-apple-ios12.0 -g -module-cache-path /Users/admin/builder/spi-builder-workspace/.derivedData/ModuleCache.noindex -Xfrontend -serialize-debugging-options -enable-testing -suppress-warnings -index-store-path /Users/admin/builder/spi-builder-workspace/.derivedData/Index.noindex/DataStore -swift-version 5 -I /Users/admin/builder/spi-builder-workspace/.derivedData/Build/Products/Debug-iphoneos -I /Applications/Xcode-16.3.0.app/Contents/Developer/Platforms/iPhoneOS.platform/Developer/usr/lib -F /Users/admin/builder/spi-builder-workspace/.derivedData/Build/Products/Debug-iphoneos/PackageFrameworks -F /Users/admin/builder/spi-builder-workspace/.derivedData/Build/Products/Debug-iphoneos -F /Applications/Xcode-16.3.0.app/Contents/Developer/Platforms/iPhoneOS.platform/Developer/Library/Frameworks -F /Applications/Xcode-16.3.0.app/Contents/Developer/Platforms/iPhoneOS.platform/Developer/SDKs/iPhoneOS18.4.sdk/Developer/Library/Frameworks -c -j10 -enable-batch-mode -incremental -Xcc -ivfsstatcache -Xcc /Users/admin/builder/spi-builder-workspace/.derivedData/SDKStatCaches.noindex/iphoneos18.4-22E235-339d34bc69d7fc736c3220795c36f340.sdkstatcache -output-file-map /Users/admin/builder/spi-builder-workspace/.derivedData/Build/Intermediates.noindex/swift-collections.build/Debug-iphoneos/BitCollections.build/Objects-normal/arm64/BitCollections-OutputFileMap.json -use-frontend-parseable-output -save-temps -no-color-diagnostics -serialize-diagnostics -emit-dependencies -emit-module -emit-module-path /Users/admin/builder/spi-builder-workspace/.derivedData/Build/Intermediates.noindex/swift-collections.build/Debug-iphoneos/BitCollections.build/Objects-normal/arm64/BitCollections.swiftmodule -validate-clang-modules-once -clang-build-session-file /Users/admin/builder/spi-builder-workspace/.derivedData/ModuleCache.noindex/Session.modulevalidation -Xcc -I/Users/admin/builder/spi-builder-workspace/.derivedData/Build/Intermediates.noindex/swift-collections.build/Debug-iphoneos/BitCollections.build/swift-overrides.hmap -emit-const-values -Xfrontend -const-gather-protocols-file -Xfrontend /Users/admin/builder/spi-builder-workspace/.derivedData/Build/Intermediates.noindex/swift-collections.build/Debug-iphoneos/BitCollections.build/Objects-normal/arm64/BitCollections_const_extract_protocols.json -Xcc -I/Users/admin/builder/spi-builder-workspace/.derivedData/Build/Products/Debug-iphoneos/include -Xcc -I/Users/admin/builder/spi-builder-workspace/.derivedData/Build/Intermediates.noindex/swift-collections.build/Debug-iphoneos/BitCollections.build/DerivedSources-normal/arm64 -Xcc -I/Users/admin/builder/spi-builder-workspace/.derivedData/Build/Intermediates.noindex/swift-collections.build/Debug-iphoneos/BitCollections.build/DerivedSources/arm64 -Xcc -I/Users/admin/builder/spi-builder-workspace/.derivedData/Build/Intermediates.noindex/swift-collections.build/Debug-iphoneos/BitCollections.build/DerivedSources -Xcc -DSWIFT_PACKAGE -Xcc -DDEBUG\=1 -emit-objc-header -emit-objc-header-path /Users/admin/builder/spi-builder-workspace/.derivedData/Build/Intermediates.noindex/swift-collections.build/Debug-iphoneos/BitCollections.build/Objects-normal/arm64/BitCollections-Swift.h -working-directory /Users/admin/builder/spi-builder-workspace/.swiftpm/xcode -experimental-emit-module-separately -disable-cmo
SwiftDriverJobDiscovery normal arm64 Compiling _HashNode+Structural isEqualSet.swift, _HashNode+Structural isSubset.swift, _HashNode+Structural mapValues.swift, _HashNode+Structural merge.swift, _HashNode+Structural subtracting.swift, _HashNode+Structural symmetricDifference.swift, _HashNode+Structural union.swift, _HashNode+Subtree Insertions.swift, _HashNode+Subtree Modify.swift (in target 'HashTreeCollections' from project 'swift-collections')
SwiftCompile normal arm64 Compiling\ ResultModifier.swift,\ ResultReader.swift,\ Logging.swift,\ Aligned.swift,\ Adding.swift,\ AddingExclusive.swift,\ Difference.swift,\ Intersection.swift,\ Union.swift,\ Measure.swift,\ OffsetBounds.swift,\ Resize2D.swift,\ Resize3D.swift,\ SetBounds.swift,\ SetBoundsSize.swift,\ Clone.swift,\ Distribute.swift /Users/admin/builder/spi-builder-workspace/.dependencies/checkouts/SwiftSCAD/Sources/SwiftSCAD/Geometry/ResultElement/ResultModifier.swift /Users/admin/builder/spi-builder-workspace/.dependencies/checkouts/SwiftSCAD/Sources/SwiftSCAD/Geometry/ResultElement/ResultReader.swift /Users/admin/builder/spi-builder-workspace/.dependencies/checkouts/SwiftSCAD/Sources/SwiftSCAD/Logging.swift /Users/admin/builder/spi-builder-workspace/.dependencies/checkouts/SwiftSCAD/Sources/SwiftSCAD/Operations/Aligned.swift /Users/admin/builder/spi-builder-workspace/.dependencies/checkouts/SwiftSCAD/Sources/SwiftSCAD/Operations/Boolean/Adding.swift /Users/admin/builder/spi-builder-workspace/.dependencies/checkouts/SwiftSCAD/Sources/SwiftSCAD/Operations/Boolean/AddingExclusive.swift /Users/admin/builder/spi-builder-workspace/.dependencies/checkouts/SwiftSCAD/Sources/SwiftSCAD/Operations/Boolean/Difference.swift /Users/admin/builder/spi-builder-workspace/.dependencies/checkouts/SwiftSCAD/Sources/SwiftSCAD/Operations/Boolean/Intersection.swift /Users/admin/builder/spi-builder-workspace/.dependencies/checkouts/SwiftSCAD/Sources/SwiftSCAD/Operations/Boolean/Union.swift /Users/admin/builder/spi-builder-workspace/.dependencies/checkouts/SwiftSCAD/Sources/SwiftSCAD/Operations/Bounds/Measure.swift /Users/admin/builder/spi-builder-workspace/.dependencies/checkouts/SwiftSCAD/Sources/SwiftSCAD/Operations/Bounds/OffsetBounds.swift /Users/admin/builder/spi-builder-workspace/.dependencies/checkouts/SwiftSCAD/Sources/SwiftSCAD/Operations/Bounds/Resize2D.swift /Users/admin/builder/spi-builder-workspace/.dependencies/checkouts/SwiftSCAD/Sources/SwiftSCAD/Operations/Bounds/Resize3D.swift /Users/admin/builder/spi-builder-workspace/.dependencies/checkouts/SwiftSCAD/Sources/SwiftSCAD/Operations/Bounds/SetBounds.swift /Users/admin/builder/spi-builder-workspace/.dependencies/checkouts/SwiftSCAD/Sources/SwiftSCAD/Operations/Bounds/SetBoundsSize.swift /Users/admin/builder/spi-builder-workspace/.dependencies/checkouts/SwiftSCAD/Sources/SwiftSCAD/Operations/Duplication/Clone.swift /Users/admin/builder/spi-builder-workspace/.dependencies/checkouts/SwiftSCAD/Sources/SwiftSCAD/Operations/Duplication/Distribute.swift (in target 'SwiftSCAD' from project 'SwiftSCAD')
SwiftCompile normal arm64 /Users/admin/builder/spi-builder-workspace/.dependencies/checkouts/SwiftSCAD/Sources/SwiftSCAD/Geometry/ResultElement/ResultModifier.swift (in target 'SwiftSCAD' from project 'SwiftSCAD')
    cd /Users/admin/builder/spi-builder-workspace/.swiftpm/xcode

SwiftCompile normal arm64 /Users/admin/builder/spi-builder-workspace/.dependencies/checkouts/SwiftSCAD/Sources/SwiftSCAD/Geometry/ResultElement/ResultReader.swift (in target 'SwiftSCAD' from project 'SwiftSCAD')
    cd /Users/admin/builder/spi-builder-workspace/.swiftpm/xcode

SwiftCompile normal arm64 /Users/admin/builder/spi-builder-workspace/.dependencies/checkouts/SwiftSCAD/Sources/SwiftSCAD/Logging.swift (in target 'SwiftSCAD' from project 'SwiftSCAD')
    cd /Users/admin/builder/spi-builder-workspace/.swiftpm/xcode

SwiftCompile normal arm64 /Users/admin/builder/spi-builder-workspace/.dependencies/checkouts/SwiftSCAD/Sources/SwiftSCAD/Operations/Aligned.swift (in target 'SwiftSCAD' from project 'SwiftSCAD')
    cd /Users/admin/builder/spi-builder-workspace/.swiftpm/xcode

SwiftCompile normal arm64 /Users/admin/builder/spi-builder-workspace/.dependencies/checkouts/SwiftSCAD/Sources/SwiftSCAD/Operations/Boolean/Adding.swift (in target 'SwiftSCAD' from project 'SwiftSCAD')
    cd /Users/admin/builder/spi-builder-workspace/.swiftpm/xcode

SwiftCompile normal arm64 /Users/admin/builder/spi-builder-workspace/.dependencies/checkouts/SwiftSCAD/Sources/SwiftSCAD/Operations/Boolean/AddingExclusive.swift (in target 'SwiftSCAD' from project 'SwiftSCAD')
    cd /Users/admin/builder/spi-builder-workspace/.swiftpm/xcode

SwiftCompile normal arm64 /Users/admin/builder/spi-builder-workspace/.dependencies/checkouts/SwiftSCAD/Sources/SwiftSCAD/Operations/Boolean/Difference.swift (in target 'SwiftSCAD' from project 'SwiftSCAD')
    cd /Users/admin/builder/spi-builder-workspace/.swiftpm/xcode

SwiftCompile normal arm64 /Users/admin/builder/spi-builder-workspace/.dependencies/checkouts/SwiftSCAD/Sources/SwiftSCAD/Operations/Boolean/Intersection.swift (in target 'SwiftSCAD' from project 'SwiftSCAD')
    cd /Users/admin/builder/spi-builder-workspace/.swiftpm/xcode

SwiftCompile normal arm64 /Users/admin/builder/spi-builder-workspace/.dependencies/checkouts/SwiftSCAD/Sources/SwiftSCAD/Operations/Boolean/Union.swift (in target 'SwiftSCAD' from project 'SwiftSCAD')
    cd /Users/admin/builder/spi-builder-workspace/.swiftpm/xcode

SwiftCompile normal arm64 /Users/admin/builder/spi-builder-workspace/.dependencies/checkouts/SwiftSCAD/Sources/SwiftSCAD/Operations/Bounds/Measure.swift (in target 'SwiftSCAD' from project 'SwiftSCAD')
    cd /Users/admin/builder/spi-builder-workspace/.swiftpm/xcode

SwiftCompile normal arm64 /Users/admin/builder/spi-builder-workspace/.dependencies/checkouts/SwiftSCAD/Sources/SwiftSCAD/Operations/Bounds/OffsetBounds.swift (in target 'SwiftSCAD' from project 'SwiftSCAD')
    cd /Users/admin/builder/spi-builder-workspace/.swiftpm/xcode

SwiftCompile normal arm64 /Users/admin/builder/spi-builder-workspace/.dependencies/checkouts/SwiftSCAD/Sources/SwiftSCAD/Operations/Bounds/Resize2D.swift (in target 'SwiftSCAD' from project 'SwiftSCAD')
    cd /Users/admin/builder/spi-builder-workspace/.swiftpm/xcode

SwiftCompile normal arm64 /Users/admin/builder/spi-builder-workspace/.dependencies/checkouts/SwiftSCAD/Sources/SwiftSCAD/Operations/Bounds/Resize3D.swift (in target 'SwiftSCAD' from project 'SwiftSCAD')
    cd /Users/admin/builder/spi-builder-workspace/.swiftpm/xcode

SwiftCompile normal arm64 /Users/admin/builder/spi-builder-workspace/.dependencies/checkouts/SwiftSCAD/Sources/SwiftSCAD/Operations/Bounds/SetBounds.swift (in target 'SwiftSCAD' from project 'SwiftSCAD')
    cd /Users/admin/builder/spi-builder-workspace/.swiftpm/xcode

SwiftCompile normal arm64 /Users/admin/builder/spi-builder-workspace/.dependencies/checkouts/SwiftSCAD/Sources/SwiftSCAD/Operations/Bounds/SetBoundsSize.swift (in target 'SwiftSCAD' from project 'SwiftSCAD')
    cd /Users/admin/builder/spi-builder-workspace/.swiftpm/xcode

SwiftCompile normal arm64 /Users/admin/builder/spi-builder-workspace/.dependencies/checkouts/SwiftSCAD/Sources/SwiftSCAD/Operations/Duplication/Clone.swift (in target 'SwiftSCAD' from project 'SwiftSCAD')
    cd /Users/admin/builder/spi-builder-workspace/.swiftpm/xcode

SwiftCompile normal arm64 /Users/admin/builder/spi-builder-workspace/.dependencies/checkouts/SwiftSCAD/Sources/SwiftSCAD/Operations/Duplication/Distribute.swift (in target 'SwiftSCAD' from project 'SwiftSCAD')
    cd /Users/admin/builder/spi-builder-workspace/.swiftpm/xcode

SwiftEmitModule normal arm64 Emitting\ module\ for\ SwiftSCAD (in target 'SwiftSCAD' from project 'SwiftSCAD')
EmitSwiftModule normal arm64 (in target 'SwiftSCAD' from project 'SwiftSCAD')
    cd /Users/admin/builder/spi-builder-workspace/.swiftpm/xcode

SwiftCompile normal arm64 Compiling\ Offset.swift,\ Rounding.swift,\ Projection.swift,\ Replace.swift,\ RoundedBoxCornerMask.swift,\ RoundedRectangleMask.swift,\ RoundingBoxCorners.swift,\ RoundingRectangleCorners.swift,\ SetVariables.swift,\ Stack.swift,\ UseFacets.swift,\ Within.swift,\ Operators.swift,\ CodeFragment+Export.swift,\ OpenSCADExport+FixSTL.swift,\ OpenSCADExport+POSIX.swift,\ OpenSCADExport+Windows.swift /Users/admin/builder/spi-builder-workspace/.dependencies/checkouts/SwiftSCAD/Sources/SwiftSCAD/Operations/Offsetting/Offset.swift /Users/admin/builder/spi-builder-workspace/.dependencies/checkouts/SwiftSCAD/Sources/SwiftSCAD/Operations/Offsetting/Rounding.swift /Users/admin/builder/spi-builder-workspace/.dependencies/checkouts/SwiftSCAD/Sources/SwiftSCAD/Operations/Projection.swift /Users/admin/builder/spi-builder-workspace/.dependencies/checkouts/SwiftSCAD/Sources/SwiftSCAD/Operations/Replace.swift /Users/admin/builder/spi-builder-workspace/.dependencies/checkouts/SwiftSCAD/Sources/SwiftSCAD/Operations/Rounding/Masks/RoundedBoxCornerMask.swift /Users/admin/builder/spi-builder-workspace/.dependencies/checkouts/SwiftSCAD/Sources/SwiftSCAD/Operations/Rounding/Masks/RoundedRectangleMask.swift /Users/admin/builder/spi-builder-workspace/.dependencies/checkouts/SwiftSCAD/Sources/SwiftSCAD/Operations/Rounding/RoundingBoxCorners.swift /Users/admin/builder/spi-builder-workspace/.dependencies/checkouts/SwiftSCAD/Sources/SwiftSCAD/Operations/Rounding/RoundingRectangleCorners.swift /Users/admin/builder/spi-builder-workspace/.dependencies/checkouts/SwiftSCAD/Sources/SwiftSCAD/Operations/SetVariables.swift /Users/admin/builder/spi-builder-workspace/.dependencies/checkouts/SwiftSCAD/Sources/SwiftSCAD/Operations/Stack.swift /Users/admin/builder/spi-builder-workspace/.dependencies/checkouts/SwiftSCAD/Sources/SwiftSCAD/Operations/UseFacets.swift /Users/admin/builder/spi-builder-workspace/.dependencies/checkouts/SwiftSCAD/Sources/SwiftSCAD/Operations/Within.swift /Users/admin/builder/spi-builder-workspace/.dependencies/checkouts/SwiftSCAD/Sources/SwiftSCAD/Operators.swift /Users/admin/builder/spi-builder-workspace/.dependencies/checkouts/SwiftSCAD/Sources/SwiftSCAD/Output/CodeFragment+Export.swift /Users/admin/builder/spi-builder-workspace/.dependencies/checkouts/SwiftSCAD/Sources/SwiftSCAD/Output/OpenSCADExport/OpenSCADExport+FixSTL.swift /Users/admin/builder/spi-builder-workspace/.dependencies/checkouts/SwiftSCAD/Sources/SwiftSCAD/Output/OpenSCADExport/OpenSCADExport+POSIX.swift /Users/admin/builder/spi-builder-workspace/.dependencies/checkouts/SwiftSCAD/Sources/SwiftSCAD/Output/OpenSCADExport/OpenSCADExport+Windows.swift (in target 'SwiftSCAD' from project 'SwiftSCAD')
Failed frontend command:
/Applications/Xcode-16.3.0.app/Contents/Developer/Toolchains/XcodeDefault.xctoolchain/usr/bin/swift-frontend -frontend -c -filelist /Users/admin/builder/spi-builder-workspace/.derivedData/Build/Intermediates.noindex/SwiftSCAD.build/Debug-iphoneos/SwiftSCAD.build/Objects-normal/arm64/sources-1 -primary-file /Users/admin/builder/spi-builder-workspace/.dependencies/checkouts/SwiftSCAD/Sources/SwiftSCAD/Operations/Offsetting/Offset.swift -primary-file /Users/admin/builder/spi-builder-workspace/.dependencies/checkouts/SwiftSCAD/Sources/SwiftSCAD/Operations/Offsetting/Rounding.swift -primary-file /Users/admin/builder/spi-builder-workspace/.dependencies/checkouts/SwiftSCAD/Sources/SwiftSCAD/Operations/Projection.swift -primary-file /Users/admin/builder/spi-builder-workspace/.dependencies/checkouts/SwiftSCAD/Sources/SwiftSCAD/Operations/Replace.swift -primary-file /Users/admin/builder/spi-builder-workspace/.dependencies/checkouts/SwiftSCAD/Sources/SwiftSCAD/Operations/Rounding/Masks/RoundedBoxCornerMask.swift -primary-file /Users/admin/builder/spi-builder-workspace/.dependencies/checkouts/SwiftSCAD/Sources/SwiftSCAD/Operations/Rounding/Masks/RoundedRectangleMask.swift -primary-file /Users/admin/builder/spi-builder-workspace/.dependencies/checkouts/SwiftSCAD/Sources/SwiftSCAD/Operations/Rounding/RoundingBoxCorners.swift -primary-file /Users/admin/builder/spi-builder-workspace/.dependencies/checkouts/SwiftSCAD/Sources/SwiftSCAD/Operations/Rounding/RoundingRectangleCorners.swift -primary-file /Users/admin/builder/spi-builder-workspace/.dependencies/checkouts/SwiftSCAD/Sources/SwiftSCAD/Operations/SetVariables.swift -primary-file /Users/admin/builder/spi-builder-workspace/.dependencies/checkouts/SwiftSCAD/Sources/SwiftSCAD/Operations/Stack.swift -primary-file /Users/admin/builder/spi-builder-workspace/.dependencies/checkouts/SwiftSCAD/Sources/SwiftSCAD/Operations/UseFacets.swift -primary-file /Users/admin/builder/spi-builder-workspace/.dependencies/checkouts/SwiftSCAD/Sources/SwiftSCAD/Operations/Within.swift -primary-file /Users/admin/builder/spi-builder-workspace/.dependencies/checkouts/SwiftSCAD/Sources/SwiftSCAD/Operators.swift -primary-file /Users/admin/builder/spi-builder-workspace/.dependencies/checkouts/SwiftSCAD/Sources/SwiftSCAD/Output/CodeFragment+Export.swift -primary-file /Users/admin/builder/spi-builder-workspace/.dependencies/checkouts/SwiftSCAD/Sources/SwiftSCAD/Output/OpenSCADExport/OpenSCADExport+FixSTL.swift -primary-file /Users/admin/builder/spi-builder-workspace/.dependencies/checkouts/SwiftSCAD/Sources/SwiftSCAD/Output/OpenSCADExport/OpenSCADExport+POSIX.swift -primary-file /Users/admin/builder/spi-builder-workspace/.dependencies/checkouts/SwiftSCAD/Sources/SwiftSCAD/Output/OpenSCADExport/OpenSCADExport+Windows.swift -supplementary-output-file-map /Users/admin/builder/spi-builder-workspace/.derivedData/Build/Intermediates.noindex/SwiftSCAD.build/Debug-iphoneos/SwiftSCAD.build/Objects-normal/arm64/supplementaryOutputs-85 -target arm64-apple-ios12.0 -Xllvm -aarch64-use-tbi -enable-objc-interop -sdk /Applications/Xcode-16.3.0.app/Contents/Developer/Platforms/iPhoneOS.platform/Developer/SDKs/iPhoneOS18.4.sdk -I /Users/admin/builder/spi-builder-workspace/.derivedData/Build/Products/Debug-iphoneos -I /Applications/Xcode-16.3.0.app/Contents/Developer/Platforms/iPhoneOS.platform/Developer/usr/lib -F /Users/admin/builder/spi-builder-workspace/.derivedData/Build/Products/Debug-iphoneos/PackageFrameworks -F /Users/admin/builder/spi-builder-workspace/.derivedData/Build/Products/Debug-iphoneos/PackageFrameworks -F /Users/admin/builder/spi-builder-workspace/.derivedData/Build/Products/Debug-iphoneos/PackageFrameworks -F /Users/admin/builder/spi-builder-workspace/.derivedData/Build/Products/Debug-iphoneos/PackageFrameworks -F /Users/admin/builder/spi-builder-workspace/.derivedData/Build/Products/Debug-iphoneos/PackageFrameworks -F /Users/admin/builder/spi-builder-workspace/.derivedData/Build/Products/Debug-iphoneos/PackageFrameworks -F /Users/admin/builder/spi-builder-workspace/.derivedData/Build/Products/Debug-iphoneos/PackageFrameworks -F /Users/admin/builder/spi-builder-workspace/.derivedData/Build/Products/Debug-iphoneos/PackageFrameworks -F /Users/admin/builder/spi-builder-workspace/.derivedData/Build/Products/Debug-iphoneos/PackageFrameworks -F /Users/admin/builder/spi-builder-workspace/.derivedData/Build/Products/Debug-iphoneos -F /Applications/Xcode-16.3.0.app/Contents/Developer/Platforms/iPhoneOS.platform/Developer/Library/Frameworks -F /Applications/Xcode-16.3.0.app/Contents/Developer/Platforms/iPhoneOS.platform/Developer/SDKs/iPhoneOS18.4.sdk/Developer/Library/Frameworks -no-color-diagnostics -enable-testing -g -debug-info-format\=dwarf -dwarf-version\=4 -module-cache-path /Users/admin/builder/spi-builder-workspace/.derivedData/ModuleCache.noindex -suppress-warnings -swift-version 6 -enforce-exclusivity\=checked -Onone -D SWIFT_PACKAGE -D DEBUG -D Xcode -serialize-debugging-options -const-gather-protocols-file /Users/admin/builder/spi-builder-workspace/.derivedData/Build/Intermediates.noindex/SwiftSCAD.build/Debug-iphoneos/SwiftSCAD.build/Objects-normal/arm64/SwiftSCAD_const_extract_protocols.json -enable-experimental-feature DebugDescriptionMacro -empty-abi-descriptor -plugin-path /Applications/Xcode-16.3.0.app/Contents/Developer/Toolchains/XcodeDefault.xctoolchain/usr/lib/swift/host/plugins/testing -user-module-version 0.9.0 -validate-clang-modules-once -clang-build-session-file /Users/admin/builder/spi-builder-workspace/.derivedData/ModuleCache.noindex/Session.modulevalidation -Xcc -working-directory -Xcc /Users/admin/builder/spi-builder-workspace/.swiftpm/xcode -resource-dir /Applications/Xcode-16.3.0.app/Contents/Developer/Toolchains/XcodeDefault.xctoolchain/usr/lib/swift -enable-anonymous-context-mangled-names -file-compilation-dir /Users/admin/builder/spi-builder-workspace/.swiftpm/xcode -Xcc -ivfsstatcache -Xcc /Users/admin/builder/spi-builder-workspace/.derivedData/SDKStatCaches.noindex/iphoneos18.4-22E235-339d34bc69d7fc736c3220795c36f340.sdkstatcache -Xcc -I/Users/admin/builder/spi-builder-workspace/.derivedData/Build/Intermediates.noindex/SwiftSCAD.build/Debug-iphoneos/SwiftSCAD.build/swift-overrides.hmap -Xcc -I/Users/admin/builder/spi-builder-workspace/.derivedData/Build/Products/Debug-iphoneos/include -Xcc -I/Users/admin/builder/spi-builder-workspace/.derivedData/Build/Intermediates.noindex/SwiftSCAD.build/Debug-iphoneos/SwiftSCAD.build/DerivedSources-normal/arm64 -Xcc -I/Users/admin/builder/spi-builder-workspace/.derivedData/Build/Intermediates.noindex/SwiftSCAD.build/Debug-iphoneos/SwiftSCAD.build/DerivedSources/arm64 -Xcc -I/Users/admin/builder/spi-builder-workspace/.derivedData/Build/Intermediates.noindex/SwiftSCAD.build/Debug-iphoneos/SwiftSCAD.build/DerivedSources -Xcc -DSWIFT_PACKAGE -Xcc -DDEBUG\=1 -module-name SwiftSCAD -package-name swiftscad -frontend-parseable-output -disable-clang-spi -target-sdk-version 18.4 -target-sdk-name iphoneos18.4 -external-plugin-path /Applications/Xcode-16.3.0.app/Contents/Developer/Platforms/iPhoneOS.platform/Developer/usr/lib/swift/host/plugins\#/Applications/Xcode-16.3.0.app/Contents/Developer/Platforms/iPhoneOS.platform/Developer/usr/bin/swift-plugin-server -external-plugin-path /Applications/Xcode-16.3.0.app/Contents/Developer/Platforms/iPhoneOS.platform/Developer/usr/local/lib/swift/host/plugins\#/Applications/Xcode-16.3.0.app/Contents/Developer/Platforms/iPhoneOS.platform/Developer/usr/bin/swift-plugin-server -in-process-plugin-server-path /Applications/Xcode-16.3.0.app/Contents/Developer/Toolchains/XcodeDefault.xctoolchain/usr/lib/swift/host/libSwiftInProcPluginServer.dylib -plugin-path /Applications/Xcode-16.3.0.app/Contents/Developer/Toolchains/XcodeDefault.xctoolchain/usr/lib/swift/host/plugins -plugin-path /Applications/Xcode-16.3.0.app/Contents/Developer/Toolchains/XcodeDefault.xctoolchain/usr/local/lib/swift/host/plugins -o /Users/admin/builder/spi-builder-workspace/.derivedData/Build/Intermediates.noindex/SwiftSCAD.build/Debug-iphoneos/SwiftSCAD.build/Objects-normal/arm64/Offset.o -o /Users/admin/builder/spi-builder-workspace/.derivedData/Build/Intermediates.noindex/SwiftSCAD.build/Debug-iphoneos/SwiftSCAD.build/Objects-normal/arm64/Rounding.o -o /Users/admin/builder/spi-builder-workspace/.derivedData/Build/Intermediates.noindex/SwiftSCAD.build/Debug-iphoneos/SwiftSCAD.build/Objects-normal/arm64/Projection.o -o /Users/admin/builder/spi-builder-workspace/.derivedData/Build/Intermediates.noindex/SwiftSCAD.build/Debug-iphoneos/SwiftSCAD.build/Objects-normal/arm64/Replace.o -o /Users/admin/builder/spi-builder-workspace/.derivedData/Build/Intermediates.noindex/SwiftSCAD.build/Debug-iphoneos/SwiftSCAD.build/Objects-normal/arm64/RoundedBoxCornerMask.o -o /Users/admin/builder/spi-builder-workspace/.derivedData/Build/Intermediates.noindex/SwiftSCAD.build/Debug-iphoneos/SwiftSCAD.build/Objects-normal/arm64/RoundedRectangleMask.o -o /Users/admin/builder/spi-builder-workspace/.derivedData/Build/Intermediates.noindex/SwiftSCAD.build/Debug-iphoneos/SwiftSCAD.build/Objects-normal/arm64/RoundingBoxCorners.o -o /Users/admin/builder/spi-builder-workspace/.derivedData/Build/Intermediates.noindex/SwiftSCAD.build/Debug-iphoneos/SwiftSCAD.build/Objects-normal/arm64/RoundingRectangleCorners.o -o /Users/admin/builder/spi-builder-workspace/.derivedData/Build/Intermediates.noindex/SwiftSCAD.build/Debug-iphoneos/SwiftSCAD.build/Objects-normal/arm64/SetVariables.o -o /Users/admin/builder/spi-builder-workspace/.derivedData/Build/Intermediates.noindex/SwiftSCAD.build/Debug-iphoneos/SwiftSCAD.build/Objects-normal/arm64/Stack.o -o /Users/admin/builder/spi-builder-workspace/.derivedData/Build/Intermediates.noindex/SwiftSCAD.build/Debug-iphoneos/SwiftSCAD.build/Objects-normal/arm64/UseFacets.o -o /Users/admin/builder/spi-builder-workspace/.derivedData/Build/Intermediates.noindex/SwiftSCAD.build/Debug-iphoneos/SwiftSCAD.build/Objects-normal/arm64/Within.o -o /Users/admin/builder/spi-builder-workspace/.derivedData/Build/Intermediates.noindex/SwiftSCAD.build/Debug-iphoneos/SwiftSCAD.build/Objects-normal/arm64/Operators.o -o /Users/admin/builder/spi-builder-workspace/.derivedData/Build/Intermediates.noindex/SwiftSCAD.build/Debug-iphoneos/SwiftSCAD.build/Objects-normal/arm64/CodeFragment+Export.o -o /Users/admin/builder/spi-builder-workspace/.derivedData/Build/Intermediates.noindex/SwiftSCAD.build/Debug-iphoneos/SwiftSCAD.build/Objects-normal/arm64/OpenSCADExport+FixSTL.o -o /Users/admin/builder/spi-builder-workspace/.derivedData/Build/Intermediates.noindex/SwiftSCAD.build/Debug-iphoneos/SwiftSCAD.build/Objects-normal/arm64/OpenSCADExport+POSIX.o -o /Users/admin/builder/spi-builder-workspace/.derivedData/Build/Intermediates.noindex/SwiftSCAD.build/Debug-iphoneos/SwiftSCAD.build/Objects-normal/arm64/OpenSCADExport+Windows.o -index-unit-output-path /SwiftSCAD.build/Debug-iphoneos/SwiftSCAD.build/Objects-normal/arm64/Offset.o -index-unit-output-path /SwiftSCAD.build/Debug-iphoneos/SwiftSCAD.build/Objects-normal/arm64/Rounding.o -index-unit-output-path /SwiftSCAD.build/Debug-iphoneos/SwiftSCAD.build/Objects-normal/arm64/Projection.o -index-unit-output-path /SwiftSCAD.build/Debug-iphoneos/SwiftSCAD.build/Objects-normal/arm64/Replace.o -index-unit-output-path /SwiftSCAD.build/Debug-iphoneos/SwiftSCAD.build/Objects-normal/arm64/RoundedBoxCornerMask.o -index-unit-output-path /SwiftSCAD.build/Debug-iphoneos/SwiftSCAD.build/Objects-normal/arm64/RoundedRectangleMask.o -index-unit-output-path /SwiftSCAD.build/Debug-iphoneos/SwiftSCAD.build/Objects-normal/arm64/RoundingBoxCorners.o -index-unit-output-path /SwiftSCAD.build/Debug-iphoneos/SwiftSCAD.build/Objects-normal/arm64/RoundingRectangleCorners.o -index-unit-output-path /SwiftSCAD.build/Debug-iphoneos/SwiftSCAD.build/Objects-normal/arm64/SetVariables.o -index-unit-output-path /SwiftSCAD.build/Debug-iphoneos/SwiftSCAD.build/Objects-normal/arm64/Stack.o -index-unit-output-path /SwiftSCAD.build/Debug-iphoneos/SwiftSCAD.build/Objects-normal/arm64/UseFacets.o -index-unit-output-path /SwiftSCAD.build/Debug-iphoneos/SwiftSCAD.build/Objects-normal/arm64/Within.o -index-unit-output-path /SwiftSCAD.build/Debug-iphoneos/SwiftSCAD.build/Objects-normal/arm64/Operators.o -index-unit-output-path /SwiftSCAD.build/Debug-iphoneos/SwiftSCAD.build/Objects-normal/arm64/CodeFragment+Export.o -index-unit-output-path /SwiftSCAD.build/Debug-iphoneos/SwiftSCAD.build/Objects-normal/arm64/OpenSCADExport+FixSTL.o -index-unit-output-path /SwiftSCAD.build/Debug-iphoneos/SwiftSCAD.build/Objects-normal/arm64/OpenSCADExport+POSIX.o -index-unit-output-path /SwiftSCAD.build/Debug-iphoneos/SwiftSCAD.build/Objects-normal/arm64/OpenSCADExport+Windows.o -index-store-path /Users/admin/builder/spi-builder-workspace/.derivedData/Index.noindex/DataStore -index-system-modules
SwiftCompile normal arm64 /Users/admin/builder/spi-builder-workspace/.dependencies/checkouts/SwiftSCAD/Sources/SwiftSCAD/Operations/Offsetting/Offset.swift (in target 'SwiftSCAD' from project 'SwiftSCAD')
    cd /Users/admin/builder/spi-builder-workspace/.swiftpm/xcode

SwiftCompile normal arm64 /Users/admin/builder/spi-builder-workspace/.dependencies/checkouts/SwiftSCAD/Sources/SwiftSCAD/Operations/Offsetting/Rounding.swift (in target 'SwiftSCAD' from project 'SwiftSCAD')
    cd /Users/admin/builder/spi-builder-workspace/.swiftpm/xcode

SwiftCompile normal arm64 /Users/admin/builder/spi-builder-workspace/.dependencies/checkouts/SwiftSCAD/Sources/SwiftSCAD/Operations/Projection.swift (in target 'SwiftSCAD' from project 'SwiftSCAD')
    cd /Users/admin/builder/spi-builder-workspace/.swiftpm/xcode

SwiftCompile normal arm64 /Users/admin/builder/spi-builder-workspace/.dependencies/checkouts/SwiftSCAD/Sources/SwiftSCAD/Operations/Replace.swift (in target 'SwiftSCAD' from project 'SwiftSCAD')
    cd /Users/admin/builder/spi-builder-workspace/.swiftpm/xcode

SwiftCompile normal arm64 /Users/admin/builder/spi-builder-workspace/.dependencies/checkouts/SwiftSCAD/Sources/SwiftSCAD/Operations/Rounding/Masks/RoundedBoxCornerMask.swift (in target 'SwiftSCAD' from project 'SwiftSCAD')
    cd /Users/admin/builder/spi-builder-workspace/.swiftpm/xcode

SwiftCompile normal arm64 /Users/admin/builder/spi-builder-workspace/.dependencies/checkouts/SwiftSCAD/Sources/SwiftSCAD/Operations/Rounding/Masks/RoundedRectangleMask.swift (in target 'SwiftSCAD' from project 'SwiftSCAD')
    cd /Users/admin/builder/spi-builder-workspace/.swiftpm/xcode

SwiftCompile normal arm64 /Users/admin/builder/spi-builder-workspace/.dependencies/checkouts/SwiftSCAD/Sources/SwiftSCAD/Operations/Rounding/RoundingBoxCorners.swift (in target 'SwiftSCAD' from project 'SwiftSCAD')
    cd /Users/admin/builder/spi-builder-workspace/.swiftpm/xcode

SwiftCompile normal arm64 /Users/admin/builder/spi-builder-workspace/.dependencies/checkouts/SwiftSCAD/Sources/SwiftSCAD/Operations/Rounding/RoundingRectangleCorners.swift (in target 'SwiftSCAD' from project 'SwiftSCAD')
    cd /Users/admin/builder/spi-builder-workspace/.swiftpm/xcode

SwiftCompile normal arm64 /Users/admin/builder/spi-builder-workspace/.dependencies/checkouts/SwiftSCAD/Sources/SwiftSCAD/Operations/SetVariables.swift (in target 'SwiftSCAD' from project 'SwiftSCAD')
    cd /Users/admin/builder/spi-builder-workspace/.swiftpm/xcode

SwiftCompile normal arm64 /Users/admin/builder/spi-builder-workspace/.dependencies/checkouts/SwiftSCAD/Sources/SwiftSCAD/Operations/Stack.swift (in target 'SwiftSCAD' from project 'SwiftSCAD')
    cd /Users/admin/builder/spi-builder-workspace/.swiftpm/xcode

SwiftCompile normal arm64 /Users/admin/builder/spi-builder-workspace/.dependencies/checkouts/SwiftSCAD/Sources/SwiftSCAD/Operations/UseFacets.swift (in target 'SwiftSCAD' from project 'SwiftSCAD')
    cd /Users/admin/builder/spi-builder-workspace/.swiftpm/xcode

SwiftCompile normal arm64 /Users/admin/builder/spi-builder-workspace/.dependencies/checkouts/SwiftSCAD/Sources/SwiftSCAD/Operations/Within.swift (in target 'SwiftSCAD' from project 'SwiftSCAD')
    cd /Users/admin/builder/spi-builder-workspace/.swiftpm/xcode

SwiftCompile normal arm64 /Users/admin/builder/spi-builder-workspace/.dependencies/checkouts/SwiftSCAD/Sources/SwiftSCAD/Operators.swift (in target 'SwiftSCAD' from project 'SwiftSCAD')
    cd /Users/admin/builder/spi-builder-workspace/.swiftpm/xcode

SwiftCompile normal arm64 /Users/admin/builder/spi-builder-workspace/.dependencies/checkouts/SwiftSCAD/Sources/SwiftSCAD/Output/CodeFragment+Export.swift (in target 'SwiftSCAD' from project 'SwiftSCAD')
    cd /Users/admin/builder/spi-builder-workspace/.swiftpm/xcode

SwiftCompile normal arm64 /Users/admin/builder/spi-builder-workspace/.dependencies/checkouts/SwiftSCAD/Sources/SwiftSCAD/Output/OpenSCADExport/OpenSCADExport+FixSTL.swift (in target 'SwiftSCAD' from project 'SwiftSCAD')
    cd /Users/admin/builder/spi-builder-workspace/.swiftpm/xcode

SwiftCompile normal arm64 /Users/admin/builder/spi-builder-workspace/.dependencies/checkouts/SwiftSCAD/Sources/SwiftSCAD/Output/OpenSCADExport/OpenSCADExport+POSIX.swift (in target 'SwiftSCAD' from project 'SwiftSCAD')
    cd /Users/admin/builder/spi-builder-workspace/.swiftpm/xcode

/Users/admin/builder/spi-builder-workspace/.dependencies/checkouts/SwiftSCAD/Sources/SwiftSCAD/Output/OpenSCADExport/OpenSCADExport+POSIX.swift:11:13: error: 'init(filePath:directoryHint:relativeTo:)' is only available in iOS 16.0 or newer
            URL(filePath: String($0), directoryHint: .isDirectory).appending(component: "openscad")
            ^
/Users/admin/builder/spi-builder-workspace/.dependencies/checkouts/SwiftSCAD/Sources/SwiftSCAD/Output/OpenSCADExport/OpenSCADExport+POSIX.swift:11:13: note: add 'if #available' version check
            URL(filePath: String($0), directoryHint: .isDirectory).appending(component: "openscad")
            ^
/Users/admin/builder/spi-builder-workspace/.dependencies/checkouts/SwiftSCAD/Sources/SwiftSCAD/Output/OpenSCADExport/OpenSCADExport+POSIX.swift:7:17: note: add @available attribute to enclosing static method
    static func findExecutableAutomatically() -> URL? {
                ^
/Users/admin/builder/spi-builder-workspace/.dependencies/checkouts/SwiftSCAD/Sources/SwiftSCAD/Output/OpenSCADExport/OpenSCADExport+POSIX.swift:6:10: note: add @available attribute to enclosing extension
internal extension OpenSCADExport {
         ^
/Users/admin/builder/spi-builder-workspace/.dependencies/checkouts/SwiftSCAD/Sources/SwiftSCAD/Output/OpenSCADExport/OpenSCADExport+POSIX.swift:11:68: error: 'appending(component:directoryHint:)' is only available in iOS 16.0 or newer
            URL(filePath: String($0), directoryHint: .isDirectory).appending(component: "openscad")
                                                                   ^
/Users/admin/builder/spi-builder-workspace/.dependencies/checkouts/SwiftSCAD/Sources/SwiftSCAD/Output/OpenSCADExport/OpenSCADExport+POSIX.swift:11:68: note: add 'if #available' version check
            URL(filePath: String($0), directoryHint: .isDirectory).appending(component: "openscad")
                                                                   ^
/Users/admin/builder/spi-builder-workspace/.dependencies/checkouts/SwiftSCAD/Sources/SwiftSCAD/Output/OpenSCADExport/OpenSCADExport+POSIX.swift:7:17: note: add @available attribute to enclosing static method
    static func findExecutableAutomatically() -> URL? {
                ^
/Users/admin/builder/spi-builder-workspace/.dependencies/checkouts/SwiftSCAD/Sources/SwiftSCAD/Output/OpenSCADExport/OpenSCADExport+POSIX.swift:6:10: note: add @available attribute to enclosing extension
internal extension OpenSCADExport {
         ^
/Users/admin/builder/spi-builder-workspace/.dependencies/checkouts/SwiftSCAD/Sources/SwiftSCAD/Output/OpenSCADExport/OpenSCADExport+POSIX.swift:15:78: error: 'path(percentEncoded:)' is only available in iOS 16.0 or newer
        return possibleExecutables.first { fileManager.fileExists(atPath: $0.path()) }
                                                                             ^
/Users/admin/builder/spi-builder-workspace/.dependencies/checkouts/SwiftSCAD/Sources/SwiftSCAD/Output/OpenSCADExport/OpenSCADExport+POSIX.swift:15:78: note: add 'if #available' version check
        return possibleExecutables.first { fileManager.fileExists(atPath: $0.path()) }
                                                                             ^
/Users/admin/builder/spi-builder-workspace/.dependencies/checkouts/SwiftSCAD/Sources/SwiftSCAD/Output/OpenSCADExport/OpenSCADExport+POSIX.swift:7:17: note: add @available attribute to enclosing static method
    static func findExecutableAutomatically() -> URL? {
                ^
/Users/admin/builder/spi-builder-workspace/.dependencies/checkouts/SwiftSCAD/Sources/SwiftSCAD/Output/OpenSCADExport/OpenSCADExport+POSIX.swift:6:10: note: add @available attribute to enclosing extension
internal extension OpenSCADExport {
         ^
SwiftCompile normal arm64 /Users/admin/builder/spi-builder-workspace/.dependencies/checkouts/SwiftSCAD/Sources/SwiftSCAD/Output/OpenSCADExport/OpenSCADExport+Windows.swift (in target 'SwiftSCAD' from project 'SwiftSCAD')
    cd /Users/admin/builder/spi-builder-workspace/.swiftpm/xcode

SwiftCompile normal arm64 Compiling\ Angle+Operators.swift,\ Angle+Trigonometry.swift,\ Angle.swift,\ Axes.swift,\ Axis.swift,\ AxisDirection.swift,\ BezierPath+Adding.swift,\ BezierPath+Operations.swift,\ BezierPath+Visualization.swift,\ BezierPath.Curve.swift,\ BezierPath.swift,\ BezierPath.Builder.swift,\ ComponentFunctions.swift,\ PathBuilderValue.swift,\ PathBuilderVector.swift,\ Boundary+Shapes.swift,\ Boundary+Visualization.swift /Users/admin/builder/spi-builder-workspace/.dependencies/checkouts/SwiftSCAD/Sources/SwiftSCAD/Values/Angle/Angle+Operators.swift /Users/admin/builder/spi-builder-workspace/.dependencies/checkouts/SwiftSCAD/Sources/SwiftSCAD/Values/Angle/Angle+Trigonometry.swift /Users/admin/builder/spi-builder-workspace/.dependencies/checkouts/SwiftSCAD/Sources/SwiftSCAD/Values/Angle/Angle.swift /Users/admin/builder/spi-builder-workspace/.dependencies/checkouts/SwiftSCAD/Sources/SwiftSCAD/Values/Axis/Axes.swift /Users/admin/builder/spi-builder-workspace/.dependencies/checkouts/SwiftSCAD/Sources/SwiftSCAD/Values/Axis/Axis.swift /Users/admin/builder/spi-builder-workspace/.dependencies/checkouts/SwiftSCAD/Sources/SwiftSCAD/Values/Axis/AxisDirection.swift /Users/admin/builder/spi-builder-workspace/.dependencies/checkouts/SwiftSCAD/Sources/SwiftSCAD/Values/Bezier/BezierPath+Adding.swift /Users/admin/builder/spi-builder-workspace/.dependencies/checkouts/SwiftSCAD/Sources/SwiftSCAD/Values/Bezier/BezierPath+Operations.swift /Users/admin/builder/spi-builder-workspace/.dependencies/checkouts/SwiftSCAD/Sources/SwiftSCAD/Values/Bezier/BezierPath+Visualization.swift /Users/admin/builder/spi-builder-workspace/.dependencies/checkouts/SwiftSCAD/Sources/SwiftSCAD/Values/Bezier/BezierPath.Curve.swift /Users/admin/builder/spi-builder-workspace/.dependencies/checkouts/SwiftSCAD/Sources/SwiftSCAD/Values/Bezier/BezierPath.swift /Users/admin/builder/spi-builder-workspace/.dependencies/checkouts/SwiftSCAD/Sources/SwiftSCAD/Values/Bezier/Path\ Builder/BezierPath.Builder.swift /Users/admin/builder/spi-builder-workspace/.dependencies/checkouts/SwiftSCAD/Sources/SwiftSCAD/Values/Bezier/Path\ Builder/ComponentFunctions.swift /Users/admin/builder/spi-builder-workspace/.dependencies/checkouts/SwiftSCAD/Sources/SwiftSCAD/Values/Bezier/Path\ Builder/PathBuilderValue.swift /Users/admin/builder/spi-builder-workspace/.dependencies/checkouts/SwiftSCAD/Sources/SwiftSCAD/Values/Bezier/Path\ Builder/PathBuilderVector.swift /Users/admin/builder/spi-builder-workspace/.dependencies/checkouts/SwiftSCAD/Sources/SwiftSCAD/Values/Boundary/Boundary+Shapes.swift /Users/admin/builder/spi-builder-workspace/.dependencies/checkouts/SwiftSCAD/Sources/SwiftSCAD/Values/Boundary/Boundary+Visualization.swift (in target 'SwiftSCAD' from project 'SwiftSCAD')
SwiftCompile normal arm64 /Users/admin/builder/spi-builder-workspace/.dependencies/checkouts/SwiftSCAD/Sources/SwiftSCAD/Values/Angle/Angle+Operators.swift (in target 'SwiftSCAD' from project 'SwiftSCAD')
    cd /Users/admin/builder/spi-builder-workspace/.swiftpm/xcode

SwiftCompile normal arm64 /Users/admin/builder/spi-builder-workspace/.dependencies/checkouts/SwiftSCAD/Sources/SwiftSCAD/Values/Angle/Angle+Trigonometry.swift (in target 'SwiftSCAD' from project 'SwiftSCAD')
    cd /Users/admin/builder/spi-builder-workspace/.swiftpm/xcode

SwiftCompile normal arm64 /Users/admin/builder/spi-builder-workspace/.dependencies/checkouts/SwiftSCAD/Sources/SwiftSCAD/Values/Angle/Angle.swift (in target 'SwiftSCAD' from project 'SwiftSCAD')
    cd /Users/admin/builder/spi-builder-workspace/.swiftpm/xcode

SwiftCompile normal arm64 /Users/admin/builder/spi-builder-workspace/.dependencies/checkouts/SwiftSCAD/Sources/SwiftSCAD/Values/Axis/Axes.swift (in target 'SwiftSCAD' from project 'SwiftSCAD')
    cd /Users/admin/builder/spi-builder-workspace/.swiftpm/xcode

SwiftCompile normal arm64 /Users/admin/builder/spi-builder-workspace/.dependencies/checkouts/SwiftSCAD/Sources/SwiftSCAD/Values/Axis/Axis.swift (in target 'SwiftSCAD' from project 'SwiftSCAD')
    cd /Users/admin/builder/spi-builder-workspace/.swiftpm/xcode

SwiftCompile normal arm64 /Users/admin/builder/spi-builder-workspace/.dependencies/checkouts/SwiftSCAD/Sources/SwiftSCAD/Values/Axis/AxisDirection.swift (in target 'SwiftSCAD' from project 'SwiftSCAD')
    cd /Users/admin/builder/spi-builder-workspace/.swiftpm/xcode

SwiftCompile normal arm64 /Users/admin/builder/spi-builder-workspace/.dependencies/checkouts/SwiftSCAD/Sources/SwiftSCAD/Values/Bezier/BezierPath+Adding.swift (in target 'SwiftSCAD' from project 'SwiftSCAD')
    cd /Users/admin/builder/spi-builder-workspace/.swiftpm/xcode

SwiftCompile normal arm64 /Users/admin/builder/spi-builder-workspace/.dependencies/checkouts/SwiftSCAD/Sources/SwiftSCAD/Values/Bezier/BezierPath+Operations.swift (in target 'SwiftSCAD' from project 'SwiftSCAD')
    cd /Users/admin/builder/spi-builder-workspace/.swiftpm/xcode

SwiftCompile normal arm64 /Users/admin/builder/spi-builder-workspace/.dependencies/checkouts/SwiftSCAD/Sources/SwiftSCAD/Values/Bezier/BezierPath+Visualization.swift (in target 'SwiftSCAD' from project 'SwiftSCAD')
    cd /Users/admin/builder/spi-builder-workspace/.swiftpm/xcode

SwiftCompile normal arm64 /Users/admin/builder/spi-builder-workspace/.dependencies/checkouts/SwiftSCAD/Sources/SwiftSCAD/Values/Bezier/BezierPath.Curve.swift (in target 'SwiftSCAD' from project 'SwiftSCAD')
    cd /Users/admin/builder/spi-builder-workspace/.swiftpm/xcode

SwiftCompile normal arm64 /Users/admin/builder/spi-builder-workspace/.dependencies/checkouts/SwiftSCAD/Sources/SwiftSCAD/Values/Bezier/BezierPath.swift (in target 'SwiftSCAD' from project 'SwiftSCAD')
    cd /Users/admin/builder/spi-builder-workspace/.swiftpm/xcode

SwiftCompile normal arm64 /Users/admin/builder/spi-builder-workspace/.dependencies/checkouts/SwiftSCAD/Sources/SwiftSCAD/Values/Bezier/Path\ Builder/BezierPath.Builder.swift (in target 'SwiftSCAD' from project 'SwiftSCAD')
    cd /Users/admin/builder/spi-builder-workspace/.swiftpm/xcode

SwiftCompile normal arm64 /Users/admin/builder/spi-builder-workspace/.dependencies/checkouts/SwiftSCAD/Sources/SwiftSCAD/Values/Bezier/Path\ Builder/ComponentFunctions.swift (in target 'SwiftSCAD' from project 'SwiftSCAD')
    cd /Users/admin/builder/spi-builder-workspace/.swiftpm/xcode

SwiftCompile normal arm64 /Users/admin/builder/spi-builder-workspace/.dependencies/checkouts/SwiftSCAD/Sources/SwiftSCAD/Values/Bezier/Path\ Builder/PathBuilderValue.swift (in target 'SwiftSCAD' from project 'SwiftSCAD')
    cd /Users/admin/builder/spi-builder-workspace/.swiftpm/xcode

SwiftCompile normal arm64 /Users/admin/builder/spi-builder-workspace/.dependencies/checkouts/SwiftSCAD/Sources/SwiftSCAD/Values/Bezier/Path\ Builder/PathBuilderVector.swift (in target 'SwiftSCAD' from project 'SwiftSCAD')
    cd /Users/admin/builder/spi-builder-workspace/.swiftpm/xcode

SwiftCompile normal arm64 /Users/admin/builder/spi-builder-workspace/.dependencies/checkouts/SwiftSCAD/Sources/SwiftSCAD/Values/Boundary/Boundary+Shapes.swift (in target 'SwiftSCAD' from project 'SwiftSCAD')
    cd /Users/admin/builder/spi-builder-workspace/.swiftpm/xcode

SwiftCompile normal arm64 /Users/admin/builder/spi-builder-workspace/.dependencies/checkouts/SwiftSCAD/Sources/SwiftSCAD/Values/Boundary/Boundary+Visualization.swift (in target 'SwiftSCAD' from project 'SwiftSCAD')
    cd /Users/admin/builder/spi-builder-workspace/.swiftpm/xcode

SwiftCompile normal arm64 Compiling\ ArrayBuilder.swift,\ Compatibility.swift,\ Concurrency.swift,\ Colored.swift,\ ForceRender.swift,\ Prefix.swift,\ VisualizeAxes.swift,\ Environment.swift,\ EnvironmentContext.swift,\ EnvironmentModifier.swift,\ EnvironmentValues.swift,\ ReadEnvironment.swift,\ Environment+Color.swift,\ Environment+Transform.swift,\ Facets.swift,\ NaturalUpDirection.swift,\ Operation.swift,\ PreviewConvexity.swift /Users/admin/builder/spi-builder-workspace/.dependencies/checkouts/SwiftSCAD/Sources/SwiftSCAD/ArrayBuilder.swift /Users/admin/builder/spi-builder-workspace/.dependencies/checkouts/SwiftSCAD/Sources/SwiftSCAD/Compatibility.swift /Users/admin/builder/spi-builder-workspace/.dependencies/checkouts/SwiftSCAD/Sources/SwiftSCAD/Concurrency.swift /Users/admin/builder/spi-builder-workspace/.dependencies/checkouts/SwiftSCAD/Sources/SwiftSCAD/Development/Colored.swift /Users/admin/builder/spi-builder-workspace/.dependencies/checkouts/SwiftSCAD/Sources/SwiftSCAD/Development/ForceRender.swift /Users/admin/builder/spi-builder-workspace/.dependencies/checkouts/SwiftSCAD/Sources/SwiftSCAD/Development/Prefix.swift /Users/admin/builder/spi-builder-workspace/.dependencies/checkouts/SwiftSCAD/Sources/SwiftSCAD/Development/VisualizeAxes.swift /Users/admin/builder/spi-builder-workspace/.dependencies/checkouts/SwiftSCAD/Sources/SwiftSCAD/Environment/Environment.swift /Users/admin/builder/spi-builder-workspace/.dependencies/checkouts/SwiftSCAD/Sources/SwiftSCAD/Environment/EnvironmentContext.swift /Users/admin/builder/spi-builder-workspace/.dependencies/checkouts/SwiftSCAD/Sources/SwiftSCAD/Environment/EnvironmentModifier.swift /Users/admin/builder/spi-builder-workspace/.dependencies/checkouts/SwiftSCAD/Sources/SwiftSCAD/Environment/EnvironmentValues.swift /Users/admin/builder/spi-builder-workspace/.dependencies/checkouts/SwiftSCAD/Sources/SwiftSCAD/Environment/ReadEnvironment.swift /Users/admin/builder/spi-builder-workspace/.dependencies/checkouts/SwiftSCAD/Sources/SwiftSCAD/Environment/Values/Environment+Color.swift /Users/admin/builder/spi-builder-workspace/.dependencies/checkouts/SwiftSCAD/Sources/SwiftSCAD/Environment/Values/Environment+Transform.swift /Users/admin/builder/spi-builder-workspace/.dependencies/checkouts/SwiftSCAD/Sources/SwiftSCAD/Environment/Values/Facets.swift /Users/admin/builder/spi-builder-workspace/.dependencies/checkouts/SwiftSCAD/Sources/SwiftSCAD/Environment/Values/NaturalUpDirection.swift /Users/admin/builder/spi-builder-workspace/.dependencies/checkouts/SwiftSCAD/Sources/SwiftSCAD/Environment/Values/Operation.swift /Users/admin/builder/spi-builder-workspace/.dependencies/checkouts/SwiftSCAD/Sources/SwiftSCAD/Environment/Values/PreviewConvexity.swift (in target 'SwiftSCAD' from project 'SwiftSCAD')
SwiftCompile normal arm64 /Users/admin/builder/spi-builder-workspace/.dependencies/checkouts/SwiftSCAD/Sources/SwiftSCAD/ArrayBuilder.swift (in target 'SwiftSCAD' from project 'SwiftSCAD')
    cd /Users/admin/builder/spi-builder-workspace/.swiftpm/xcode

SwiftCompile normal arm64 /Users/admin/builder/spi-builder-workspace/.dependencies/checkouts/SwiftSCAD/Sources/SwiftSCAD/Compatibility.swift (in target 'SwiftSCAD' from project 'SwiftSCAD')
    cd /Users/admin/builder/spi-builder-workspace/.swiftpm/xcode

SwiftCompile normal arm64 /Users/admin/builder/spi-builder-workspace/.dependencies/checkouts/SwiftSCAD/Sources/SwiftSCAD/Concurrency.swift (in target 'SwiftSCAD' from project 'SwiftSCAD')
    cd /Users/admin/builder/spi-builder-workspace/.swiftpm/xcode

SwiftCompile normal arm64 /Users/admin/builder/spi-builder-workspace/.dependencies/checkouts/SwiftSCAD/Sources/SwiftSCAD/Development/Colored.swift (in target 'SwiftSCAD' from project 'SwiftSCAD')
    cd /Users/admin/builder/spi-builder-workspace/.swiftpm/xcode

SwiftCompile normal arm64 /Users/admin/builder/spi-builder-workspace/.dependencies/checkouts/SwiftSCAD/Sources/SwiftSCAD/Development/ForceRender.swift (in target 'SwiftSCAD' from project 'SwiftSCAD')
    cd /Users/admin/builder/spi-builder-workspace/.swiftpm/xcode

SwiftCompile normal arm64 /Users/admin/builder/spi-builder-workspace/.dependencies/checkouts/SwiftSCAD/Sources/SwiftSCAD/Development/Prefix.swift (in target 'SwiftSCAD' from project 'SwiftSCAD')
    cd /Users/admin/builder/spi-builder-workspace/.swiftpm/xcode

SwiftCompile normal arm64 /Users/admin/builder/spi-builder-workspace/.dependencies/checkouts/SwiftSCAD/Sources/SwiftSCAD/Development/VisualizeAxes.swift (in target 'SwiftSCAD' from project 'SwiftSCAD')
    cd /Users/admin/builder/spi-builder-workspace/.swiftpm/xcode

SwiftCompile normal arm64 /Users/admin/builder/spi-builder-workspace/.dependencies/checkouts/SwiftSCAD/Sources/SwiftSCAD/Environment/Environment.swift (in target 'SwiftSCAD' from project 'SwiftSCAD')
    cd /Users/admin/builder/spi-builder-workspace/.swiftpm/xcode

SwiftCompile normal arm64 /Users/admin/builder/spi-builder-workspace/.dependencies/checkouts/SwiftSCAD/Sources/SwiftSCAD/Environment/EnvironmentContext.swift (in target 'SwiftSCAD' from project 'SwiftSCAD')
    cd /Users/admin/builder/spi-builder-workspace/.swiftpm/xcode

SwiftCompile normal arm64 /Users/admin/builder/spi-builder-workspace/.dependencies/checkouts/SwiftSCAD/Sources/SwiftSCAD/Environment/EnvironmentModifier.swift (in target 'SwiftSCAD' from project 'SwiftSCAD')
    cd /Users/admin/builder/spi-builder-workspace/.swiftpm/xcode

SwiftCompile normal arm64 /Users/admin/builder/spi-builder-workspace/.dependencies/checkouts/SwiftSCAD/Sources/SwiftSCAD/Environment/EnvironmentValues.swift (in target 'SwiftSCAD' from project 'SwiftSCAD')
    cd /Users/admin/builder/spi-builder-workspace/.swiftpm/xcode

SwiftCompile normal arm64 /Users/admin/builder/spi-builder-workspace/.dependencies/checkouts/SwiftSCAD/Sources/SwiftSCAD/Environment/ReadEnvironment.swift (in target 'SwiftSCAD' from project 'SwiftSCAD')
    cd /Users/admin/builder/spi-builder-workspace/.swiftpm/xcode

SwiftCompile normal arm64 /Users/admin/builder/spi-builder-workspace/.dependencies/checkouts/SwiftSCAD/Sources/SwiftSCAD/Environment/Values/Environment+Color.swift (in target 'SwiftSCAD' from project 'SwiftSCAD')
    cd /Users/admin/builder/spi-builder-workspace/.swiftpm/xcode

SwiftCompile normal arm64 /Users/admin/builder/spi-builder-workspace/.dependencies/checkouts/SwiftSCAD/Sources/SwiftSCAD/Environment/Values/Environment+Transform.swift (in target 'SwiftSCAD' from project 'SwiftSCAD')
    cd /Users/admin/builder/spi-builder-workspace/.swiftpm/xcode

SwiftCompile normal arm64 /Users/admin/builder/spi-builder-workspace/.dependencies/checkouts/SwiftSCAD/Sources/SwiftSCAD/Environment/Values/Facets.swift (in target 'SwiftSCAD' from project 'SwiftSCAD')
    cd /Users/admin/builder/spi-builder-workspace/.swiftpm/xcode

SwiftCompile normal arm64 /Users/admin/builder/spi-builder-workspace/.dependencies/checkouts/SwiftSCAD/Sources/SwiftSCAD/Environment/Values/NaturalUpDirection.swift (in target 'SwiftSCAD' from project 'SwiftSCAD')
    cd /Users/admin/builder/spi-builder-workspace/.swiftpm/xcode

SwiftCompile normal arm64 /Users/admin/builder/spi-builder-workspace/.dependencies/checkouts/SwiftSCAD/Sources/SwiftSCAD/Environment/Values/Operation.swift (in target 'SwiftSCAD' from project 'SwiftSCAD')
    cd /Users/admin/builder/spi-builder-workspace/.swiftpm/xcode

SwiftCompile normal arm64 /Users/admin/builder/spi-builder-workspace/.dependencies/checkouts/SwiftSCAD/Sources/SwiftSCAD/Environment/Values/PreviewConvexity.swift (in target 'SwiftSCAD' from project 'SwiftSCAD')
    cd /Users/admin/builder/spi-builder-workspace/.swiftpm/xcode

SwiftCompile normal arm64 Compiling\ RepeatAlong.swift,\ RepeatAround.swift,\ Symmetry.swift,\ ApplyBoxEdgeProfile.swift,\ ApplyEdgeProfile.swift,\ ExtrudePolygon.swift,\ ExtrudeWithEdgeProfiles.swift,\ ExtrudedAlong.swift,\ ExtrudedHull.swift,\ LinearExtrude.swift,\ LinearExtrudeScaling.swift,\ RotateExtrude.swift,\ ConvexHull.swift,\ Fill.swift,\ Import.swift,\ Name.swift,\ MinkowskiSum.swift /Users/admin/builder/spi-builder-workspace/.dependencies/checkouts/SwiftSCAD/Sources/SwiftSCAD/Operations/Duplication/RepeatAlong.swift /Users/admin/builder/spi-builder-workspace/.dependencies/checkouts/SwiftSCAD/Sources/SwiftSCAD/Operations/Duplication/RepeatAround.swift /Users/admin/builder/spi-builder-workspace/.dependencies/checkouts/SwiftSCAD/Sources/SwiftSCAD/Operations/Duplication/Symmetry.swift /Users/admin/builder/spi-builder-workspace/.dependencies/checkouts/SwiftSCAD/Sources/SwiftSCAD/Operations/Edge\ Profile\ Application/ApplyBoxEdgeProfile.swift /Users/admin/builder/spi-builder-workspace/.dependencies/checkouts/SwiftSCAD/Sources/SwiftSCAD/Operations/Edge\ Profile\ Application/ApplyEdgeProfile.swift /Users/admin/builder/spi-builder-workspace/.dependencies/checkouts/SwiftSCAD/Sources/SwiftSCAD/Operations/Extrude/ExtrudePolygon.swift /Users/admin/builder/spi-builder-workspace/.dependencies/checkouts/SwiftSCAD/Sources/SwiftSCAD/Operations/Extrude/ExtrudeWithEdgeProfiles.swift /Users/admin/builder/spi-builder-workspace/.dependencies/checkouts/SwiftSCAD/Sources/SwiftSCAD/Operations/Extrude/ExtrudedAlong.swift /Users/admin/builder/spi-builder-workspace/.dependencies/checkouts/SwiftSCAD/Sources/SwiftSCAD/Operations/Extrude/ExtrudedHull.swift /Users/admin/builder/spi-builder-workspace/.dependencies/checkouts/SwiftSCAD/Sources/SwiftSCAD/Operations/Extrude/LinearExtrude.swift /Users/admin/builder/spi-builder-workspace/.dependencies/checkouts/SwiftSCAD/Sources/SwiftSCAD/Operations/Extrude/LinearExtrudeScaling.swift /Users/admin/builder/spi-builder-workspace/.dependencies/checkouts/SwiftSCAD/Sources/SwiftSCAD/Operations/Extrude/RotateExtrude.swift /Users/admin/builder/spi-builder-workspace/.dependencies/checkouts/SwiftSCAD/Sources/SwiftSCAD/Operations/Filling/ConvexHull.swift /Users/admin/builder/spi-builder-workspace/.dependencies/checkouts/SwiftSCAD/Sources/SwiftSCAD/Operations/Filling/Fill.swift /Users/admin/builder/spi-builder-workspace/.dependencies/checkouts/SwiftSCAD/Sources/SwiftSCAD/Operations/Import.swift /Users/admin/builder/spi-builder-workspace/.dependencies/checkouts/SwiftSCAD/Sources/SwiftSCAD/Operations/Name.swift /Users/admin/builder/spi-builder-workspace/.dependencies/checkouts/SwiftSCAD/Sources/SwiftSCAD/Operations/Offsetting/MinkowskiSum.swift (in target 'SwiftSCAD' from project 'SwiftSCAD')
SwiftCompile normal arm64 /Users/admin/builder/spi-builder-workspace/.dependencies/checkouts/SwiftSCAD/Sources/SwiftSCAD/Operations/Duplication/RepeatAlong.swift (in target 'SwiftSCAD' from project 'SwiftSCAD')
    cd /Users/admin/builder/spi-builder-workspace/.swiftpm/xcode

SwiftCompile normal arm64 /Users/admin/builder/spi-builder-workspace/.dependencies/checkouts/SwiftSCAD/Sources/SwiftSCAD/Operations/Duplication/RepeatAround.swift (in target 'SwiftSCAD' from project 'SwiftSCAD')
    cd /Users/admin/builder/spi-builder-workspace/.swiftpm/xcode

SwiftCompile normal arm64 /Users/admin/builder/spi-builder-workspace/.dependencies/checkouts/SwiftSCAD/Sources/SwiftSCAD/Operations/Duplication/Symmetry.swift (in target 'SwiftSCAD' from project 'SwiftSCAD')
    cd /Users/admin/builder/spi-builder-workspace/.swiftpm/xcode

SwiftCompile normal arm64 /Users/admin/builder/spi-builder-workspace/.dependencies/checkouts/SwiftSCAD/Sources/SwiftSCAD/Operations/Edge\ Profile\ Application/ApplyBoxEdgeProfile.swift (in target 'SwiftSCAD' from project 'SwiftSCAD')
    cd /Users/admin/builder/spi-builder-workspace/.swiftpm/xcode

SwiftCompile normal arm64 /Users/admin/builder/spi-builder-workspace/.dependencies/checkouts/SwiftSCAD/Sources/SwiftSCAD/Operations/Edge\ Profile\ Application/ApplyEdgeProfile.swift (in target 'SwiftSCAD' from project 'SwiftSCAD')
    cd /Users/admin/builder/spi-builder-workspace/.swiftpm/xcode

SwiftCompile normal arm64 /Users/admin/builder/spi-builder-workspace/.dependencies/checkouts/SwiftSCAD/Sources/SwiftSCAD/Operations/Extrude/ExtrudePolygon.swift (in target 'SwiftSCAD' from project 'SwiftSCAD')
    cd /Users/admin/builder/spi-builder-workspace/.swiftpm/xcode

SwiftCompile normal arm64 /Users/admin/builder/spi-builder-workspace/.dependencies/checkouts/SwiftSCAD/Sources/SwiftSCAD/Operations/Extrude/ExtrudeWithEdgeProfiles.swift (in target 'SwiftSCAD' from project 'SwiftSCAD')
    cd /Users/admin/builder/spi-builder-workspace/.swiftpm/xcode

SwiftCompile normal arm64 /Users/admin/builder/spi-builder-workspace/.dependencies/checkouts/SwiftSCAD/Sources/SwiftSCAD/Operations/Extrude/ExtrudedAlong.swift (in target 'SwiftSCAD' from project 'SwiftSCAD')
    cd /Users/admin/builder/spi-builder-workspace/.swiftpm/xcode

SwiftCompile normal arm64 /Users/admin/builder/spi-builder-workspace/.dependencies/checkouts/SwiftSCAD/Sources/SwiftSCAD/Operations/Extrude/ExtrudedHull.swift (in target 'SwiftSCAD' from project 'SwiftSCAD')
    cd /Users/admin/builder/spi-builder-workspace/.swiftpm/xcode

SwiftCompile normal arm64 /Users/admin/builder/spi-builder-workspace/.dependencies/checkouts/SwiftSCAD/Sources/SwiftSCAD/Operations/Extrude/LinearExtrude.swift (in target 'SwiftSCAD' from project 'SwiftSCAD')
    cd /Users/admin/builder/spi-builder-workspace/.swiftpm/xcode

SwiftCompile normal arm64 /Users/admin/builder/spi-builder-workspace/.dependencies/checkouts/SwiftSCAD/Sources/SwiftSCAD/Operations/Extrude/LinearExtrudeScaling.swift (in target 'SwiftSCAD' from project 'SwiftSCAD')
    cd /Users/admin/builder/spi-builder-workspace/.swiftpm/xcode

SwiftCompile normal arm64 /Users/admin/builder/spi-builder-workspace/.dependencies/checkouts/SwiftSCAD/Sources/SwiftSCAD/Operations/Extrude/RotateExtrude.swift (in target 'SwiftSCAD' from project 'SwiftSCAD')
    cd /Users/admin/builder/spi-builder-workspace/.swiftpm/xcode

SwiftCompile normal arm64 /Users/admin/builder/spi-builder-workspace/.dependencies/checkouts/SwiftSCAD/Sources/SwiftSCAD/Operations/Filling/ConvexHull.swift (in target 'SwiftSCAD' from project 'SwiftSCAD')
    cd /Users/admin/builder/spi-builder-workspace/.swiftpm/xcode

SwiftCompile normal arm64 /Users/admin/builder/spi-builder-workspace/.dependencies/checkouts/SwiftSCAD/Sources/SwiftSCAD/Operations/Filling/Fill.swift (in target 'SwiftSCAD' from project 'SwiftSCAD')
    cd /Users/admin/builder/spi-builder-workspace/.swiftpm/xcode

SwiftCompile normal arm64 /Users/admin/builder/spi-builder-workspace/.dependencies/checkouts/SwiftSCAD/Sources/SwiftSCAD/Operations/Import.swift (in target 'SwiftSCAD' from project 'SwiftSCAD')
    cd /Users/admin/builder/spi-builder-workspace/.swiftpm/xcode

SwiftCompile normal arm64 /Users/admin/builder/spi-builder-workspace/.dependencies/checkouts/SwiftSCAD/Sources/SwiftSCAD/Operations/Name.swift (in target 'SwiftSCAD' from project 'SwiftSCAD')
    cd /Users/admin/builder/spi-builder-workspace/.swiftpm/xcode

SwiftCompile normal arm64 /Users/admin/builder/spi-builder-workspace/.dependencies/checkouts/SwiftSCAD/Sources/SwiftSCAD/Operations/Offsetting/MinkowskiSum.swift (in target 'SwiftSCAD' from project 'SwiftSCAD')
    cd /Users/admin/builder/spi-builder-workspace/.swiftpm/xcode

SwiftCompile normal arm64 Compiling\ Boundary.swift,\ BoundingBox+Visualization.swift,\ BoundingBox.swift,\ Color.swift,\ Box.Corner.swift,\ Box.Edge.swift,\ Box.Side.swift,\ OrthogonalCorner.swift,\ Rectangle.Corner.swift,\ RoundedCornerStyle.swift,\ Chamfer.swift,\ ChamferedFillet.swift,\ EdgeProfile.swift,\ EdgeProfileShape.swift,\ Fillet.swift,\ SCADValue.swift,\ AffineTransform2D+Creation.swift /Users/admin/builder/spi-builder-workspace/.dependencies/checkouts/SwiftSCAD/Sources/SwiftSCAD/Values/Boundary/Boundary.swift /Users/admin/builder/spi-builder-workspace/.dependencies/checkouts/SwiftSCAD/Sources/SwiftSCAD/Values/Boundary/BoundingBox+Visualization.swift /Users/admin/builder/spi-builder-workspace/.dependencies/checkouts/SwiftSCAD/Sources/SwiftSCAD/Values/Boundary/BoundingBox.swift /Users/admin/builder/spi-builder-workspace/.dependencies/checkouts/SwiftSCAD/Sources/SwiftSCAD/Values/Color.swift /Users/admin/builder/spi-builder-workspace/.dependencies/checkouts/SwiftSCAD/Sources/SwiftSCAD/Values/Corners,\ Edges\ and\ Sides/Box.Corner.swift /Users/admin/builder/spi-builder-workspace/.dependencies/checkouts/SwiftSCAD/Sources/SwiftSCAD/Values/Corners,\ Edges\ and\ Sides/Box.Edge.swift /Users/admin/builder/spi-builder-workspace/.dependencies/checkouts/SwiftSCAD/Sources/SwiftSCAD/Values/Corners,\ Edges\ and\ Sides/Box.Side.swift /Users/admin/builder/spi-builder-workspace/.dependencies/checkouts/SwiftSCAD/Sources/SwiftSCAD/Values/Corners,\ Edges\ and\ Sides/OrthogonalCorner.swift /Users/admin/builder/spi-builder-workspace/.dependencies/checkouts/SwiftSCAD/Sources/SwiftSCAD/Values/Corners,\ Edges\ and\ Sides/Rectangle.Corner.swift /Users/admin/builder/spi-builder-workspace/.dependencies/checkouts/SwiftSCAD/Sources/SwiftSCAD/Values/Corners,\ Edges\ and\ Sides/RoundedCornerStyle.swift /Users/admin/builder/spi-builder-workspace/.dependencies/checkouts/SwiftSCAD/Sources/SwiftSCAD/Values/Edge\ Profiles/Chamfer.swift /Users/admin/builder/spi-builder-workspace/.dependencies/checkouts/SwiftSCAD/Sources/SwiftSCAD/Values/Edge\ Profiles/ChamferedFillet.swift /Users/admin/builder/spi-builder-workspace/.dependencies/checkouts/SwiftSCAD/Sources/SwiftSCAD/Values/Edge\ Profiles/EdgeProfile.swift /Users/admin/builder/spi-builder-workspace/.dependencies/checkouts/SwiftSCAD/Sources/SwiftSCAD/Values/Edge\ Profiles/EdgeProfileShape.swift /Users/admin/builder/spi-builder-workspace/.dependencies/checkouts/SwiftSCAD/Sources/SwiftSCAD/Values/Edge\ Profiles/Fillet.swift /Users/admin/builder/spi-builder-workspace/.dependencies/checkouts/SwiftSCAD/Sources/SwiftSCAD/Values/SCADValue.swift /Users/admin/builder/spi-builder-workspace/.dependencies/checkouts/SwiftSCAD/Sources/SwiftSCAD/Values/Transforms/2D/AffineTransform2D+Creation.swift (in target 'SwiftSCAD' from project 'SwiftSCAD')
SwiftCompile normal arm64 /Users/admin/builder/spi-builder-workspace/.dependencies/checkouts/SwiftSCAD/Sources/SwiftSCAD/Values/Boundary/Boundary.swift (in target 'SwiftSCAD' from project 'SwiftSCAD')
    cd /Users/admin/builder/spi-builder-workspace/.swiftpm/xcode

SwiftCompile normal arm64 /Users/admin/builder/spi-builder-workspace/.dependencies/checkouts/SwiftSCAD/Sources/SwiftSCAD/Values/Boundary/BoundingBox+Visualization.swift (in target 'SwiftSCAD' from project 'SwiftSCAD')
    cd /Users/admin/builder/spi-builder-workspace/.swiftpm/xcode

SwiftCompile normal arm64 /Users/admin/builder/spi-builder-workspace/.dependencies/checkouts/SwiftSCAD/Sources/SwiftSCAD/Values/Boundary/BoundingBox.swift (in target 'SwiftSCAD' from project 'SwiftSCAD')
    cd /Users/admin/builder/spi-builder-workspace/.swiftpm/xcode

SwiftCompile normal arm64 /Users/admin/builder/spi-builder-workspace/.dependencies/checkouts/SwiftSCAD/Sources/SwiftSCAD/Values/Color.swift (in target 'SwiftSCAD' from project 'SwiftSCAD')
    cd /Users/admin/builder/spi-builder-workspace/.swiftpm/xcode

SwiftCompile normal arm64 /Users/admin/builder/spi-builder-workspace/.dependencies/checkouts/SwiftSCAD/Sources/SwiftSCAD/Values/Corners,\ Edges\ and\ Sides/Box.Corner.swift (in target 'SwiftSCAD' from project 'SwiftSCAD')
    cd /Users/admin/builder/spi-builder-workspace/.swiftpm/xcode

SwiftCompile normal arm64 /Users/admin/builder/spi-builder-workspace/.dependencies/checkouts/SwiftSCAD/Sources/SwiftSCAD/Values/Corners,\ Edges\ and\ Sides/Box.Edge.swift (in target 'SwiftSCAD' from project 'SwiftSCAD')
    cd /Users/admin/builder/spi-builder-workspace/.swiftpm/xcode

SwiftCompile normal arm64 /Users/admin/builder/spi-builder-workspace/.dependencies/checkouts/SwiftSCAD/Sources/SwiftSCAD/Values/Corners,\ Edges\ and\ Sides/Box.Side.swift (in target 'SwiftSCAD' from project 'SwiftSCAD')
    cd /Users/admin/builder/spi-builder-workspace/.swiftpm/xcode

SwiftCompile normal arm64 /Users/admin/builder/spi-builder-workspace/.dependencies/checkouts/SwiftSCAD/Sources/SwiftSCAD/Values/Corners,\ Edges\ and\ Sides/OrthogonalCorner.swift (in target 'SwiftSCAD' from project 'SwiftSCAD')
    cd /Users/admin/builder/spi-builder-workspace/.swiftpm/xcode

SwiftCompile normal arm64 /Users/admin/builder/spi-builder-workspace/.dependencies/checkouts/SwiftSCAD/Sources/SwiftSCAD/Values/Corners,\ Edges\ and\ Sides/Rectangle.Corner.swift (in target 'SwiftSCAD' from project 'SwiftSCAD')
    cd /Users/admin/builder/spi-builder-workspace/.swiftpm/xcode

SwiftCompile normal arm64 /Users/admin/builder/spi-builder-workspace/.dependencies/checkouts/SwiftSCAD/Sources/SwiftSCAD/Values/Corners,\ Edges\ and\ Sides/RoundedCornerStyle.swift (in target 'SwiftSCAD' from project 'SwiftSCAD')
    cd /Users/admin/builder/spi-builder-workspace/.swiftpm/xcode

SwiftCompile normal arm64 /Users/admin/builder/spi-builder-workspace/.dependencies/checkouts/SwiftSCAD/Sources/SwiftSCAD/Values/Edge\ Profiles/Chamfer.swift (in target 'SwiftSCAD' from project 'SwiftSCAD')
    cd /Users/admin/builder/spi-builder-workspace/.swiftpm/xcode

SwiftCompile normal arm64 /Users/admin/builder/spi-builder-workspace/.dependencies/checkouts/SwiftSCAD/Sources/SwiftSCAD/Values/Edge\ Profiles/ChamferedFillet.swift (in target 'SwiftSCAD' from project 'SwiftSCAD')
    cd /Users/admin/builder/spi-builder-workspace/.swiftpm/xcode

SwiftCompile normal arm64 /Users/admin/builder/spi-builder-workspace/.dependencies/checkouts/SwiftSCAD/Sources/SwiftSCAD/Values/Edge\ Profiles/EdgeProfile.swift (in target 'SwiftSCAD' from project 'SwiftSCAD')
    cd /Users/admin/builder/spi-builder-workspace/.swiftpm/xcode

SwiftCompile normal arm64 /Users/admin/builder/spi-builder-workspace/.dependencies/checkouts/SwiftSCAD/Sources/SwiftSCAD/Values/Edge\ Profiles/EdgeProfileShape.swift (in target 'SwiftSCAD' from project 'SwiftSCAD')
    cd /Users/admin/builder/spi-builder-workspace/.swiftpm/xcode

SwiftCompile normal arm64 /Users/admin/builder/spi-builder-workspace/.dependencies/checkouts/SwiftSCAD/Sources/SwiftSCAD/Values/Edge\ Profiles/Fillet.swift (in target 'SwiftSCAD' from project 'SwiftSCAD')
    cd /Users/admin/builder/spi-builder-workspace/.swiftpm/xcode

SwiftCompile normal arm64 /Users/admin/builder/spi-builder-workspace/.dependencies/checkouts/SwiftSCAD/Sources/SwiftSCAD/Values/SCADValue.swift (in target 'SwiftSCAD' from project 'SwiftSCAD')
    cd /Users/admin/builder/spi-builder-workspace/.swiftpm/xcode

SwiftCompile normal arm64 /Users/admin/builder/spi-builder-workspace/.dependencies/checkouts/SwiftSCAD/Sources/SwiftSCAD/Values/Transforms/2D/AffineTransform2D+Creation.swift (in target 'SwiftSCAD' from project 'SwiftSCAD')
    cd /Users/admin/builder/spi-builder-workspace/.swiftpm/xcode

SwiftCompile normal arm64 Compiling\ OpenSCADExport+macOS.swift,\ OpenSCADExport.swift,\ OutputFormat.swift,\ SaveBatch.swift,\ SaveSingle.swift,\ Area2D.swift,\ Arc.swift,\ Circle.swift,\ Ring.swift,\ CylinderBridge.swift,\ Teardrop.swift,\ Polygon.Metrics.swift,\ Polygon.swift,\ PolygonPointsProvider.swift,\ RegularPolygon.swift,\ Rectangle.swift,\ Environment+Text.swift /Users/admin/builder/spi-builder-workspace/.dependencies/checkouts/SwiftSCAD/Sources/SwiftSCAD/Output/OpenSCADExport/OpenSCADExport+macOS.swift /Users/admin/builder/spi-builder-workspace/.dependencies/checkouts/SwiftSCAD/Sources/SwiftSCAD/Output/OpenSCADExport/OpenSCADExport.swift /Users/admin/builder/spi-builder-workspace/.dependencies/checkouts/SwiftSCAD/Sources/SwiftSCAD/Output/OutputFormat.swift /Users/admin/builder/spi-builder-workspace/.dependencies/checkouts/SwiftSCAD/Sources/SwiftSCAD/Output/SaveBatch.swift /Users/admin/builder/spi-builder-workspace/.dependencies/checkouts/SwiftSCAD/Sources/SwiftSCAD/Output/SaveSingle.swift /Users/admin/builder/spi-builder-workspace/.dependencies/checkouts/SwiftSCAD/Sources/SwiftSCAD/Shapes/2D/Area2D.swift /Users/admin/builder/spi-builder-workspace/.dependencies/checkouts/SwiftSCAD/Sources/SwiftSCAD/Shapes/2D/Circle/Arc.swift /Users/admin/builder/spi-builder-workspace/.dependencies/checkouts/SwiftSCAD/Sources/SwiftSCAD/Shapes/2D/Circle/Circle.swift /Users/admin/builder/spi-builder-workspace/.dependencies/checkouts/SwiftSCAD/Sources/SwiftSCAD/Shapes/2D/Circle/Ring.swift /Users/admin/builder/spi-builder-workspace/.dependencies/checkouts/SwiftSCAD/Sources/SwiftSCAD/Shapes/2D/Overhang/CylinderBridge.swift /Users/admin/builder/spi-builder-workspace/.dependencies/checkouts/SwiftSCAD/Sources/SwiftSCAD/Shapes/2D/Overhang/Teardrop.swift /Users/admin/builder/spi-builder-workspace/.dependencies/checkouts/SwiftSCAD/Sources/SwiftSCAD/Shapes/2D/Polygon/Polygon.Metrics.swift /Users/admin/builder/spi-builder-workspace/.dependencies/checkouts/SwiftSCAD/Sources/SwiftSCAD/Shapes/2D/Polygon/Polygon.swift /Users/admin/builder/spi-builder-workspace/.dependencies/checkouts/SwiftSCAD/Sources/SwiftSCAD/Shapes/2D/Polygon/PolygonPointsProvider.swift /Users/admin/builder/spi-builder-workspace/.dependencies/checkouts/SwiftSCAD/Sources/SwiftSCAD/Shapes/2D/Polygon/RegularPolygon.swift /Users/admin/builder/spi-builder-workspace/.dependencies/checkouts/SwiftSCAD/Sources/SwiftSCAD/Shapes/2D/Rectangle.swift /Users/admin/builder/spi-builder-workspace/.dependencies/checkouts/SwiftSCAD/Sources/SwiftSCAD/Shapes/2D/Text/Environment+Text.swift (in target 'SwiftSCAD' from project 'SwiftSCAD')
SwiftCompile normal arm64 /Users/admin/builder/spi-builder-workspace/.dependencies/checkouts/SwiftSCAD/Sources/SwiftSCAD/Output/OpenSCADExport/OpenSCADExport+macOS.swift (in target 'SwiftSCAD' from project 'SwiftSCAD')
    cd /Users/admin/builder/spi-builder-workspace/.swiftpm/xcode

SwiftCompile normal arm64 /Users/admin/builder/spi-builder-workspace/.dependencies/checkouts/SwiftSCAD/Sources/SwiftSCAD/Output/OpenSCADExport/OpenSCADExport.swift (in target 'SwiftSCAD' from project 'SwiftSCAD')
    cd /Users/admin/builder/spi-builder-workspace/.swiftpm/xcode

SwiftCompile normal arm64 /Users/admin/builder/spi-builder-workspace/.dependencies/checkouts/SwiftSCAD/Sources/SwiftSCAD/Output/OutputFormat.swift (in target 'SwiftSCAD' from project 'SwiftSCAD')
    cd /Users/admin/builder/spi-builder-workspace/.swiftpm/xcode

SwiftCompile normal arm64 /Users/admin/builder/spi-builder-workspace/.dependencies/checkouts/SwiftSCAD/Sources/SwiftSCAD/Output/SaveBatch.swift (in target 'SwiftSCAD' from project 'SwiftSCAD')
    cd /Users/admin/builder/spi-builder-workspace/.swiftpm/xcode

SwiftCompile normal arm64 /Users/admin/builder/spi-builder-workspace/.dependencies/checkouts/SwiftSCAD/Sources/SwiftSCAD/Output/SaveSingle.swift (in target 'SwiftSCAD' from project 'SwiftSCAD')
    cd /Users/admin/builder/spi-builder-workspace/.swiftpm/xcode

SwiftCompile normal arm64 /Users/admin/builder/spi-builder-workspace/.dependencies/checkouts/SwiftSCAD/Sources/SwiftSCAD/Shapes/2D/Area2D.swift (in target 'SwiftSCAD' from project 'SwiftSCAD')
    cd /Users/admin/builder/spi-builder-workspace/.swiftpm/xcode

SwiftCompile normal arm64 /Users/admin/builder/spi-builder-workspace/.dependencies/checkouts/SwiftSCAD/Sources/SwiftSCAD/Shapes/2D/Circle/Arc.swift (in target 'SwiftSCAD' from project 'SwiftSCAD')
    cd /Users/admin/builder/spi-builder-workspace/.swiftpm/xcode

SwiftCompile normal arm64 /Users/admin/builder/spi-builder-workspace/.dependencies/checkouts/SwiftSCAD/Sources/SwiftSCAD/Shapes/2D/Circle/Circle.swift (in target 'SwiftSCAD' from project 'SwiftSCAD')
    cd /Users/admin/builder/spi-builder-workspace/.swiftpm/xcode

SwiftCompile normal arm64 /Users/admin/builder/spi-builder-workspace/.dependencies/checkouts/SwiftSCAD/Sources/SwiftSCAD/Shapes/2D/Circle/Ring.swift (in target 'SwiftSCAD' from project 'SwiftSCAD')
    cd /Users/admin/builder/spi-builder-workspace/.swiftpm/xcode

SwiftCompile normal arm64 /Users/admin/builder/spi-builder-workspace/.dependencies/checkouts/SwiftSCAD/Sources/SwiftSCAD/Shapes/2D/Overhang/CylinderBridge.swift (in target 'SwiftSCAD' from project 'SwiftSCAD')
    cd /Users/admin/builder/spi-builder-workspace/.swiftpm/xcode

SwiftCompile normal arm64 /Users/admin/builder/spi-builder-workspace/.dependencies/checkouts/SwiftSCAD/Sources/SwiftSCAD/Shapes/2D/Overhang/Teardrop.swift (in target 'SwiftSCAD' from project 'SwiftSCAD')
    cd /Users/admin/builder/spi-builder-workspace/.swiftpm/xcode

SwiftCompile normal arm64 /Users/admin/builder/spi-builder-workspace/.dependencies/checkouts/SwiftSCAD/Sources/SwiftSCAD/Shapes/2D/Polygon/Polygon.Metrics.swift (in target 'SwiftSCAD' from project 'SwiftSCAD')
    cd /Users/admin/builder/spi-builder-workspace/.swiftpm/xcode

SwiftCompile normal arm64 /Users/admin/builder/spi-builder-workspace/.dependencies/checkouts/SwiftSCAD/Sources/SwiftSCAD/Shapes/2D/Polygon/Polygon.swift (in target 'SwiftSCAD' from project 'SwiftSCAD')
    cd /Users/admin/builder/spi-builder-workspace/.swiftpm/xcode

SwiftCompile normal arm64 /Users/admin/builder/spi-builder-workspace/.dependencies/checkouts/SwiftSCAD/Sources/SwiftSCAD/Shapes/2D/Polygon/PolygonPointsProvider.swift (in target 'SwiftSCAD' from project 'SwiftSCAD')
    cd /Users/admin/builder/spi-builder-workspace/.swiftpm/xcode

SwiftCompile normal arm64 /Users/admin/builder/spi-builder-workspace/.dependencies/checkouts/SwiftSCAD/Sources/SwiftSCAD/Shapes/2D/Polygon/RegularPolygon.swift (in target 'SwiftSCAD' from project 'SwiftSCAD')
    cd /Users/admin/builder/spi-builder-workspace/.swiftpm/xcode

SwiftCompile normal arm64 /Users/admin/builder/spi-builder-workspace/.dependencies/checkouts/SwiftSCAD/Sources/SwiftSCAD/Shapes/2D/Rectangle.swift (in target 'SwiftSCAD' from project 'SwiftSCAD')
    cd /Users/admin/builder/spi-builder-workspace/.swiftpm/xcode

SwiftCompile normal arm64 /Users/admin/builder/spi-builder-workspace/.dependencies/checkouts/SwiftSCAD/Sources/SwiftSCAD/Shapes/2D/Text/Environment+Text.swift (in target 'SwiftSCAD' from project 'SwiftSCAD')
    cd /Users/admin/builder/spi-builder-workspace/.swiftpm/xcode

SwiftCompile normal arm64 Compiling\ AffineTransform2D+Modification.swift,\ AffineTransform2D.swift,\ AffineTransform3D+Creation.swift,\ AffineTransform3D+Modification.swift,\ AffineTransform3D.swift,\ Rotation3D.swift,\ AffineTransform.swift,\ BasicMatrix3x3.swift,\ BasicMatrix4x4.swift,\ Matrix.swift,\ DimensionalValues.swift,\ Vector.swift,\ Vector2D+Operators.swift,\ Vector2D.swift,\ Vector3D+Directions.swift,\ Vector3D+Operators.swift,\ Vector3D.swift /Users/admin/builder/spi-builder-workspace/.dependencies/checkouts/SwiftSCAD/Sources/SwiftSCAD/Values/Transforms/2D/AffineTransform2D+Modification.swift /Users/admin/builder/spi-builder-workspace/.dependencies/checkouts/SwiftSCAD/Sources/SwiftSCAD/Values/Transforms/2D/AffineTransform2D.swift /Users/admin/builder/spi-builder-workspace/.dependencies/checkouts/SwiftSCAD/Sources/SwiftSCAD/Values/Transforms/3D/AffineTransform3D+Creation.swift /Users/admin/builder/spi-builder-workspace/.dependencies/checkouts/SwiftSCAD/Sources/SwiftSCAD/Values/Transforms/3D/AffineTransform3D+Modification.swift /Users/admin/builder/spi-builder-workspace/.dependencies/checkouts/SwiftSCAD/Sources/SwiftSCAD/Values/Transforms/3D/AffineTransform3D.swift /Users/admin/builder/spi-builder-workspace/.dependencies/checkouts/SwiftSCAD/Sources/SwiftSCAD/Values/Transforms/3D/Rotation3D.swift /Users/admin/builder/spi-builder-workspace/.dependencies/checkouts/SwiftSCAD/Sources/SwiftSCAD/Values/Transforms/AffineTransform.swift /Users/admin/builder/spi-builder-workspace/.dependencies/checkouts/SwiftSCAD/Sources/SwiftSCAD/Values/Transforms/Matrix/BasicMatrix3x3.swift /Users/admin/builder/spi-builder-workspace/.dependencies/checkouts/SwiftSCAD/Sources/SwiftSCAD/Values/Transforms/Matrix/BasicMatrix4x4.swift /Users/admin/builder/spi-builder-workspace/.dependencies/checkouts/SwiftSCAD/Sources/SwiftSCAD/Values/Transforms/Matrix/Matrix.swift /Users/admin/builder/spi-builder-workspace/.dependencies/checkouts/SwiftSCAD/Sources/SwiftSCAD/Values/Vectors/DimensionalValues.swift /Users/admin/builder/spi-builder-workspace/.dependencies/checkouts/SwiftSCAD/Sources/SwiftSCAD/Values/Vectors/Vector.swift /Users/admin/builder/spi-builder-workspace/.dependencies/checkouts/SwiftSCAD/Sources/SwiftSCAD/Values/Vectors/Vector2D+Operators.swift /Users/admin/builder/spi-builder-workspace/.dependencies/checkouts/SwiftSCAD/Sources/SwiftSCAD/Values/Vectors/Vector2D.swift /Users/admin/builder/spi-builder-workspace/.dependencies/checkouts/SwiftSCAD/Sources/SwiftSCAD/Values/Vectors/Vector3D+Directions.swift /Users/admin/builder/spi-builder-workspace/.dependencies/checkouts/SwiftSCAD/Sources/SwiftSCAD/Values/Vectors/Vector3D+Operators.swift /Users/admin/builder/spi-builder-workspace/.dependencies/checkouts/SwiftSCAD/Sources/SwiftSCAD/Values/Vectors/Vector3D.swift (in target 'SwiftSCAD' from project 'SwiftSCAD')
SwiftCompile normal arm64 /Users/admin/builder/spi-builder-workspace/.dependencies/checkouts/SwiftSCAD/Sources/SwiftSCAD/Values/Transforms/2D/AffineTransform2D+Modification.swift (in target 'SwiftSCAD' from project 'SwiftSCAD')
    cd /Users/admin/builder/spi-builder-workspace/.swiftpm/xcode

SwiftCompile normal arm64 /Users/admin/builder/spi-builder-workspace/.dependencies/checkouts/SwiftSCAD/Sources/SwiftSCAD/Values/Transforms/2D/AffineTransform2D.swift (in target 'SwiftSCAD' from project 'SwiftSCAD')
    cd /Users/admin/builder/spi-builder-workspace/.swiftpm/xcode

SwiftCompile normal arm64 /Users/admin/builder/spi-builder-workspace/.dependencies/checkouts/SwiftSCAD/Sources/SwiftSCAD/Values/Transforms/3D/AffineTransform3D+Creation.swift (in target 'SwiftSCAD' from project 'SwiftSCAD')
    cd /Users/admin/builder/spi-builder-workspace/.swiftpm/xcode

SwiftCompile normal arm64 /Users/admin/builder/spi-builder-workspace/.dependencies/checkouts/SwiftSCAD/Sources/SwiftSCAD/Values/Transforms/3D/AffineTransform3D+Modification.swift (in target 'SwiftSCAD' from project 'SwiftSCAD')
    cd /Users/admin/builder/spi-builder-workspace/.swiftpm/xcode

SwiftCompile normal arm64 /Users/admin/builder/spi-builder-workspace/.dependencies/checkouts/SwiftSCAD/Sources/SwiftSCAD/Values/Transforms/3D/AffineTransform3D.swift (in target 'SwiftSCAD' from project 'SwiftSCAD')
    cd /Users/admin/builder/spi-builder-workspace/.swiftpm/xcode

SwiftCompile normal arm64 /Users/admin/builder/spi-builder-workspace/.dependencies/checkouts/SwiftSCAD/Sources/SwiftSCAD/Values/Transforms/3D/Rotation3D.swift (in target 'SwiftSCAD' from project 'SwiftSCAD')
    cd /Users/admin/builder/spi-builder-workspace/.swiftpm/xcode

SwiftCompile normal arm64 /Users/admin/builder/spi-builder-workspace/.dependencies/checkouts/SwiftSCAD/Sources/SwiftSCAD/Values/Transforms/AffineTransform.swift (in target 'SwiftSCAD' from project 'SwiftSCAD')
    cd /Users/admin/builder/spi-builder-workspace/.swiftpm/xcode

SwiftCompile normal arm64 /Users/admin/builder/spi-builder-workspace/.dependencies/checkouts/SwiftSCAD/Sources/SwiftSCAD/Values/Transforms/Matrix/BasicMatrix3x3.swift (in target 'SwiftSCAD' from project 'SwiftSCAD')
    cd /Users/admin/builder/spi-builder-workspace/.swiftpm/xcode

SwiftCompile normal arm64 /Users/admin/builder/spi-builder-workspace/.dependencies/checkouts/SwiftSCAD/Sources/SwiftSCAD/Values/Transforms/Matrix/BasicMatrix4x4.swift (in target 'SwiftSCAD' from project 'SwiftSCAD')
    cd /Users/admin/builder/spi-builder-workspace/.swiftpm/xcode

SwiftCompile normal arm64 /Users/admin/builder/spi-builder-workspace/.dependencies/checkouts/SwiftSCAD/Sources/SwiftSCAD/Values/Transforms/Matrix/Matrix.swift (in target 'SwiftSCAD' from project 'SwiftSCAD')
    cd /Users/admin/builder/spi-builder-workspace/.swiftpm/xcode

SwiftCompile normal arm64 /Users/admin/builder/spi-builder-workspace/.dependencies/checkouts/SwiftSCAD/Sources/SwiftSCAD/Values/Vectors/DimensionalValues.swift (in target 'SwiftSCAD' from project 'SwiftSCAD')
    cd /Users/admin/builder/spi-builder-workspace/.swiftpm/xcode

SwiftCompile normal arm64 /Users/admin/builder/spi-builder-workspace/.dependencies/checkouts/SwiftSCAD/Sources/SwiftSCAD/Values/Vectors/Vector.swift (in target 'SwiftSCAD' from project 'SwiftSCAD')
    cd /Users/admin/builder/spi-builder-workspace/.swiftpm/xcode

SwiftCompile normal arm64 /Users/admin/builder/spi-builder-workspace/.dependencies/checkouts/SwiftSCAD/Sources/SwiftSCAD/Values/Vectors/Vector2D+Operators.swift (in target 'SwiftSCAD' from project 'SwiftSCAD')
    cd /Users/admin/builder/spi-builder-workspace/.swiftpm/xcode

SwiftCompile normal arm64 /Users/admin/builder/spi-builder-workspace/.dependencies/checkouts/SwiftSCAD/Sources/SwiftSCAD/Values/Vectors/Vector2D.swift (in target 'SwiftSCAD' from project 'SwiftSCAD')
    cd /Users/admin/builder/spi-builder-workspace/.swiftpm/xcode

SwiftCompile normal arm64 /Users/admin/builder/spi-builder-workspace/.dependencies/checkouts/SwiftSCAD/Sources/SwiftSCAD/Values/Vectors/Vector3D+Directions.swift (in target 'SwiftSCAD' from project 'SwiftSCAD')
    cd /Users/admin/builder/spi-builder-workspace/.swiftpm/xcode

SwiftCompile normal arm64 /Users/admin/builder/spi-builder-workspace/.dependencies/checkouts/SwiftSCAD/Sources/SwiftSCAD/Values/Vectors/Vector3D+Operators.swift (in target 'SwiftSCAD' from project 'SwiftSCAD')
    cd /Users/admin/builder/spi-builder-workspace/.swiftpm/xcode

SwiftCompile normal arm64 /Users/admin/builder/spi-builder-workspace/.dependencies/checkouts/SwiftSCAD/Sources/SwiftSCAD/Values/Vectors/Vector3D.swift (in target 'SwiftSCAD' from project 'SwiftSCAD')
    cd /Users/admin/builder/spi-builder-workspace/.swiftpm/xcode

SwiftCompile normal arm64 Compiling\ Text.swift,\ TextModifiers.swift,\ Box.swift,\ Cylinder+Angles.swift,\ Cylinder.swift,\ Polyhedron.swift,\ Sphere.swift,\ Torus.swift,\ Tube.swift,\ Rotate.swift,\ RotateAround.swift,\ Scale.swift,\ Transform.swift,\ Translate.swift,\ AxisAlignment.swift,\ GeometryAlignment+Presets.swift,\ GeometryAlignment.swift /Users/admin/builder/spi-builder-workspace/.dependencies/checkouts/SwiftSCAD/Sources/SwiftSCAD/Shapes/2D/Text/Text.swift /Users/admin/builder/spi-builder-workspace/.dependencies/checkouts/SwiftSCAD/Sources/SwiftSCAD/Shapes/2D/Text/TextModifiers.swift /Users/admin/builder/spi-builder-workspace/.dependencies/checkouts/SwiftSCAD/Sources/SwiftSCAD/Shapes/3D/Box.swift /Users/admin/builder/spi-builder-workspace/.dependencies/checkouts/SwiftSCAD/Sources/SwiftSCAD/Shapes/3D/Cylinder+Angles.swift /Users/admin/builder/spi-builder-workspace/.dependencies/checkouts/SwiftSCAD/Sources/SwiftSCAD/Shapes/3D/Cylinder.swift /Users/admin/builder/spi-builder-workspace/.dependencies/checkouts/SwiftSCAD/Sources/SwiftSCAD/Shapes/3D/Polyhedron.swift /Users/admin/builder/spi-builder-workspace/.dependencies/checkouts/SwiftSCAD/Sources/SwiftSCAD/Shapes/3D/Sphere.swift /Users/admin/builder/spi-builder-workspace/.dependencies/checkouts/SwiftSCAD/Sources/SwiftSCAD/Shapes/3D/Torus.swift /Users/admin/builder/spi-builder-workspace/.dependencies/checkouts/SwiftSCAD/Sources/SwiftSCAD/Shapes/3D/Tube.swift /Users/admin/builder/spi-builder-workspace/.dependencies/checkouts/SwiftSCAD/Sources/SwiftSCAD/Transformations/Rotate.swift /Users/admin/builder/spi-builder-workspace/.dependencies/checkouts/SwiftSCAD/Sources/SwiftSCAD/Transformations/RotateAround.swift /Users/admin/builder/spi-builder-workspace/.dependencies/checkouts/SwiftSCAD/Sources/SwiftSCAD/Transformations/Scale.swift /Users/admin/builder/spi-builder-workspace/.dependencies/checkouts/SwiftSCAD/Sources/SwiftSCAD/Transformations/Transform.swift /Users/admin/builder/spi-builder-workspace/.dependencies/checkouts/SwiftSCAD/Sources/SwiftSCAD/Transformations/Translate.swift /Users/admin/builder/spi-builder-workspace/.dependencies/checkouts/SwiftSCAD/Sources/SwiftSCAD/Values/Alignment/AxisAlignment.swift /Users/admin/builder/spi-builder-workspace/.dependencies/checkouts/SwiftSCAD/Sources/SwiftSCAD/Values/Alignment/GeometryAlignment+Presets.swift /Users/admin/builder/spi-builder-workspace/.dependencies/checkouts/SwiftSCAD/Sources/SwiftSCAD/Values/Alignment/GeometryAlignment.swift (in target 'SwiftSCAD' from project 'SwiftSCAD')
SwiftCompile normal arm64 /Users/admin/builder/spi-builder-workspace/.dependencies/checkouts/SwiftSCAD/Sources/SwiftSCAD/Shapes/2D/Text/Text.swift (in target 'SwiftSCAD' from project 'SwiftSCAD')
    cd /Users/admin/builder/spi-builder-workspace/.swiftpm/xcode

SwiftCompile normal arm64 /Users/admin/builder/spi-builder-workspace/.dependencies/checkouts/SwiftSCAD/Sources/SwiftSCAD/Shapes/2D/Text/TextModifiers.swift (in target 'SwiftSCAD' from project 'SwiftSCAD')
    cd /Users/admin/builder/spi-builder-workspace/.swiftpm/xcode

SwiftCompile normal arm64 /Users/admin/builder/spi-builder-workspace/.dependencies/checkouts/SwiftSCAD/Sources/SwiftSCAD/Shapes/3D/Box.swift (in target 'SwiftSCAD' from project 'SwiftSCAD')
    cd /Users/admin/builder/spi-builder-workspace/.swiftpm/xcode

SwiftCompile normal arm64 /Users/admin/builder/spi-builder-workspace/.dependencies/checkouts/SwiftSCAD/Sources/SwiftSCAD/Shapes/3D/Cylinder+Angles.swift (in target 'SwiftSCAD' from project 'SwiftSCAD')
    cd /Users/admin/builder/spi-builder-workspace/.swiftpm/xcode

SwiftCompile normal arm64 /Users/admin/builder/spi-builder-workspace/.dependencies/checkouts/SwiftSCAD/Sources/SwiftSCAD/Shapes/3D/Cylinder.swift (in target 'SwiftSCAD' from project 'SwiftSCAD')
    cd /Users/admin/builder/spi-builder-workspace/.swiftpm/xcode

SwiftCompile normal arm64 /Users/admin/builder/spi-builder-workspace/.dependencies/checkouts/SwiftSCAD/Sources/SwiftSCAD/Shapes/3D/Polyhedron.swift (in target 'SwiftSCAD' from project 'SwiftSCAD')
    cd /Users/admin/builder/spi-builder-workspace/.swiftpm/xcode

SwiftCompile normal arm64 /Users/admin/builder/spi-builder-workspace/.dependencies/checkouts/SwiftSCAD/Sources/SwiftSCAD/Shapes/3D/Sphere.swift (in target 'SwiftSCAD' from project 'SwiftSCAD')
    cd /Users/admin/builder/spi-builder-workspace/.swiftpm/xcode

SwiftCompile normal arm64 /Users/admin/builder/spi-builder-workspace/.dependencies/checkouts/SwiftSCAD/Sources/SwiftSCAD/Shapes/3D/Torus.swift (in target 'SwiftSCAD' from project 'SwiftSCAD')
    cd /Users/admin/builder/spi-builder-workspace/.swiftpm/xcode

SwiftCompile normal arm64 /Users/admin/builder/spi-builder-workspace/.dependencies/checkouts/SwiftSCAD/Sources/SwiftSCAD/Shapes/3D/Tube.swift (in target 'SwiftSCAD' from project 'SwiftSCAD')
    cd /Users/admin/builder/spi-builder-workspace/.swiftpm/xcode

SwiftCompile normal arm64 /Users/admin/builder/spi-builder-workspace/.dependencies/checkouts/SwiftSCAD/Sources/SwiftSCAD/Transformations/Rotate.swift (in target 'SwiftSCAD' from project 'SwiftSCAD')
    cd /Users/admin/builder/spi-builder-workspace/.swiftpm/xcode

SwiftCompile normal arm64 /Users/admin/builder/spi-builder-workspace/.dependencies/checkouts/SwiftSCAD/Sources/SwiftSCAD/Transformations/RotateAround.swift (in target 'SwiftSCAD' from project 'SwiftSCAD')
    cd /Users/admin/builder/spi-builder-workspace/.swiftpm/xcode

SwiftCompile normal arm64 /Users/admin/builder/spi-builder-workspace/.dependencies/checkouts/SwiftSCAD/Sources/SwiftSCAD/Transformations/Scale.swift (in target 'SwiftSCAD' from project 'SwiftSCAD')
    cd /Users/admin/builder/spi-builder-workspace/.swiftpm/xcode

SwiftCompile normal arm64 /Users/admin/builder/spi-builder-workspace/.dependencies/checkouts/SwiftSCAD/Sources/SwiftSCAD/Transformations/Transform.swift (in target 'SwiftSCAD' from project 'SwiftSCAD')
    cd /Users/admin/builder/spi-builder-workspace/.swiftpm/xcode

SwiftCompile normal arm64 /Users/admin/builder/spi-builder-workspace/.dependencies/checkouts/SwiftSCAD/Sources/SwiftSCAD/Transformations/Translate.swift (in target 'SwiftSCAD' from project 'SwiftSCAD')
    cd /Users/admin/builder/spi-builder-workspace/.swiftpm/xcode

SwiftCompile normal arm64 /Users/admin/builder/spi-builder-workspace/.dependencies/checkouts/SwiftSCAD/Sources/SwiftSCAD/Values/Alignment/AxisAlignment.swift (in target 'SwiftSCAD' from project 'SwiftSCAD')
    cd /Users/admin/builder/spi-builder-workspace/.swiftpm/xcode

SwiftCompile normal arm64 /Users/admin/builder/spi-builder-workspace/.dependencies/checkouts/SwiftSCAD/Sources/SwiftSCAD/Values/Alignment/GeometryAlignment+Presets.swift (in target 'SwiftSCAD' from project 'SwiftSCAD')
    cd /Users/admin/builder/spi-builder-workspace/.swiftpm/xcode

SwiftCompile normal arm64 /Users/admin/builder/spi-builder-workspace/.dependencies/checkouts/SwiftSCAD/Sources/SwiftSCAD/Values/Alignment/GeometryAlignment.swift (in target 'SwiftSCAD' from project 'SwiftSCAD')
    cd /Users/admin/builder/spi-builder-workspace/.swiftpm/xcode

Ld /Users/admin/builder/spi-builder-workspace/.derivedData/Build/Products/Debug-iphoneos/BitCollections.o normal (in target 'BitCollections' from project 'swift-collections')
    cd /Users/admin/builder/spi-builder-workspace/.dependencies/checkouts/swift-collections
    /Applications/Xcode-16.3.0.app/Contents/Developer/Toolchains/XcodeDefault.xctoolchain/usr/bin/clang -Xlinker -reproducible -target arm64-apple-ios12.0 -r -isysroot /Applications/Xcode-16.3.0.app/Contents/Developer/Platforms/iPhoneOS.platform/Developer/SDKs/iPhoneOS18.4.sdk -O0 -w -L/Users/admin/builder/spi-builder-workspace/.derivedData/Build/Intermediates.noindex/EagerLinkingTBDs/Debug-iphoneos -L/Users/admin/builder/spi-builder-workspace/.derivedData/Build/Products/Debug-iphoneos -L/Applications/Xcode-16.3.0.app/Contents/Developer/Platforms/iPhoneOS.platform/Developer/usr/lib -F/Users/admin/builder/spi-builder-workspace/.derivedData/Build/Intermediates.noindex/EagerLinkingTBDs/Debug-iphoneos -F/Users/admin/builder/spi-builder-workspace/.derivedData/Build/Products/Debug-iphoneos/PackageFrameworks -F/Users/admin/builder/spi-builder-workspace/.derivedData/Build/Products/Debug-iphoneos -iframework /Applications/Xcode-16.3.0.app/Contents/Developer/Platforms/iPhoneOS.platform/Developer/Library/Frameworks -iframework /Applications/Xcode-16.3.0.app/Contents/Developer/Platforms/iPhoneOS.platform/Developer/SDKs/iPhoneOS18.4.sdk/Developer/Library/Frameworks -filelist /Users/admin/builder/spi-builder-workspace/.derivedData/Build/Intermediates.noindex/swift-collections.build/Debug-iphoneos/BitCollections.build/Objects-normal/arm64/BitCollections.LinkFileList -nostdlib -Xlinker -object_path_lto -Xlinker /Users/admin/builder/spi-builder-workspace/.derivedData/Build/Intermediates.noindex/swift-collections.build/Debug-iphoneos/BitCollections.build/Objects-normal/arm64/BitCollections_lto.o -rdynamic -Xlinker -no_deduplicate -Xlinker -dependency_info -Xlinker /Users/admin/builder/spi-builder-workspace/.derivedData/Build/Intermediates.noindex/swift-collections.build/Debug-iphoneos/BitCollections.build/Objects-normal/arm64/BitCollections_dependency_info.dat -fobjc-link-runtime -L/Applications/Xcode-16.3.0.app/Contents/Developer/Toolchains/XcodeDefault.xctoolchain/usr/lib/swift/iphoneos -L/usr/lib/swift -Xlinker -add_ast_path -Xlinker /Users/admin/builder/spi-builder-workspace/.derivedData/Build/Intermediates.noindex/swift-collections.build/Debug-iphoneos/BitCollections.build/Objects-normal/arm64/BitCollections.swiftmodule -o /Users/admin/builder/spi-builder-workspace/.derivedData/Build/Products/Debug-iphoneos/BitCollections.o
** BUILD FAILED **
The following build commands failed:
	SwiftCompile normal arm64 Compiling\ Offset.swift,\ Rounding.swift,\ Projection.swift,\ Replace.swift,\ RoundedBoxCornerMask.swift,\ RoundedRectangleMask.swift,\ RoundingBoxCorners.swift,\ RoundingRectangleCorners.swift,\ SetVariables.swift,\ Stack.swift,\ UseFacets.swift,\ Within.swift,\ Operators.swift,\ CodeFragment+Export.swift,\ OpenSCADExport+FixSTL.swift,\ OpenSCADExport+POSIX.swift,\ OpenSCADExport+Windows.swift /Users/admin/builder/spi-builder-workspace/.dependencies/checkouts/SwiftSCAD/Sources/SwiftSCAD/Operations/Offsetting/Offset.swift /Users/admin/builder/spi-builder-workspace/.dependencies/checkouts/SwiftSCAD/Sources/SwiftSCAD/Operations/Offsetting/Rounding.swift /Users/admin/builder/spi-builder-workspace/.dependencies/checkouts/SwiftSCAD/Sources/SwiftSCAD/Operations/Projection.swift /Users/admin/builder/spi-builder-workspace/.dependencies/checkouts/SwiftSCAD/Sources/SwiftSCAD/Operations/Replace.swift /Users/admin/builder/spi-builder-workspace/.dependencies/checkouts/SwiftSCAD/Sources/SwiftSCAD/Operations/Rounding/Masks/RoundedBoxCornerMask.swift /Users/admin/builder/spi-builder-workspace/.dependencies/checkouts/SwiftSCAD/Sources/SwiftSCAD/Operations/Rounding/Masks/RoundedRectangleMask.swift /Users/admin/builder/spi-builder-workspace/.dependencies/checkouts/SwiftSCAD/Sources/SwiftSCAD/Operations/Rounding/RoundingBoxCorners.swift /Users/admin/builder/spi-builder-workspace/.dependencies/checkouts/SwiftSCAD/Sources/SwiftSCAD/Operations/Rounding/RoundingRectangleCorners.swift /Users/admin/builder/spi-builder-workspace/.dependencies/checkouts/SwiftSCAD/Sources/SwiftSCAD/Operations/SetVariables.swift /Users/admin/builder/spi-builder-workspace/.dependencies/checkouts/SwiftSCAD/Sources/SwiftSCAD/Operations/Stack.swift /Users/admin/builder/spi-builder-workspace/.dependencies/checkouts/SwiftSCAD/Sources/SwiftSCAD/Operations/UseFacets.swift /Users/admin/builder/spi-builder-workspace/.dependencies/checkouts/SwiftSCAD/Sources/SwiftSCAD/Operations/Within.swift /Users/admin/builder/spi-builder-workspace/.dependencies/checkouts/SwiftSCAD/Sources/SwiftSCAD/Operators.swift /Users/admin/builder/spi-builder-workspace/.dependencies/checkouts/SwiftSCAD/Sources/SwiftSCAD/Output/CodeFragment+Export.swift /Users/admin/builder/spi-builder-workspace/.dependencies/checkouts/SwiftSCAD/Sources/SwiftSCAD/Output/OpenSCADExport/OpenSCADExport+FixSTL.swift /Users/admin/builder/spi-builder-workspace/.dependencies/checkouts/SwiftSCAD/Sources/SwiftSCAD/Output/OpenSCADExport/OpenSCADExport+POSIX.swift /Users/admin/builder/spi-builder-workspace/.dependencies/checkouts/SwiftSCAD/Sources/SwiftSCAD/Output/OpenSCADExport/OpenSCADExport+Windows.swift (in target 'SwiftSCAD' from project 'SwiftSCAD')
	SwiftCompile normal arm64 /Users/admin/builder/spi-builder-workspace/.dependencies/checkouts/SwiftSCAD/Sources/SwiftSCAD/Output/OpenSCADExport/OpenSCADExport+POSIX.swift (in target 'SwiftSCAD' from project 'SwiftSCAD')
	Building workspace spi-builder-workspace with scheme RichText
(3 failures)
BUILD FAILURE 6.1 iOS