The Swift Package Index logo.Swift Package Index

Track the adoption of Swift 6 strict concurrency checks for data race safety. How many packages are Ready for Swift 6?

Build Information

Failed to build SUICoordinator, reference 0.4.2 (b55c3d), with Swift 6.0 for Linux on 1 Jan 2025 02:14:41 UTC.

Build Command

bash -c docker run --pull=always --rm -v "checkouts-4606859-0":/host -w "$PWD" registry.gitlab.com/finestructure/spi-images:basic-6.0-latest swift build --triple x86_64-unknown-linux-gnu 2>&1

Build Log

========================================
RunAll
========================================
Builder version: 4.60.0
Interrupt handler set up.
========================================
Checkout
========================================
Clone URL: https://github.com/felilo/SUICoordinator.git
Reference: 0.4.2
Initialized empty Git repository in /host/spi-builder-workspace/.git/
hint: Using 'master' as the name for the initial branch. This default branch name
hint: is subject to change. To configure the initial branch name to use in all
hint: of your new repositories, which will suppress this warning, call:
hint:
hint: 	git config --global init.defaultBranch <name>
hint:
hint: Names commonly chosen instead of 'master' are 'main', 'trunk' and
hint: 'development'. The just-created branch can be renamed via this command:
hint:
hint: 	git branch -m <name>
From https://github.com/felilo/SUICoordinator
 * tag               0.4.2      -> FETCH_HEAD
HEAD is now at b55c3d7 Fixes restart coordinator feature (#48)
Cloned https://github.com/felilo/SUICoordinator.git
Revision (git rev-parse @):
b55c3d7e1efd5cb86ee7fb57f1f3ec146080b628
SUCCESS checkout https://github.com/felilo/SUICoordinator.git at 0.4.2
========================================
Build
========================================
Selected platform:         linux
Swift version:             6.0
Building package at path:  $PWD
https://github.com/felilo/SUICoordinator.git
https://github.com/felilo/SUICoordinator.git
WARNING: environment variable SUPPRESS_SWIFT_6_FLAGS is not set
{
  "dependencies" : [
  ],
  "manifest_display_name" : "SUICoordinator",
  "name" : "SUICoordinator",
  "path" : "/host/spi-builder-workspace",
  "platforms" : [
    {
      "name" : "ios",
      "version" : "16.0"
    }
  ],
  "products" : [
    {
      "name" : "SUICoordinator",
      "targets" : [
        "SUICoordinator"
      ],
      "type" : {
        "library" : [
          "automatic"
        ]
      }
    }
  ],
  "targets" : [
    {
      "c99name" : "SUICoordinatorTests",
      "module_type" : "SwiftTarget",
      "name" : "SUICoordinatorTests",
      "path" : "Tests/SUICoordinatorTests",
      "sources" : [
        "CoordinatorTests.swift",
        "Helpers/Tests+Helpers.swift",
        "Models/AnyCoordinator.swift",
        "Models/AnyRoute.swift",
        "Models/AnyTabbarCoordinator.swift",
        "RouterTests.swift",
        "SheetCoordinatorTests.swift",
        "TabbarCoordinatorTests.swift"
      ],
      "target_dependencies" : [
        "SUICoordinator"
      ],
      "type" : "test"
    },
    {
      "c99name" : "SUICoordinator",
      "module_type" : "SwiftTarget",
      "name" : "SUICoordinator",
      "path" : "Sources/SUICoordinator",
      "product_memberships" : [
        "SUICoordinator"
      ],
      "sources" : [
        "Coordinator/Coordinator.swift",
        "Coordinator/CoordinatorView.swift",
        "CoordinatorType/CoordinatorType+Helpers.swift",
        "CoordinatorType/CoordinatorType+Navigation.swift",
        "CoordinatorType/CoordinatorType+UI.swift",
        "CoordinatorType/CoordinatorType.swift",
        "Router/DefaultRoute.swift",
        "Router/RouteType.swift",
        "Router/Router+Helpers.swift",
        "Router/Router.swift",
        "Router/RouterType.swift",
        "Router/RouterView.swift",
        "Router/TransitionPresentationStyle.swift",
        "Shared/Collection+Helpers.swift",
        "Shared/Protocols/Protocols.swift",
        "Shared/Protocols/SheetItemType.swift",
        "Shared/View+Helpers/ViewDidLoadModifier.swift",
        "Shared/View+Helpers/ViewModifier.swift",
        "SheetCoordinator/SheetCoordinator.swift",
        "SheetCoordinator/SheetCoordinatorType.swift",
        "SheetCoordinator/SheetCoordinatorView.swift",
        "SheetCoordinator/SheetItem.swift",
        "SheetCoordinator/SheetView.swift",
        "Tabbar/PageDataSource.swift",
        "Tabbar/TabbarCoordinator.swift",
        "Tabbar/TabbarCoordinatorError.swift",
        "Tabbar/TabbarCoordinatorType+Helpers.swift",
        "Tabbar/TabbarCoordinatorType+TabbarCoordinatable.swift",
        "Tabbar/TabbarCoordinatorType.swift",
        "Tabbar/TabbarCoordinatorView.swift",
        "Tabbar/TabbarNavigationRouter.swift"
      ],
      "type" : "library"
    }
  ],
  "tools_version" : "5.9"
}
Running build ...
bash -c docker run --pull=always --rm -v "checkouts-4606859-0":/host -w "$PWD" registry.gitlab.com/finestructure/spi-images:basic-6.0-latest swift build --triple x86_64-unknown-linux-gnu -Xswiftc -Xfrontend -Xswiftc -stats-output-dir -Xswiftc -Xfrontend -Xswiftc .stats -Xswiftc -strict-concurrency=complete -Xswiftc -enable-upcoming-feature -Xswiftc StrictConcurrency -Xswiftc -enable-upcoming-feature -Xswiftc DisableOutwardActorInference -Xswiftc -enable-upcoming-feature -Xswiftc GlobalActorIsolatedTypesUsability -Xswiftc -enable-upcoming-feature -Xswiftc InferSendableFromCaptures 2>&1
basic-6.0-latest: Pulling from finestructure/spi-images
7478e0ac0f23: Already exists
d2078c270eeb: Pulling fs layer
4d345160ec45: Pulling fs layer
b504d0abf61f: Pulling fs layer
772e5007c952: Pulling fs layer
b02cc3adee55: Pulling fs layer
b504d0abf61f: Waiting
772e5007c952: Waiting
d2078c270eeb: Waiting
b02cc3adee55: Waiting
4d345160ec45: Waiting
d2078c270eeb: Verifying Checksum
d2078c270eeb: Download complete
b504d0abf61f: Verifying Checksum
b504d0abf61f: Download complete
b02cc3adee55: Download complete
772e5007c952: Verifying Checksum
772e5007c952: Download complete
4d345160ec45: Verifying Checksum
4d345160ec45: Download complete
d2078c270eeb: Pull complete
4d345160ec45: Pull complete
b504d0abf61f: Pull complete
772e5007c952: Pull complete
b02cc3adee55: Pull complete
Digest: sha256:081dcf4fb829aea9d08447f4790431afbdfbcc335bfeed728ca69c6f181ae2aa
Status: Downloaded newer image for registry.gitlab.com/finestructure/spi-images:basic-6.0-latest
Building for debugging...
[0/2] Write sources
[1/2] Write swift-version-24593BA9C3E375BF.txt
error: emit-module command failed with exit code 1 (use -v to see invocation)
[3/31] Emitting module SUICoordinator
/host/spi-builder-workspace/Sources/SUICoordinator/Coordinator/Coordinator.swift:26:8: error: no such module 'Combine'
24 |
25 | import Foundation
26 | import Combine
   |        `- error: no such module 'Combine'
27 |
28 | /// An open class representing a coordinator in a coordinator-based architecture.
[4/34] Compiling SUICoordinator CoordinatorType+UI.swift
/host/spi-builder-workspace/Sources/SUICoordinator/Coordinator/Coordinator.swift:26:8: error: no such module 'Combine'
24 |
25 | import Foundation
26 | import Combine
   |        `- error: no such module 'Combine'
27 |
28 | /// An open class representing a coordinator in a coordinator-based architecture.
[5/34] Compiling SUICoordinator CoordinatorType.swift
/host/spi-builder-workspace/Sources/SUICoordinator/Coordinator/Coordinator.swift:26:8: error: no such module 'Combine'
24 |
25 | import Foundation
26 | import Combine
   |        `- error: no such module 'Combine'
27 |
28 | /// An open class representing a coordinator in a coordinator-based architecture.
[6/34] Compiling SUICoordinator DefaultRoute.swift
/host/spi-builder-workspace/Sources/SUICoordinator/Coordinator/Coordinator.swift:26:8: error: no such module 'Combine'
24 |
25 | import Foundation
26 | import Combine
   |        `- error: no such module 'Combine'
27 |
28 | /// An open class representing a coordinator in a coordinator-based architecture.
[7/34] Compiling SUICoordinator RouteType.swift
/host/spi-builder-workspace/Sources/SUICoordinator/Coordinator/Coordinator.swift:26:8: error: no such module 'Combine'
24 |
25 | import Foundation
26 | import Combine
   |        `- error: no such module 'Combine'
27 |
28 | /// An open class representing a coordinator in a coordinator-based architecture.
[8/34] Compiling SUICoordinator SheetCoordinatorView.swift
/host/spi-builder-workspace/Sources/SUICoordinator/Coordinator/Coordinator.swift:26:8: error: no such module 'Combine'
24 |
25 | import Foundation
26 | import Combine
   |        `- error: no such module 'Combine'
27 |
28 | /// An open class representing a coordinator in a coordinator-based architecture.
[9/34] Compiling SUICoordinator SheetItem.swift
/host/spi-builder-workspace/Sources/SUICoordinator/Coordinator/Coordinator.swift:26:8: error: no such module 'Combine'
24 |
25 | import Foundation
26 | import Combine
   |        `- error: no such module 'Combine'
27 |
28 | /// An open class representing a coordinator in a coordinator-based architecture.
[10/34] Compiling SUICoordinator SheetView.swift
/host/spi-builder-workspace/Sources/SUICoordinator/Coordinator/Coordinator.swift:26:8: error: no such module 'Combine'
24 |
25 | import Foundation
26 | import Combine
   |        `- error: no such module 'Combine'
27 |
28 | /// An open class representing a coordinator in a coordinator-based architecture.
[11/34] Compiling SUICoordinator PageDataSource.swift
/host/spi-builder-workspace/Sources/SUICoordinator/Coordinator/Coordinator.swift:26:8: error: no such module 'Combine'
24 |
25 | import Foundation
26 | import Combine
   |        `- error: no such module 'Combine'
27 |
28 | /// An open class representing a coordinator in a coordinator-based architecture.
[12/34] Compiling SUICoordinator Coordinator.swift
/host/spi-builder-workspace/Sources/SUICoordinator/Coordinator/Coordinator.swift:26:8: error: no such module 'Combine'
24 |
25 | import Foundation
26 | import Combine
   |        `- error: no such module 'Combine'
27 |
28 | /// An open class representing a coordinator in a coordinator-based architecture.
[13/34] Compiling SUICoordinator CoordinatorView.swift
/host/spi-builder-workspace/Sources/SUICoordinator/Coordinator/Coordinator.swift:26:8: error: no such module 'Combine'
24 |
25 | import Foundation
26 | import Combine
   |        `- error: no such module 'Combine'
27 |
28 | /// An open class representing a coordinator in a coordinator-based architecture.
[14/34] Compiling SUICoordinator CoordinatorType+Helpers.swift
/host/spi-builder-workspace/Sources/SUICoordinator/Coordinator/Coordinator.swift:26:8: error: no such module 'Combine'
24 |
25 | import Foundation
26 | import Combine
   |        `- error: no such module 'Combine'
27 |
28 | /// An open class representing a coordinator in a coordinator-based architecture.
[15/34] Compiling SUICoordinator CoordinatorType+Navigation.swift
/host/spi-builder-workspace/Sources/SUICoordinator/Coordinator/Coordinator.swift:26:8: error: no such module 'Combine'
24 |
25 | import Foundation
26 | import Combine
   |        `- error: no such module 'Combine'
27 |
28 | /// An open class representing a coordinator in a coordinator-based architecture.
[16/34] Compiling SUICoordinator TabbarCoordinatorType.swift
/host/spi-builder-workspace/Sources/SUICoordinator/Coordinator/Coordinator.swift:26:8: error: no such module 'Combine'
24 |
25 | import Foundation
26 | import Combine
   |        `- error: no such module 'Combine'
27 |
28 | /// An open class representing a coordinator in a coordinator-based architecture.
[17/34] Compiling SUICoordinator TabbarCoordinatorView.swift
/host/spi-builder-workspace/Sources/SUICoordinator/Coordinator/Coordinator.swift:26:8: error: no such module 'Combine'
24 |
25 | import Foundation
26 | import Combine
   |        `- error: no such module 'Combine'
27 |
28 | /// An open class representing a coordinator in a coordinator-based architecture.
[18/34] Compiling SUICoordinator TabbarNavigationRouter.swift
/host/spi-builder-workspace/Sources/SUICoordinator/Coordinator/Coordinator.swift:26:8: error: no such module 'Combine'
24 |
25 | import Foundation
26 | import Combine
   |        `- error: no such module 'Combine'
27 |
28 | /// An open class representing a coordinator in a coordinator-based architecture.
[19/34] Compiling SUICoordinator ViewDidLoadModifier.swift
/host/spi-builder-workspace/Sources/SUICoordinator/Coordinator/Coordinator.swift:26:8: error: no such module 'Combine'
24 |
25 | import Foundation
26 | import Combine
   |        `- error: no such module 'Combine'
27 |
28 | /// An open class representing a coordinator in a coordinator-based architecture.
[20/34] Compiling SUICoordinator ViewModifier.swift
/host/spi-builder-workspace/Sources/SUICoordinator/Coordinator/Coordinator.swift:26:8: error: no such module 'Combine'
24 |
25 | import Foundation
26 | import Combine
   |        `- error: no such module 'Combine'
27 |
28 | /// An open class representing a coordinator in a coordinator-based architecture.
[21/34] Compiling SUICoordinator SheetCoordinator.swift
/host/spi-builder-workspace/Sources/SUICoordinator/Coordinator/Coordinator.swift:26:8: error: no such module 'Combine'
24 |
25 | import Foundation
26 | import Combine
   |        `- error: no such module 'Combine'
27 |
28 | /// An open class representing a coordinator in a coordinator-based architecture.
[22/34] Compiling SUICoordinator SheetCoordinatorType.swift
/host/spi-builder-workspace/Sources/SUICoordinator/Coordinator/Coordinator.swift:26:8: error: no such module 'Combine'
24 |
25 | import Foundation
26 | import Combine
   |        `- error: no such module 'Combine'
27 |
28 | /// An open class representing a coordinator in a coordinator-based architecture.
[23/34] Compiling SUICoordinator TabbarCoordinator.swift
/host/spi-builder-workspace/Sources/SUICoordinator/Coordinator/Coordinator.swift:26:8: error: no such module 'Combine'
24 |
25 | import Foundation
26 | import Combine
   |        `- error: no such module 'Combine'
27 |
28 | /// An open class representing a coordinator in a coordinator-based architecture.
[24/34] Compiling SUICoordinator TabbarCoordinatorError.swift
/host/spi-builder-workspace/Sources/SUICoordinator/Coordinator/Coordinator.swift:26:8: error: no such module 'Combine'
24 |
25 | import Foundation
26 | import Combine
   |        `- error: no such module 'Combine'
27 |
28 | /// An open class representing a coordinator in a coordinator-based architecture.
[25/34] Compiling SUICoordinator TabbarCoordinatorType+Helpers.swift
/host/spi-builder-workspace/Sources/SUICoordinator/Coordinator/Coordinator.swift:26:8: error: no such module 'Combine'
24 |
25 | import Foundation
26 | import Combine
   |        `- error: no such module 'Combine'
27 |
28 | /// An open class representing a coordinator in a coordinator-based architecture.
[26/34] Compiling SUICoordinator TabbarCoordinatorType+TabbarCoordinatable.swift
/host/spi-builder-workspace/Sources/SUICoordinator/Coordinator/Coordinator.swift:26:8: error: no such module 'Combine'
24 |
25 | import Foundation
26 | import Combine
   |        `- error: no such module 'Combine'
27 |
28 | /// An open class representing a coordinator in a coordinator-based architecture.
[27/34] Compiling SUICoordinator TransitionPresentationStyle.swift
/host/spi-builder-workspace/Sources/SUICoordinator/Coordinator/Coordinator.swift:26:8: error: no such module 'Combine'
24 |
25 | import Foundation
26 | import Combine
   |        `- error: no such module 'Combine'
27 |
28 | /// An open class representing a coordinator in a coordinator-based architecture.
[28/34] Compiling SUICoordinator Collection+Helpers.swift
/host/spi-builder-workspace/Sources/SUICoordinator/Coordinator/Coordinator.swift:26:8: error: no such module 'Combine'
24 |
25 | import Foundation
26 | import Combine
   |        `- error: no such module 'Combine'
27 |
28 | /// An open class representing a coordinator in a coordinator-based architecture.
[29/34] Compiling SUICoordinator Protocols.swift
/host/spi-builder-workspace/Sources/SUICoordinator/Coordinator/Coordinator.swift:26:8: error: no such module 'Combine'
24 |
25 | import Foundation
26 | import Combine
   |        `- error: no such module 'Combine'
27 |
28 | /// An open class representing a coordinator in a coordinator-based architecture.
[30/34] Compiling SUICoordinator SheetItemType.swift
/host/spi-builder-workspace/Sources/SUICoordinator/Coordinator/Coordinator.swift:26:8: error: no such module 'Combine'
24 |
25 | import Foundation
26 | import Combine
   |        `- error: no such module 'Combine'
27 |
28 | /// An open class representing a coordinator in a coordinator-based architecture.
[31/34] Compiling SUICoordinator Router+Helpers.swift
/host/spi-builder-workspace/Sources/SUICoordinator/Coordinator/Coordinator.swift:26:8: error: no such module 'Combine'
24 |
25 | import Foundation
26 | import Combine
   |        `- error: no such module 'Combine'
27 |
28 | /// An open class representing a coordinator in a coordinator-based architecture.
[32/34] Compiling SUICoordinator Router.swift
/host/spi-builder-workspace/Sources/SUICoordinator/Coordinator/Coordinator.swift:26:8: error: no such module 'Combine'
24 |
25 | import Foundation
26 | import Combine
   |        `- error: no such module 'Combine'
27 |
28 | /// An open class representing a coordinator in a coordinator-based architecture.
[33/34] Compiling SUICoordinator RouterType.swift
/host/spi-builder-workspace/Sources/SUICoordinator/Coordinator/Coordinator.swift:26:8: error: no such module 'Combine'
24 |
25 | import Foundation
26 | import Combine
   |        `- error: no such module 'Combine'
27 |
28 | /// An open class representing a coordinator in a coordinator-based architecture.
[34/34] Compiling SUICoordinator RouterView.swift
/host/spi-builder-workspace/Sources/SUICoordinator/Coordinator/Coordinator.swift:26:8: error: no such module 'Combine'
24 |
25 | import Foundation
26 | import Combine
   |        `- error: no such module 'Combine'
27 |
28 | /// An open class representing a coordinator in a coordinator-based architecture.
Running build ...
bash -c docker run --pull=always --rm -v "checkouts-4606859-0":/host -w "$PWD" registry.gitlab.com/finestructure/spi-images:basic-6.0-latest swift build --triple x86_64-unknown-linux-gnu 2>&1
basic-6.0-latest: Pulling from finestructure/spi-images
Digest: sha256:081dcf4fb829aea9d08447f4790431afbdfbcc335bfeed728ca69c6f181ae2aa
Status: Image is up to date for registry.gitlab.com/finestructure/spi-images:basic-6.0-latest
[0/1] Planning build
Building for debugging...
[0/1] Write swift-version-24593BA9C3E375BF.txt
[2/30] Compiling SUICoordinator SheetCoordinatorView.swift
/host/spi-builder-workspace/Sources/SUICoordinator/Coordinator/Coordinator.swift:26:8: error: no such module 'Combine'
24 |
25 | import Foundation
26 | import Combine
   |        `- error: no such module 'Combine'
27 |
28 | /// An open class representing a coordinator in a coordinator-based architecture.
[3/30] Compiling SUICoordinator SheetItem.swift
/host/spi-builder-workspace/Sources/SUICoordinator/Coordinator/Coordinator.swift:26:8: error: no such module 'Combine'
24 |
25 | import Foundation
26 | import Combine
   |        `- error: no such module 'Combine'
27 |
28 | /// An open class representing a coordinator in a coordinator-based architecture.
[4/30] Compiling SUICoordinator SheetView.swift
/host/spi-builder-workspace/Sources/SUICoordinator/Coordinator/Coordinator.swift:26:8: error: no such module 'Combine'
24 |
25 | import Foundation
26 | import Combine
   |        `- error: no such module 'Combine'
27 |
28 | /// An open class representing a coordinator in a coordinator-based architecture.
[5/30] Compiling SUICoordinator PageDataSource.swift
/host/spi-builder-workspace/Sources/SUICoordinator/Coordinator/Coordinator.swift:26:8: error: no such module 'Combine'
24 |
25 | import Foundation
26 | import Combine
   |        `- error: no such module 'Combine'
27 |
28 | /// An open class representing a coordinator in a coordinator-based architecture.
[6/30] Compiling SUICoordinator TransitionPresentationStyle.swift
/host/spi-builder-workspace/Sources/SUICoordinator/Coordinator/Coordinator.swift:26:8: error: no such module 'Combine'
24 |
25 | import Foundation
26 | import Combine
   |        `- error: no such module 'Combine'
27 |
28 | /// An open class representing a coordinator in a coordinator-based architecture.
[7/30] Compiling SUICoordinator Collection+Helpers.swift
/host/spi-builder-workspace/Sources/SUICoordinator/Coordinator/Coordinator.swift:26:8: error: no such module 'Combine'
24 |
25 | import Foundation
26 | import Combine
   |        `- error: no such module 'Combine'
27 |
28 | /// An open class representing a coordinator in a coordinator-based architecture.
[8/30] Compiling SUICoordinator Protocols.swift
/host/spi-builder-workspace/Sources/SUICoordinator/Coordinator/Coordinator.swift:26:8: error: no such module 'Combine'
24 |
25 | import Foundation
26 | import Combine
   |        `- error: no such module 'Combine'
27 |
28 | /// An open class representing a coordinator in a coordinator-based architecture.
[9/30] Compiling SUICoordinator SheetItemType.swift
/host/spi-builder-workspace/Sources/SUICoordinator/Coordinator/Coordinator.swift:26:8: error: no such module 'Combine'
24 |
25 | import Foundation
26 | import Combine
   |        `- error: no such module 'Combine'
27 |
28 | /// An open class representing a coordinator in a coordinator-based architecture.
[10/33] Compiling SUICoordinator ViewDidLoadModifier.swift
/host/spi-builder-workspace/Sources/SUICoordinator/Coordinator/Coordinator.swift:26:8: error: no such module 'Combine'
24 |
25 | import Foundation
26 | import Combine
   |        `- error: no such module 'Combine'
27 |
28 | /// An open class representing a coordinator in a coordinator-based architecture.
[11/33] Compiling SUICoordinator ViewModifier.swift
/host/spi-builder-workspace/Sources/SUICoordinator/Coordinator/Coordinator.swift:26:8: error: no such module 'Combine'
24 |
25 | import Foundation
26 | import Combine
   |        `- error: no such module 'Combine'
27 |
28 | /// An open class representing a coordinator in a coordinator-based architecture.
[12/33] Compiling SUICoordinator SheetCoordinator.swift
/host/spi-builder-workspace/Sources/SUICoordinator/Coordinator/Coordinator.swift:26:8: error: no such module 'Combine'
24 |
25 | import Foundation
26 | import Combine
   |        `- error: no such module 'Combine'
27 |
28 | /// An open class representing a coordinator in a coordinator-based architecture.
[13/33] Compiling SUICoordinator SheetCoordinatorType.swift
/host/spi-builder-workspace/Sources/SUICoordinator/Coordinator/Coordinator.swift:26:8: error: no such module 'Combine'
24 |
25 | import Foundation
26 | import Combine
   |        `- error: no such module 'Combine'
27 |
28 | /// An open class representing a coordinator in a coordinator-based architecture.
[14/33] Compiling SUICoordinator CoordinatorType+UI.swift
/host/spi-builder-workspace/Sources/SUICoordinator/Coordinator/Coordinator.swift:26:8: error: no such module 'Combine'
24 |
25 | import Foundation
26 | import Combine
   |        `- error: no such module 'Combine'
27 |
28 | /// An open class representing a coordinator in a coordinator-based architecture.
[15/33] Compiling SUICoordinator CoordinatorType.swift
/host/spi-builder-workspace/Sources/SUICoordinator/Coordinator/Coordinator.swift:26:8: error: no such module 'Combine'
24 |
25 | import Foundation
26 | import Combine
   |        `- error: no such module 'Combine'
27 |
28 | /// An open class representing a coordinator in a coordinator-based architecture.
[16/33] Compiling SUICoordinator DefaultRoute.swift
/host/spi-builder-workspace/Sources/SUICoordinator/Coordinator/Coordinator.swift:26:8: error: no such module 'Combine'
24 |
25 | import Foundation
26 | import Combine
   |        `- error: no such module 'Combine'
27 |
28 | /// An open class representing a coordinator in a coordinator-based architecture.
[17/33] Compiling SUICoordinator RouteType.swift
/host/spi-builder-workspace/Sources/SUICoordinator/Coordinator/Coordinator.swift:26:8: error: no such module 'Combine'
24 |
25 | import Foundation
26 | import Combine
   |        `- error: no such module 'Combine'
27 |
28 | /// An open class representing a coordinator in a coordinator-based architecture.
[18/33] Compiling SUICoordinator Router+Helpers.swift
/host/spi-builder-workspace/Sources/SUICoordinator/Coordinator/Coordinator.swift:26:8: error: no such module 'Combine'
24 |
25 | import Foundation
26 | import Combine
   |        `- error: no such module 'Combine'
27 |
28 | /// An open class representing a coordinator in a coordinator-based architecture.
[19/33] Compiling SUICoordinator Router.swift
/host/spi-builder-workspace/Sources/SUICoordinator/Coordinator/Coordinator.swift:26:8: error: no such module 'Combine'
24 |
25 | import Foundation
26 | import Combine
   |        `- error: no such module 'Combine'
27 |
28 | /// An open class representing a coordinator in a coordinator-based architecture.
[20/33] Compiling SUICoordinator RouterType.swift
/host/spi-builder-workspace/Sources/SUICoordinator/Coordinator/Coordinator.swift:26:8: error: no such module 'Combine'
24 |
25 | import Foundation
26 | import Combine
   |        `- error: no such module 'Combine'
27 |
28 | /// An open class representing a coordinator in a coordinator-based architecture.
[21/33] Compiling SUICoordinator RouterView.swift
/host/spi-builder-workspace/Sources/SUICoordinator/Coordinator/Coordinator.swift:26:8: error: no such module 'Combine'
24 |
25 | import Foundation
26 | import Combine
   |        `- error: no such module 'Combine'
27 |
28 | /// An open class representing a coordinator in a coordinator-based architecture.
error: emit-module command failed with exit code 1 (use -v to see invocation)
[22/33] Compiling SUICoordinator TabbarCoordinator.swift
/host/spi-builder-workspace/Sources/SUICoordinator/Coordinator/Coordinator.swift:26:8: error: no such module 'Combine'
24 |
25 | import Foundation
26 | import Combine
   |        `- error: no such module 'Combine'
27 |
28 | /// An open class representing a coordinator in a coordinator-based architecture.
[23/33] Compiling SUICoordinator TabbarCoordinatorError.swift
/host/spi-builder-workspace/Sources/SUICoordinator/Coordinator/Coordinator.swift:26:8: error: no such module 'Combine'
24 |
25 | import Foundation
26 | import Combine
   |        `- error: no such module 'Combine'
27 |
28 | /// An open class representing a coordinator in a coordinator-based architecture.
[24/33] Compiling SUICoordinator TabbarCoordinatorType+Helpers.swift
/host/spi-builder-workspace/Sources/SUICoordinator/Coordinator/Coordinator.swift:26:8: error: no such module 'Combine'
24 |
25 | import Foundation
26 | import Combine
   |        `- error: no such module 'Combine'
27 |
28 | /// An open class representing a coordinator in a coordinator-based architecture.
[25/33] Compiling SUICoordinator TabbarCoordinatorType+TabbarCoordinatable.swift
/host/spi-builder-workspace/Sources/SUICoordinator/Coordinator/Coordinator.swift:26:8: error: no such module 'Combine'
24 |
25 | import Foundation
26 | import Combine
   |        `- error: no such module 'Combine'
27 |
28 | /// An open class representing a coordinator in a coordinator-based architecture.
[26/33] Emitting module SUICoordinator
/host/spi-builder-workspace/Sources/SUICoordinator/Coordinator/Coordinator.swift:26:8: error: no such module 'Combine'
24 |
25 | import Foundation
26 | import Combine
   |        `- error: no such module 'Combine'
27 |
28 | /// An open class representing a coordinator in a coordinator-based architecture.
[27/33] Compiling SUICoordinator Coordinator.swift
/host/spi-builder-workspace/Sources/SUICoordinator/Coordinator/Coordinator.swift:26:8: error: no such module 'Combine'
24 |
25 | import Foundation
26 | import Combine
   |        `- error: no such module 'Combine'
27 |
28 | /// An open class representing a coordinator in a coordinator-based architecture.
[28/33] Compiling SUICoordinator CoordinatorView.swift
/host/spi-builder-workspace/Sources/SUICoordinator/Coordinator/Coordinator.swift:26:8: error: no such module 'Combine'
24 |
25 | import Foundation
26 | import Combine
   |        `- error: no such module 'Combine'
27 |
28 | /// An open class representing a coordinator in a coordinator-based architecture.
[29/33] Compiling SUICoordinator CoordinatorType+Helpers.swift
/host/spi-builder-workspace/Sources/SUICoordinator/Coordinator/Coordinator.swift:26:8: error: no such module 'Combine'
24 |
25 | import Foundation
26 | import Combine
   |        `- error: no such module 'Combine'
27 |
28 | /// An open class representing a coordinator in a coordinator-based architecture.
[30/33] Compiling SUICoordinator CoordinatorType+Navigation.swift
/host/spi-builder-workspace/Sources/SUICoordinator/Coordinator/Coordinator.swift:26:8: error: no such module 'Combine'
24 |
25 | import Foundation
26 | import Combine
   |        `- error: no such module 'Combine'
27 |
28 | /// An open class representing a coordinator in a coordinator-based architecture.
[31/33] Compiling SUICoordinator TabbarCoordinatorType.swift
/host/spi-builder-workspace/Sources/SUICoordinator/Coordinator/Coordinator.swift:26:8: error: no such module 'Combine'
24 |
25 | import Foundation
26 | import Combine
   |        `- error: no such module 'Combine'
27 |
28 | /// An open class representing a coordinator in a coordinator-based architecture.
[32/33] Compiling SUICoordinator TabbarCoordinatorView.swift
/host/spi-builder-workspace/Sources/SUICoordinator/Coordinator/Coordinator.swift:26:8: error: no such module 'Combine'
24 |
25 | import Foundation
26 | import Combine
   |        `- error: no such module 'Combine'
27 |
28 | /// An open class representing a coordinator in a coordinator-based architecture.
[33/33] Compiling SUICoordinator TabbarNavigationRouter.swift
/host/spi-builder-workspace/Sources/SUICoordinator/Coordinator/Coordinator.swift:26:8: error: no such module 'Combine'
24 |
25 | import Foundation
26 | import Combine
   |        `- error: no such module 'Combine'
27 |
28 | /// An open class representing a coordinator in a coordinator-based architecture.
BUILD FAILURE 6.0 linux