Build Information
Failed to build DeckUI, reference main (df66ef
), with Swift 6.1 for Linux on 27 Apr 2025 03:57:07 UTC.
Build Command
bash -c docker run --pull=always --rm -v "checkouts-4606859-1":/host -w "$PWD" registry.gitlab.com/finestructure/spi-images:basic-6.1-latest swift build --triple x86_64-unknown-linux-gnu 2>&1
Build Log
========================================
RunAll
========================================
Builder version: 4.61.0
Interrupt handler set up.
========================================
Checkout
========================================
Clone URL: https://github.com/joshdholtz/DeckUI.git
Reference: main
Initialized empty Git repository in /host/spi-builder-workspace/.git/
hint: Using 'master' as the name for the initial branch. This default branch name
hint: is subject to change. To configure the initial branch name to use in all
hint: of your new repositories, which will suppress this warning, call:
hint:
hint: git config --global init.defaultBranch <name>
hint:
hint: Names commonly chosen instead of 'master' are 'main', 'trunk' and
hint: 'development'. The just-created branch can be renamed via this command:
hint:
hint: git branch -m <name>
From https://github.com/joshdholtz/DeckUI
* branch main -> FETCH_HEAD
* [new branch] main -> origin/main
HEAD is now at df66efe Merge pull request #37 from zhbrass/iOSPresenterNotesView
Cloned https://github.com/joshdholtz/DeckUI.git
Revision (git rev-parse @):
df66efe501cfefbd76233eb2524c55f5a720d81f
SUCCESS checkout https://github.com/joshdholtz/DeckUI.git at main
========================================
Build
========================================
Selected platform: linux
Swift version: 6.1
Building package at path: $PWD
https://github.com/joshdholtz/DeckUI.git
https://github.com/joshdholtz/DeckUI.git
WARNING: environment variable SUPPRESS_SWIFT_6_FLAGS is not set
{
"dependencies" : [
{
"identity" : "splash",
"requirement" : {
"range" : [
{
"lower_bound" : "0.16.0",
"upper_bound" : "1.0.0"
}
]
},
"type" : "sourceControl",
"url" : "https://github.com/johnsundell/Splash.git"
}
],
"manifest_display_name" : "DeckUI",
"name" : "DeckUI",
"path" : "/host/spi-builder-workspace",
"platforms" : [
{
"name" : "macos",
"version" : "12.0"
},
{
"name" : "ios",
"version" : "15.0"
}
],
"products" : [
{
"name" : "DeckUI",
"targets" : [
"DeckUI"
],
"type" : {
"library" : [
"automatic"
]
}
}
],
"targets" : [
{
"c99name" : "DeckUITests",
"module_type" : "SwiftTarget",
"name" : "DeckUITests",
"path" : "Tests/DeckUITests",
"sources" : [
"DeckUITests.swift"
],
"target_dependencies" : [
"DeckUI"
],
"type" : "test"
},
{
"c99name" : "DeckUI",
"module_type" : "SwiftTarget",
"name" : "DeckUI",
"path" : "Sources/DeckUI",
"product_dependencies" : [
"Splash"
],
"product_memberships" : [
"DeckUI"
],
"sources" : [
"Compatibility.swift",
"DSL/ContentItem.swift",
"DSL/ContentItems/Bullets.swift",
"DSL/ContentItems/Code.swift",
"DSL/ContentItems/Columns.swift",
"DSL/ContentItems/Media.swift",
"DSL/ContentItems/RawView.swift",
"DSL/ContentItems/Title.swift",
"DSL/ContentItems/Words.swift",
"DSL/Deck.swift",
"DSL/Slide.swift",
"DSL/Theme.swift",
"DeckUI.swift",
"Deprecations.swift",
"PresentationState.swift",
"Syntax Highlight/CodeComponent.swift",
"Syntax Highlight/CodeComponentFormat.swift",
"Syntax Highlight/CodeTheme.swift",
"Syntax Highlight/Grammar/NoGrammar.swift",
"Syntax Highlight/ProgrammingLanguage.swift",
"Views/CameraView.swift",
"Views/Presenter.swift",
"Views/PresenterNotesView.swift",
"Views/SlideNavigation.swift"
],
"type" : "library"
}
],
"tools_version" : "5.6"
}
Running build ...
bash -c docker run --pull=always --rm -v "checkouts-4606859-1":/host -w "$PWD" registry.gitlab.com/finestructure/spi-images:basic-6.1-latest swift build --triple x86_64-unknown-linux-gnu -Xswiftc -Xfrontend -Xswiftc -stats-output-dir -Xswiftc -Xfrontend -Xswiftc .stats -Xswiftc -strict-concurrency=complete -Xswiftc -enable-upcoming-feature -Xswiftc StrictConcurrency -Xswiftc -enable-upcoming-feature -Xswiftc DisableOutwardActorInference -Xswiftc -enable-upcoming-feature -Xswiftc GlobalActorIsolatedTypesUsability -Xswiftc -enable-upcoming-feature -Xswiftc InferSendableFromCaptures 2>&1
basic-6.1-latest: Pulling from finestructure/spi-images
Digest: sha256:3bdcac04179f4ed3e5b8e9dbd6e74bbf5ebc0f4fde48bbaad7d1e5c757e65bcb
Status: Image is up to date for registry.gitlab.com/finestructure/spi-images:basic-6.1-latest
Fetching https://github.com/johnsundell/Splash.git
[1/2167] Fetching splash
Fetched https://github.com/johnsundell/Splash.git from cache (0.43s)
Computing version for https://github.com/johnsundell/Splash.git
Computed https://github.com/johnsundell/Splash.git at 0.16.0 (1.19s)
Creating working copy for https://github.com/johnsundell/Splash.git
Working copy of https://github.com/johnsundell/Splash.git resolved at 0.16.0
Building for debugging...
[0/3] Write sources
[2/3] Write swift-version-24593BA9C3E375BF.txt
[4/27] Emitting module Splash
[5/30] Compiling Splash String+Removing.swift
[6/30] Compiling Splash Substring+HasSuffix.swift
[7/30] Compiling Splash Grammar.swift
[8/30] Compiling Splash SyntaxHighlighter.swift
[9/30] Compiling Splash SyntaxRule.swift
[10/30] Compiling Splash Color.swift
[11/30] Compiling Splash Segment.swift
[12/30] Compiling Splash TokenType.swift
[13/30] Compiling Splash Tokenizer.swift
[14/30] Compiling Splash CharacterSet+Contains.swift
[15/30] Compiling Splash Equatable+AnyOf.swift
[16/30] Compiling Splash Int+IsOdd.swift
[17/30] Compiling Splash Sequence+AnyOf.swift
[18/30] Compiling Splash MarkdownDecorator.swift
[19/30] Compiling Splash OutputBuilder.swift
[20/30] Compiling Splash OutputFormat.swift
[21/30] Compiling Splash Sequence+Occurrences.swift
[22/30] Compiling Splash String+HTMLEntities.swift
[23/30] Compiling Splash String+IsNumber.swift
[24/30] Compiling Splash String+PrefixChecking.swift
[25/30] Compiling Splash SwiftGrammar.swift
[26/30] Compiling Splash AttributedStringOutputFormat.swift
[27/30] Compiling Splash HTMLOutputFormat.swift
[28/30] Compiling Splash Font.swift
[29/30] Compiling Splash Theme+Defaults.swift
[30/30] Compiling Splash Theme.swift
[32/53] Compiling DeckUI NoGrammar.swift
/host/spi-builder-workspace/Sources/DeckUI/Compatibility.swift:20:8: error: no such module 'SwiftUI'
18 | #endif
19 |
20 | import SwiftUI
| `- error: no such module 'SwiftUI'
21 |
22 | extension Image {
[33/53] Compiling DeckUI ProgrammingLanguage.swift
/host/spi-builder-workspace/Sources/DeckUI/Compatibility.swift:20:8: error: no such module 'SwiftUI'
18 | #endif
19 |
20 | import SwiftUI
| `- error: no such module 'SwiftUI'
21 |
22 | extension Image {
[34/53] Compiling DeckUI CameraView.swift
/host/spi-builder-workspace/Sources/DeckUI/Compatibility.swift:20:8: error: no such module 'SwiftUI'
18 | #endif
19 |
20 | import SwiftUI
| `- error: no such module 'SwiftUI'
21 |
22 | extension Image {
[35/56] Compiling DeckUI Code.swift
/host/spi-builder-workspace/Sources/DeckUI/Compatibility.swift:20:8: error: no such module 'SwiftUI'
18 | #endif
19 |
20 | import SwiftUI
| `- error: no such module 'SwiftUI'
21 |
22 | extension Image {
[36/56] Compiling DeckUI Columns.swift
/host/spi-builder-workspace/Sources/DeckUI/Compatibility.swift:20:8: error: no such module 'SwiftUI'
18 | #endif
19 |
20 | import SwiftUI
| `- error: no such module 'SwiftUI'
21 |
22 | extension Image {
[37/56] Compiling DeckUI Media.swift
/host/spi-builder-workspace/Sources/DeckUI/Compatibility.swift:20:8: error: no such module 'SwiftUI'
18 | #endif
19 |
20 | import SwiftUI
| `- error: no such module 'SwiftUI'
21 |
22 | extension Image {
[38/56] Compiling DeckUI RawView.swift
/host/spi-builder-workspace/Sources/DeckUI/Compatibility.swift:20:8: error: no such module 'SwiftUI'
18 | #endif
19 |
20 | import SwiftUI
| `- error: no such module 'SwiftUI'
21 |
22 | extension Image {
[39/56] Compiling DeckUI Title.swift
/host/spi-builder-workspace/Sources/DeckUI/Compatibility.swift:20:8: error: no such module 'SwiftUI'
18 | #endif
19 |
20 | import SwiftUI
| `- error: no such module 'SwiftUI'
21 |
22 | extension Image {
[40/56] Compiling DeckUI Words.swift
/host/spi-builder-workspace/Sources/DeckUI/Compatibility.swift:20:8: error: no such module 'SwiftUI'
18 | #endif
19 |
20 | import SwiftUI
| `- error: no such module 'SwiftUI'
21 |
22 | extension Image {
[41/56] Compiling DeckUI Compatibility.swift
/host/spi-builder-workspace/Sources/DeckUI/Compatibility.swift:20:8: error: no such module 'SwiftUI'
18 | #endif
19 |
20 | import SwiftUI
| `- error: no such module 'SwiftUI'
21 |
22 | extension Image {
[42/56] Compiling DeckUI ContentItem.swift
/host/spi-builder-workspace/Sources/DeckUI/Compatibility.swift:20:8: error: no such module 'SwiftUI'
18 | #endif
19 |
20 | import SwiftUI
| `- error: no such module 'SwiftUI'
21 |
22 | extension Image {
[43/56] Compiling DeckUI Bullets.swift
/host/spi-builder-workspace/Sources/DeckUI/Compatibility.swift:20:8: error: no such module 'SwiftUI'
18 | #endif
19 |
20 | import SwiftUI
| `- error: no such module 'SwiftUI'
21 |
22 | extension Image {
[44/56] Compiling DeckUI DeckUI.swift
/host/spi-builder-workspace/Sources/DeckUI/Compatibility.swift:20:8: error: no such module 'SwiftUI'
18 | #endif
19 |
20 | import SwiftUI
| `- error: no such module 'SwiftUI'
21 |
22 | extension Image {
[45/56] Compiling DeckUI Deprecations.swift
/host/spi-builder-workspace/Sources/DeckUI/Compatibility.swift:20:8: error: no such module 'SwiftUI'
18 | #endif
19 |
20 | import SwiftUI
| `- error: no such module 'SwiftUI'
21 |
22 | extension Image {
[46/56] Compiling DeckUI PresentationState.swift
/host/spi-builder-workspace/Sources/DeckUI/Compatibility.swift:20:8: error: no such module 'SwiftUI'
18 | #endif
19 |
20 | import SwiftUI
| `- error: no such module 'SwiftUI'
21 |
22 | extension Image {
[47/56] Compiling DeckUI CodeComponent.swift
/host/spi-builder-workspace/Sources/DeckUI/Compatibility.swift:20:8: error: no such module 'SwiftUI'
18 | #endif
19 |
20 | import SwiftUI
| `- error: no such module 'SwiftUI'
21 |
22 | extension Image {
[48/56] Compiling DeckUI CodeComponentFormat.swift
/host/spi-builder-workspace/Sources/DeckUI/Compatibility.swift:20:8: error: no such module 'SwiftUI'
18 | #endif
19 |
20 | import SwiftUI
| `- error: no such module 'SwiftUI'
21 |
22 | extension Image {
[49/56] Compiling DeckUI CodeTheme.swift
/host/spi-builder-workspace/Sources/DeckUI/Compatibility.swift:20:8: error: no such module 'SwiftUI'
18 | #endif
19 |
20 | import SwiftUI
| `- error: no such module 'SwiftUI'
21 |
22 | extension Image {
error: emit-module command failed with exit code 1 (use -v to see invocation)
[50/56] Emitting module DeckUI
/host/spi-builder-workspace/Sources/DeckUI/Compatibility.swift:20:8: error: no such module 'SwiftUI'
18 | #endif
19 |
20 | import SwiftUI
| `- error: no such module 'SwiftUI'
21 |
22 | extension Image {
[51/56] Compiling DeckUI Deck.swift
/host/spi-builder-workspace/Sources/DeckUI/Compatibility.swift:20:8: error: no such module 'SwiftUI'
18 | #endif
19 |
20 | import SwiftUI
| `- error: no such module 'SwiftUI'
21 |
22 | extension Image {
[52/56] Compiling DeckUI Slide.swift
/host/spi-builder-workspace/Sources/DeckUI/Compatibility.swift:20:8: error: no such module 'SwiftUI'
18 | #endif
19 |
20 | import SwiftUI
| `- error: no such module 'SwiftUI'
21 |
22 | extension Image {
[53/56] Compiling DeckUI Theme.swift
/host/spi-builder-workspace/Sources/DeckUI/Compatibility.swift:20:8: error: no such module 'SwiftUI'
18 | #endif
19 |
20 | import SwiftUI
| `- error: no such module 'SwiftUI'
21 |
22 | extension Image {
[54/56] Compiling DeckUI Presenter.swift
/host/spi-builder-workspace/Sources/DeckUI/Compatibility.swift:20:8: error: no such module 'SwiftUI'
18 | #endif
19 |
20 | import SwiftUI
| `- error: no such module 'SwiftUI'
21 |
22 | extension Image {
[55/56] Compiling DeckUI PresenterNotesView.swift
/host/spi-builder-workspace/Sources/DeckUI/Compatibility.swift:20:8: error: no such module 'SwiftUI'
18 | #endif
19 |
20 | import SwiftUI
| `- error: no such module 'SwiftUI'
21 |
22 | extension Image {
[56/56] Compiling DeckUI SlideNavigation.swift
/host/spi-builder-workspace/Sources/DeckUI/Compatibility.swift:20:8: error: no such module 'SwiftUI'
18 | #endif
19 |
20 | import SwiftUI
| `- error: no such module 'SwiftUI'
21 |
22 | extension Image {
Running build ...
bash -c docker run --pull=always --rm -v "checkouts-4606859-1":/host -w "$PWD" registry.gitlab.com/finestructure/spi-images:basic-6.1-latest swift build --triple x86_64-unknown-linux-gnu 2>&1
basic-6.1-latest: Pulling from finestructure/spi-images
Digest: sha256:3bdcac04179f4ed3e5b8e9dbd6e74bbf5ebc0f4fde48bbaad7d1e5c757e65bcb
Status: Image is up to date for registry.gitlab.com/finestructure/spi-images:basic-6.1-latest
[0/1] Planning build
Building for debugging...
[0/1] Write swift-version-24593BA9C3E375BF.txt
[2/25] Compiling Splash Font.swift
[3/25] Compiling Splash Theme+Defaults.swift
[4/25] Compiling Splash Theme.swift
[5/28] Compiling Splash CharacterSet+Contains.swift
[6/28] Compiling Splash Equatable+AnyOf.swift
[7/28] Compiling Splash Int+IsOdd.swift
[8/28] Compiling Splash Sequence+AnyOf.swift
[9/28] Emitting module Splash
[10/28] Compiling Splash SyntaxHighlighter.swift
[11/28] Compiling Splash SyntaxRule.swift
[12/28] Compiling Splash Color.swift
[13/28] Compiling Splash String+Removing.swift
[14/28] Compiling Splash Substring+HasSuffix.swift
[15/28] Compiling Splash Grammar.swift
[16/28] Compiling Splash MarkdownDecorator.swift
[17/28] Compiling Splash OutputBuilder.swift
[18/28] Compiling Splash OutputFormat.swift
[19/28] Compiling Splash Segment.swift
[20/28] Compiling Splash TokenType.swift
[21/28] Compiling Splash Tokenizer.swift
[22/28] Compiling Splash SwiftGrammar.swift
[23/28] Compiling Splash AttributedStringOutputFormat.swift
[24/28] Compiling Splash HTMLOutputFormat.swift
[25/28] Compiling Splash Sequence+Occurrences.swift
[26/28] Compiling Splash String+HTMLEntities.swift
[27/28] Compiling Splash String+IsNumber.swift
[28/28] Compiling Splash String+PrefixChecking.swift
[30/51] Compiling DeckUI DeckUI.swift
/host/spi-builder-workspace/Sources/DeckUI/Compatibility.swift:20:8: error: no such module 'SwiftUI'
18 | #endif
19 |
20 | import SwiftUI
| `- error: no such module 'SwiftUI'
21 |
22 | extension Image {
[31/51] Compiling DeckUI Deprecations.swift
/host/spi-builder-workspace/Sources/DeckUI/Compatibility.swift:20:8: error: no such module 'SwiftUI'
18 | #endif
19 |
20 | import SwiftUI
| `- error: no such module 'SwiftUI'
21 |
22 | extension Image {
[32/51] Compiling DeckUI PresentationState.swift
/host/spi-builder-workspace/Sources/DeckUI/Compatibility.swift:20:8: error: no such module 'SwiftUI'
18 | #endif
19 |
20 | import SwiftUI
| `- error: no such module 'SwiftUI'
21 |
22 | extension Image {
[33/54] Compiling DeckUI Compatibility.swift
/host/spi-builder-workspace/Sources/DeckUI/Compatibility.swift:20:8: error: no such module 'SwiftUI'
18 | #endif
19 |
20 | import SwiftUI
| `- error: no such module 'SwiftUI'
21 |
22 | extension Image {
[34/54] Compiling DeckUI ContentItem.swift
/host/spi-builder-workspace/Sources/DeckUI/Compatibility.swift:20:8: error: no such module 'SwiftUI'
18 | #endif
19 |
20 | import SwiftUI
| `- error: no such module 'SwiftUI'
21 |
22 | extension Image {
[35/54] Compiling DeckUI Bullets.swift
/host/spi-builder-workspace/Sources/DeckUI/Compatibility.swift:20:8: error: no such module 'SwiftUI'
18 | #endif
19 |
20 | import SwiftUI
| `- error: no such module 'SwiftUI'
21 |
22 | extension Image {
[36/54] Compiling DeckUI NoGrammar.swift
/host/spi-builder-workspace/Sources/DeckUI/Compatibility.swift:20:8: error: no such module 'SwiftUI'
18 | #endif
19 |
20 | import SwiftUI
| `- error: no such module 'SwiftUI'
21 |
22 | extension Image {
[37/54] Compiling DeckUI ProgrammingLanguage.swift
/host/spi-builder-workspace/Sources/DeckUI/Compatibility.swift:20:8: error: no such module 'SwiftUI'
18 | #endif
19 |
20 | import SwiftUI
| `- error: no such module 'SwiftUI'
21 |
22 | extension Image {
[38/54] Compiling DeckUI CameraView.swift
/host/spi-builder-workspace/Sources/DeckUI/Compatibility.swift:20:8: error: no such module 'SwiftUI'
18 | #endif
19 |
20 | import SwiftUI
| `- error: no such module 'SwiftUI'
21 |
22 | extension Image {
[39/54] Compiling DeckUI Code.swift
/host/spi-builder-workspace/Sources/DeckUI/Compatibility.swift:20:8: error: no such module 'SwiftUI'
18 | #endif
19 |
20 | import SwiftUI
| `- error: no such module 'SwiftUI'
21 |
22 | extension Image {
[40/54] Compiling DeckUI Columns.swift
/host/spi-builder-workspace/Sources/DeckUI/Compatibility.swift:20:8: error: no such module 'SwiftUI'
18 | #endif
19 |
20 | import SwiftUI
| `- error: no such module 'SwiftUI'
21 |
22 | extension Image {
[41/54] Compiling DeckUI Media.swift
/host/spi-builder-workspace/Sources/DeckUI/Compatibility.swift:20:8: error: no such module 'SwiftUI'
18 | #endif
19 |
20 | import SwiftUI
| `- error: no such module 'SwiftUI'
21 |
22 | extension Image {
[42/54] Compiling DeckUI CodeComponent.swift
/host/spi-builder-workspace/Sources/DeckUI/Compatibility.swift:20:8: error: no such module 'SwiftUI'
18 | #endif
19 |
20 | import SwiftUI
| `- error: no such module 'SwiftUI'
21 |
22 | extension Image {
[43/54] Compiling DeckUI CodeComponentFormat.swift
/host/spi-builder-workspace/Sources/DeckUI/Compatibility.swift:20:8: error: no such module 'SwiftUI'
18 | #endif
19 |
20 | import SwiftUI
| `- error: no such module 'SwiftUI'
21 |
22 | extension Image {
[44/54] Compiling DeckUI CodeTheme.swift
/host/spi-builder-workspace/Sources/DeckUI/Compatibility.swift:20:8: error: no such module 'SwiftUI'
18 | #endif
19 |
20 | import SwiftUI
| `- error: no such module 'SwiftUI'
21 |
22 | extension Image {
[45/54] Compiling DeckUI Deck.swift
/host/spi-builder-workspace/Sources/DeckUI/Compatibility.swift:20:8: error: no such module 'SwiftUI'
18 | #endif
19 |
20 | import SwiftUI
| `- error: no such module 'SwiftUI'
21 |
22 | extension Image {
[46/54] Compiling DeckUI Slide.swift
/host/spi-builder-workspace/Sources/DeckUI/Compatibility.swift:20:8: error: no such module 'SwiftUI'
18 | #endif
19 |
20 | import SwiftUI
| `- error: no such module 'SwiftUI'
21 |
22 | extension Image {
[47/54] Compiling DeckUI Theme.swift
/host/spi-builder-workspace/Sources/DeckUI/Compatibility.swift:20:8: error: no such module 'SwiftUI'
18 | #endif
19 |
20 | import SwiftUI
| `- error: no such module 'SwiftUI'
21 |
22 | extension Image {
[48/54] Compiling DeckUI Presenter.swift
/host/spi-builder-workspace/Sources/DeckUI/Compatibility.swift:20:8: error: no such module 'SwiftUI'
18 | #endif
19 |
20 | import SwiftUI
| `- error: no such module 'SwiftUI'
21 |
22 | extension Image {
[49/54] Compiling DeckUI PresenterNotesView.swift
/host/spi-builder-workspace/Sources/DeckUI/Compatibility.swift:20:8: error: no such module 'SwiftUI'
18 | #endif
19 |
20 | import SwiftUI
| `- error: no such module 'SwiftUI'
21 |
22 | extension Image {
[50/54] Compiling DeckUI SlideNavigation.swift
/host/spi-builder-workspace/Sources/DeckUI/Compatibility.swift:20:8: error: no such module 'SwiftUI'
18 | #endif
19 |
20 | import SwiftUI
| `- error: no such module 'SwiftUI'
21 |
22 | extension Image {
error: emit-module command failed with exit code 1 (use -v to see invocation)
[51/54] Emitting module DeckUI
/host/spi-builder-workspace/Sources/DeckUI/Compatibility.swift:20:8: error: no such module 'SwiftUI'
18 | #endif
19 |
20 | import SwiftUI
| `- error: no such module 'SwiftUI'
21 |
22 | extension Image {
[52/54] Compiling DeckUI RawView.swift
/host/spi-builder-workspace/Sources/DeckUI/Compatibility.swift:20:8: error: no such module 'SwiftUI'
18 | #endif
19 |
20 | import SwiftUI
| `- error: no such module 'SwiftUI'
21 |
22 | extension Image {
[53/54] Compiling DeckUI Title.swift
/host/spi-builder-workspace/Sources/DeckUI/Compatibility.swift:20:8: error: no such module 'SwiftUI'
18 | #endif
19 |
20 | import SwiftUI
| `- error: no such module 'SwiftUI'
21 |
22 | extension Image {
[54/54] Compiling DeckUI Words.swift
/host/spi-builder-workspace/Sources/DeckUI/Compatibility.swift:20:8: error: no such module 'SwiftUI'
18 | #endif
19 |
20 | import SwiftUI
| `- error: no such module 'SwiftUI'
21 |
22 | extension Image {
BUILD FAILURE 6.1 linux