Build Information
Failed to build SwiftInspector, reference 0.16.0 (29a0bb
), with Swift 6.0 for macOS (SPM) on 29 Nov 2024 00:43:47 UTC.
Build Command
env DEVELOPER_DIR=/Applications/Xcode-16.1.0.app xcrun swift build --arch arm64 -Xswiftc -Xfrontend -Xswiftc -stats-output-dir -Xswiftc -Xfrontend -Xswiftc .stats -Xswiftc -strict-concurrency=complete -Xswiftc -enable-upcoming-feature -Xswiftc StrictConcurrency -Xswiftc -enable-upcoming-feature -Xswiftc DisableOutwardActorInference -Xswiftc -enable-upcoming-feature -Xswiftc GlobalActorIsolatedTypesUsability -Xswiftc -enable-upcoming-feature -Xswiftc InferSendableFromCaptures
Build Log
========================================
RunAll
========================================
Builder version: 4.58.0
Interrupt handler set up.
========================================
Checkout
========================================
Clone URL: https://github.com/fdiaz/SwiftInspector.git
Reference: 0.16.0
Initialized empty Git repository in /Users/admin/builder/spi-builder-workspace/.git/
From https://github.com/fdiaz/SwiftInspector
* tag 0.16.0 -> FETCH_HEAD
HEAD is now at 29a0bb2 Use DeclarationModifierVisitor in more places & consolidate on the Modifiers OptionSet (#130)
Cloned https://github.com/fdiaz/SwiftInspector.git
Revision (git rev-parse @):
29a0bb2fa3a52752a509fbe0ad6afb76343f5b40
SUCCESS checkout https://github.com/fdiaz/SwiftInspector.git at 0.16.0
Fetching https://github.com/Quick/Nimble.git
Fetching https://github.com/Quick/Quick.git
Fetching https://github.com/apple/swift-argument-parser
Fetching https://github.com/mattgallagher/CwlCatchException.git
Fetching https://github.com/apple/swift-syntax.git
Fetching https://github.com/mattgallagher/CwlPreconditionTesting.git
[1/455] Fetching cwlcatchexception
[193/1712] Fetching cwlcatchexception, cwlpreconditiontesting
[1010/16452] Fetching cwlcatchexception, cwlpreconditiontesting, quick
[2008/28847] Fetching cwlcatchexception, cwlpreconditiontesting, quick, swift-argument-parser
[27361/48122] Fetching cwlcatchexception, cwlpreconditiontesting, quick, swift-argument-parser, nimble
Fetched https://github.com/Quick/Quick.git from cache (1.48s)
[14053/33382] Fetching cwlcatchexception, cwlpreconditiontesting, swift-argument-parser, nimble
Fetched https://github.com/apple/swift-argument-parser from cache (1.61s)
Fetched https://github.com/mattgallagher/CwlPreconditionTesting.git from cache (1.61s)
[2190/19730] Fetching cwlcatchexception, nimble
[8166/86413] Fetching cwlcatchexception, nimble, swift-syntax
Fetched https://github.com/Quick/Nimble.git from cache (2.39s)
[33130/67138] Fetching cwlcatchexception, swift-syntax
Fetched https://github.com/mattgallagher/CwlCatchException.git from cache (3.63s)
Fetched https://github.com/apple/swift-syntax.git from cache (3.63s)
Computing version for https://github.com/Quick/Quick.git
Computed https://github.com/Quick/Quick.git at 4.0.0 (0.60s)
Computing version for https://github.com/Quick/Nimble.git
Computed https://github.com/Quick/Nimble.git at 9.2.1 (0.55s)
Computing version for https://github.com/apple/swift-syntax.git
Computed https://github.com/apple/swift-syntax.git at 0.50600.1 (0.71s)
Computing version for https://github.com/apple/swift-argument-parser
Computed https://github.com/apple/swift-argument-parser at 1.1.2 (0.54s)
Computing version for https://github.com/mattgallagher/CwlPreconditionTesting.git
Computed https://github.com/mattgallagher/CwlPreconditionTesting.git at 2.1.0 (0.52s)
Computing version for https://github.com/mattgallagher/CwlCatchException.git
Computed https://github.com/mattgallagher/CwlCatchException.git at 2.1.1 (0.53s)
Creating working copy for https://github.com/Quick/Quick.git
Working copy of https://github.com/Quick/Quick.git resolved at 4.0.0
Creating working copy for https://github.com/mattgallagher/CwlPreconditionTesting.git
Working copy of https://github.com/mattgallagher/CwlPreconditionTesting.git resolved at 2.1.0
Creating working copy for https://github.com/Quick/Nimble.git
Working copy of https://github.com/Quick/Nimble.git resolved at 9.2.1
Creating working copy for https://github.com/apple/swift-syntax.git
Working copy of https://github.com/apple/swift-syntax.git resolved at 0.50600.1
Creating working copy for https://github.com/mattgallagher/CwlCatchException.git
Working copy of https://github.com/mattgallagher/CwlCatchException.git resolved at 2.1.1
Creating working copy for https://github.com/apple/swift-argument-parser
Working copy of https://github.com/apple/swift-argument-parser resolved at 1.1.2
[11015/20579159] Downloading https://github.com/apple/swift-syntax/releases/download/0.50600.1/_InternalSwiftSyntaxParser.xcframework.zip
Downloading binary artifact https://github.com/apple/swift-syntax/releases/download/0.50600.1/_InternalSwiftSyntaxParser.xcframework.zip
Downloaded https://github.com/apple/swift-syntax/releases/download/0.50600.1/_InternalSwiftSyntaxParser.xcframework.zip (2.11s)
========================================
ResolveProductDependencies
========================================
Resolving dependencies ...
{
"identity": ".resolve-product-dependencies",
"name": "resolve-dependencies",
"url": "/Users/admin/builder/spi-builder-workspace/.resolve-product-dependencies",
"version": "unspecified",
"path": "/Users/admin/builder/spi-builder-workspace/.resolve-product-dependencies",
"dependencies": [
{
"identity": "swiftinspector",
"name": "SwiftInspector",
"url": "https://github.com/fdiaz/SwiftInspector.git",
"version": "unspecified",
"path": "/Users/admin/builder/spi-builder-workspace/.resolve-product-dependencies/.build/checkouts/SwiftInspector",
"dependencies": [
{
"identity": "swift-argument-parser",
"name": "swift-argument-parser",
"url": "https://github.com/apple/swift-argument-parser",
"version": "1.5.0",
"path": "/Users/admin/builder/spi-builder-workspace/.resolve-product-dependencies/.build/checkouts/swift-argument-parser",
"dependencies": [
]
},
{
"identity": "swift-syntax",
"name": "SwiftSyntax",
"url": "https://github.com/apple/swift-syntax.git",
"version": "0.50600.1",
"path": "/Users/admin/builder/spi-builder-workspace/.resolve-product-dependencies/.build/checkouts/swift-syntax",
"dependencies": [
]
}
]
}
]
}
Fetching https://github.com/fdiaz/SwiftInspector.git
[1/4043] Fetching swiftinspector
Fetched https://github.com/fdiaz/SwiftInspector.git from cache (1.00s)
Fetching https://github.com/apple/swift-syntax.git from cache
Fetching https://github.com/apple/swift-argument-parser from cache
Fetched https://github.com/apple/swift-argument-parser from cache (0.59s)
Fetched https://github.com/apple/swift-syntax.git from cache (0.83s)
Computing version for https://github.com/apple/swift-syntax.git
Computed https://github.com/apple/swift-syntax.git at 0.50600.1 (0.02s)
Computing version for https://github.com/apple/swift-argument-parser
Computed https://github.com/apple/swift-argument-parser at 1.5.0 (0.45s)
Creating working copy for https://github.com/apple/swift-syntax.git
Working copy of https://github.com/apple/swift-syntax.git resolved at 0.50600.1
Creating working copy for https://github.com/apple/swift-argument-parser
Working copy of https://github.com/apple/swift-argument-parser resolved at 1.5.0
Creating working copy for https://github.com/fdiaz/SwiftInspector.git
Working copy of https://github.com/fdiaz/SwiftInspector.git resolved at 0.16.0 (29a0bb2)
Fetching binary artifact https://github.com/apple/swift-syntax/releases/download/0.50600.1/_InternalSwiftSyntaxParser.xcframework.zip from cache
Fetched https://github.com/apple/swift-syntax/releases/download/0.50600.1/_InternalSwiftSyntaxParser.xcframework.zip from cache (0.92s)
Found 2 product dependencies
- swift-argument-parser
- SwiftSyntax
========================================
Build
========================================
Selected platform: macosSpm
Swift version: 6.0
Building package at path: $PWD
https://github.com/fdiaz/SwiftInspector.git
Running build ...
env DEVELOPER_DIR=/Applications/Xcode-16.1.0.app xcrun swift build --arch arm64 -Xswiftc -Xfrontend -Xswiftc -stats-output-dir -Xswiftc -Xfrontend -Xswiftc .stats -Xswiftc -strict-concurrency=complete -Xswiftc -enable-upcoming-feature -Xswiftc StrictConcurrency -Xswiftc -enable-upcoming-feature -Xswiftc DisableOutwardActorInference -Xswiftc -enable-upcoming-feature -Xswiftc GlobalActorIsolatedTypesUsability -Xswiftc -enable-upcoming-feature -Xswiftc InferSendableFromCaptures
Building for debugging...
[0/20] Write sources
[0/20] Copying lib_InternalSwiftSyntaxParser.dylib
[0/20] Write sources
[0/20] Write swiftinspector-entitlement.plist
[0/20] Write sources
[11/20] Write swift-version--7754E27361AE5C74.txt
[12/20] Compiling atomic-counter.c
[14/56] Compiling ArgumentParserToolInfo ToolInfo.swift
[15/56] Emitting module ArgumentParserToolInfo
[16/93] Compiling ArgumentParser InputOrigin.swift
[17/93] Compiling ArgumentParser Name.swift
[18/93] Compiling ArgumentParser Parsed.swift
[19/93] Compiling ArgumentParser ParsedValues.swift
[20/96] Compiling ArgumentParser ArgumentDecoder.swift
[21/96] Compiling ArgumentParser ArgumentDefinition.swift
[22/96] Compiling ArgumentParser ArgumentSet.swift
[23/96] Compiling ArgumentParser CommandParser.swift
[24/99] Compiling ArgumentParser SequenceExtensions.swift
[25/99] Compiling ArgumentParser StringExtensions.swift
[26/99] Compiling ArgumentParser Tree.swift
[27/99] Emitting module ArgumentParser
[28/99] Compiling ArgumentParser BashCompletionsGenerator.swift
[29/99] Compiling ArgumentParser CompletionsGenerator.swift
[30/99] Compiling ArgumentParser FishCompletionsGenerator.swift
[31/99] Compiling ArgumentParser ZshCompletionsGenerator.swift
[36/99] Compiling ArgumentParser ExpressibleByArgument.swift
[37/99] Compiling ArgumentParser ParsableArguments.swift
[38/99] Compiling ArgumentParser ParsableArgumentsValidation.swift
[39/99] Compiling ArgumentParser ParsableCommand.swift
[40/99] Compiling ArgumentParser Errors.swift
[41/99] Compiling ArgumentParser Flag.swift
[42/99] Compiling ArgumentParser NameSpecification.swift
[43/99] Compiling ArgumentParser Option.swift
[44/99] Compiling ArgumentParser OptionGroup.swift
[45/99] Compiling ArgumentParser AsyncParsableCommand.swift
[46/99] Compiling ArgumentParser CommandConfiguration.swift
[47/99] Compiling ArgumentParser EnumerableFlag.swift
[48/99] Compiling ArgumentParser Argument.swift
[49/99] Compiling ArgumentParser ArgumentHelp.swift
[50/99] Compiling ArgumentParser ArgumentVisibility.swift
[51/99] Compiling ArgumentParser CompletionKind.swift
[60/99] Compiling ArgumentParser HelpGenerator.swift
[61/99] Compiling ArgumentParser MessageInfo.swift
[62/99] Compiling ArgumentParser UsageGenerator.swift
[63/99] Compiling ArgumentParser CollectionExtensions.swift
[64/99] Compiling ArgumentParser ParserError.swift
[65/99] Compiling ArgumentParser SplitArguments.swift
[66/99] Compiling ArgumentParser DumpHelpGenerator.swift
[67/99] Compiling ArgumentParser HelpCommand.swift
[68/99] Compiling SwiftSyntax SyntaxPatternNodes.swift
[69/99] Compiling SwiftSyntax SyntaxStmtNodes.swift
[70/99] Compiling SwiftSyntax SyntaxTypeNodes.swift
[71/99] Emitting module SwiftSyntax
[92/99] Write Objects.LinkFileList
[93/99] Archiving libSwiftSyntax.a
error: emit-module command failed with exit code 1 (use -v to see invocation)
[95/123] Emitting module SwiftSyntaxParser
/Users/admin/builder/spi-builder-workspace/.build/checkouts/swift-syntax/Sources/SwiftSyntaxParser/CNodes.swift:13:29: error: no such module '_InternalSwiftSyntaxParser'
11 | //===----------------------------------------------------------------------===//
12 |
13 | @_implementationOnly import _InternalSwiftSyntaxParser
| `- error: no such module '_InternalSwiftSyntaxParser'
14 |
15 | typealias CSyntaxNode = swiftparse_syntax_node_t
[96/123] Compiling SwiftSyntaxParser CNodes.swift
/Users/admin/builder/spi-builder-workspace/.build/checkouts/swift-syntax/Sources/SwiftSyntaxParser/CNodes.swift:13:29: error: no such module '_InternalSwiftSyntaxParser'
11 | //===----------------------------------------------------------------------===//
12 |
13 | @_implementationOnly import _InternalSwiftSyntaxParser
| `- error: no such module '_InternalSwiftSyntaxParser'
14 |
15 | typealias CSyntaxNode = swiftparse_syntax_node_t
[97/123] Compiling SwiftSyntaxParser Diagnostic.swift
/Users/admin/builder/spi-builder-workspace/.build/checkouts/swift-syntax/Sources/SwiftSyntaxParser/CNodes.swift:13:29: error: no such module '_InternalSwiftSyntaxParser'
11 | //===----------------------------------------------------------------------===//
12 |
13 | @_implementationOnly import _InternalSwiftSyntaxParser
| `- error: no such module '_InternalSwiftSyntaxParser'
14 |
15 | typealias CSyntaxNode = swiftparse_syntax_node_t
[98/123] Compiling SwiftSyntaxParser NodeDeclarationHash.swift
/Users/admin/builder/spi-builder-workspace/.build/checkouts/swift-syntax/Sources/SwiftSyntaxParser/CNodes.swift:13:29: error: no such module '_InternalSwiftSyntaxParser'
11 | //===----------------------------------------------------------------------===//
12 |
13 | @_implementationOnly import _InternalSwiftSyntaxParser
| `- error: no such module '_InternalSwiftSyntaxParser'
14 |
15 | typealias CSyntaxNode = swiftparse_syntax_node_t
[99/123] Compiling SwiftSyntaxParser SyntaxParser.swift
/Users/admin/builder/spi-builder-workspace/.build/checkouts/swift-syntax/Sources/SwiftSyntaxParser/CNodes.swift:13:29: error: no such module '_InternalSwiftSyntaxParser'
11 | //===----------------------------------------------------------------------===//
12 |
13 | @_implementationOnly import _InternalSwiftSyntaxParser
| `- error: no such module '_InternalSwiftSyntaxParser'
14 |
15 | typealias CSyntaxNode = swiftparse_syntax_node_t
BUILD FAILURE 6.0 macosSpm