The Swift Package Index logo.Swift Package Index

Track the adoption of Swift 6 strict concurrency checks for data race safety. How many packages are Ready for Swift 6?

Build Information

Failed to build Flare, reference dev (0b3de5), with Swift 6.1 for macOS (Xcode) using Xcode 16.3 on 1 May 2025 06:37:00 UTC.

Build Command

env DEVELOPER_DIR=/Applications/Xcode-16.3.0.app xcrun xcodebuild -IDEClonedSourcePackagesDirPathOverride=$PWD/.dependencies -skipMacroValidation -skipPackagePluginValidation -derivedDataPath $PWD/.derivedData build -scheme Flare-Package -destination platform=macOS,arch=arm64

Build Log

SwiftDriver Log normal arm64 com.apple.xcode.tools.swift.compiler (in target 'Log' from project 'Log')
    cd /Users/admin/builder/spi-builder-workspace/.swiftpm/xcode
    builtin-SwiftDriver -- /Applications/Xcode-16.3.0.app/Contents/Developer/Toolchains/XcodeDefault.xctoolchain/usr/bin/swiftc -module-name Log -Onone -enforce-exclusivity\=checked @/Users/admin/builder/spi-builder-workspace/.derivedData/Build/Intermediates.noindex/Log.build/Debug/Log.build/Objects-normal/arm64/Log.SwiftFileList -DSWIFT_PACKAGE -DDEBUG -DXcode -plugin-path /Applications/Xcode-16.3.0.app/Contents/Developer/Toolchains/XcodeDefault.xctoolchain/usr/lib/swift/host/plugins/testing -enable-experimental-feature DebugDescriptionMacro -sdk /Applications/Xcode-16.3.0.app/Contents/Developer/Platforms/MacOSX.platform/Developer/SDKs/MacOSX15.4.sdk -target arm64-apple-macos10.15 -g -module-cache-path /Users/admin/builder/spi-builder-workspace/.derivedData/ModuleCache.noindex -Xfrontend -serialize-debugging-options -profile-coverage-mapping -profile-generate -enable-testing -suppress-warnings -index-store-path /Users/admin/builder/spi-builder-workspace/.derivedData/Index.noindex/DataStore -swift-version 6 -I /Users/admin/builder/spi-builder-workspace/.derivedData/Build/Products/Debug -I /Applications/Xcode-16.3.0.app/Contents/Developer/Platforms/MacOSX.platform/Developer/usr/lib -F /Users/admin/builder/spi-builder-workspace/.derivedData/Build/Products/Debug -F /Applications/Xcode-16.3.0.app/Contents/Developer/Platforms/MacOSX.platform/Developer/Library/Frameworks -c -j10 -enable-batch-mode -incremental -Xcc -ivfsstatcache -Xcc /Users/admin/builder/spi-builder-workspace/.derivedData/SDKStatCaches.noindex/macosx15.4-24E241-8287b8f5db97e746a1562fbca0c9d29b.sdkstatcache -output-file-map /Users/admin/builder/spi-builder-workspace/.derivedData/Build/Intermediates.noindex/Log.build/Debug/Log.build/Objects-normal/arm64/Log-OutputFileMap.json -use-frontend-parseable-output -save-temps -no-color-diagnostics -serialize-diagnostics -emit-dependencies -emit-module -emit-module-path /Users/admin/builder/spi-builder-workspace/.derivedData/Build/Intermediates.noindex/Log.build/Debug/Log.build/Objects-normal/arm64/Log.swiftmodule -user-module-version 1.2.0 -validate-clang-modules-once -clang-build-session-file /Users/admin/builder/spi-builder-workspace/.derivedData/ModuleCache.noindex/Session.modulevalidation -package-name log -Xcc -I/Users/admin/builder/spi-builder-workspace/.derivedData/Build/Intermediates.noindex/Log.build/Debug/Log.build/swift-overrides.hmap -emit-const-values -Xfrontend -const-gather-protocols-file -Xfrontend /Users/admin/builder/spi-builder-workspace/.derivedData/Build/Intermediates.noindex/Log.build/Debug/Log.build/Objects-normal/arm64/Log_const_extract_protocols.json -Xcc -I/Users/admin/builder/spi-builder-workspace/.derivedData/Build/Products/Debug/include -Xcc -I/Users/admin/builder/spi-builder-workspace/.derivedData/Build/Intermediates.noindex/Log.build/Debug/Log.build/DerivedSources-normal/arm64 -Xcc -I/Users/admin/builder/spi-builder-workspace/.derivedData/Build/Intermediates.noindex/Log.build/Debug/Log.build/DerivedSources/arm64 -Xcc -I/Users/admin/builder/spi-builder-workspace/.derivedData/Build/Intermediates.noindex/Log.build/Debug/Log.build/DerivedSources -Xcc -DSWIFT_PACKAGE -Xcc -DDEBUG\=1 -emit-objc-header -emit-objc-header-path /Users/admin/builder/spi-builder-workspace/.derivedData/Build/Intermediates.noindex/Log.build/Debug/Log.build/Objects-normal/arm64/Log-Swift.h -working-directory /Users/admin/builder/spi-builder-workspace/.swiftpm/xcode -experimental-emit-module-separately -disable-cmo
SwiftDriver Concurrency normal arm64 com.apple.xcode.tools.swift.compiler (in target 'Concurrency' from project 'Concurrency')
    cd /Users/admin/builder/spi-builder-workspace/.swiftpm/xcode
    builtin-SwiftDriver -- /Applications/Xcode-16.3.0.app/Contents/Developer/Toolchains/XcodeDefault.xctoolchain/usr/bin/swiftc -module-name Concurrency -Onone -enforce-exclusivity\=checked @/Users/admin/builder/spi-builder-workspace/.derivedData/Build/Intermediates.noindex/Concurrency.build/Debug/Concurrency.build/Objects-normal/arm64/Concurrency.SwiftFileList -DSWIFT_PACKAGE -DDEBUG -DXcode -plugin-path /Applications/Xcode-16.3.0.app/Contents/Developer/Toolchains/XcodeDefault.xctoolchain/usr/lib/swift/host/plugins/testing -enable-experimental-feature DebugDescriptionMacro -sdk /Applications/Xcode-16.3.0.app/Contents/Developer/Platforms/MacOSX.platform/Developer/SDKs/MacOSX15.4.sdk -target arm64-apple-macos10.15 -g -module-cache-path /Users/admin/builder/spi-builder-workspace/.derivedData/ModuleCache.noindex -Xfrontend -serialize-debugging-options -profile-coverage-mapping -profile-generate -enable-testing -suppress-warnings -index-store-path /Users/admin/builder/spi-builder-workspace/.derivedData/Index.noindex/DataStore -swift-version 6 -I /Users/admin/builder/spi-builder-workspace/.derivedData/Build/Products/Debug -I /Applications/Xcode-16.3.0.app/Contents/Developer/Platforms/MacOSX.platform/Developer/usr/lib -F /Users/admin/builder/spi-builder-workspace/.derivedData/Build/Products/Debug -F /Applications/Xcode-16.3.0.app/Contents/Developer/Platforms/MacOSX.platform/Developer/Library/Frameworks -c -j10 -enable-batch-mode -incremental -Xcc -ivfsstatcache -Xcc /Users/admin/builder/spi-builder-workspace/.derivedData/SDKStatCaches.noindex/macosx15.4-24E241-8287b8f5db97e746a1562fbca0c9d29b.sdkstatcache -output-file-map /Users/admin/builder/spi-builder-workspace/.derivedData/Build/Intermediates.noindex/Concurrency.build/Debug/Concurrency.build/Objects-normal/arm64/Concurrency-OutputFileMap.json -use-frontend-parseable-output -save-temps -no-color-diagnostics -serialize-diagnostics -emit-dependencies -emit-module -emit-module-path /Users/admin/builder/spi-builder-workspace/.derivedData/Build/Intermediates.noindex/Concurrency.build/Debug/Concurrency.build/Objects-normal/arm64/Concurrency.swiftmodule -user-module-version 0.2.0 -validate-clang-modules-once -clang-build-session-file /Users/admin/builder/spi-builder-workspace/.derivedData/ModuleCache.noindex/Session.modulevalidation -package-name concurrency -Xcc -I/Users/admin/builder/spi-builder-workspace/.derivedData/Build/Intermediates.noindex/Concurrency.build/Debug/Concurrency.build/swift-overrides.hmap -emit-const-values -Xfrontend -const-gather-protocols-file -Xfrontend /Users/admin/builder/spi-builder-workspace/.derivedData/Build/Intermediates.noindex/Concurrency.build/Debug/Concurrency.build/Objects-normal/arm64/Concurrency_const_extract_protocols.json -Xcc -I/Users/admin/builder/spi-builder-workspace/.derivedData/Build/Products/Debug/include -Xcc -I/Users/admin/builder/spi-builder-workspace/.derivedData/Build/Intermediates.noindex/Concurrency.build/Debug/Concurrency.build/DerivedSources-normal/arm64 -Xcc -I/Users/admin/builder/spi-builder-workspace/.derivedData/Build/Intermediates.noindex/Concurrency.build/Debug/Concurrency.build/DerivedSources/arm64 -Xcc -I/Users/admin/builder/spi-builder-workspace/.derivedData/Build/Intermediates.noindex/Concurrency.build/Debug/Concurrency.build/DerivedSources -Xcc -DSWIFT_PACKAGE -Xcc -DDEBUG\=1 -emit-objc-header -emit-objc-header-path /Users/admin/builder/spi-builder-workspace/.derivedData/Build/Intermediates.noindex/Concurrency.build/Debug/Concurrency.build/Objects-normal/arm64/Concurrency-Swift.h -working-directory /Users/admin/builder/spi-builder-workspace/.swiftpm/xcode -experimental-emit-module-separately -disable-cmo
SwiftDriver Atomic normal arm64 com.apple.xcode.tools.swift.compiler (in target 'Atomic' from project 'Atomic')
    cd /Users/admin/builder/spi-builder-workspace/.swiftpm/xcode
    builtin-SwiftDriver -- /Applications/Xcode-16.3.0.app/Contents/Developer/Toolchains/XcodeDefault.xctoolchain/usr/bin/swiftc -module-name Atomic -Onone -enforce-exclusivity\=checked @/Users/admin/builder/spi-builder-workspace/.derivedData/Build/Intermediates.noindex/Atomic.build/Debug/Atomic.build/Objects-normal/arm64/Atomic.SwiftFileList -DSWIFT_PACKAGE -DDEBUG -DXcode -plugin-path /Applications/Xcode-16.3.0.app/Contents/Developer/Toolchains/XcodeDefault.xctoolchain/usr/lib/swift/host/plugins/testing -enable-experimental-feature DebugDescriptionMacro -sdk /Applications/Xcode-16.3.0.app/Contents/Developer/Platforms/MacOSX.platform/Developer/SDKs/MacOSX15.4.sdk -target arm64-apple-macos10.15 -g -module-cache-path /Users/admin/builder/spi-builder-workspace/.derivedData/ModuleCache.noindex -Xfrontend -serialize-debugging-options -profile-coverage-mapping -profile-generate -enable-testing -suppress-warnings -index-store-path /Users/admin/builder/spi-builder-workspace/.derivedData/Index.noindex/DataStore -swift-version 6 -I /Users/admin/builder/spi-builder-workspace/.derivedData/Build/Products/Debug -I /Applications/Xcode-16.3.0.app/Contents/Developer/Platforms/MacOSX.platform/Developer/usr/lib -F /Users/admin/builder/spi-builder-workspace/.derivedData/Build/Products/Debug -F /Applications/Xcode-16.3.0.app/Contents/Developer/Platforms/MacOSX.platform/Developer/Library/Frameworks -c -j10 -enable-batch-mode -incremental -Xcc -ivfsstatcache -Xcc /Users/admin/builder/spi-builder-workspace/.derivedData/SDKStatCaches.noindex/macosx15.4-24E241-8287b8f5db97e746a1562fbca0c9d29b.sdkstatcache -output-file-map /Users/admin/builder/spi-builder-workspace/.derivedData/Build/Intermediates.noindex/Atomic.build/Debug/Atomic.build/Objects-normal/arm64/Atomic-OutputFileMap.json -use-frontend-parseable-output -save-temps -no-color-diagnostics -serialize-diagnostics -emit-dependencies -emit-module -emit-module-path /Users/admin/builder/spi-builder-workspace/.derivedData/Build/Intermediates.noindex/Atomic.build/Debug/Atomic.build/Objects-normal/arm64/Atomic.swiftmodule -user-module-version 1.1.0 -validate-clang-modules-once -clang-build-session-file /Users/admin/builder/spi-builder-workspace/.derivedData/ModuleCache.noindex/Session.modulevalidation -package-name atomic -Xcc -I/Users/admin/builder/spi-builder-workspace/.derivedData/Build/Intermediates.noindex/Atomic.build/Debug/Atomic.build/swift-overrides.hmap -emit-const-values -Xfrontend -const-gather-protocols-file -Xfrontend /Users/admin/builder/spi-builder-workspace/.derivedData/Build/Intermediates.noindex/Atomic.build/Debug/Atomic.build/Objects-normal/arm64/Atomic_const_extract_protocols.json -Xcc -I/Users/admin/builder/spi-builder-workspace/.derivedData/Build/Products/Debug/include -Xcc -I/Users/admin/builder/spi-builder-workspace/.derivedData/Build/Intermediates.noindex/Atomic.build/Debug/Atomic.build/DerivedSources-normal/arm64 -Xcc -I/Users/admin/builder/spi-builder-workspace/.derivedData/Build/Intermediates.noindex/Atomic.build/Debug/Atomic.build/DerivedSources/arm64 -Xcc -I/Users/admin/builder/spi-builder-workspace/.derivedData/Build/Intermediates.noindex/Atomic.build/Debug/Atomic.build/DerivedSources -Xcc -DSWIFT_PACKAGE -Xcc -DDEBUG\=1 -emit-objc-header -emit-objc-header-path /Users/admin/builder/spi-builder-workspace/.derivedData/Build/Intermediates.noindex/Atomic.build/Debug/Atomic.build/Objects-normal/arm64/Atomic-Swift.h -working-directory /Users/admin/builder/spi-builder-workspace/.swiftpm/xcode -experimental-emit-module-separately -disable-cmo
SwiftEmitModule normal arm64 Emitting\ module\ for\ Atomic (in target 'Atomic' from project 'Atomic')
EmitSwiftModule normal arm64 (in target 'Atomic' from project 'Atomic')
    cd /Users/admin/builder/spi-builder-workspace/.swiftpm/xcode

SwiftCompile normal arm64 Compiling\ Atomic.swift /Users/admin/builder/spi-builder-workspace/.dependencies/checkouts/atomic/Sources/Atomic/Classes/Core/Atomic/Atomic.swift (in target 'Atomic' from project 'Atomic')
SwiftCompile normal arm64 /Users/admin/builder/spi-builder-workspace/.dependencies/checkouts/atomic/Sources/Atomic/Classes/Core/Atomic/Atomic.swift (in target 'Atomic' from project 'Atomic')
    cd /Users/admin/builder/spi-builder-workspace/.swiftpm/xcode

SwiftCompile normal arm64 Compiling\ ILock.swift /Users/admin/builder/spi-builder-workspace/.dependencies/checkouts/atomic/Sources/Atomic/Classes/Helpers/Lock/ILock.swift (in target 'Atomic' from project 'Atomic')
SwiftCompile normal arm64 /Users/admin/builder/spi-builder-workspace/.dependencies/checkouts/atomic/Sources/Atomic/Classes/Helpers/Lock/ILock.swift (in target 'Atomic' from project 'Atomic')
    cd /Users/admin/builder/spi-builder-workspace/.swiftpm/xcode

SwiftCompile normal arm64 Compiling\ UnfairLock.swift /Users/admin/builder/spi-builder-workspace/.dependencies/checkouts/atomic/Sources/Atomic/Classes/Helpers/Lock/UnfairLock.swift (in target 'Atomic' from project 'Atomic')
SwiftCompile normal arm64 /Users/admin/builder/spi-builder-workspace/.dependencies/checkouts/atomic/Sources/Atomic/Classes/Helpers/Lock/UnfairLock.swift (in target 'Atomic' from project 'Atomic')
    cd /Users/admin/builder/spi-builder-workspace/.swiftpm/xcode

SwiftCompile normal arm64 Compiling\ IDispatchQueue.swift /Users/admin/builder/spi-builder-workspace/.dependencies/checkouts/concurrency/Sources/Concurrency/DispatchQueue/IDispatchQueue.swift (in target 'Concurrency' from project 'Concurrency')
SwiftCompile normal arm64 /Users/admin/builder/spi-builder-workspace/.dependencies/checkouts/concurrency/Sources/Concurrency/DispatchQueue/IDispatchQueue.swift (in target 'Concurrency' from project 'Concurrency')
    cd /Users/admin/builder/spi-builder-workspace/.swiftpm/xcode

SwiftEmitModule normal arm64 Emitting\ module\ for\ Concurrency (in target 'Concurrency' from project 'Concurrency')
EmitSwiftModule normal arm64 (in target 'Concurrency' from project 'Concurrency')
    cd /Users/admin/builder/spi-builder-workspace/.swiftpm/xcode

SwiftCompile normal arm64 Compiling\ DispatchQueueFactory.swift /Users/admin/builder/spi-builder-workspace/.dependencies/checkouts/concurrency/Sources/Concurrency/DispatchQueueFactory/DispatchQueueFactory.swift (in target 'Concurrency' from project 'Concurrency')
SwiftCompile normal arm64 /Users/admin/builder/spi-builder-workspace/.dependencies/checkouts/concurrency/Sources/Concurrency/DispatchQueueFactory/DispatchQueueFactory.swift (in target 'Concurrency' from project 'Concurrency')
    cd /Users/admin/builder/spi-builder-workspace/.swiftpm/xcode

SwiftCompile normal arm64 Compiling\ DispatchQueue+IDispatchQueue.swift /Users/admin/builder/spi-builder-workspace/.dependencies/checkouts/concurrency/Sources/Concurrency/DispatchQueue/DispatchQueue+IDispatchQueue.swift (in target 'Concurrency' from project 'Concurrency')
SwiftCompile normal arm64 /Users/admin/builder/spi-builder-workspace/.dependencies/checkouts/concurrency/Sources/Concurrency/DispatchQueue/DispatchQueue+IDispatchQueue.swift (in target 'Concurrency' from project 'Concurrency')
    cd /Users/admin/builder/spi-builder-workspace/.swiftpm/xcode

SwiftCompile normal arm64 Compiling\ TaskFactory.swift /Users/admin/builder/spi-builder-workspace/.dependencies/checkouts/concurrency/Sources/Concurrency/TaskFactory/TaskFactory.swift (in target 'Concurrency' from project 'Concurrency')
SwiftCompile normal arm64 /Users/admin/builder/spi-builder-workspace/.dependencies/checkouts/concurrency/Sources/Concurrency/TaskFactory/TaskFactory.swift (in target 'Concurrency' from project 'Concurrency')
    cd /Users/admin/builder/spi-builder-workspace/.swiftpm/xcode

SwiftEmitModule normal arm64 Emitting\ module\ for\ Log (in target 'Log' from project 'Log')
EmitSwiftModule normal arm64 (in target 'Log' from project 'Log')
    cd /Users/admin/builder/spi-builder-workspace/.swiftpm/xcode

SwiftEmitModule normal arm64 Emitting\ module\ for\ SnapshotTesting (in target 'SnapshotTesting' from project 'swift-snapshot-testing')
EmitSwiftModule normal arm64 (in target 'SnapshotTesting' from project 'swift-snapshot-testing')
    cd /Users/admin/builder/spi-builder-workspace/.swiftpm/xcode

SwiftDriverJobDiscovery normal arm64 Compiling ILock.swift (in target 'Atomic' from project 'Atomic')
SwiftCompile normal arm64 Compiling\ Data.swift,\ Encodable.swift,\ NSBezierPath.swift /Users/admin/builder/spi-builder-workspace/.dependencies/checkouts/swift-snapshot-testing/Sources/SnapshotTesting/Snapshotting/Data.swift /Users/admin/builder/spi-builder-workspace/.dependencies/checkouts/swift-snapshot-testing/Sources/SnapshotTesting/Snapshotting/Encodable.swift /Users/admin/builder/spi-builder-workspace/.dependencies/checkouts/swift-snapshot-testing/Sources/SnapshotTesting/Snapshotting/NSBezierPath.swift (in target 'SnapshotTesting' from project 'swift-snapshot-testing')
SwiftCompile normal arm64 /Users/admin/builder/spi-builder-workspace/.dependencies/checkouts/swift-snapshot-testing/Sources/SnapshotTesting/Snapshotting/Data.swift (in target 'SnapshotTesting' from project 'swift-snapshot-testing')
    cd /Users/admin/builder/spi-builder-workspace/.swiftpm/xcode

SwiftCompile normal arm64 /Users/admin/builder/spi-builder-workspace/.dependencies/checkouts/swift-snapshot-testing/Sources/SnapshotTesting/Snapshotting/Encodable.swift (in target 'SnapshotTesting' from project 'swift-snapshot-testing')
    cd /Users/admin/builder/spi-builder-workspace/.swiftpm/xcode

SwiftCompile normal arm64 /Users/admin/builder/spi-builder-workspace/.dependencies/checkouts/swift-snapshot-testing/Sources/SnapshotTesting/Snapshotting/NSBezierPath.swift (in target 'SnapshotTesting' from project 'swift-snapshot-testing')
    cd /Users/admin/builder/spi-builder-workspace/.swiftpm/xcode

SwiftDriverJobDiscovery normal arm64 Compiling UnfairLock.swift (in target 'Atomic' from project 'Atomic')
SwiftCompile normal arm64 Compiling\ Diffing.swift,\ Wait.swift,\ Deprecations.swift,\ RecordIssue.swift /Users/admin/builder/spi-builder-workspace/.dependencies/checkouts/swift-snapshot-testing/Sources/SnapshotTesting/Diffing.swift /Users/admin/builder/spi-builder-workspace/.dependencies/checkouts/swift-snapshot-testing/Sources/SnapshotTesting/Extensions/Wait.swift /Users/admin/builder/spi-builder-workspace/.dependencies/checkouts/swift-snapshot-testing/Sources/SnapshotTesting/Internal/Deprecations.swift /Users/admin/builder/spi-builder-workspace/.dependencies/checkouts/swift-snapshot-testing/Sources/SnapshotTesting/Internal/RecordIssue.swift (in target 'SnapshotTesting' from project 'swift-snapshot-testing')
SwiftCompile normal arm64 /Users/admin/builder/spi-builder-workspace/.dependencies/checkouts/swift-snapshot-testing/Sources/SnapshotTesting/Diffing.swift (in target 'SnapshotTesting' from project 'swift-snapshot-testing')
    cd /Users/admin/builder/spi-builder-workspace/.swiftpm/xcode

SwiftCompile normal arm64 /Users/admin/builder/spi-builder-workspace/.dependencies/checkouts/swift-snapshot-testing/Sources/SnapshotTesting/Extensions/Wait.swift (in target 'SnapshotTesting' from project 'swift-snapshot-testing')
    cd /Users/admin/builder/spi-builder-workspace/.swiftpm/xcode

SwiftCompile normal arm64 /Users/admin/builder/spi-builder-workspace/.dependencies/checkouts/swift-snapshot-testing/Sources/SnapshotTesting/Internal/Deprecations.swift (in target 'SnapshotTesting' from project 'swift-snapshot-testing')
    cd /Users/admin/builder/spi-builder-workspace/.swiftpm/xcode

SwiftCompile normal arm64 /Users/admin/builder/spi-builder-workspace/.dependencies/checkouts/swift-snapshot-testing/Sources/SnapshotTesting/Internal/RecordIssue.swift (in target 'SnapshotTesting' from project 'swift-snapshot-testing')
    cd /Users/admin/builder/spi-builder-workspace/.swiftpm/xcode

SwiftDriverJobDiscovery normal arm64 Emitting module for Atomic (in target 'Atomic' from project 'Atomic')
SwiftDriver\ Compilation\ Requirements Atomic normal arm64 com.apple.xcode.tools.swift.compiler (in target 'Atomic' from project 'Atomic')
    cd /Users/admin/builder/spi-builder-workspace/.swiftpm/xcode
    builtin-Swift-Compilation-Requirements -- /Applications/Xcode-16.3.0.app/Contents/Developer/Toolchains/XcodeDefault.xctoolchain/usr/bin/swiftc -module-name Atomic -Onone -enforce-exclusivity\=checked @/Users/admin/builder/spi-builder-workspace/.derivedData/Build/Intermediates.noindex/Atomic.build/Debug/Atomic.build/Objects-normal/arm64/Atomic.SwiftFileList -DSWIFT_PACKAGE -DDEBUG -DXcode -plugin-path /Applications/Xcode-16.3.0.app/Contents/Developer/Toolchains/XcodeDefault.xctoolchain/usr/lib/swift/host/plugins/testing -enable-experimental-feature DebugDescriptionMacro -sdk /Applications/Xcode-16.3.0.app/Contents/Developer/Platforms/MacOSX.platform/Developer/SDKs/MacOSX15.4.sdk -target arm64-apple-macos10.15 -g -module-cache-path /Users/admin/builder/spi-builder-workspace/.derivedData/ModuleCache.noindex -Xfrontend -serialize-debugging-options -profile-coverage-mapping -profile-generate -enable-testing -suppress-warnings -index-store-path /Users/admin/builder/spi-builder-workspace/.derivedData/Index.noindex/DataStore -swift-version 6 -I /Users/admin/builder/spi-builder-workspace/.derivedData/Build/Products/Debug -I /Applications/Xcode-16.3.0.app/Contents/Developer/Platforms/MacOSX.platform/Developer/usr/lib -F /Users/admin/builder/spi-builder-workspace/.derivedData/Build/Products/Debug -F /Applications/Xcode-16.3.0.app/Contents/Developer/Platforms/MacOSX.platform/Developer/Library/Frameworks -c -j10 -enable-batch-mode -incremental -Xcc -ivfsstatcache -Xcc /Users/admin/builder/spi-builder-workspace/.derivedData/SDKStatCaches.noindex/macosx15.4-24E241-8287b8f5db97e746a1562fbca0c9d29b.sdkstatcache -output-file-map /Users/admin/builder/spi-builder-workspace/.derivedData/Build/Intermediates.noindex/Atomic.build/Debug/Atomic.build/Objects-normal/arm64/Atomic-OutputFileMap.json -use-frontend-parseable-output -save-temps -no-color-diagnostics -serialize-diagnostics -emit-dependencies -emit-module -emit-module-path /Users/admin/builder/spi-builder-workspace/.derivedData/Build/Intermediates.noindex/Atomic.build/Debug/Atomic.build/Objects-normal/arm64/Atomic.swiftmodule -user-module-version 1.1.0 -validate-clang-modules-once -clang-build-session-file /Users/admin/builder/spi-builder-workspace/.derivedData/ModuleCache.noindex/Session.modulevalidation -package-name atomic -Xcc -I/Users/admin/builder/spi-builder-workspace/.derivedData/Build/Intermediates.noindex/Atomic.build/Debug/Atomic.build/swift-overrides.hmap -emit-const-values -Xfrontend -const-gather-protocols-file -Xfrontend /Users/admin/builder/spi-builder-workspace/.derivedData/Build/Intermediates.noindex/Atomic.build/Debug/Atomic.build/Objects-normal/arm64/Atomic_const_extract_protocols.json -Xcc -I/Users/admin/builder/spi-builder-workspace/.derivedData/Build/Products/Debug/include -Xcc -I/Users/admin/builder/spi-builder-workspace/.derivedData/Build/Intermediates.noindex/Atomic.build/Debug/Atomic.build/DerivedSources-normal/arm64 -Xcc -I/Users/admin/builder/spi-builder-workspace/.derivedData/Build/Intermediates.noindex/Atomic.build/Debug/Atomic.build/DerivedSources/arm64 -Xcc -I/Users/admin/builder/spi-builder-workspace/.derivedData/Build/Intermediates.noindex/Atomic.build/Debug/Atomic.build/DerivedSources -Xcc -DSWIFT_PACKAGE -Xcc -DDEBUG\=1 -emit-objc-header -emit-objc-header-path /Users/admin/builder/spi-builder-workspace/.derivedData/Build/Intermediates.noindex/Atomic.build/Debug/Atomic.build/Objects-normal/arm64/Atomic-Swift.h -working-directory /Users/admin/builder/spi-builder-workspace/.swiftpm/xcode -experimental-emit-module-separately -disable-cmo
SwiftDriverJobDiscovery normal arm64 Emitting module for Concurrency (in target 'Concurrency' from project 'Concurrency')
SwiftDriver\ Compilation\ Requirements Concurrency normal arm64 com.apple.xcode.tools.swift.compiler (in target 'Concurrency' from project 'Concurrency')
    cd /Users/admin/builder/spi-builder-workspace/.swiftpm/xcode
    builtin-Swift-Compilation-Requirements -- /Applications/Xcode-16.3.0.app/Contents/Developer/Toolchains/XcodeDefault.xctoolchain/usr/bin/swiftc -module-name Concurrency -Onone -enforce-exclusivity\=checked @/Users/admin/builder/spi-builder-workspace/.derivedData/Build/Intermediates.noindex/Concurrency.build/Debug/Concurrency.build/Objects-normal/arm64/Concurrency.SwiftFileList -DSWIFT_PACKAGE -DDEBUG -DXcode -plugin-path /Applications/Xcode-16.3.0.app/Contents/Developer/Toolchains/XcodeDefault.xctoolchain/usr/lib/swift/host/plugins/testing -enable-experimental-feature DebugDescriptionMacro -sdk /Applications/Xcode-16.3.0.app/Contents/Developer/Platforms/MacOSX.platform/Developer/SDKs/MacOSX15.4.sdk -target arm64-apple-macos10.15 -g -module-cache-path /Users/admin/builder/spi-builder-workspace/.derivedData/ModuleCache.noindex -Xfrontend -serialize-debugging-options -profile-coverage-mapping -profile-generate -enable-testing -suppress-warnings -index-store-path /Users/admin/builder/spi-builder-workspace/.derivedData/Index.noindex/DataStore -swift-version 6 -I /Users/admin/builder/spi-builder-workspace/.derivedData/Build/Products/Debug -I /Applications/Xcode-16.3.0.app/Contents/Developer/Platforms/MacOSX.platform/Developer/usr/lib -F /Users/admin/builder/spi-builder-workspace/.derivedData/Build/Products/Debug -F /Applications/Xcode-16.3.0.app/Contents/Developer/Platforms/MacOSX.platform/Developer/Library/Frameworks -c -j10 -enable-batch-mode -incremental -Xcc -ivfsstatcache -Xcc /Users/admin/builder/spi-builder-workspace/.derivedData/SDKStatCaches.noindex/macosx15.4-24E241-8287b8f5db97e746a1562fbca0c9d29b.sdkstatcache -output-file-map /Users/admin/builder/spi-builder-workspace/.derivedData/Build/Intermediates.noindex/Concurrency.build/Debug/Concurrency.build/Objects-normal/arm64/Concurrency-OutputFileMap.json -use-frontend-parseable-output -save-temps -no-color-diagnostics -serialize-diagnostics -emit-dependencies -emit-module -emit-module-path /Users/admin/builder/spi-builder-workspace/.derivedData/Build/Intermediates.noindex/Concurrency.build/Debug/Concurrency.build/Objects-normal/arm64/Concurrency.swiftmodule -user-module-version 0.2.0 -validate-clang-modules-once -clang-build-session-file /Users/admin/builder/spi-builder-workspace/.derivedData/ModuleCache.noindex/Session.modulevalidation -package-name concurrency -Xcc -I/Users/admin/builder/spi-builder-workspace/.derivedData/Build/Intermediates.noindex/Concurrency.build/Debug/Concurrency.build/swift-overrides.hmap -emit-const-values -Xfrontend -const-gather-protocols-file -Xfrontend /Users/admin/builder/spi-builder-workspace/.derivedData/Build/Intermediates.noindex/Concurrency.build/Debug/Concurrency.build/Objects-normal/arm64/Concurrency_const_extract_protocols.json -Xcc -I/Users/admin/builder/spi-builder-workspace/.derivedData/Build/Products/Debug/include -Xcc -I/Users/admin/builder/spi-builder-workspace/.derivedData/Build/Intermediates.noindex/Concurrency.build/Debug/Concurrency.build/DerivedSources-normal/arm64 -Xcc -I/Users/admin/builder/spi-builder-workspace/.derivedData/Build/Intermediates.noindex/Concurrency.build/Debug/Concurrency.build/DerivedSources/arm64 -Xcc -I/Users/admin/builder/spi-builder-workspace/.derivedData/Build/Intermediates.noindex/Concurrency.build/Debug/Concurrency.build/DerivedSources -Xcc -DSWIFT_PACKAGE -Xcc -DDEBUG\=1 -emit-objc-header -emit-objc-header-path /Users/admin/builder/spi-builder-workspace/.derivedData/Build/Intermediates.noindex/Concurrency.build/Debug/Concurrency.build/Objects-normal/arm64/Concurrency-Swift.h -working-directory /Users/admin/builder/spi-builder-workspace/.swiftpm/xcode -experimental-emit-module-separately -disable-cmo
SwiftCompile normal arm64 Compiling\ String+SpecialCharacters.swift,\ View.swift,\ XCTAttachment.swift,\ Diff.swift /Users/admin/builder/spi-builder-workspace/.dependencies/checkouts/swift-snapshot-testing/Sources/SnapshotTesting/Common/String+SpecialCharacters.swift /Users/admin/builder/spi-builder-workspace/.dependencies/checkouts/swift-snapshot-testing/Sources/SnapshotTesting/Common/View.swift /Users/admin/builder/spi-builder-workspace/.dependencies/checkouts/swift-snapshot-testing/Sources/SnapshotTesting/Common/XCTAttachment.swift /Users/admin/builder/spi-builder-workspace/.dependencies/checkouts/swift-snapshot-testing/Sources/SnapshotTesting/Diff.swift (in target 'SnapshotTesting' from project 'swift-snapshot-testing')
SwiftCompile normal arm64 /Users/admin/builder/spi-builder-workspace/.dependencies/checkouts/swift-snapshot-testing/Sources/SnapshotTesting/Common/String+SpecialCharacters.swift (in target 'SnapshotTesting' from project 'swift-snapshot-testing')
    cd /Users/admin/builder/spi-builder-workspace/.swiftpm/xcode

SwiftCompile normal arm64 /Users/admin/builder/spi-builder-workspace/.dependencies/checkouts/swift-snapshot-testing/Sources/SnapshotTesting/Common/View.swift (in target 'SnapshotTesting' from project 'swift-snapshot-testing')
    cd /Users/admin/builder/spi-builder-workspace/.swiftpm/xcode

SwiftCompile normal arm64 /Users/admin/builder/spi-builder-workspace/.dependencies/checkouts/swift-snapshot-testing/Sources/SnapshotTesting/Common/XCTAttachment.swift (in target 'SnapshotTesting' from project 'swift-snapshot-testing')
    cd /Users/admin/builder/spi-builder-workspace/.swiftpm/xcode

SwiftCompile normal arm64 /Users/admin/builder/spi-builder-workspace/.dependencies/checkouts/swift-snapshot-testing/Sources/SnapshotTesting/Diff.swift (in target 'SnapshotTesting' from project 'swift-snapshot-testing')
    cd /Users/admin/builder/spi-builder-workspace/.swiftpm/xcode

SwiftDriverJobDiscovery normal arm64 Compiling DispatchQueue+IDispatchQueue.swift (in target 'Concurrency' from project 'Concurrency')
SwiftCompile normal arm64 Compiling\ SceneKit.swift,\ SpriteKit.swift,\ String.swift /Users/admin/builder/spi-builder-workspace/.dependencies/checkouts/swift-snapshot-testing/Sources/SnapshotTesting/Snapshotting/SceneKit.swift /Users/admin/builder/spi-builder-workspace/.dependencies/checkouts/swift-snapshot-testing/Sources/SnapshotTesting/Snapshotting/SpriteKit.swift /Users/admin/builder/spi-builder-workspace/.dependencies/checkouts/swift-snapshot-testing/Sources/SnapshotTesting/Snapshotting/String.swift (in target 'SnapshotTesting' from project 'swift-snapshot-testing')
SwiftCompile normal arm64 /Users/admin/builder/spi-builder-workspace/.dependencies/checkouts/swift-snapshot-testing/Sources/SnapshotTesting/Snapshotting/SceneKit.swift (in target 'SnapshotTesting' from project 'swift-snapshot-testing')
    cd /Users/admin/builder/spi-builder-workspace/.swiftpm/xcode

SwiftCompile normal arm64 /Users/admin/builder/spi-builder-workspace/.dependencies/checkouts/swift-snapshot-testing/Sources/SnapshotTesting/Snapshotting/SpriteKit.swift (in target 'SnapshotTesting' from project 'swift-snapshot-testing')
    cd /Users/admin/builder/spi-builder-workspace/.swiftpm/xcode

SwiftCompile normal arm64 /Users/admin/builder/spi-builder-workspace/.dependencies/checkouts/swift-snapshot-testing/Sources/SnapshotTesting/Snapshotting/String.swift (in target 'SnapshotTesting' from project 'swift-snapshot-testing')
    cd /Users/admin/builder/spi-builder-workspace/.swiftpm/xcode

Copy /Users/admin/builder/spi-builder-workspace/.derivedData/Build/Products/Debug/Concurrency.swiftmodule/arm64-apple-macos.abi.json /Users/admin/builder/spi-builder-workspace/.derivedData/Build/Intermediates.noindex/Concurrency.build/Debug/Concurrency.build/Objects-normal/arm64/Concurrency.abi.json (in target 'Concurrency' from project 'Concurrency')
    cd /Users/admin/builder/spi-builder-workspace/.dependencies/checkouts/concurrency
    builtin-copy -exclude .DS_Store -exclude CVS -exclude .svn -exclude .git -exclude .hg -resolve-src-symlinks -rename /Users/admin/builder/spi-builder-workspace/.derivedData/Build/Intermediates.noindex/Concurrency.build/Debug/Concurrency.build/Objects-normal/arm64/Concurrency.abi.json /Users/admin/builder/spi-builder-workspace/.derivedData/Build/Products/Debug/Concurrency.swiftmodule/arm64-apple-macos.abi.json
SwiftDriverJobDiscovery normal arm64 Compiling DispatchQueueFactory.swift (in target 'Concurrency' from project 'Concurrency')
Copy /Users/admin/builder/spi-builder-workspace/.derivedData/Build/Products/Debug/Atomic.swiftmodule/arm64-apple-macos.abi.json /Users/admin/builder/spi-builder-workspace/.derivedData/Build/Intermediates.noindex/Atomic.build/Debug/Atomic.build/Objects-normal/arm64/Atomic.abi.json (in target 'Atomic' from project 'Atomic')
    cd /Users/admin/builder/spi-builder-workspace/.dependencies/checkouts/atomic
    builtin-copy -exclude .DS_Store -exclude CVS -exclude .svn -exclude .git -exclude .hg -resolve-src-symlinks -rename /Users/admin/builder/spi-builder-workspace/.derivedData/Build/Intermediates.noindex/Atomic.build/Debug/Atomic.build/Objects-normal/arm64/Atomic.abi.json /Users/admin/builder/spi-builder-workspace/.derivedData/Build/Products/Debug/Atomic.swiftmodule/arm64-apple-macos.abi.json
SwiftDriverJobDiscovery normal arm64 Compiling IDispatchQueue.swift (in target 'Concurrency' from project 'Concurrency')
SwiftCompile normal arm64 Compiling\ AssertSnapshot.swift,\ Async.swift,\ Internal.swift,\ PlistEncoder.swift /Users/admin/builder/spi-builder-workspace/.dependencies/checkouts/swift-snapshot-testing/Sources/SnapshotTesting/AssertSnapshot.swift /Users/admin/builder/spi-builder-workspace/.dependencies/checkouts/swift-snapshot-testing/Sources/SnapshotTesting/Async.swift /Users/admin/builder/spi-builder-workspace/.dependencies/checkouts/swift-snapshot-testing/Sources/SnapshotTesting/Common/Internal.swift /Users/admin/builder/spi-builder-workspace/.dependencies/checkouts/swift-snapshot-testing/Sources/SnapshotTesting/Common/PlistEncoder.swift (in target 'SnapshotTesting' from project 'swift-snapshot-testing')
SwiftCompile normal arm64 /Users/admin/builder/spi-builder-workspace/.dependencies/checkouts/swift-snapshot-testing/Sources/SnapshotTesting/AssertSnapshot.swift (in target 'SnapshotTesting' from project 'swift-snapshot-testing')
    cd /Users/admin/builder/spi-builder-workspace/.swiftpm/xcode

SwiftCompile normal arm64 /Users/admin/builder/spi-builder-workspace/.dependencies/checkouts/swift-snapshot-testing/Sources/SnapshotTesting/Async.swift (in target 'SnapshotTesting' from project 'swift-snapshot-testing')
    cd /Users/admin/builder/spi-builder-workspace/.swiftpm/xcode

SwiftCompile normal arm64 /Users/admin/builder/spi-builder-workspace/.dependencies/checkouts/swift-snapshot-testing/Sources/SnapshotTesting/Common/Internal.swift (in target 'SnapshotTesting' from project 'swift-snapshot-testing')
    cd /Users/admin/builder/spi-builder-workspace/.swiftpm/xcode

SwiftCompile normal arm64 /Users/admin/builder/spi-builder-workspace/.dependencies/checkouts/swift-snapshot-testing/Sources/SnapshotTesting/Common/PlistEncoder.swift (in target 'SnapshotTesting' from project 'swift-snapshot-testing')
    cd /Users/admin/builder/spi-builder-workspace/.swiftpm/xcode

SwiftDriverJobDiscovery normal arm64 Compiling TaskFactory.swift (in target 'Concurrency' from project 'Concurrency')
SwiftCompile normal arm64 Compiling\ CALayer.swift,\ CGPath.swift,\ CaseIterable.swift /Users/admin/builder/spi-builder-workspace/.dependencies/checkouts/swift-snapshot-testing/Sources/SnapshotTesting/Snapshotting/CALayer.swift /Users/admin/builder/spi-builder-workspace/.dependencies/checkouts/swift-snapshot-testing/Sources/SnapshotTesting/Snapshotting/CGPath.swift /Users/admin/builder/spi-builder-workspace/.dependencies/checkouts/swift-snapshot-testing/Sources/SnapshotTesting/Snapshotting/CaseIterable.swift (in target 'SnapshotTesting' from project 'swift-snapshot-testing')
SwiftCompile normal arm64 /Users/admin/builder/spi-builder-workspace/.dependencies/checkouts/swift-snapshot-testing/Sources/SnapshotTesting/Snapshotting/CALayer.swift (in target 'SnapshotTesting' from project 'swift-snapshot-testing')
    cd /Users/admin/builder/spi-builder-workspace/.swiftpm/xcode

SwiftCompile normal arm64 /Users/admin/builder/spi-builder-workspace/.dependencies/checkouts/swift-snapshot-testing/Sources/SnapshotTesting/Snapshotting/CGPath.swift (in target 'SnapshotTesting' from project 'swift-snapshot-testing')
    cd /Users/admin/builder/spi-builder-workspace/.swiftpm/xcode

SwiftCompile normal arm64 /Users/admin/builder/spi-builder-workspace/.dependencies/checkouts/swift-snapshot-testing/Sources/SnapshotTesting/Snapshotting/CaseIterable.swift (in target 'SnapshotTesting' from project 'swift-snapshot-testing')
    cd /Users/admin/builder/spi-builder-workspace/.swiftpm/xcode

SwiftCompile normal arm64 Compiling\ SnapshotTestingConfiguration.swift,\ SnapshotsTestTrait.swift,\ Snapshotting.swift,\ Any.swift /Users/admin/builder/spi-builder-workspace/.dependencies/checkouts/swift-snapshot-testing/Sources/SnapshotTesting/SnapshotTestingConfiguration.swift /Users/admin/builder/spi-builder-workspace/.dependencies/checkouts/swift-snapshot-testing/Sources/SnapshotTesting/SnapshotsTestTrait.swift /Users/admin/builder/spi-builder-workspace/.dependencies/checkouts/swift-snapshot-testing/Sources/SnapshotTesting/Snapshotting.swift /Users/admin/builder/spi-builder-workspace/.dependencies/checkouts/swift-snapshot-testing/Sources/SnapshotTesting/Snapshotting/Any.swift (in target 'SnapshotTesting' from project 'swift-snapshot-testing')
SwiftCompile normal arm64 /Users/admin/builder/spi-builder-workspace/.dependencies/checkouts/swift-snapshot-testing/Sources/SnapshotTesting/SnapshotTestingConfiguration.swift (in target 'SnapshotTesting' from project 'swift-snapshot-testing')
    cd /Users/admin/builder/spi-builder-workspace/.swiftpm/xcode

SwiftCompile normal arm64 /Users/admin/builder/spi-builder-workspace/.dependencies/checkouts/swift-snapshot-testing/Sources/SnapshotTesting/SnapshotsTestTrait.swift (in target 'SnapshotTesting' from project 'swift-snapshot-testing')
    cd /Users/admin/builder/spi-builder-workspace/.swiftpm/xcode

SwiftCompile normal arm64 /Users/admin/builder/spi-builder-workspace/.dependencies/checkouts/swift-snapshot-testing/Sources/SnapshotTesting/Snapshotting.swift (in target 'SnapshotTesting' from project 'swift-snapshot-testing')
    cd /Users/admin/builder/spi-builder-workspace/.swiftpm/xcode

SwiftCompile normal arm64 /Users/admin/builder/spi-builder-workspace/.dependencies/checkouts/swift-snapshot-testing/Sources/SnapshotTesting/Snapshotting/Any.swift (in target 'SnapshotTesting' from project 'swift-snapshot-testing')
    cd /Users/admin/builder/spi-builder-workspace/.swiftpm/xcode

SwiftCompile normal arm64 Compiling\ UIView.swift,\ UIViewController.swift,\ URLRequest.swift /Users/admin/builder/spi-builder-workspace/.dependencies/checkouts/swift-snapshot-testing/Sources/SnapshotTesting/Snapshotting/UIView.swift /Users/admin/builder/spi-builder-workspace/.dependencies/checkouts/swift-snapshot-testing/Sources/SnapshotTesting/Snapshotting/UIViewController.swift /Users/admin/builder/spi-builder-workspace/.dependencies/checkouts/swift-snapshot-testing/Sources/SnapshotTesting/Snapshotting/URLRequest.swift (in target 'SnapshotTesting' from project 'swift-snapshot-testing')
SwiftCompile normal arm64 /Users/admin/builder/spi-builder-workspace/.dependencies/checkouts/swift-snapshot-testing/Sources/SnapshotTesting/Snapshotting/UIView.swift (in target 'SnapshotTesting' from project 'swift-snapshot-testing')
    cd /Users/admin/builder/spi-builder-workspace/.swiftpm/xcode

SwiftCompile normal arm64 /Users/admin/builder/spi-builder-workspace/.dependencies/checkouts/swift-snapshot-testing/Sources/SnapshotTesting/Snapshotting/UIViewController.swift (in target 'SnapshotTesting' from project 'swift-snapshot-testing')
    cd /Users/admin/builder/spi-builder-workspace/.swiftpm/xcode

SwiftCompile normal arm64 /Users/admin/builder/spi-builder-workspace/.dependencies/checkouts/swift-snapshot-testing/Sources/SnapshotTesting/Snapshotting/URLRequest.swift (in target 'SnapshotTesting' from project 'swift-snapshot-testing')
    cd /Users/admin/builder/spi-builder-workspace/.swiftpm/xcode

SwiftDriverJobDiscovery normal arm64 Compiling Atomic.swift (in target 'Atomic' from project 'Atomic')
SwiftCompile normal arm64 Compiling\ SwiftUIView.swift,\ UIBezierPath.swift,\ UIImage.swift /Users/admin/builder/spi-builder-workspace/.dependencies/checkouts/swift-snapshot-testing/Sources/SnapshotTesting/Snapshotting/SwiftUIView.swift /Users/admin/builder/spi-builder-workspace/.dependencies/checkouts/swift-snapshot-testing/Sources/SnapshotTesting/Snapshotting/UIBezierPath.swift /Users/admin/builder/spi-builder-workspace/.dependencies/checkouts/swift-snapshot-testing/Sources/SnapshotTesting/Snapshotting/UIImage.swift (in target 'SnapshotTesting' from project 'swift-snapshot-testing')
SwiftCompile normal arm64 /Users/admin/builder/spi-builder-workspace/.dependencies/checkouts/swift-snapshot-testing/Sources/SnapshotTesting/Snapshotting/SwiftUIView.swift (in target 'SnapshotTesting' from project 'swift-snapshot-testing')
    cd /Users/admin/builder/spi-builder-workspace/.swiftpm/xcode

SwiftCompile normal arm64 /Users/admin/builder/spi-builder-workspace/.dependencies/checkouts/swift-snapshot-testing/Sources/SnapshotTesting/Snapshotting/UIBezierPath.swift (in target 'SnapshotTesting' from project 'swift-snapshot-testing')
    cd /Users/admin/builder/spi-builder-workspace/.swiftpm/xcode

SwiftCompile normal arm64 /Users/admin/builder/spi-builder-workspace/.dependencies/checkouts/swift-snapshot-testing/Sources/SnapshotTesting/Snapshotting/UIImage.swift (in target 'SnapshotTesting' from project 'swift-snapshot-testing')
    cd /Users/admin/builder/spi-builder-workspace/.swiftpm/xcode

SwiftDriverJobDiscovery normal arm64 Emitting module for Log (in target 'Log' from project 'Log')
SwiftDriver\ Compilation\ Requirements Log normal arm64 com.apple.xcode.tools.swift.compiler (in target 'Log' from project 'Log')
    cd /Users/admin/builder/spi-builder-workspace/.swiftpm/xcode
    builtin-Swift-Compilation-Requirements -- /Applications/Xcode-16.3.0.app/Contents/Developer/Toolchains/XcodeDefault.xctoolchain/usr/bin/swiftc -module-name Log -Onone -enforce-exclusivity\=checked @/Users/admin/builder/spi-builder-workspace/.derivedData/Build/Intermediates.noindex/Log.build/Debug/Log.build/Objects-normal/arm64/Log.SwiftFileList -DSWIFT_PACKAGE -DDEBUG -DXcode -plugin-path /Applications/Xcode-16.3.0.app/Contents/Developer/Toolchains/XcodeDefault.xctoolchain/usr/lib/swift/host/plugins/testing -enable-experimental-feature DebugDescriptionMacro -sdk /Applications/Xcode-16.3.0.app/Contents/Developer/Platforms/MacOSX.platform/Developer/SDKs/MacOSX15.4.sdk -target arm64-apple-macos10.15 -g -module-cache-path /Users/admin/builder/spi-builder-workspace/.derivedData/ModuleCache.noindex -Xfrontend -serialize-debugging-options -profile-coverage-mapping -profile-generate -enable-testing -suppress-warnings -index-store-path /Users/admin/builder/spi-builder-workspace/.derivedData/Index.noindex/DataStore -swift-version 6 -I /Users/admin/builder/spi-builder-workspace/.derivedData/Build/Products/Debug -I /Applications/Xcode-16.3.0.app/Contents/Developer/Platforms/MacOSX.platform/Developer/usr/lib -F /Users/admin/builder/spi-builder-workspace/.derivedData/Build/Products/Debug -F /Applications/Xcode-16.3.0.app/Contents/Developer/Platforms/MacOSX.platform/Developer/Library/Frameworks -c -j10 -enable-batch-mode -incremental -Xcc -ivfsstatcache -Xcc /Users/admin/builder/spi-builder-workspace/.derivedData/SDKStatCaches.noindex/macosx15.4-24E241-8287b8f5db97e746a1562fbca0c9d29b.sdkstatcache -output-file-map /Users/admin/builder/spi-builder-workspace/.derivedData/Build/Intermediates.noindex/Log.build/Debug/Log.build/Objects-normal/arm64/Log-OutputFileMap.json -use-frontend-parseable-output -save-temps -no-color-diagnostics -serialize-diagnostics -emit-dependencies -emit-module -emit-module-path /Users/admin/builder/spi-builder-workspace/.derivedData/Build/Intermediates.noindex/Log.build/Debug/Log.build/Objects-normal/arm64/Log.swiftmodule -user-module-version 1.2.0 -validate-clang-modules-once -clang-build-session-file /Users/admin/builder/spi-builder-workspace/.derivedData/ModuleCache.noindex/Session.modulevalidation -package-name log -Xcc -I/Users/admin/builder/spi-builder-workspace/.derivedData/Build/Intermediates.noindex/Log.build/Debug/Log.build/swift-overrides.hmap -emit-const-values -Xfrontend -const-gather-protocols-file -Xfrontend /Users/admin/builder/spi-builder-workspace/.derivedData/Build/Intermediates.noindex/Log.build/Debug/Log.build/Objects-normal/arm64/Log_const_extract_protocols.json -Xcc -I/Users/admin/builder/spi-builder-workspace/.derivedData/Build/Products/Debug/include -Xcc -I/Users/admin/builder/spi-builder-workspace/.derivedData/Build/Intermediates.noindex/Log.build/Debug/Log.build/DerivedSources-normal/arm64 -Xcc -I/Users/admin/builder/spi-builder-workspace/.derivedData/Build/Intermediates.noindex/Log.build/Debug/Log.build/DerivedSources/arm64 -Xcc -I/Users/admin/builder/spi-builder-workspace/.derivedData/Build/Intermediates.noindex/Log.build/Debug/Log.build/DerivedSources -Xcc -DSWIFT_PACKAGE -Xcc -DDEBUG\=1 -emit-objc-header -emit-objc-header-path /Users/admin/builder/spi-builder-workspace/.derivedData/Build/Intermediates.noindex/Log.build/Debug/Log.build/Objects-normal/arm64/Log-Swift.h -working-directory /Users/admin/builder/spi-builder-workspace/.swiftpm/xcode -experimental-emit-module-separately -disable-cmo
SwiftDriverJobDiscovery normal arm64 Compiling SceneKit.swift, SpriteKit.swift, String.swift (in target 'SnapshotTesting' from project 'swift-snapshot-testing')
SwiftCompile normal arm64 Compiling\ NSImage.swift,\ NSView.swift,\ NSViewController.swift /Users/admin/builder/spi-builder-workspace/.dependencies/checkouts/swift-snapshot-testing/Sources/SnapshotTesting/Snapshotting/NSImage.swift /Users/admin/builder/spi-builder-workspace/.dependencies/checkouts/swift-snapshot-testing/Sources/SnapshotTesting/Snapshotting/NSView.swift /Users/admin/builder/spi-builder-workspace/.dependencies/checkouts/swift-snapshot-testing/Sources/SnapshotTesting/Snapshotting/NSViewController.swift (in target 'SnapshotTesting' from project 'swift-snapshot-testing')
SwiftCompile normal arm64 /Users/admin/builder/spi-builder-workspace/.dependencies/checkouts/swift-snapshot-testing/Sources/SnapshotTesting/Snapshotting/NSImage.swift (in target 'SnapshotTesting' from project 'swift-snapshot-testing')
    cd /Users/admin/builder/spi-builder-workspace/.swiftpm/xcode

SwiftCompile normal arm64 /Users/admin/builder/spi-builder-workspace/.dependencies/checkouts/swift-snapshot-testing/Sources/SnapshotTesting/Snapshotting/NSView.swift (in target 'SnapshotTesting' from project 'swift-snapshot-testing')
    cd /Users/admin/builder/spi-builder-workspace/.swiftpm/xcode

SwiftCompile normal arm64 /Users/admin/builder/spi-builder-workspace/.dependencies/checkouts/swift-snapshot-testing/Sources/SnapshotTesting/Snapshotting/NSViewController.swift (in target 'SnapshotTesting' from project 'swift-snapshot-testing')
    cd /Users/admin/builder/spi-builder-workspace/.swiftpm/xcode

Copy /Users/admin/builder/spi-builder-workspace/.derivedData/Build/Products/Debug/Log.swiftmodule/arm64-apple-macos.abi.json /Users/admin/builder/spi-builder-workspace/.derivedData/Build/Intermediates.noindex/Log.build/Debug/Log.build/Objects-normal/arm64/Log.abi.json (in target 'Log' from project 'Log')
    cd /Users/admin/builder/spi-builder-workspace/.dependencies/checkouts/log
    builtin-copy -exclude .DS_Store -exclude CVS -exclude .svn -exclude .git -exclude .hg -resolve-src-symlinks -rename /Users/admin/builder/spi-builder-workspace/.derivedData/Build/Intermediates.noindex/Log.build/Debug/Log.build/Objects-normal/arm64/Log.abi.json /Users/admin/builder/spi-builder-workspace/.derivedData/Build/Products/Debug/Log.swiftmodule/arm64-apple-macos.abi.json
SwiftDriverJobDiscovery normal arm64 Compiling UIView.swift, UIViewController.swift, URLRequest.swift (in target 'SnapshotTesting' from project 'swift-snapshot-testing')
SwiftCompile normal arm64 Compiling\ IStyleLogStrategy.swift,\ ConsolePrinter.swift /Users/admin/builder/spi-builder-workspace/.dependencies/checkouts/log/Sources/Log/Classes/Core/Logger/Strategies/IStyleLogStrategy.swift /Users/admin/builder/spi-builder-workspace/.dependencies/checkouts/log/Sources/Log/Classes/Core/Printers/ConsolePrinter.swift (in target 'Log' from project 'Log')
SwiftCompile normal arm64 /Users/admin/builder/spi-builder-workspace/.dependencies/checkouts/log/Sources/Log/Classes/Core/Logger/Strategies/IStyleLogStrategy.swift (in target 'Log' from project 'Log')
    cd /Users/admin/builder/spi-builder-workspace/.swiftpm/xcode

SwiftCompile normal arm64 /Users/admin/builder/spi-builder-workspace/.dependencies/checkouts/log/Sources/Log/Classes/Core/Printers/ConsolePrinter.swift (in target 'Log' from project 'Log')
    cd /Users/admin/builder/spi-builder-workspace/.swiftpm/xcode

SwiftCompile normal arm64 Compiling\ TimestampLogFormatter.swift,\ ILogger.swift /Users/admin/builder/spi-builder-workspace/.dependencies/checkouts/log/Sources/Log/Classes/Core/Formatters/TimestampLogFormatter.swift /Users/admin/builder/spi-builder-workspace/.dependencies/checkouts/log/Sources/Log/Classes/Core/Logger/ILogger.swift (in target 'Log' from project 'Log')
SwiftCompile normal arm64 /Users/admin/builder/spi-builder-workspace/.dependencies/checkouts/log/Sources/Log/Classes/Core/Formatters/TimestampLogFormatter.swift (in target 'Log' from project 'Log')
    cd /Users/admin/builder/spi-builder-workspace/.swiftpm/xcode

SwiftCompile normal arm64 /Users/admin/builder/spi-builder-workspace/.dependencies/checkouts/log/Sources/Log/Classes/Core/Logger/ILogger.swift (in target 'Log' from project 'Log')
    cd /Users/admin/builder/spi-builder-workspace/.swiftpm/xcode

SwiftDriverJobDiscovery normal arm64 Compiling CALayer.swift, CGPath.swift, CaseIterable.swift (in target 'SnapshotTesting' from project 'swift-snapshot-testing')
SwiftCompile normal arm64 Compiling\ LogLevel.swift /Users/admin/builder/spi-builder-workspace/.dependencies/checkouts/log/Sources/Log/Classes/Models/LogLevel.swift (in target 'Log' from project 'Log')
SwiftCompile normal arm64 /Users/admin/builder/spi-builder-workspace/.dependencies/checkouts/log/Sources/Log/Classes/Models/LogLevel.swift (in target 'Log' from project 'Log')
    cd /Users/admin/builder/spi-builder-workspace/.swiftpm/xcode

SwiftDriverJobDiscovery normal arm64 Compiling Data.swift, Encodable.swift, NSBezierPath.swift (in target 'SnapshotTesting' from project 'swift-snapshot-testing')
SwiftCompile normal arm64 Compiling\ OSWriter.swift /Users/admin/builder/spi-builder-workspace/.dependencies/checkouts/log/Sources/Log/Classes/Helpers/Writers/OSWriter/OSWriter.swift (in target 'Log' from project 'Log')
SwiftCompile normal arm64 /Users/admin/builder/spi-builder-workspace/.dependencies/checkouts/log/Sources/Log/Classes/Helpers/Writers/OSWriter/OSWriter.swift (in target 'Log' from project 'Log')
    cd /Users/admin/builder/spi-builder-workspace/.swiftpm/xcode

SwiftDriverJobDiscovery normal arm64 Compiling Diffing.swift, Wait.swift, Deprecations.swift, RecordIssue.swift (in target 'SnapshotTesting' from project 'swift-snapshot-testing')
SwiftCompile normal arm64 Compiling\ IConsoleWriter.swift,\ IOSWriter.swift /Users/admin/builder/spi-builder-workspace/.dependencies/checkouts/log/Sources/Log/Classes/Helpers/Writers/ConsoleWriter/IConsoleWriter.swift /Users/admin/builder/spi-builder-workspace/.dependencies/checkouts/log/Sources/Log/Classes/Helpers/Writers/OSWriter/IOSWriter.swift (in target 'Log' from project 'Log')
SwiftCompile normal arm64 /Users/admin/builder/spi-builder-workspace/.dependencies/checkouts/log/Sources/Log/Classes/Helpers/Writers/ConsoleWriter/IConsoleWriter.swift (in target 'Log' from project 'Log')
    cd /Users/admin/builder/spi-builder-workspace/.swiftpm/xcode

SwiftCompile normal arm64 /Users/admin/builder/spi-builder-workspace/.dependencies/checkouts/log/Sources/Log/Classes/Helpers/Writers/OSWriter/IOSWriter.swift (in target 'Log' from project 'Log')
    cd /Users/admin/builder/spi-builder-workspace/.swiftpm/xcode

SwiftDriverJobDiscovery normal arm64 Compiling SwiftUIView.swift, UIBezierPath.swift, UIImage.swift (in target 'SnapshotTesting' from project 'swift-snapshot-testing')
SwiftCompile normal arm64 Compiling\ Atomic.swift,\ ConsoleWriter.swift /Users/admin/builder/spi-builder-workspace/.dependencies/checkouts/log/Sources/Log/Classes/Helpers/Atomic/Atomic.swift /Users/admin/builder/spi-builder-workspace/.dependencies/checkouts/log/Sources/Log/Classes/Helpers/Writers/ConsoleWriter/ConsoleWriter.swift (in target 'Log' from project 'Log')
SwiftCompile normal arm64 /Users/admin/builder/spi-builder-workspace/.dependencies/checkouts/log/Sources/Log/Classes/Helpers/Atomic/Atomic.swift (in target 'Log' from project 'Log')
    cd /Users/admin/builder/spi-builder-workspace/.swiftpm/xcode

SwiftCompile normal arm64 /Users/admin/builder/spi-builder-workspace/.dependencies/checkouts/log/Sources/Log/Classes/Helpers/Writers/ConsoleWriter/ConsoleWriter.swift (in target 'Log' from project 'Log')
    cd /Users/admin/builder/spi-builder-workspace/.swiftpm/xcode

SwiftDriverJobDiscovery normal arm64 Compiling String+SpecialCharacters.swift, View.swift, XCTAttachment.swift, Diff.swift (in target 'SnapshotTesting' from project 'swift-snapshot-testing')
SwiftCompile normal arm64 Compiling\ IPrinter.swift,\ OSPrinter.swift /Users/admin/builder/spi-builder-workspace/.dependencies/checkouts/log/Sources/Log/Classes/Core/Printers/Interfaces/IPrinter.swift /Users/admin/builder/spi-builder-workspace/.dependencies/checkouts/log/Sources/Log/Classes/Core/Printers/OSPrinter.swift (in target 'Log' from project 'Log')
SwiftCompile normal arm64 /Users/admin/builder/spi-builder-workspace/.dependencies/checkouts/log/Sources/Log/Classes/Core/Printers/Interfaces/IPrinter.swift (in target 'Log' from project 'Log')
    cd /Users/admin/builder/spi-builder-workspace/.swiftpm/xcode

SwiftCompile normal arm64 /Users/admin/builder/spi-builder-workspace/.dependencies/checkouts/log/Sources/Log/Classes/Core/Printers/OSPrinter.swift (in target 'Log' from project 'Log')
    cd /Users/admin/builder/spi-builder-workspace/.swiftpm/xcode

SwiftDriverJobDiscovery normal arm64 Compiling IStyleLogStrategy.swift, ConsolePrinter.swift (in target 'Log' from project 'Log')
SwiftCompile normal arm64 Compiling\ IOSWriterStrategy.swift /Users/admin/builder/spi-builder-workspace/.dependencies/checkouts/log/Sources/Log/Classes/Helpers/Writers/OSWriter/Strategies/IOSWriterStrategy.swift (in target 'Log' from project 'Log')
SwiftCompile normal arm64 /Users/admin/builder/spi-builder-workspace/.dependencies/checkouts/log/Sources/Log/Classes/Helpers/Writers/OSWriter/Strategies/IOSWriterStrategy.swift (in target 'Log' from project 'Log')
    cd /Users/admin/builder/spi-builder-workspace/.swiftpm/xcode

SwiftDriverJobDiscovery normal arm64 Compiling TimestampLogFormatter.swift, ILogger.swift (in target 'Log' from project 'Log')
SwiftCompile normal arm64 Compiling\ Logger.swift,\ IPrinterStrategy.swift /Users/admin/builder/spi-builder-workspace/.dependencies/checkouts/log/Sources/Log/Classes/Core/Logger/Logger.swift /Users/admin/builder/spi-builder-workspace/.dependencies/checkouts/log/Sources/Log/Classes/Core/Logger/Strategies/IPrinterStrategy.swift (in target 'Log' from project 'Log')
SwiftCompile normal arm64 /Users/admin/builder/spi-builder-workspace/.dependencies/checkouts/log/Sources/Log/Classes/Core/Logger/Logger.swift (in target 'Log' from project 'Log')
    cd /Users/admin/builder/spi-builder-workspace/.swiftpm/xcode

SwiftCompile normal arm64 /Users/admin/builder/spi-builder-workspace/.dependencies/checkouts/log/Sources/Log/Classes/Core/Logger/Strategies/IPrinterStrategy.swift (in target 'Log' from project 'Log')
    cd /Users/admin/builder/spi-builder-workspace/.swiftpm/xcode

SwiftDriverJobDiscovery normal arm64 Compiling IConsoleWriter.swift, IOSWriter.swift (in target 'Log' from project 'Log')
SwiftCompile normal arm64 Compiling\ ILogFormatter.swift,\ PrefixLogFormatter.swift /Users/admin/builder/spi-builder-workspace/.dependencies/checkouts/log/Sources/Log/Classes/Core/Formatters/Interfaces/ILogFormatter.swift /Users/admin/builder/spi-builder-workspace/.dependencies/checkouts/log/Sources/Log/Classes/Core/Formatters/PrefixLogFormatter.swift (in target 'Log' from project 'Log')
SwiftCompile normal arm64 /Users/admin/builder/spi-builder-workspace/.dependencies/checkouts/log/Sources/Log/Classes/Core/Formatters/Interfaces/ILogFormatter.swift (in target 'Log' from project 'Log')
    cd /Users/admin/builder/spi-builder-workspace/.swiftpm/xcode

SwiftCompile normal arm64 /Users/admin/builder/spi-builder-workspace/.dependencies/checkouts/log/Sources/Log/Classes/Core/Formatters/PrefixLogFormatter.swift (in target 'Log' from project 'Log')
    cd /Users/admin/builder/spi-builder-workspace/.swiftpm/xcode

SwiftDriverJobDiscovery normal arm64 Compiling SnapshotTestingConfiguration.swift, SnapshotsTestTrait.swift, Snapshotting.swift, Any.swift (in target 'SnapshotTesting' from project 'swift-snapshot-testing')
SwiftCompile normal arm64 Compiling\ IDispatchQueueFactory.swift /Users/admin/builder/spi-builder-workspace/.dependencies/checkouts/concurrency/Sources/Concurrency/DispatchQueueFactory/IDispatchQueueFactory.swift (in target 'Concurrency' from project 'Concurrency')
SwiftCompile normal arm64 /Users/admin/builder/spi-builder-workspace/.dependencies/checkouts/concurrency/Sources/Concurrency/DispatchQueueFactory/IDispatchQueueFactory.swift (in target 'Concurrency' from project 'Concurrency')
    cd /Users/admin/builder/spi-builder-workspace/.swiftpm/xcode

SwiftDriverJobDiscovery normal arm64 Compiling OSWriter.swift (in target 'Log' from project 'Log')
SwiftDriver TestConcurrency normal arm64 com.apple.xcode.tools.swift.compiler (in target 'TestConcurrency' from project 'Concurrency')
    cd /Users/admin/builder/spi-builder-workspace/.swiftpm/xcode
    builtin-SwiftDriver -- /Applications/Xcode-16.3.0.app/Contents/Developer/Toolchains/XcodeDefault.xctoolchain/usr/bin/swiftc -module-name TestConcurrency -Onone -enforce-exclusivity\=checked @/Users/admin/builder/spi-builder-workspace/.derivedData/Build/Intermediates.noindex/Concurrency.build/Debug/TestConcurrency.build/Objects-normal/arm64/TestConcurrency.SwiftFileList -DSWIFT_PACKAGE -DDEBUG -DXcode -plugin-path /Applications/Xcode-16.3.0.app/Contents/Developer/Toolchains/XcodeDefault.xctoolchain/usr/lib/swift/host/plugins/testing -enable-experimental-feature DebugDescriptionMacro -sdk /Applications/Xcode-16.3.0.app/Contents/Developer/Platforms/MacOSX.platform/Developer/SDKs/MacOSX15.4.sdk -target arm64-apple-macos10.15 -g -module-cache-path /Users/admin/builder/spi-builder-workspace/.derivedData/ModuleCache.noindex -Xfrontend -serialize-debugging-options -profile-coverage-mapping -profile-generate -enable-testing -suppress-warnings -index-store-path /Users/admin/builder/spi-builder-workspace/.derivedData/Index.noindex/DataStore -swift-version 6 -I /Users/admin/builder/spi-builder-workspace/.derivedData/Build/Products/Debug -I /Applications/Xcode-16.3.0.app/Contents/Developer/Platforms/MacOSX.platform/Developer/usr/lib -F /Users/admin/builder/spi-builder-workspace/.derivedData/Build/Products/Debug/PackageFrameworks -F /Users/admin/builder/spi-builder-workspace/.derivedData/Build/Products/Debug -F /Applications/Xcode-16.3.0.app/Contents/Developer/Platforms/MacOSX.platform/Developer/Library/Frameworks -c -j10 -enable-batch-mode -incremental -Xcc -ivfsstatcache -Xcc /Users/admin/builder/spi-builder-workspace/.derivedData/SDKStatCaches.noindex/macosx15.4-24E241-8287b8f5db97e746a1562fbca0c9d29b.sdkstatcache -output-file-map /Users/admin/builder/spi-builder-workspace/.derivedData/Build/Intermediates.noindex/Concurrency.build/Debug/TestConcurrency.build/Objects-normal/arm64/TestConcurrency-OutputFileMap.json -use-frontend-parseable-output -save-temps -no-color-diagnostics -serialize-diagnostics -emit-dependencies -emit-module -emit-module-path /Users/admin/builder/spi-builder-workspace/.derivedData/Build/Intermediates.noindex/Concurrency.build/Debug/TestConcurrency.build/Objects-normal/arm64/TestConcurrency.swiftmodule -user-module-version 0.2.0 -validate-clang-modules-once -clang-build-session-file /Users/admin/builder/spi-builder-workspace/.derivedData/ModuleCache.noindex/Session.modulevalidation -package-name concurrency -Xcc -I/Users/admin/builder/spi-builder-workspace/.derivedData/Build/Intermediates.noindex/Concurrency.build/Debug/TestConcurrency.build/swift-overrides.hmap -emit-const-values -Xfrontend -const-gather-protocols-file -Xfrontend /Users/admin/builder/spi-builder-workspace/.derivedData/Build/Intermediates.noindex/Concurrency.build/Debug/TestConcurrency.build/Objects-normal/arm64/TestConcurrency_const_extract_protocols.json -Xcc -I/Users/admin/builder/spi-builder-workspace/.derivedData/Build/Products/Debug/include -Xcc -I/Users/admin/builder/spi-builder-workspace/.derivedData/Build/Intermediates.noindex/Concurrency.build/Debug/TestConcurrency.build/DerivedSources-normal/arm64 -Xcc -I/Users/admin/builder/spi-builder-workspace/.derivedData/Build/Intermediates.noindex/Concurrency.build/Debug/TestConcurrency.build/DerivedSources/arm64 -Xcc -I/Users/admin/builder/spi-builder-workspace/.derivedData/Build/Intermediates.noindex/Concurrency.build/Debug/TestConcurrency.build/DerivedSources -Xcc -DSWIFT_PACKAGE -Xcc -DDEBUG\=1 -emit-objc-header -emit-objc-header-path /Users/admin/builder/spi-builder-workspace/.derivedData/Build/Intermediates.noindex/Concurrency.build/Debug/TestConcurrency.build/Objects-normal/arm64/TestConcurrency-Swift.h -working-directory /Users/admin/builder/spi-builder-workspace/.swiftpm/xcode -experimental-emit-module-separately -disable-cmo
SwiftDriverJobDiscovery normal arm64 Compiling LogLevel.swift (in target 'Log' from project 'Log')
SwiftCompile normal arm64 Compiling\ ITaskFactory.swift /Users/admin/builder/spi-builder-workspace/.dependencies/checkouts/concurrency/Sources/Concurrency/TaskFactory/ITaskFactory.swift (in target 'Concurrency' from project 'Concurrency')
SwiftCompile normal arm64 /Users/admin/builder/spi-builder-workspace/.dependencies/checkouts/concurrency/Sources/Concurrency/TaskFactory/ITaskFactory.swift (in target 'Concurrency' from project 'Concurrency')
    cd /Users/admin/builder/spi-builder-workspace/.swiftpm/xcode

SwiftEmitModule normal arm64 Emitting\ module\ for\ TestConcurrency (in target 'TestConcurrency' from project 'Concurrency')
EmitSwiftModule normal arm64 (in target 'TestConcurrency' from project 'Concurrency')
    cd /Users/admin/builder/spi-builder-workspace/.swiftpm/xcode

SwiftDriverJobDiscovery normal arm64 Emitting module for SnapshotTesting (in target 'SnapshotTesting' from project 'swift-snapshot-testing')
SwiftDriver\ Compilation\ Requirements SnapshotTesting normal arm64 com.apple.xcode.tools.swift.compiler (in target 'SnapshotTesting' from project 'swift-snapshot-testing')
    cd /Users/admin/builder/spi-builder-workspace/.swiftpm/xcode
    builtin-Swift-Compilation-Requirements -- /Applications/Xcode-16.3.0.app/Contents/Developer/Toolchains/XcodeDefault.xctoolchain/usr/bin/swiftc -module-name SnapshotTesting -Onone -enforce-exclusivity\=checked @/Users/admin/builder/spi-builder-workspace/.derivedData/Build/Intermediates.noindex/swift-snapshot-testing.build/Debug/SnapshotTesting.build/Objects-normal/arm64/SnapshotTesting.SwiftFileList -DSWIFT_PACKAGE -DDEBUG -DXcode -plugin-path /Applications/Xcode-16.3.0.app/Contents/Developer/Toolchains/XcodeDefault.xctoolchain/usr/lib/swift/host/plugins/testing -enable-experimental-feature DebugDescriptionMacro -sdk /Applications/Xcode-16.3.0.app/Contents/Developer/Platforms/MacOSX.platform/Developer/SDKs/MacOSX15.4.sdk -target arm64-apple-macos10.15 -g -module-cache-path /Users/admin/builder/spi-builder-workspace/.derivedData/ModuleCache.noindex -Xfrontend -serialize-debugging-options -profile-coverage-mapping -profile-generate -enable-testing -suppress-warnings -index-store-path /Users/admin/builder/spi-builder-workspace/.derivedData/Index.noindex/DataStore -swift-version 5 -I /Users/admin/builder/spi-builder-workspace/.derivedData/Build/Products/Debug -I /Applications/Xcode-16.3.0.app/Contents/Developer/Platforms/MacOSX.platform/Developer/usr/lib -F /Users/admin/builder/spi-builder-workspace/.derivedData/Build/Products/Debug -F /Applications/Xcode-16.3.0.app/Contents/Developer/Platforms/MacOSX.platform/Developer/Library/Frameworks -c -j10 -enable-batch-mode -incremental -Xcc -ivfsstatcache -Xcc /Users/admin/builder/spi-builder-workspace/.derivedData/SDKStatCaches.noindex/macosx15.4-24E241-8287b8f5db97e746a1562fbca0c9d29b.sdkstatcache -output-file-map /Users/admin/builder/spi-builder-workspace/.derivedData/Build/Intermediates.noindex/swift-snapshot-testing.build/Debug/SnapshotTesting.build/Objects-normal/arm64/SnapshotTesting-OutputFileMap.json -use-frontend-parseable-output -save-temps -no-color-diagnostics -serialize-diagnostics -emit-dependencies -emit-module -emit-module-path /Users/admin/builder/spi-builder-workspace/.derivedData/Build/Intermediates.noindex/swift-snapshot-testing.build/Debug/SnapshotTesting.build/Objects-normal/arm64/SnapshotTesting.swiftmodule -user-module-version 1.18.3 -validate-clang-modules-once -clang-build-session-file /Users/admin/builder/spi-builder-workspace/.derivedData/ModuleCache.noindex/Session.modulevalidation -package-name swift_snapshot_testing -Xcc -I/Users/admin/builder/spi-builder-workspace/.derivedData/Build/Intermediates.noindex/swift-snapshot-testing.build/Debug/SnapshotTesting.build/swift-overrides.hmap -emit-const-values -Xfrontend -const-gather-protocols-file -Xfrontend /Users/admin/builder/spi-builder-workspace/.derivedData/Build/Intermediates.noindex/swift-snapshot-testing.build/Debug/SnapshotTesting.build/Objects-normal/arm64/SnapshotTesting_const_extract_protocols.json -Xcc -I/Users/admin/builder/spi-builder-workspace/.derivedData/Build/Products/Debug/include -Xcc -I/Users/admin/builder/spi-builder-workspace/.derivedData/Build/Intermediates.noindex/swift-snapshot-testing.build/Debug/SnapshotTesting.build/DerivedSources-normal/arm64 -Xcc -I/Users/admin/builder/spi-builder-workspace/.derivedData/Build/Intermediates.noindex/swift-snapshot-testing.build/Debug/SnapshotTesting.build/DerivedSources/arm64 -Xcc -I/Users/admin/builder/spi-builder-workspace/.derivedData/Build/Intermediates.noindex/swift-snapshot-testing.build/Debug/SnapshotTesting.build/DerivedSources -Xcc -DSWIFT_PACKAGE -Xcc -DDEBUG\=1 -emit-objc-header -emit-objc-header-path /Users/admin/builder/spi-builder-workspace/.derivedData/Build/Intermediates.noindex/swift-snapshot-testing.build/Debug/SnapshotTesting.build/Objects-normal/arm64/SnapshotTesting-Swift.h -working-directory /Users/admin/builder/spi-builder-workspace/.swiftpm/xcode -experimental-emit-module-separately -disable-cmo
SwiftDriverJobDiscovery normal arm64 Compiling Atomic.swift, ConsoleWriter.swift (in target 'Log' from project 'Log')
SwiftCompile normal arm64 Compiling\ TestDispatchQueueFactory.swift /Users/admin/builder/spi-builder-workspace/.dependencies/checkouts/concurrency/Sources/TestConcurrency/TestDispatchQueueFactory.swift (in target 'TestConcurrency' from project 'Concurrency')
SwiftCompile normal arm64 /Users/admin/builder/spi-builder-workspace/.dependencies/checkouts/concurrency/Sources/TestConcurrency/TestDispatchQueueFactory.swift (in target 'TestConcurrency' from project 'Concurrency')
    cd /Users/admin/builder/spi-builder-workspace/.swiftpm/xcode

SwiftCompile normal arm64 Compiling\ Task.swift /Users/admin/builder/spi-builder-workspace/.dependencies/checkouts/concurrency/Sources/TestConcurrency/Task.swift (in target 'TestConcurrency' from project 'Concurrency')
SwiftCompile normal arm64 /Users/admin/builder/spi-builder-workspace/.dependencies/checkouts/concurrency/Sources/TestConcurrency/Task.swift (in target 'TestConcurrency' from project 'Concurrency')
    cd /Users/admin/builder/spi-builder-workspace/.swiftpm/xcode

SwiftDriverJobDiscovery normal arm64 Compiling IPrinter.swift, OSPrinter.swift (in target 'Log' from project 'Log')
Copy /Users/admin/builder/spi-builder-workspace/.derivedData/Build/Products/Debug/SnapshotTesting.swiftmodule/arm64-apple-macos.abi.json /Users/admin/builder/spi-builder-workspace/.derivedData/Build/Intermediates.noindex/swift-snapshot-testing.build/Debug/SnapshotTesting.build/Objects-normal/arm64/SnapshotTesting.abi.json (in target 'SnapshotTesting' from project 'swift-snapshot-testing')
    cd /Users/admin/builder/spi-builder-workspace/.dependencies/checkouts/swift-snapshot-testing
    builtin-copy -exclude .DS_Store -exclude CVS -exclude .svn -exclude .git -exclude .hg -resolve-src-symlinks -rename /Users/admin/builder/spi-builder-workspace/.derivedData/Build/Intermediates.noindex/swift-snapshot-testing.build/Debug/SnapshotTesting.build/Objects-normal/arm64/SnapshotTesting.abi.json /Users/admin/builder/spi-builder-workspace/.derivedData/Build/Products/Debug/SnapshotTesting.swiftmodule/arm64-apple-macos.abi.json
SwiftDriverJobDiscovery normal arm64 Compiling IDispatchQueueFactory.swift (in target 'Concurrency' from project 'Concurrency')
SwiftCompile normal arm64 Compiling\ TestDispatchQueue.swift /Users/admin/builder/spi-builder-workspace/.dependencies/checkouts/concurrency/Sources/TestConcurrency/TestDispatchQueue.swift (in target 'TestConcurrency' from project 'Concurrency')
SwiftCompile normal arm64 /Users/admin/builder/spi-builder-workspace/.dependencies/checkouts/concurrency/Sources/TestConcurrency/TestDispatchQueue.swift (in target 'TestConcurrency' from project 'Concurrency')
    cd /Users/admin/builder/spi-builder-workspace/.swiftpm/xcode

SwiftCompile normal arm64 Compiling\ TestTaskFactory.swift /Users/admin/builder/spi-builder-workspace/.dependencies/checkouts/concurrency/Sources/TestConcurrency/TestTaskFactory.swift (in target 'TestConcurrency' from project 'Concurrency')
SwiftCompile normal arm64 /Users/admin/builder/spi-builder-workspace/.dependencies/checkouts/concurrency/Sources/TestConcurrency/TestTaskFactory.swift (in target 'TestConcurrency' from project 'Concurrency')
    cd /Users/admin/builder/spi-builder-workspace/.swiftpm/xcode

SwiftDriverJobDiscovery normal arm64 Compiling ILogFormatter.swift, PrefixLogFormatter.swift (in target 'Log' from project 'Log')
SwiftDriver\ Compilation Atomic normal arm64 com.apple.xcode.tools.swift.compiler (in target 'Atomic' from project 'Atomic')
    cd /Users/admin/builder/spi-builder-workspace/.swiftpm/xcode
    builtin-Swift-Compilation -- /Applications/Xcode-16.3.0.app/Contents/Developer/Toolchains/XcodeDefault.xctoolchain/usr/bin/swiftc -module-name Atomic -Onone -enforce-exclusivity\=checked @/Users/admin/builder/spi-builder-workspace/.derivedData/Build/Intermediates.noindex/Atomic.build/Debug/Atomic.build/Objects-normal/arm64/Atomic.SwiftFileList -DSWIFT_PACKAGE -DDEBUG -DXcode -plugin-path /Applications/Xcode-16.3.0.app/Contents/Developer/Toolchains/XcodeDefault.xctoolchain/usr/lib/swift/host/plugins/testing -enable-experimental-feature DebugDescriptionMacro -sdk /Applications/Xcode-16.3.0.app/Contents/Developer/Platforms/MacOSX.platform/Developer/SDKs/MacOSX15.4.sdk -target arm64-apple-macos10.15 -g -module-cache-path /Users/admin/builder/spi-builder-workspace/.derivedData/ModuleCache.noindex -Xfrontend -serialize-debugging-options -profile-coverage-mapping -profile-generate -enable-testing -suppress-warnings -index-store-path /Users/admin/builder/spi-builder-workspace/.derivedData/Index.noindex/DataStore -swift-version 6 -I /Users/admin/builder/spi-builder-workspace/.derivedData/Build/Products/Debug -I /Applications/Xcode-16.3.0.app/Contents/Developer/Platforms/MacOSX.platform/Developer/usr/lib -F /Users/admin/builder/spi-builder-workspace/.derivedData/Build/Products/Debug -F /Applications/Xcode-16.3.0.app/Contents/Developer/Platforms/MacOSX.platform/Developer/Library/Frameworks -c -j10 -enable-batch-mode -incremental -Xcc -ivfsstatcache -Xcc /Users/admin/builder/spi-builder-workspace/.derivedData/SDKStatCaches.noindex/macosx15.4-24E241-8287b8f5db97e746a1562fbca0c9d29b.sdkstatcache -output-file-map /Users/admin/builder/spi-builder-workspace/.derivedData/Build/Intermediates.noindex/Atomic.build/Debug/Atomic.build/Objects-normal/arm64/Atomic-OutputFileMap.json -use-frontend-parseable-output -save-temps -no-color-diagnostics -serialize-diagnostics -emit-dependencies -emit-module -emit-module-path /Users/admin/builder/spi-builder-workspace/.derivedData/Build/Intermediates.noindex/Atomic.build/Debug/Atomic.build/Objects-normal/arm64/Atomic.swiftmodule -user-module-version 1.1.0 -validate-clang-modules-once -clang-build-session-file /Users/admin/builder/spi-builder-workspace/.derivedData/ModuleCache.noindex/Session.modulevalidation -package-name atomic -Xcc -I/Users/admin/builder/spi-builder-workspace/.derivedData/Build/Intermediates.noindex/Atomic.build/Debug/Atomic.build/swift-overrides.hmap -emit-const-values -Xfrontend -const-gather-protocols-file -Xfrontend /Users/admin/builder/spi-builder-workspace/.derivedData/Build/Intermediates.noindex/Atomic.build/Debug/Atomic.build/Objects-normal/arm64/Atomic_const_extract_protocols.json -Xcc -I/Users/admin/builder/spi-builder-workspace/.derivedData/Build/Products/Debug/include -Xcc -I/Users/admin/builder/spi-builder-workspace/.derivedData/Build/Intermediates.noindex/Atomic.build/Debug/Atomic.build/DerivedSources-normal/arm64 -Xcc -I/Users/admin/builder/spi-builder-workspace/.derivedData/Build/Intermediates.noindex/Atomic.build/Debug/Atomic.build/DerivedSources/arm64 -Xcc -I/Users/admin/builder/spi-builder-workspace/.derivedData/Build/Intermediates.noindex/Atomic.build/Debug/Atomic.build/DerivedSources -Xcc -DSWIFT_PACKAGE -Xcc -DDEBUG\=1 -emit-objc-header -emit-objc-header-path /Users/admin/builder/spi-builder-workspace/.derivedData/Build/Intermediates.noindex/Atomic.build/Debug/Atomic.build/Objects-normal/arm64/Atomic-Swift.h -working-directory /Users/admin/builder/spi-builder-workspace/.swiftpm/xcode -experimental-emit-module-separately -disable-cmo
SwiftDriverJobDiscovery normal arm64 Compiling Logger.swift, IPrinterStrategy.swift (in target 'Log' from project 'Log')
SwiftDriverJobDiscovery normal arm64 Compiling ITaskFactory.swift (in target 'Concurrency' from project 'Concurrency')
SwiftDriver Flare normal arm64 com.apple.xcode.tools.swift.compiler (in target 'Flare' from project 'Flare')
    cd /Users/admin/builder/spi-builder-workspace/.swiftpm/xcode
    builtin-SwiftDriver -- /Applications/Xcode-16.3.0.app/Contents/Developer/Toolchains/XcodeDefault.xctoolchain/usr/bin/swiftc -module-name Flare -Onone -enforce-exclusivity\=checked @/Users/admin/builder/spi-builder-workspace/.derivedData/Build/Intermediates.noindex/Flare.build/Debug/Flare.build/Objects-normal/arm64/Flare.SwiftFileList -DSWIFT_PACKAGE -DDEBUG -DXcode -plugin-path /Applications/Xcode-16.3.0.app/Contents/Developer/Toolchains/XcodeDefault.xctoolchain/usr/lib/swift/host/plugins/testing -enable-experimental-feature DebugDescriptionMacro -sdk /Applications/Xcode-16.3.0.app/Contents/Developer/Platforms/MacOSX.platform/Developer/SDKs/MacOSX15.4.sdk -target arm64-apple-macos10.15 -g -module-cache-path /Users/admin/builder/spi-builder-workspace/.derivedData/ModuleCache.noindex -Xfrontend -serialize-debugging-options -profile-coverage-mapping -profile-generate -enable-testing -index-store-path /Users/admin/builder/spi-builder-workspace/.derivedData/Index.noindex/DataStore -swift-version 6 -I /Users/admin/builder/spi-builder-workspace/.derivedData/Build/Products/Debug -I /Applications/Xcode-16.3.0.app/Contents/Developer/Platforms/MacOSX.platform/Developer/usr/lib -F /Users/admin/builder/spi-builder-workspace/.derivedData/Build/Products/Debug/PackageFrameworks -F /Users/admin/builder/spi-builder-workspace/.derivedData/Build/Products/Debug/PackageFrameworks -F /Users/admin/builder/spi-builder-workspace/.derivedData/Build/Products/Debug/PackageFrameworks -F /Users/admin/builder/spi-builder-workspace/.derivedData/Build/Products/Debug -F /Applications/Xcode-16.3.0.app/Contents/Developer/Platforms/MacOSX.platform/Developer/Library/Frameworks -emit-localized-strings -emit-localized-strings-path /Users/admin/builder/spi-builder-workspace/.derivedData/Build/Intermediates.noindex/Flare.build/Debug/Flare.build/Objects-normal/arm64 -c -j10 -enable-batch-mode -incremental -Xcc -ivfsstatcache -Xcc /Users/admin/builder/spi-builder-workspace/.derivedData/SDKStatCaches.noindex/macosx15.4-24E241-8287b8f5db97e746a1562fbca0c9d29b.sdkstatcache -output-file-map /Users/admin/builder/spi-builder-workspace/.derivedData/Build/Intermediates.noindex/Flare.build/Debug/Flare.build/Objects-normal/arm64/Flare-OutputFileMap.json -use-frontend-parseable-output -save-temps -no-color-diagnostics -serialize-diagnostics -emit-dependencies -emit-module -emit-module-path /Users/admin/builder/spi-builder-workspace/.derivedData/Build/Intermediates.noindex/Flare.build/Debug/Flare.build/Objects-normal/arm64/Flare.swiftmodule -validate-clang-modules-once -clang-build-session-file /Users/admin/builder/spi-builder-workspace/.derivedData/ModuleCache.noindex/Session.modulevalidation -package-name spi_builder_workspace -Xcc -I/Users/admin/builder/spi-builder-workspace/.derivedData/Build/Intermediates.noindex/Flare.build/Debug/Flare.build/swift-overrides.hmap -emit-const-values -Xfrontend -const-gather-protocols-file -Xfrontend /Users/admin/builder/spi-builder-workspace/.derivedData/Build/Intermediates.noindex/Flare.build/Debug/Flare.build/Objects-normal/arm64/Flare_const_extract_protocols.json -Xcc -I/Users/admin/builder/spi-builder-workspace/.derivedData/Build/Products/Debug/include -Xcc -I/Users/admin/builder/spi-builder-workspace/.derivedData/Build/Intermediates.noindex/Flare.build/Debug/Flare.build/DerivedSources-normal/arm64 -Xcc -I/Users/admin/builder/spi-builder-workspace/.derivedData/Build/Intermediates.noindex/Flare.build/Debug/Flare.build/DerivedSources/arm64 -Xcc -I/Users/admin/builder/spi-builder-workspace/.derivedData/Build/Intermediates.noindex/Flare.build/Debug/Flare.build/DerivedSources -Xcc -DSWIFT_PACKAGE -Xcc -DDEBUG\=1 -emit-objc-header -emit-objc-header-path /Users/admin/builder/spi-builder-workspace/.derivedData/Build/Intermediates.noindex/Flare.build/Debug/Flare.build/Objects-normal/arm64/Flare-Swift.h -working-directory /Users/admin/builder/spi-builder-workspace/.swiftpm/xcode -experimental-emit-module-separately -disable-cmo
SwiftDriver\ Compilation Concurrency normal arm64 com.apple.xcode.tools.swift.compiler (in target 'Concurrency' from project 'Concurrency')
    cd /Users/admin/builder/spi-builder-workspace/.swiftpm/xcode
    builtin-Swift-Compilation -- /Applications/Xcode-16.3.0.app/Contents/Developer/Toolchains/XcodeDefault.xctoolchain/usr/bin/swiftc -module-name Concurrency -Onone -enforce-exclusivity\=checked @/Users/admin/builder/spi-builder-workspace/.derivedData/Build/Intermediates.noindex/Concurrency.build/Debug/Concurrency.build/Objects-normal/arm64/Concurrency.SwiftFileList -DSWIFT_PACKAGE -DDEBUG -DXcode -plugin-path /Applications/Xcode-16.3.0.app/Contents/Developer/Toolchains/XcodeDefault.xctoolchain/usr/lib/swift/host/plugins/testing -enable-experimental-feature DebugDescriptionMacro -sdk /Applications/Xcode-16.3.0.app/Contents/Developer/Platforms/MacOSX.platform/Developer/SDKs/MacOSX15.4.sdk -target arm64-apple-macos10.15 -g -module-cache-path /Users/admin/builder/spi-builder-workspace/.derivedData/ModuleCache.noindex -Xfrontend -serialize-debugging-options -profile-coverage-mapping -profile-generate -enable-testing -suppress-warnings -index-store-path /Users/admin/builder/spi-builder-workspace/.derivedData/Index.noindex/DataStore -swift-version 6 -I /Users/admin/builder/spi-builder-workspace/.derivedData/Build/Products/Debug -I /Applications/Xcode-16.3.0.app/Contents/Developer/Platforms/MacOSX.platform/Developer/usr/lib -F /Users/admin/builder/spi-builder-workspace/.derivedData/Build/Products/Debug -F /Applications/Xcode-16.3.0.app/Contents/Developer/Platforms/MacOSX.platform/Developer/Library/Frameworks -c -j10 -enable-batch-mode -incremental -Xcc -ivfsstatcache -Xcc /Users/admin/builder/spi-builder-workspace/.derivedData/SDKStatCaches.noindex/macosx15.4-24E241-8287b8f5db97e746a1562fbca0c9d29b.sdkstatcache -output-file-map /Users/admin/builder/spi-builder-workspace/.derivedData/Build/Intermediates.noindex/Concurrency.build/Debug/Concurrency.build/Objects-normal/arm64/Concurrency-OutputFileMap.json -use-frontend-parseable-output -save-temps -no-color-diagnostics -serialize-diagnostics -emit-dependencies -emit-module -emit-module-path /Users/admin/builder/spi-builder-workspace/.derivedData/Build/Intermediates.noindex/Concurrency.build/Debug/Concurrency.build/Objects-normal/arm64/Concurrency.swiftmodule -user-module-version 0.2.0 -validate-clang-modules-once -clang-build-session-file /Users/admin/builder/spi-builder-workspace/.derivedData/ModuleCache.noindex/Session.modulevalidation -package-name concurrency -Xcc -I/Users/admin/builder/spi-builder-workspace/.derivedData/Build/Intermediates.noindex/Concurrency.build/Debug/Concurrency.build/swift-overrides.hmap -emit-const-values -Xfrontend -const-gather-protocols-file -Xfrontend /Users/admin/builder/spi-builder-workspace/.derivedData/Build/Intermediates.noindex/Concurrency.build/Debug/Concurrency.build/Objects-normal/arm64/Concurrency_const_extract_protocols.json -Xcc -I/Users/admin/builder/spi-builder-workspace/.derivedData/Build/Products/Debug/include -Xcc -I/Users/admin/builder/spi-builder-workspace/.derivedData/Build/Intermediates.noindex/Concurrency.build/Debug/Concurrency.build/DerivedSources-normal/arm64 -Xcc -I/Users/admin/builder/spi-builder-workspace/.derivedData/Build/Intermediates.noindex/Concurrency.build/Debug/Concurrency.build/DerivedSources/arm64 -Xcc -I/Users/admin/builder/spi-builder-workspace/.derivedData/Build/Intermediates.noindex/Concurrency.build/Debug/Concurrency.build/DerivedSources -Xcc -DSWIFT_PACKAGE -Xcc -DDEBUG\=1 -emit-objc-header -emit-objc-header-path /Users/admin/builder/spi-builder-workspace/.derivedData/Build/Intermediates.noindex/Concurrency.build/Debug/Concurrency.build/Objects-normal/arm64/Concurrency-Swift.h -working-directory /Users/admin/builder/spi-builder-workspace/.swiftpm/xcode -experimental-emit-module-separately -disable-cmo
SwiftDriverJobDiscovery normal arm64 Compiling IOSWriterStrategy.swift (in target 'Log' from project 'Log')
SwiftDriver\ Compilation Log normal arm64 com.apple.xcode.tools.swift.compiler (in target 'Log' from project 'Log')
    cd /Users/admin/builder/spi-builder-workspace/.swiftpm/xcode
    builtin-Swift-Compilation -- /Applications/Xcode-16.3.0.app/Contents/Developer/Toolchains/XcodeDefault.xctoolchain/usr/bin/swiftc -module-name Log -Onone -enforce-exclusivity\=checked @/Users/admin/builder/spi-builder-workspace/.derivedData/Build/Intermediates.noindex/Log.build/Debug/Log.build/Objects-normal/arm64/Log.SwiftFileList -DSWIFT_PACKAGE -DDEBUG -DXcode -plugin-path /Applications/Xcode-16.3.0.app/Contents/Developer/Toolchains/XcodeDefault.xctoolchain/usr/lib/swift/host/plugins/testing -enable-experimental-feature DebugDescriptionMacro -sdk /Applications/Xcode-16.3.0.app/Contents/Developer/Platforms/MacOSX.platform/Developer/SDKs/MacOSX15.4.sdk -target arm64-apple-macos10.15 -g -module-cache-path /Users/admin/builder/spi-builder-workspace/.derivedData/ModuleCache.noindex -Xfrontend -serialize-debugging-options -profile-coverage-mapping -profile-generate -enable-testing -suppress-warnings -index-store-path /Users/admin/builder/spi-builder-workspace/.derivedData/Index.noindex/DataStore -swift-version 6 -I /Users/admin/builder/spi-builder-workspace/.derivedData/Build/Products/Debug -I /Applications/Xcode-16.3.0.app/Contents/Developer/Platforms/MacOSX.platform/Developer/usr/lib -F /Users/admin/builder/spi-builder-workspace/.derivedData/Build/Products/Debug -F /Applications/Xcode-16.3.0.app/Contents/Developer/Platforms/MacOSX.platform/Developer/Library/Frameworks -c -j10 -enable-batch-mode -incremental -Xcc -ivfsstatcache -Xcc /Users/admin/builder/spi-builder-workspace/.derivedData/SDKStatCaches.noindex/macosx15.4-24E241-8287b8f5db97e746a1562fbca0c9d29b.sdkstatcache -output-file-map /Users/admin/builder/spi-builder-workspace/.derivedData/Build/Intermediates.noindex/Log.build/Debug/Log.build/Objects-normal/arm64/Log-OutputFileMap.json -use-frontend-parseable-output -save-temps -no-color-diagnostics -serialize-diagnostics -emit-dependencies -emit-module -emit-module-path /Users/admin/builder/spi-builder-workspace/.derivedData/Build/Intermediates.noindex/Log.build/Debug/Log.build/Objects-normal/arm64/Log.swiftmodule -user-module-version 1.2.0 -validate-clang-modules-once -clang-build-session-file /Users/admin/builder/spi-builder-workspace/.derivedData/ModuleCache.noindex/Session.modulevalidation -package-name log -Xcc -I/Users/admin/builder/spi-builder-workspace/.derivedData/Build/Intermediates.noindex/Log.build/Debug/Log.build/swift-overrides.hmap -emit-const-values -Xfrontend -const-gather-protocols-file -Xfrontend /Users/admin/builder/spi-builder-workspace/.derivedData/Build/Intermediates.noindex/Log.build/Debug/Log.build/Objects-normal/arm64/Log_const_extract_protocols.json -Xcc -I/Users/admin/builder/spi-builder-workspace/.derivedData/Build/Products/Debug/include -Xcc -I/Users/admin/builder/spi-builder-workspace/.derivedData/Build/Intermediates.noindex/Log.build/Debug/Log.build/DerivedSources-normal/arm64 -Xcc -I/Users/admin/builder/spi-builder-workspace/.derivedData/Build/Intermediates.noindex/Log.build/Debug/Log.build/DerivedSources/arm64 -Xcc -I/Users/admin/builder/spi-builder-workspace/.derivedData/Build/Intermediates.noindex/Log.build/Debug/Log.build/DerivedSources -Xcc -DSWIFT_PACKAGE -Xcc -DDEBUG\=1 -emit-objc-header -emit-objc-header-path /Users/admin/builder/spi-builder-workspace/.derivedData/Build/Intermediates.noindex/Log.build/Debug/Log.build/Objects-normal/arm64/Log-Swift.h -working-directory /Users/admin/builder/spi-builder-workspace/.swiftpm/xcode -experimental-emit-module-separately -disable-cmo
SwiftDriverJobDiscovery normal arm64 Emitting module for TestConcurrency (in target 'TestConcurrency' from project 'Concurrency')
SwiftDriver\ Compilation\ Requirements TestConcurrency normal arm64 com.apple.xcode.tools.swift.compiler (in target 'TestConcurrency' from project 'Concurrency')
    cd /Users/admin/builder/spi-builder-workspace/.swiftpm/xcode
    builtin-Swift-Compilation-Requirements -- /Applications/Xcode-16.3.0.app/Contents/Developer/Toolchains/XcodeDefault.xctoolchain/usr/bin/swiftc -module-name TestConcurrency -Onone -enforce-exclusivity\=checked @/Users/admin/builder/spi-builder-workspace/.derivedData/Build/Intermediates.noindex/Concurrency.build/Debug/TestConcurrency.build/Objects-normal/arm64/TestConcurrency.SwiftFileList -DSWIFT_PACKAGE -DDEBUG -DXcode -plugin-path /Applications/Xcode-16.3.0.app/Contents/Developer/Toolchains/XcodeDefault.xctoolchain/usr/lib/swift/host/plugins/testing -enable-experimental-feature DebugDescriptionMacro -sdk /Applications/Xcode-16.3.0.app/Contents/Developer/Platforms/MacOSX.platform/Developer/SDKs/MacOSX15.4.sdk -target arm64-apple-macos10.15 -g -module-cache-path /Users/admin/builder/spi-builder-workspace/.derivedData/ModuleCache.noindex -Xfrontend -serialize-debugging-options -profile-coverage-mapping -profile-generate -enable-testing -suppress-warnings -index-store-path /Users/admin/builder/spi-builder-workspace/.derivedData/Index.noindex/DataStore -swift-version 6 -I /Users/admin/builder/spi-builder-workspace/.derivedData/Build/Products/Debug -I /Applications/Xcode-16.3.0.app/Contents/Developer/Platforms/MacOSX.platform/Developer/usr/lib -F /Users/admin/builder/spi-builder-workspace/.derivedData/Build/Products/Debug/PackageFrameworks -F /Users/admin/builder/spi-builder-workspace/.derivedData/Build/Products/Debug -F /Applications/Xcode-16.3.0.app/Contents/Developer/Platforms/MacOSX.platform/Developer/Library/Frameworks -c -j10 -enable-batch-mode -incremental -Xcc -ivfsstatcache -Xcc /Users/admin/builder/spi-builder-workspace/.derivedData/SDKStatCaches.noindex/macosx15.4-24E241-8287b8f5db97e746a1562fbca0c9d29b.sdkstatcache -output-file-map /Users/admin/builder/spi-builder-workspace/.derivedData/Build/Intermediates.noindex/Concurrency.build/Debug/TestConcurrency.build/Objects-normal/arm64/TestConcurrency-OutputFileMap.json -use-frontend-parseable-output -save-temps -no-color-diagnostics -serialize-diagnostics -emit-dependencies -emit-module -emit-module-path /Users/admin/builder/spi-builder-workspace/.derivedData/Build/Intermediates.noindex/Concurrency.build/Debug/TestConcurrency.build/Objects-normal/arm64/TestConcurrency.swiftmodule -user-module-version 0.2.0 -validate-clang-modules-once -clang-build-session-file /Users/admin/builder/spi-builder-workspace/.derivedData/ModuleCache.noindex/Session.modulevalidation -package-name concurrency -Xcc -I/Users/admin/builder/spi-builder-workspace/.derivedData/Build/Intermediates.noindex/Concurrency.build/Debug/TestConcurrency.build/swift-overrides.hmap -emit-const-values -Xfrontend -const-gather-protocols-file -Xfrontend /Users/admin/builder/spi-builder-workspace/.derivedData/Build/Intermediates.noindex/Concurrency.build/Debug/TestConcurrency.build/Objects-normal/arm64/TestConcurrency_const_extract_protocols.json -Xcc -I/Users/admin/builder/spi-builder-workspace/.derivedData/Build/Products/Debug/include -Xcc -I/Users/admin/builder/spi-builder-workspace/.derivedData/Build/Intermediates.noindex/Concurrency.build/Debug/TestConcurrency.build/DerivedSources-normal/arm64 -Xcc -I/Users/admin/builder/spi-builder-workspace/.derivedData/Build/Intermediates.noindex/Concurrency.build/Debug/TestConcurrency.build/DerivedSources/arm64 -Xcc -I/Users/admin/builder/spi-builder-workspace/.derivedData/Build/Intermediates.noindex/Concurrency.build/Debug/TestConcurrency.build/DerivedSources -Xcc -DSWIFT_PACKAGE -Xcc -DDEBUG\=1 -emit-objc-header -emit-objc-header-path /Users/admin/builder/spi-builder-workspace/.derivedData/Build/Intermediates.noindex/Concurrency.build/Debug/TestConcurrency.build/Objects-normal/arm64/TestConcurrency-Swift.h -working-directory /Users/admin/builder/spi-builder-workspace/.swiftpm/xcode -experimental-emit-module-separately -disable-cmo
Copy /Users/admin/builder/spi-builder-workspace/.derivedData/Build/Products/Debug/TestConcurrency.swiftmodule/arm64-apple-macos.abi.json /Users/admin/builder/spi-builder-workspace/.derivedData/Build/Intermediates.noindex/Concurrency.build/Debug/TestConcurrency.build/Objects-normal/arm64/TestConcurrency.abi.json (in target 'TestConcurrency' from project 'Concurrency')
    cd /Users/admin/builder/spi-builder-workspace/.dependencies/checkouts/concurrency
    builtin-copy -exclude .DS_Store -exclude CVS -exclude .svn -exclude .git -exclude .hg -resolve-src-symlinks -rename /Users/admin/builder/spi-builder-workspace/.derivedData/Build/Intermediates.noindex/Concurrency.build/Debug/TestConcurrency.build/Objects-normal/arm64/TestConcurrency.abi.json /Users/admin/builder/spi-builder-workspace/.derivedData/Build/Products/Debug/TestConcurrency.swiftmodule/arm64-apple-macos.abi.json
SwiftDriverJobDiscovery normal arm64 Compiling NSImage.swift, NSView.swift, NSViewController.swift (in target 'SnapshotTesting' from project 'swift-snapshot-testing')
SwiftDriverJobDiscovery normal arm64 Compiling Task.swift (in target 'TestConcurrency' from project 'Concurrency')
SwiftDriverJobDiscovery normal arm64 Compiling TestDispatchQueueFactory.swift (in target 'TestConcurrency' from project 'Concurrency')
SwiftCompile normal arm64 Compiling\ IAPError.swift,\ ProductsRequest.swift,\ IRenewalInfo.swift,\ ISKProduct.swift,\ ISKRequest.swift,\ IStorePayment.swift,\ IStoreProductDiscount.swift,\ IStoreTransaction.swift,\ ISubscriptionInfo.swift,\ ISubscriptionInfoStatus.swift,\ SK1StorePayment.swift /Users/admin/builder/spi-builder-workspace/Sources/Flare/Classes/Models/IAPError.swift /Users/admin/builder/spi-builder-workspace/Sources/Flare/Classes/Models/Internal/ProductsRequest.swift /Users/admin/builder/spi-builder-workspace/Sources/Flare/Classes/Models/Internal/Protocols/IRenewalInfo.swift /Users/admin/builder/spi-builder-workspace/Sources/Flare/Classes/Models/Internal/Protocols/ISKProduct.swift /Users/admin/builder/spi-builder-workspace/Sources/Flare/Classes/Models/Internal/Protocols/ISKRequest.swift /Users/admin/builder/spi-builder-workspace/Sources/Flare/Classes/Models/Internal/Protocols/IStorePayment.swift /Users/admin/builder/spi-builder-workspace/Sources/Flare/Classes/Models/Internal/Protocols/IStoreProductDiscount.swift /Users/admin/builder/spi-builder-workspace/Sources/Flare/Classes/Models/Internal/Protocols/IStoreTransaction.swift /Users/admin/builder/spi-builder-workspace/Sources/Flare/Classes/Models/Internal/Protocols/ISubscriptionInfo.swift /Users/admin/builder/spi-builder-workspace/Sources/Flare/Classes/Models/Internal/Protocols/ISubscriptionInfoStatus.swift /Users/admin/builder/spi-builder-workspace/Sources/Flare/Classes/Models/Internal/SK1StorePayment.swift (in target 'Flare' from project 'Flare')
SwiftCompile normal arm64 /Users/admin/builder/spi-builder-workspace/Sources/Flare/Classes/Models/IAPError.swift (in target 'Flare' from project 'Flare')
    cd /Users/admin/builder/spi-builder-workspace/.swiftpm/xcode

SwiftCompile normal arm64 /Users/admin/builder/spi-builder-workspace/Sources/Flare/Classes/Models/Internal/ProductsRequest.swift (in target 'Flare' from project 'Flare')
    cd /Users/admin/builder/spi-builder-workspace/.swiftpm/xcode

SwiftCompile normal arm64 /Users/admin/builder/spi-builder-workspace/Sources/Flare/Classes/Models/Internal/Protocols/IRenewalInfo.swift (in target 'Flare' from project 'Flare')
    cd /Users/admin/builder/spi-builder-workspace/.swiftpm/xcode

SwiftCompile normal arm64 /Users/admin/builder/spi-builder-workspace/Sources/Flare/Classes/Models/Internal/Protocols/ISKProduct.swift (in target 'Flare' from project 'Flare')
    cd /Users/admin/builder/spi-builder-workspace/.swiftpm/xcode

SwiftCompile normal arm64 /Users/admin/builder/spi-builder-workspace/Sources/Flare/Classes/Models/Internal/Protocols/ISKRequest.swift (in target 'Flare' from project 'Flare')
    cd /Users/admin/builder/spi-builder-workspace/.swiftpm/xcode

SwiftCompile normal arm64 /Users/admin/builder/spi-builder-workspace/Sources/Flare/Classes/Models/Internal/Protocols/IStorePayment.swift (in target 'Flare' from project 'Flare')
    cd /Users/admin/builder/spi-builder-workspace/.swiftpm/xcode

SwiftCompile normal arm64 /Users/admin/builder/spi-builder-workspace/Sources/Flare/Classes/Models/Internal/Protocols/IStoreProductDiscount.swift (in target 'Flare' from project 'Flare')
    cd /Users/admin/builder/spi-builder-workspace/.swiftpm/xcode

SwiftCompile normal arm64 /Users/admin/builder/spi-builder-workspace/Sources/Flare/Classes/Models/Internal/Protocols/IStoreTransaction.swift (in target 'Flare' from project 'Flare')
    cd /Users/admin/builder/spi-builder-workspace/.swiftpm/xcode

SwiftCompile normal arm64 /Users/admin/builder/spi-builder-workspace/Sources/Flare/Classes/Models/Internal/Protocols/ISubscriptionInfo.swift (in target 'Flare' from project 'Flare')
    cd /Users/admin/builder/spi-builder-workspace/.swiftpm/xcode

SwiftCompile normal arm64 /Users/admin/builder/spi-builder-workspace/Sources/Flare/Classes/Models/Internal/Protocols/ISubscriptionInfoStatus.swift (in target 'Flare' from project 'Flare')
    cd /Users/admin/builder/spi-builder-workspace/.swiftpm/xcode

SwiftCompile normal arm64 /Users/admin/builder/spi-builder-workspace/Sources/Flare/Classes/Models/Internal/SK1StorePayment.swift (in target 'Flare' from project 'Flare')
    cd /Users/admin/builder/spi-builder-workspace/.swiftpm/xcode

SwiftCompile normal arm64 Compiling\ resource_bundle_accessor.swift,\ Logger.swift,\ Types.swift,\ FlareDependencies.swift,\ IFlareDependencies.swift,\ Bundle+IAppStoreReceiptProvider.swift,\ FileManager+IFileManager.swift,\ NumberFormatter+.swift,\ Locale+CurrencyCode.swift,\ Product.SubscriptionInfo.Status+ISubscriptionInfoStatus.swift,\ ProductType+.swift /Users/admin/builder/spi-builder-workspace/.derivedData/Build/Intermediates.noindex/Flare.build/Debug/Flare.build/DerivedSources/resource_bundle_accessor.swift /Users/admin/builder/spi-builder-workspace/Sources/Flare/Classes/Common/Logger.swift /Users/admin/builder/spi-builder-workspace/Sources/Flare/Classes/Common/Types.swift /Users/admin/builder/spi-builder-workspace/Sources/Flare/Classes/DI/FlareDependencies.swift /Users/admin/builder/spi-builder-workspace/Sources/Flare/Classes/DI/IFlareDependencies.swift /Users/admin/builder/spi-builder-workspace/Sources/Flare/Classes/Extensions/Bundle+IAppStoreReceiptProvider.swift /Users/admin/builder/spi-builder-workspace/Sources/Flare/Classes/Extensions/FileManager+IFileManager.swift /Users/admin/builder/spi-builder-workspace/Sources/Flare/Classes/Extensions/Formatters/NumberFormatter+.swift /Users/admin/builder/spi-builder-workspace/Sources/Flare/Classes/Extensions/Locale/Locale+CurrencyCode.swift /Users/admin/builder/spi-builder-workspace/Sources/Flare/Classes/Extensions/Product.SubscriptionInfo.Status+ISubscriptionInfoStatus.swift /Users/admin/builder/spi-builder-workspace/Sources/Flare/Classes/Extensions/ProductType+.swift (in target 'Flare' from project 'Flare')
SwiftCompile normal arm64 /Users/admin/builder/spi-builder-workspace/.derivedData/Build/Intermediates.noindex/Flare.build/Debug/Flare.build/DerivedSources/resource_bundle_accessor.swift (in target 'Flare' from project 'Flare')
    cd /Users/admin/builder/spi-builder-workspace/.swiftpm/xcode

SwiftCompile normal arm64 /Users/admin/builder/spi-builder-workspace/Sources/Flare/Classes/Common/Logger.swift (in target 'Flare' from project 'Flare')
    cd /Users/admin/builder/spi-builder-workspace/.swiftpm/xcode

SwiftCompile normal arm64 /Users/admin/builder/spi-builder-workspace/Sources/Flare/Classes/Common/Types.swift (in target 'Flare' from project 'Flare')
    cd /Users/admin/builder/spi-builder-workspace/.swiftpm/xcode

SwiftCompile normal arm64 /Users/admin/builder/spi-builder-workspace/Sources/Flare/Classes/DI/FlareDependencies.swift (in target 'Flare' from project 'Flare')
    cd /Users/admin/builder/spi-builder-workspace/.swiftpm/xcode

SwiftCompile normal arm64 /Users/admin/builder/spi-builder-workspace/Sources/Flare/Classes/DI/IFlareDependencies.swift (in target 'Flare' from project 'Flare')
    cd /Users/admin/builder/spi-builder-workspace/.swiftpm/xcode

SwiftCompile normal arm64 /Users/admin/builder/spi-builder-workspace/Sources/Flare/Classes/Extensions/Bundle+IAppStoreReceiptProvider.swift (in target 'Flare' from project 'Flare')
    cd /Users/admin/builder/spi-builder-workspace/.swiftpm/xcode

SwiftCompile normal arm64 /Users/admin/builder/spi-builder-workspace/Sources/Flare/Classes/Extensions/FileManager+IFileManager.swift (in target 'Flare' from project 'Flare')
    cd /Users/admin/builder/spi-builder-workspace/.swiftpm/xcode

SwiftCompile normal arm64 /Users/admin/builder/spi-builder-workspace/Sources/Flare/Classes/Extensions/Formatters/NumberFormatter+.swift (in target 'Flare' from project 'Flare')
    cd /Users/admin/builder/spi-builder-workspace/.swiftpm/xcode

SwiftCompile normal arm64 /Users/admin/builder/spi-builder-workspace/Sources/Flare/Classes/Extensions/Locale/Locale+CurrencyCode.swift (in target 'Flare' from project 'Flare')
    cd /Users/admin/builder/spi-builder-workspace/.swiftpm/xcode

SwiftCompile normal arm64 /Users/admin/builder/spi-builder-workspace/Sources/Flare/Classes/Extensions/Product.SubscriptionInfo.Status+ISubscriptionInfoStatus.swift (in target 'Flare' from project 'Flare')
    cd /Users/admin/builder/spi-builder-workspace/.swiftpm/xcode

SwiftCompile normal arm64 /Users/admin/builder/spi-builder-workspace/Sources/Flare/Classes/Extensions/ProductType+.swift (in target 'Flare' from project 'Flare')
    cd /Users/admin/builder/spi-builder-workspace/.swiftpm/xcode

SwiftCompile normal arm64 Compiling\ SKProduct+.swift,\ SKRequest+IReceiptRefreshRequest.swift,\ SKRequest+Identifier.swift,\ Flare.swift,\ IUserDefaults.swift,\ UserDefaults.swift,\ Strings.swift,\ AsyncHandler.swift,\ IFileManager.swift,\ PaymentQueue.swift,\ SKPaymentQueue+PaymentQueue.swift /Users/admin/builder/spi-builder-workspace/Sources/Flare/Classes/Extensions/SKProduct+.swift /Users/admin/builder/spi-builder-workspace/Sources/Flare/Classes/Extensions/SKRequest+IReceiptRefreshRequest.swift /Users/admin/builder/spi-builder-workspace/Sources/Flare/Classes/Extensions/SKRequest+Identifier.swift /Users/admin/builder/spi-builder-workspace/Sources/Flare/Classes/Flare.swift /Users/admin/builder/spi-builder-workspace/Sources/Flare/Classes/Foundation/UserDefaults/IUserDefaults.swift /Users/admin/builder/spi-builder-workspace/Sources/Flare/Classes/Foundation/UserDefaults/UserDefaults.swift /Users/admin/builder/spi-builder-workspace/Sources/Flare/Classes/Generated/Strings.swift /Users/admin/builder/spi-builder-workspace/Sources/Flare/Classes/Helpers/Async/AsyncHandler.swift /Users/admin/builder/spi-builder-workspace/Sources/Flare/Classes/Helpers/FileManager/IFileManager.swift /Users/admin/builder/spi-builder-workspace/Sources/Flare/Classes/Helpers/PaymentQueue/PaymentQueue.swift /Users/admin/builder/spi-builder-workspace/Sources/Flare/Classes/Helpers/PaymentQueue/SKPaymentQueue+PaymentQueue.swift (in target 'Flare' from project 'Flare')
SwiftCompile normal arm64 /Users/admin/builder/spi-builder-workspace/Sources/Flare/Classes/Extensions/SKProduct+.swift (in target 'Flare' from project 'Flare')
    cd /Users/admin/builder/spi-builder-workspace/.swiftpm/xcode

SwiftCompile normal arm64 /Users/admin/builder/spi-builder-workspace/Sources/Flare/Classes/Extensions/SKRequest+IReceiptRefreshRequest.swift (in target 'Flare' from project 'Flare')
    cd /Users/admin/builder/spi-builder-workspace/.swiftpm/xcode

SwiftCompile normal arm64 /Users/admin/builder/spi-builder-workspace/Sources/Flare/Classes/Extensions/SKRequest+Identifier.swift (in target 'Flare' from project 'Flare')
    cd /Users/admin/builder/spi-builder-workspace/.swiftpm/xcode

SwiftCompile normal arm64 /Users/admin/builder/spi-builder-workspace/Sources/Flare/Classes/Flare.swift (in target 'Flare' from project 'Flare')
    cd /Users/admin/builder/spi-builder-workspace/.swiftpm/xcode

SwiftCompile normal arm64 /Users/admin/builder/spi-builder-workspace/Sources/Flare/Classes/Foundation/UserDefaults/IUserDefaults.swift (in target 'Flare' from project 'Flare')
    cd /Users/admin/builder/spi-builder-workspace/.swiftpm/xcode

SwiftCompile normal arm64 /Users/admin/builder/spi-builder-workspace/Sources/Flare/Classes/Foundation/UserDefaults/UserDefaults.swift (in target 'Flare' from project 'Flare')
    cd /Users/admin/builder/spi-builder-workspace/.swiftpm/xcode

SwiftCompile normal arm64 /Users/admin/builder/spi-builder-workspace/Sources/Flare/Classes/Generated/Strings.swift (in target 'Flare' from project 'Flare')
    cd /Users/admin/builder/spi-builder-workspace/.swiftpm/xcode

SwiftCompile normal arm64 /Users/admin/builder/spi-builder-workspace/Sources/Flare/Classes/Helpers/Async/AsyncHandler.swift (in target 'Flare' from project 'Flare')
    cd /Users/admin/builder/spi-builder-workspace/.swiftpm/xcode

SwiftCompile normal arm64 /Users/admin/builder/spi-builder-workspace/Sources/Flare/Classes/Helpers/FileManager/IFileManager.swift (in target 'Flare' from project 'Flare')
    cd /Users/admin/builder/spi-builder-workspace/.swiftpm/xcode

SwiftCompile normal arm64 /Users/admin/builder/spi-builder-workspace/Sources/Flare/Classes/Helpers/PaymentQueue/PaymentQueue.swift (in target 'Flare' from project 'Flare')
    cd /Users/admin/builder/spi-builder-workspace/.swiftpm/xcode

SwiftCompile normal arm64 /Users/admin/builder/spi-builder-workspace/Sources/Flare/Classes/Helpers/PaymentQueue/SKPaymentQueue+PaymentQueue.swift (in target 'Flare' from project 'Flare')
    cd /Users/admin/builder/spi-builder-workspace/.swiftpm/xcode

SwiftCompile normal arm64 Compiling\ PaymentTransaction.swift,\ ProcessInfo+.swift,\ IScenesHolder.swift,\ IFlare.swift,\ ITransactionListener.swift,\ TransactionListener.swift,\ TransactionListenerDelegate.swift,\ Configuration.swift,\ DiscountType.swift,\ ExpirationReason.swift,\ FetchCachePolicy.swift /Users/admin/builder/spi-builder-workspace/Sources/Flare/Classes/Helpers/PaymentTransaction/PaymentTransaction.swift /Users/admin/builder/spi-builder-workspace/Sources/Flare/Classes/Helpers/ProcessInfo/ProcessInfo+.swift /Users/admin/builder/spi-builder-workspace/Sources/Flare/Classes/Helpers/ScenesHolder/IScenesHolder.swift /Users/admin/builder/spi-builder-workspace/Sources/Flare/Classes/IFlare.swift /Users/admin/builder/spi-builder-workspace/Sources/Flare/Classes/Listeners/TransactionListener/ITransactionListener.swift /Users/admin/builder/spi-builder-workspace/Sources/Flare/Classes/Listeners/TransactionListener/TransactionListener.swift /Users/admin/builder/spi-builder-workspace/Sources/Flare/Classes/Listeners/TransactionListener/TransactionListenerDelegate.swift /Users/admin/builder/spi-builder-workspace/Sources/Flare/Classes/Models/Configuration.swift /Users/admin/builder/spi-builder-workspace/Sources/Flare/Classes/Models/DiscountType.swift /Users/admin/builder/spi-builder-workspace/Sources/Flare/Classes/Models/ExpirationReason.swift /Users/admin/builder/spi-builder-workspace/Sources/Flare/Classes/Models/FetchCachePolicy.swift (in target 'Flare' from project 'Flare')
SwiftCompile normal arm64 /Users/admin/builder/spi-builder-workspace/Sources/Flare/Classes/Helpers/PaymentTransaction/PaymentTransaction.swift (in target 'Flare' from project 'Flare')
    cd /Users/admin/builder/spi-builder-workspace/.swiftpm/xcode

SwiftCompile normal arm64 /Users/admin/builder/spi-builder-workspace/Sources/Flare/Classes/Helpers/ProcessInfo/ProcessInfo+.swift (in target 'Flare' from project 'Flare')
    cd /Users/admin/builder/spi-builder-workspace/.swiftpm/xcode

SwiftCompile normal arm64 /Users/admin/builder/spi-builder-workspace/Sources/Flare/Classes/Helpers/ScenesHolder/IScenesHolder.swift (in target 'Flare' from project 'Flare')
    cd /Users/admin/builder/spi-builder-workspace/.swiftpm/xcode

SwiftCompile normal arm64 /Users/admin/builder/spi-builder-workspace/Sources/Flare/Classes/IFlare.swift (in target 'Flare' from project 'Flare')
    cd /Users/admin/builder/spi-builder-workspace/.swiftpm/xcode

SwiftCompile normal arm64 /Users/admin/builder/spi-builder-workspace/Sources/Flare/Classes/Listeners/TransactionListener/ITransactionListener.swift (in target 'Flare' from project 'Flare')
    cd /Users/admin/builder/spi-builder-workspace/.swiftpm/xcode

SwiftCompile normal arm64 /Users/admin/builder/spi-builder-workspace/Sources/Flare/Classes/Listeners/TransactionListener/TransactionListener.swift (in target 'Flare' from project 'Flare')
    cd /Users/admin/builder/spi-builder-workspace/.swiftpm/xcode

SwiftCompile normal arm64 /Users/admin/builder/spi-builder-workspace/Sources/Flare/Classes/Listeners/TransactionListener/TransactionListenerDelegate.swift (in target 'Flare' from project 'Flare')
    cd /Users/admin/builder/spi-builder-workspace/.swiftpm/xcode

SwiftCompile normal arm64 /Users/admin/builder/spi-builder-workspace/Sources/Flare/Classes/Models/Configuration.swift (in target 'Flare' from project 'Flare')
    cd /Users/admin/builder/spi-builder-workspace/.swiftpm/xcode

SwiftCompile normal arm64 /Users/admin/builder/spi-builder-workspace/Sources/Flare/Classes/Models/DiscountType.swift (in target 'Flare' from project 'Flare')
    cd /Users/admin/builder/spi-builder-workspace/.swiftpm/xcode

SwiftCompile normal arm64 /Users/admin/builder/spi-builder-workspace/Sources/Flare/Classes/Models/ExpirationReason.swift (in target 'Flare' from project 'Flare')
    cd /Users/admin/builder/spi-builder-workspace/.swiftpm/xcode

SwiftCompile normal arm64 /Users/admin/builder/spi-builder-workspace/Sources/Flare/Classes/Models/FetchCachePolicy.swift (in target 'Flare' from project 'Flare')
    cd /Users/admin/builder/spi-builder-workspace/.swiftpm/xcode

SwiftCompile normal arm64 Compiling\ SK1StoreProduct.swift,\ SK1StoreProductDiscount.swift,\ SK1StoreTransaction.swift,\ SK2RenewalInfo.swift,\ SK2StoreProduct.swift,\ SK2StoreProductDiscount.swift,\ SK2StoreTransaction.swift,\ SK2SubscriptionInfo.swift,\ SK2SubscriptionInfoStatus.swift,\ StoreEnvironment.swift /Users/admin/builder/spi-builder-workspace/Sources/Flare/Classes/Models/Internal/SK1StoreProduct.swift /Users/admin/builder/spi-builder-workspace/Sources/Flare/Classes/Models/Internal/SK1StoreProductDiscount.swift /Users/admin/builder/spi-builder-workspace/Sources/Flare/Classes/Models/Internal/SK1StoreTransaction.swift /Users/admin/builder/spi-builder-workspace/Sources/Flare/Classes/Models/Internal/SK2RenewalInfo.swift /Users/admin/builder/spi-builder-workspace/Sources/Flare/Classes/Models/Internal/SK2StoreProduct.swift /Users/admin/builder/spi-builder-workspace/Sources/Flare/Classes/Models/Internal/SK2StoreProductDiscount.swift /Users/admin/builder/spi-builder-workspace/Sources/Flare/Classes/Models/Internal/SK2StoreTransaction.swift /Users/admin/builder/spi-builder-workspace/Sources/Flare/Classes/Models/Internal/SK2SubscriptionInfo.swift /Users/admin/builder/spi-builder-workspace/Sources/Flare/Classes/Models/Internal/SK2SubscriptionInfoStatus.swift /Users/admin/builder/spi-builder-workspace/Sources/Flare/Classes/Models/Internal/StoreEnvironment.swift (in target 'Flare' from project 'Flare')
SwiftCompile normal arm64 /Users/admin/builder/spi-builder-workspace/Sources/Flare/Classes/Models/Internal/SK1StoreProduct.swift (in target 'Flare' from project 'Flare')
    cd /Users/admin/builder/spi-builder-workspace/.swiftpm/xcode

SwiftCompile normal arm64 /Users/admin/builder/spi-builder-workspace/Sources/Flare/Classes/Models/Internal/SK1StoreProductDiscount.swift (in target 'Flare' from project 'Flare')
    cd /Users/admin/builder/spi-builder-workspace/.swiftpm/xcode

SwiftCompile normal arm64 /Users/admin/builder/spi-builder-workspace/Sources/Flare/Classes/Models/Internal/SK1StoreTransaction.swift (in target 'Flare' from project 'Flare')
    cd /Users/admin/builder/spi-builder-workspace/.swiftpm/xcode

SwiftCompile normal arm64 /Users/admin/builder/spi-builder-workspace/Sources/Flare/Classes/Models/Internal/SK2RenewalInfo.swift (in target 'Flare' from project 'Flare')
    cd /Users/admin/builder/spi-builder-workspace/.swiftpm/xcode

SwiftCompile normal arm64 /Users/admin/builder/spi-builder-workspace/Sources/Flare/Classes/Models/Internal/SK2StoreProduct.swift (in target 'Flare' from project 'Flare')
    cd /Users/admin/builder/spi-builder-workspace/.swiftpm/xcode

SwiftCompile normal arm64 /Users/admin/builder/spi-builder-workspace/Sources/Flare/Classes/Models/Internal/SK2StoreProductDiscount.swift (in target 'Flare' from project 'Flare')
    cd /Users/admin/builder/spi-builder-workspace/.swiftpm/xcode

SwiftCompile normal arm64 /Users/admin/builder/spi-builder-workspace/Sources/Flare/Classes/Models/Internal/SK2StoreTransaction.swift (in target 'Flare' from project 'Flare')
    cd /Users/admin/builder/spi-builder-workspace/.swiftpm/xcode

SwiftCompile normal arm64 /Users/admin/builder/spi-builder-workspace/Sources/Flare/Classes/Models/Internal/SK2SubscriptionInfo.swift (in target 'Flare' from project 'Flare')
    cd /Users/admin/builder/spi-builder-workspace/.swiftpm/xcode

SwiftCompile normal arm64 /Users/admin/builder/spi-builder-workspace/Sources/Flare/Classes/Models/Internal/SK2SubscriptionInfoStatus.swift (in target 'Flare' from project 'Flare')
    cd /Users/admin/builder/spi-builder-workspace/.swiftpm/xcode

SwiftCompile normal arm64 /Users/admin/builder/spi-builder-workspace/Sources/Flare/Classes/Models/Internal/StoreEnvironment.swift (in target 'Flare' from project 'Flare')
    cd /Users/admin/builder/spi-builder-workspace/.swiftpm/xcode

SwiftEmitModule normal arm64 Emitting\ module\ for\ Flare (in target 'Flare' from project 'Flare')
EmitSwiftModule normal arm64 (in target 'Flare' from project 'Flare')
    cd /Users/admin/builder/spi-builder-workspace/.swiftpm/xcode

SwiftCompile normal arm64 Compiling\ PaymentMode.swift,\ PriceIncreaseStatus.swift,\ ProductCategory.swift,\ ProductType.swift,\ PromotionalOffer.swift,\ RefundError.swift,\ RefundRequestStatus.swift,\ RenewalInfo.swift,\ RenewalState.swift,\ StoreProduct.swift /Users/admin/builder/spi-builder-workspace/Sources/Flare/Classes/Models/PaymentMode.swift /Users/admin/builder/spi-builder-workspace/Sources/Flare/Classes/Models/PriceIncreaseStatus.swift /Users/admin/builder/spi-builder-workspace/Sources/Flare/Classes/Models/ProductCategory.swift /Users/admin/builder/spi-builder-workspace/Sources/Flare/Classes/Models/ProductType.swift /Users/admin/builder/spi-builder-workspace/Sources/Flare/Classes/Models/PromotionalOffer.swift /Users/admin/builder/spi-builder-workspace/Sources/Flare/Classes/Models/RefundError.swift /Users/admin/builder/spi-builder-workspace/Sources/Flare/Classes/Models/RefundRequestStatus.swift /Users/admin/builder/spi-builder-workspace/Sources/Flare/Classes/Models/RenewalInfo.swift /Users/admin/builder/spi-builder-workspace/Sources/Flare/Classes/Models/RenewalState.swift /Users/admin/builder/spi-builder-workspace/Sources/Flare/Classes/Models/StoreProduct.swift (in target 'Flare' from project 'Flare')
SwiftCompile normal arm64 /Users/admin/builder/spi-builder-workspace/Sources/Flare/Classes/Models/PaymentMode.swift (in target 'Flare' from project 'Flare')
    cd /Users/admin/builder/spi-builder-workspace/.swiftpm/xcode

SwiftCompile normal arm64 /Users/admin/builder/spi-builder-workspace/Sources/Flare/Classes/Models/PriceIncreaseStatus.swift (in target 'Flare' from project 'Flare')
    cd /Users/admin/builder/spi-builder-workspace/.swiftpm/xcode

SwiftCompile normal arm64 /Users/admin/builder/spi-builder-workspace/Sources/Flare/Classes/Models/ProductCategory.swift (in target 'Flare' from project 'Flare')
    cd /Users/admin/builder/spi-builder-workspace/.swiftpm/xcode

SwiftCompile normal arm64 /Users/admin/builder/spi-builder-workspace/Sources/Flare/Classes/Models/ProductType.swift (in target 'Flare' from project 'Flare')
    cd /Users/admin/builder/spi-builder-workspace/.swiftpm/xcode

SwiftCompile normal arm64 /Users/admin/builder/spi-builder-workspace/Sources/Flare/Classes/Models/PromotionalOffer.swift (in target 'Flare' from project 'Flare')
    cd /Users/admin/builder/spi-builder-workspace/.swiftpm/xcode

SwiftCompile normal arm64 /Users/admin/builder/spi-builder-workspace/Sources/Flare/Classes/Models/RefundError.swift (in target 'Flare' from project 'Flare')
    cd /Users/admin/builder/spi-builder-workspace/.swiftpm/xcode

SwiftCompile normal arm64 /Users/admin/builder/spi-builder-workspace/Sources/Flare/Classes/Models/RefundRequestStatus.swift (in target 'Flare' from project 'Flare')
    cd /Users/admin/builder/spi-builder-workspace/.swiftpm/xcode

SwiftCompile normal arm64 /Users/admin/builder/spi-builder-workspace/Sources/Flare/Classes/Models/RenewalInfo.swift (in target 'Flare' from project 'Flare')
    cd /Users/admin/builder/spi-builder-workspace/.swiftpm/xcode

SwiftCompile normal arm64 /Users/admin/builder/spi-builder-workspace/Sources/Flare/Classes/Models/RenewalState.swift (in target 'Flare' from project 'Flare')
    cd /Users/admin/builder/spi-builder-workspace/.swiftpm/xcode

SwiftCompile normal arm64 /Users/admin/builder/spi-builder-workspace/Sources/Flare/Classes/Models/StoreProduct.swift (in target 'Flare' from project 'Flare')
    cd /Users/admin/builder/spi-builder-workspace/.swiftpm/xcode

SwiftCompile normal arm64 Compiling\ ICacheProvider.swift,\ ConfigurationProvider.swift,\ IConfigurationProvider.swift,\ EligibilityProvider.swift,\ IEligibilityProvider.swift,\ IAPProvider.swift,\ IIAPProvider.swift,\ IPaymentProvider.swift,\ PaymentProvider.swift,\ CachingProductsProviderDecorator.swift /Users/admin/builder/spi-builder-workspace/Sources/Flare/Classes/Providers/CacheProvider/ICacheProvider.swift /Users/admin/builder/spi-builder-workspace/Sources/Flare/Classes/Providers/ConfigurationProvider/ConfigurationProvider.swift /Users/admin/builder/spi-builder-workspace/Sources/Flare/Classes/Providers/ConfigurationProvider/IConfigurationProvider.swift /Users/admin/builder/spi-builder-workspace/Sources/Flare/Classes/Providers/EligibilityProvider/EligibilityProvider.swift /Users/admin/builder/spi-builder-workspace/Sources/Flare/Classes/Providers/EligibilityProvider/IEligibilityProvider.swift /Users/admin/builder/spi-builder-workspace/Sources/Flare/Classes/Providers/IAPProvider/IAPProvider.swift /Users/admin/builder/spi-builder-workspace/Sources/Flare/Classes/Providers/IAPProvider/IIAPProvider.swift /Users/admin/builder/spi-builder-workspace/Sources/Flare/Classes/Providers/PaymentProvider/IPaymentProvider.swift /Users/admin/builder/spi-builder-workspace/Sources/Flare/Classes/Providers/PaymentProvider/PaymentProvider.swift /Users/admin/builder/spi-builder-workspace/Sources/Flare/Classes/Providers/ProductProvider/Decorators/CachingProductsProviderDecorator/CachingProductsProviderDecorator.swift (in target 'Flare' from project 'Flare')
SwiftCompile normal arm64 /Users/admin/builder/spi-builder-workspace/Sources/Flare/Classes/Providers/CacheProvider/ICacheProvider.swift (in target 'Flare' from project 'Flare')
    cd /Users/admin/builder/spi-builder-workspace/.swiftpm/xcode

SwiftCompile normal arm64 /Users/admin/builder/spi-builder-workspace/Sources/Flare/Classes/Providers/ConfigurationProvider/ConfigurationProvider.swift (in target 'Flare' from project 'Flare')
    cd /Users/admin/builder/spi-builder-workspace/.swiftpm/xcode

SwiftCompile normal arm64 /Users/admin/builder/spi-builder-workspace/Sources/Flare/Classes/Providers/ConfigurationProvider/IConfigurationProvider.swift (in target 'Flare' from project 'Flare')
    cd /Users/admin/builder/spi-builder-workspace/.swiftpm/xcode

SwiftCompile normal arm64 /Users/admin/builder/spi-builder-workspace/Sources/Flare/Classes/Providers/EligibilityProvider/EligibilityProvider.swift (in target 'Flare' from project 'Flare')
    cd /Users/admin/builder/spi-builder-workspace/.swiftpm/xcode

SwiftCompile normal arm64 /Users/admin/builder/spi-builder-workspace/Sources/Flare/Classes/Providers/EligibilityProvider/IEligibilityProvider.swift (in target 'Flare' from project 'Flare')
    cd /Users/admin/builder/spi-builder-workspace/.swiftpm/xcode

SwiftCompile normal arm64 /Users/admin/builder/spi-builder-workspace/Sources/Flare/Classes/Providers/IAPProvider/IAPProvider.swift (in target 'Flare' from project 'Flare')
    cd /Users/admin/builder/spi-builder-workspace/.swiftpm/xcode

SwiftCompile normal arm64 /Users/admin/builder/spi-builder-workspace/Sources/Flare/Classes/Providers/IAPProvider/IIAPProvider.swift (in target 'Flare' from project 'Flare')
    cd /Users/admin/builder/spi-builder-workspace/.swiftpm/xcode

SwiftCompile normal arm64 /Users/admin/builder/spi-builder-workspace/Sources/Flare/Classes/Providers/PaymentProvider/IPaymentProvider.swift (in target 'Flare' from project 'Flare')
    cd /Users/admin/builder/spi-builder-workspace/.swiftpm/xcode

SwiftCompile normal arm64 /Users/admin/builder/spi-builder-workspace/Sources/Flare/Classes/Providers/PaymentProvider/PaymentProvider.swift (in target 'Flare' from project 'Flare')
    cd /Users/admin/builder/spi-builder-workspace/.swiftpm/xcode

SwiftCompile normal arm64 /Users/admin/builder/spi-builder-workspace/Sources/Flare/Classes/Providers/ProductProvider/Decorators/CachingProductsProviderDecorator/CachingProductsProviderDecorator.swift (in target 'Flare' from project 'Flare')
    cd /Users/admin/builder/spi-builder-workspace/.swiftpm/xcode

SwiftDriverJobDiscovery normal arm64 Compiling TestDispatchQueue.swift (in target 'TestConcurrency' from project 'Concurrency')
SwiftCompile normal arm64 Compiling\ ICachingProductsProviderDecorator.swift,\ ISortingProductsProviderDecorator.swift,\ SortingProductsProviderDecorator.swift,\ IProductProvider.swift,\ ProductProvider.swift,\ IPurchaseProvider.swift,\ PurchaseProvider.swift,\ IReceiptRefreshRequest.swift,\ IReceiptRefreshRequestFactory.swift,\ ReceiptRefreshRequestFactory.swift /Users/admin/builder/spi-builder-workspace/Sources/Flare/Classes/Providers/ProductProvider/Decorators/CachingProductsProviderDecorator/ICachingProductsProviderDecorator.swift /Users/admin/builder/spi-builder-workspace/Sources/Flare/Classes/Providers/ProductProvider/Decorators/SortingProductsProviderDecorator/ISortingProductsProviderDecorator.swift /Users/admin/builder/spi-builder-workspace/Sources/Flare/Classes/Providers/ProductProvider/Decorators/SortingProductsProviderDecorator/SortingProductsProviderDecorator.swift /Users/admin/builder/spi-builder-workspace/Sources/Flare/Classes/Providers/ProductProvider/IProductProvider.swift /Users/admin/builder/spi-builder-workspace/Sources/Flare/Classes/Providers/ProductProvider/ProductProvider.swift /Users/admin/builder/spi-builder-workspace/Sources/Flare/Classes/Providers/PurchaseProvider/IPurchaseProvider.swift /Users/admin/builder/spi-builder-workspace/Sources/Flare/Classes/Providers/PurchaseProvider/PurchaseProvider.swift /Users/admin/builder/spi-builder-workspace/Sources/Flare/Classes/Providers/ReceiptRefreshProvider/Factories/IReceiptRefreshRequest.swift /Users/admin/builder/spi-builder-workspace/Sources/Flare/Classes/Providers/ReceiptRefreshProvider/Factories/ReceiptRefreshRequestFactory/IReceiptRefreshRequestFactory.swift /Users/admin/builder/spi-builder-workspace/Sources/Flare/Classes/Providers/ReceiptRefreshProvider/Factories/ReceiptRefreshRequestFactory/ReceiptRefreshRequestFactory.swift (in target 'Flare' from project 'Flare')
SwiftCompile normal arm64 /Users/admin/builder/spi-builder-workspace/Sources/Flare/Classes/Providers/ProductProvider/Decorators/CachingProductsProviderDecorator/ICachingProductsProviderDecorator.swift (in target 'Flare' from project 'Flare')
    cd /Users/admin/builder/spi-builder-workspace/.swiftpm/xcode

SwiftCompile normal arm64 /Users/admin/builder/spi-builder-workspace/Sources/Flare/Classes/Providers/ProductProvider/Decorators/SortingProductsProviderDecorator/ISortingProductsProviderDecorator.swift (in target 'Flare' from project 'Flare')
    cd /Users/admin/builder/spi-builder-workspace/.swiftpm/xcode

SwiftCompile normal arm64 /Users/admin/builder/spi-builder-workspace/Sources/Flare/Classes/Providers/ProductProvider/Decorators/SortingProductsProviderDecorator/SortingProductsProviderDecorator.swift (in target 'Flare' from project 'Flare')
    cd /Users/admin/builder/spi-builder-workspace/.swiftpm/xcode

SwiftCompile normal arm64 /Users/admin/builder/spi-builder-workspace/Sources/Flare/Classes/Providers/ProductProvider/IProductProvider.swift (in target 'Flare' from project 'Flare')
    cd /Users/admin/builder/spi-builder-workspace/.swiftpm/xcode

SwiftCompile normal arm64 /Users/admin/builder/spi-builder-workspace/Sources/Flare/Classes/Providers/ProductProvider/ProductProvider.swift (in target 'Flare' from project 'Flare')
    cd /Users/admin/builder/spi-builder-workspace/.swiftpm/xcode

SwiftCompile normal arm64 /Users/admin/builder/spi-builder-workspace/Sources/Flare/Classes/Providers/PurchaseProvider/IPurchaseProvider.swift (in target 'Flare' from project 'Flare')
    cd /Users/admin/builder/spi-builder-workspace/.swiftpm/xcode

SwiftCompile normal arm64 /Users/admin/builder/spi-builder-workspace/Sources/Flare/Classes/Providers/PurchaseProvider/PurchaseProvider.swift (in target 'Flare' from project 'Flare')
    cd /Users/admin/builder/spi-builder-workspace/.swiftpm/xcode

/Users/admin/builder/spi-builder-workspace/Sources/Flare/Classes/Providers/PurchaseProvider/PurchaseProvider.swift:184:17: warning: no 'async' operations occur within 'await' expression
                await completion(.failure(.unknown))
                ^
SwiftCompile normal arm64 /Users/admin/builder/spi-builder-workspace/Sources/Flare/Classes/Providers/ReceiptRefreshProvider/Factories/IReceiptRefreshRequest.swift (in target 'Flare' from project 'Flare')
    cd /Users/admin/builder/spi-builder-workspace/.swiftpm/xcode

SwiftCompile normal arm64 /Users/admin/builder/spi-builder-workspace/Sources/Flare/Classes/Providers/ReceiptRefreshProvider/Factories/ReceiptRefreshRequestFactory/IReceiptRefreshRequestFactory.swift (in target 'Flare' from project 'Flare')
    cd /Users/admin/builder/spi-builder-workspace/.swiftpm/xcode

SwiftCompile normal arm64 /Users/admin/builder/spi-builder-workspace/Sources/Flare/Classes/Providers/ReceiptRefreshProvider/Factories/ReceiptRefreshRequestFactory/ReceiptRefreshRequestFactory.swift (in target 'Flare' from project 'Flare')
    cd /Users/admin/builder/spi-builder-workspace/.swiftpm/xcode

SwiftDriverJobDiscovery normal arm64 Compiling TestTaskFactory.swift (in target 'TestConcurrency' from project 'Concurrency')
SwiftDriver\ Compilation TestConcurrency normal arm64 com.apple.xcode.tools.swift.compiler (in target 'TestConcurrency' from project 'Concurrency')
    cd /Users/admin/builder/spi-builder-workspace/.swiftpm/xcode
    builtin-Swift-Compilation -- /Applications/Xcode-16.3.0.app/Contents/Developer/Toolchains/XcodeDefault.xctoolchain/usr/bin/swiftc -module-name TestConcurrency -Onone -enforce-exclusivity\=checked @/Users/admin/builder/spi-builder-workspace/.derivedData/Build/Intermediates.noindex/Concurrency.build/Debug/TestConcurrency.build/Objects-normal/arm64/TestConcurrency.SwiftFileList -DSWIFT_PACKAGE -DDEBUG -DXcode -plugin-path /Applications/Xcode-16.3.0.app/Contents/Developer/Toolchains/XcodeDefault.xctoolchain/usr/lib/swift/host/plugins/testing -enable-experimental-feature DebugDescriptionMacro -sdk /Applications/Xcode-16.3.0.app/Contents/Developer/Platforms/MacOSX.platform/Developer/SDKs/MacOSX15.4.sdk -target arm64-apple-macos10.15 -g -module-cache-path /Users/admin/builder/spi-builder-workspace/.derivedData/ModuleCache.noindex -Xfrontend -serialize-debugging-options -profile-coverage-mapping -profile-generate -enable-testing -suppress-warnings -index-store-path /Users/admin/builder/spi-builder-workspace/.derivedData/Index.noindex/DataStore -swift-version 6 -I /Users/admin/builder/spi-builder-workspace/.derivedData/Build/Products/Debug -I /Applications/Xcode-16.3.0.app/Contents/Developer/Platforms/MacOSX.platform/Developer/usr/lib -F /Users/admin/builder/spi-builder-workspace/.derivedData/Build/Products/Debug/PackageFrameworks -F /Users/admin/builder/spi-builder-workspace/.derivedData/Build/Products/Debug -F /Applications/Xcode-16.3.0.app/Contents/Developer/Platforms/MacOSX.platform/Developer/Library/Frameworks -c -j10 -enable-batch-mode -incremental -Xcc -ivfsstatcache -Xcc /Users/admin/builder/spi-builder-workspace/.derivedData/SDKStatCaches.noindex/macosx15.4-24E241-8287b8f5db97e746a1562fbca0c9d29b.sdkstatcache -output-file-map /Users/admin/builder/spi-builder-workspace/.derivedData/Build/Intermediates.noindex/Concurrency.build/Debug/TestConcurrency.build/Objects-normal/arm64/TestConcurrency-OutputFileMap.json -use-frontend-parseable-output -save-temps -no-color-diagnostics -serialize-diagnostics -emit-dependencies -emit-module -emit-module-path /Users/admin/builder/spi-builder-workspace/.derivedData/Build/Intermediates.noindex/Concurrency.build/Debug/TestConcurrency.build/Objects-normal/arm64/TestConcurrency.swiftmodule -user-module-version 0.2.0 -validate-clang-modules-once -clang-build-session-file /Users/admin/builder/spi-builder-workspace/.derivedData/ModuleCache.noindex/Session.modulevalidation -package-name concurrency -Xcc -I/Users/admin/builder/spi-builder-workspace/.derivedData/Build/Intermediates.noindex/Concurrency.build/Debug/TestConcurrency.build/swift-overrides.hmap -emit-const-values -Xfrontend -const-gather-protocols-file -Xfrontend /Users/admin/builder/spi-builder-workspace/.derivedData/Build/Intermediates.noindex/Concurrency.build/Debug/TestConcurrency.build/Objects-normal/arm64/TestConcurrency_const_extract_protocols.json -Xcc -I/Users/admin/builder/spi-builder-workspace/.derivedData/Build/Products/Debug/include -Xcc -I/Users/admin/builder/spi-builder-workspace/.derivedData/Build/Intermediates.noindex/Concurrency.build/Debug/TestConcurrency.build/DerivedSources-normal/arm64 -Xcc -I/Users/admin/builder/spi-builder-workspace/.derivedData/Build/Intermediates.noindex/Concurrency.build/Debug/TestConcurrency.build/DerivedSources/arm64 -Xcc -I/Users/admin/builder/spi-builder-workspace/.derivedData/Build/Intermediates.noindex/Concurrency.build/Debug/TestConcurrency.build/DerivedSources -Xcc -DSWIFT_PACKAGE -Xcc -DDEBUG\=1 -emit-objc-header -emit-objc-header-path /Users/admin/builder/spi-builder-workspace/.derivedData/Build/Intermediates.noindex/Concurrency.build/Debug/TestConcurrency.build/Objects-normal/arm64/TestConcurrency-Swift.h -working-directory /Users/admin/builder/spi-builder-workspace/.swiftpm/xcode -experimental-emit-module-separately -disable-cmo
SwiftDriverJobDiscovery normal arm64 Compiling AssertSnapshot.swift, Async.swift, Internal.swift, PlistEncoder.swift (in target 'SnapshotTesting' from project 'swift-snapshot-testing')
SwiftCompile normal arm64 Compiling\ IReceiptRefreshProvider.swift,\ ReceiptRefreshProvider.swift,\ IRedeemCodeProvider.swift,\ RedeemCodeProvider.swift,\ IRefundProvider.swift,\ RefundProvider.swift,\ IRefundRequestProvider.swift,\ RefundRequestProvider.swift,\ ISystemInfoProvider.swift,\ SystemInfoProvider.swift /Users/admin/builder/spi-builder-workspace/Sources/Flare/Classes/Providers/ReceiptRefreshProvider/IReceiptRefreshProvider.swift /Users/admin/builder/spi-builder-workspace/Sources/Flare/Classes/Providers/ReceiptRefreshProvider/ReceiptRefreshProvider.swift /Users/admin/builder/spi-builder-workspace/Sources/Flare/Classes/Providers/RedeemCodeProvider/IRedeemCodeProvider.swift /Users/admin/builder/spi-builder-workspace/Sources/Flare/Classes/Providers/RedeemCodeProvider/RedeemCodeProvider.swift /Users/admin/builder/spi-builder-workspace/Sources/Flare/Classes/Providers/RefundProvider/IRefundProvider.swift /Users/admin/builder/spi-builder-workspace/Sources/Flare/Classes/Providers/RefundProvider/RefundProvider.swift /Users/admin/builder/spi-builder-workspace/Sources/Flare/Classes/Providers/RefundRequestProvider/IRefundRequestProvider.swift /Users/admin/builder/spi-builder-workspace/Sources/Flare/Classes/Providers/RefundRequestProvider/RefundRequestProvider.swift /Users/admin/builder/spi-builder-workspace/Sources/Flare/Classes/Providers/SystemInfoProvider/ISystemInfoProvider.swift /Users/admin/builder/spi-builder-workspace/Sources/Flare/Classes/Providers/SystemInfoProvider/SystemInfoProvider.swift (in target 'Flare' from project 'Flare')
SwiftCompile normal arm64 /Users/admin/builder/spi-builder-workspace/Sources/Flare/Classes/Providers/ReceiptRefreshProvider/IReceiptRefreshProvider.swift (in target 'Flare' from project 'Flare')
    cd /Users/admin/builder/spi-builder-workspace/.swiftpm/xcode

SwiftCompile normal arm64 /Users/admin/builder/spi-builder-workspace/Sources/Flare/Classes/Providers/ReceiptRefreshProvider/ReceiptRefreshProvider.swift (in target 'Flare' from project 'Flare')
    cd /Users/admin/builder/spi-builder-workspace/.swiftpm/xcode

SwiftCompile normal arm64 /Users/admin/builder/spi-builder-workspace/Sources/Flare/Classes/Providers/RedeemCodeProvider/IRedeemCodeProvider.swift (in target 'Flare' from project 'Flare')
    cd /Users/admin/builder/spi-builder-workspace/.swiftpm/xcode

SwiftCompile normal arm64 /Users/admin/builder/spi-builder-workspace/Sources/Flare/Classes/Providers/RedeemCodeProvider/RedeemCodeProvider.swift (in target 'Flare' from project 'Flare')
    cd /Users/admin/builder/spi-builder-workspace/.swiftpm/xcode

SwiftCompile normal arm64 /Users/admin/builder/spi-builder-workspace/Sources/Flare/Classes/Providers/RefundProvider/IRefundProvider.swift (in target 'Flare' from project 'Flare')
    cd /Users/admin/builder/spi-builder-workspace/.swiftpm/xcode

SwiftCompile normal arm64 /Users/admin/builder/spi-builder-workspace/Sources/Flare/Classes/Providers/RefundProvider/RefundProvider.swift (in target 'Flare' from project 'Flare')
    cd /Users/admin/builder/spi-builder-workspace/.swiftpm/xcode

SwiftCompile normal arm64 /Users/admin/builder/spi-builder-workspace/Sources/Flare/Classes/Providers/RefundRequestProvider/IRefundRequestProvider.swift (in target 'Flare' from project 'Flare')
    cd /Users/admin/builder/spi-builder-workspace/.swiftpm/xcode

SwiftCompile normal arm64 /Users/admin/builder/spi-builder-workspace/Sources/Flare/Classes/Providers/RefundRequestProvider/RefundRequestProvider.swift (in target 'Flare' from project 'Flare')
    cd /Users/admin/builder/spi-builder-workspace/.swiftpm/xcode

SwiftCompile normal arm64 /Users/admin/builder/spi-builder-workspace/Sources/Flare/Classes/Providers/SystemInfoProvider/ISystemInfoProvider.swift (in target 'Flare' from project 'Flare')
    cd /Users/admin/builder/spi-builder-workspace/.swiftpm/xcode

SwiftCompile normal arm64 /Users/admin/builder/spi-builder-workspace/Sources/Flare/Classes/Providers/SystemInfoProvider/SystemInfoProvider.swift (in target 'Flare' from project 'Flare')
    cd /Users/admin/builder/spi-builder-workspace/.swiftpm/xcode

SwiftDriver\ Compilation SnapshotTesting normal arm64 com.apple.xcode.tools.swift.compiler (in target 'SnapshotTesting' from project 'swift-snapshot-testing')
    cd /Users/admin/builder/spi-builder-workspace/.swiftpm/xcode
    builtin-Swift-Compilation -- /Applications/Xcode-16.3.0.app/Contents/Developer/Toolchains/XcodeDefault.xctoolchain/usr/bin/swiftc -module-name SnapshotTesting -Onone -enforce-exclusivity\=checked @/Users/admin/builder/spi-builder-workspace/.derivedData/Build/Intermediates.noindex/swift-snapshot-testing.build/Debug/SnapshotTesting.build/Objects-normal/arm64/SnapshotTesting.SwiftFileList -DSWIFT_PACKAGE -DDEBUG -DXcode -plugin-path /Applications/Xcode-16.3.0.app/Contents/Developer/Toolchains/XcodeDefault.xctoolchain/usr/lib/swift/host/plugins/testing -enable-experimental-feature DebugDescriptionMacro -sdk /Applications/Xcode-16.3.0.app/Contents/Developer/Platforms/MacOSX.platform/Developer/SDKs/MacOSX15.4.sdk -target arm64-apple-macos10.15 -g -module-cache-path /Users/admin/builder/spi-builder-workspace/.derivedData/ModuleCache.noindex -Xfrontend -serialize-debugging-options -profile-coverage-mapping -profile-generate -enable-testing -suppress-warnings -index-store-path /Users/admin/builder/spi-builder-workspace/.derivedData/Index.noindex/DataStore -swift-version 5 -I /Users/admin/builder/spi-builder-workspace/.derivedData/Build/Products/Debug -I /Applications/Xcode-16.3.0.app/Contents/Developer/Platforms/MacOSX.platform/Developer/usr/lib -F /Users/admin/builder/spi-builder-workspace/.derivedData/Build/Products/Debug -F /Applications/Xcode-16.3.0.app/Contents/Developer/Platforms/MacOSX.platform/Developer/Library/Frameworks -c -j10 -enable-batch-mode -incremental -Xcc -ivfsstatcache -Xcc /Users/admin/builder/spi-builder-workspace/.derivedData/SDKStatCaches.noindex/macosx15.4-24E241-8287b8f5db97e746a1562fbca0c9d29b.sdkstatcache -output-file-map /Users/admin/builder/spi-builder-workspace/.derivedData/Build/Intermediates.noindex/swift-snapshot-testing.build/Debug/SnapshotTesting.build/Objects-normal/arm64/SnapshotTesting-OutputFileMap.json -use-frontend-parseable-output -save-temps -no-color-diagnostics -serialize-diagnostics -emit-dependencies -emit-module -emit-module-path /Users/admin/builder/spi-builder-workspace/.derivedData/Build/Intermediates.noindex/swift-snapshot-testing.build/Debug/SnapshotTesting.build/Objects-normal/arm64/SnapshotTesting.swiftmodule -user-module-version 1.18.3 -validate-clang-modules-once -clang-build-session-file /Users/admin/builder/spi-builder-workspace/.derivedData/ModuleCache.noindex/Session.modulevalidation -package-name swift_snapshot_testing -Xcc -I/Users/admin/builder/spi-builder-workspace/.derivedData/Build/Intermediates.noindex/swift-snapshot-testing.build/Debug/SnapshotTesting.build/swift-overrides.hmap -emit-const-values -Xfrontend -const-gather-protocols-file -Xfrontend /Users/admin/builder/spi-builder-workspace/.derivedData/Build/Intermediates.noindex/swift-snapshot-testing.build/Debug/SnapshotTesting.build/Objects-normal/arm64/SnapshotTesting_const_extract_protocols.json -Xcc -I/Users/admin/builder/spi-builder-workspace/.derivedData/Build/Products/Debug/include -Xcc -I/Users/admin/builder/spi-builder-workspace/.derivedData/Build/Intermediates.noindex/swift-snapshot-testing.build/Debug/SnapshotTesting.build/DerivedSources-normal/arm64 -Xcc -I/Users/admin/builder/spi-builder-workspace/.derivedData/Build/Intermediates.noindex/swift-snapshot-testing.build/Debug/SnapshotTesting.build/DerivedSources/arm64 -Xcc -I/Users/admin/builder/spi-builder-workspace/.derivedData/Build/Intermediates.noindex/swift-snapshot-testing.build/Debug/SnapshotTesting.build/DerivedSources -Xcc -DSWIFT_PACKAGE -Xcc -DDEBUG\=1 -emit-objc-header -emit-objc-header-path /Users/admin/builder/spi-builder-workspace/.derivedData/Build/Intermediates.noindex/swift-snapshot-testing.build/Debug/SnapshotTesting.build/Objects-normal/arm64/SnapshotTesting-Swift.h -working-directory /Users/admin/builder/spi-builder-workspace/.swiftpm/xcode -experimental-emit-module-separately -disable-cmo
SwiftDriverJobDiscovery normal arm64 Compiling IAPError.swift, ProductsRequest.swift, IRenewalInfo.swift, ISKProduct.swift, ISKRequest.swift, IStorePayment.swift, IStoreProductDiscount.swift, IStoreTransaction.swift, ISubscriptionInfo.swift, ISubscriptionInfoStatus.swift, SK1StorePayment.swift (in target 'Flare' from project 'Flare')
SwiftCompile normal arm64 Compiling\ StoreProductDiscount.swift,\ StoreTransaction.swift,\ SubscriptionEligibility.swift,\ SubscriptionInfo.swift,\ SubscriptionInfoStatus.swift,\ SubscriptionPeriod.swift,\ VerificationError.swift,\ VerificationResult.swift,\ IAppStoreReceiptProvider.swift,\ CacheProvider.swift /Users/admin/builder/spi-builder-workspace/Sources/Flare/Classes/Models/StoreProductDiscount.swift /Users/admin/builder/spi-builder-workspace/Sources/Flare/Classes/Models/StoreTransaction.swift /Users/admin/builder/spi-builder-workspace/Sources/Flare/Classes/Models/SubscriptionEligibility.swift /Users/admin/builder/spi-builder-workspace/Sources/Flare/Classes/Models/SubscriptionInfo.swift /Users/admin/builder/spi-builder-workspace/Sources/Flare/Classes/Models/SubscriptionInfoStatus.swift /Users/admin/builder/spi-builder-workspace/Sources/Flare/Classes/Models/SubscriptionPeriod.swift /Users/admin/builder/spi-builder-workspace/Sources/Flare/Classes/Models/VerificationError.swift /Users/admin/builder/spi-builder-workspace/Sources/Flare/Classes/Models/VerificationResult.swift /Users/admin/builder/spi-builder-workspace/Sources/Flare/Classes/Providers/AppStoreReceiptProvider/IAppStoreReceiptProvider.swift /Users/admin/builder/spi-builder-workspace/Sources/Flare/Classes/Providers/CacheProvider/CacheProvider.swift (in target 'Flare' from project 'Flare')
SwiftCompile normal arm64 /Users/admin/builder/spi-builder-workspace/Sources/Flare/Classes/Models/StoreProductDiscount.swift (in target 'Flare' from project 'Flare')
    cd /Users/admin/builder/spi-builder-workspace/.swiftpm/xcode

SwiftCompile normal arm64 /Users/admin/builder/spi-builder-workspace/Sources/Flare/Classes/Models/StoreTransaction.swift (in target 'Flare' from project 'Flare')
    cd /Users/admin/builder/spi-builder-workspace/.swiftpm/xcode

SwiftCompile normal arm64 /Users/admin/builder/spi-builder-workspace/Sources/Flare/Classes/Models/SubscriptionEligibility.swift (in target 'Flare' from project 'Flare')
    cd /Users/admin/builder/spi-builder-workspace/.swiftpm/xcode

SwiftCompile normal arm64 /Users/admin/builder/spi-builder-workspace/Sources/Flare/Classes/Models/SubscriptionInfo.swift (in target 'Flare' from project 'Flare')
    cd /Users/admin/builder/spi-builder-workspace/.swiftpm/xcode

SwiftCompile normal arm64 /Users/admin/builder/spi-builder-workspace/Sources/Flare/Classes/Models/SubscriptionInfoStatus.swift (in target 'Flare' from project 'Flare')
    cd /Users/admin/builder/spi-builder-workspace/.swiftpm/xcode

SwiftCompile normal arm64 /Users/admin/builder/spi-builder-workspace/Sources/Flare/Classes/Models/SubscriptionPeriod.swift (in target 'Flare' from project 'Flare')
    cd /Users/admin/builder/spi-builder-workspace/.swiftpm/xcode

SwiftCompile normal arm64 /Users/admin/builder/spi-builder-workspace/Sources/Flare/Classes/Models/VerificationError.swift (in target 'Flare' from project 'Flare')
    cd /Users/admin/builder/spi-builder-workspace/.swiftpm/xcode

SwiftCompile normal arm64 /Users/admin/builder/spi-builder-workspace/Sources/Flare/Classes/Models/VerificationResult.swift (in target 'Flare' from project 'Flare')
    cd /Users/admin/builder/spi-builder-workspace/.swiftpm/xcode

SwiftCompile normal arm64 /Users/admin/builder/spi-builder-workspace/Sources/Flare/Classes/Providers/AppStoreReceiptProvider/IAppStoreReceiptProvider.swift (in target 'Flare' from project 'Flare')
    cd /Users/admin/builder/spi-builder-workspace/.swiftpm/xcode

SwiftCompile normal arm64 /Users/admin/builder/spi-builder-workspace/Sources/Flare/Classes/Providers/CacheProvider/CacheProvider.swift (in target 'Flare' from project 'Flare')
    cd /Users/admin/builder/spi-builder-workspace/.swiftpm/xcode

SwiftDriverJobDiscovery normal arm64 Compiling resource_bundle_accessor.swift, Logger.swift, Types.swift, FlareDependencies.swift, IFlareDependencies.swift, Bundle+IAppStoreReceiptProvider.swift, FileManager+IFileManager.swift, NumberFormatter+.swift, Locale+CurrencyCode.swift, Product.SubscriptionInfo.Status+ISubscriptionInfoStatus.swift, ProductType+.swift (in target 'Flare' from project 'Flare')
SwiftDriverJobDiscovery normal arm64 Compiling PaymentMode.swift, PriceIncreaseStatus.swift, ProductCategory.swift, ProductType.swift, PromotionalOffer.swift, RefundError.swift, RefundRequestStatus.swift, RenewalInfo.swift, RenewalState.swift, StoreProduct.swift (in target 'Flare' from project 'Flare')
SwiftDriverJobDiscovery normal arm64 Emitting module for Flare (in target 'Flare' from project 'Flare')
SwiftDriver\ Compilation\ Requirements Flare normal arm64 com.apple.xcode.tools.swift.compiler (in target 'Flare' from project 'Flare')
    cd /Users/admin/builder/spi-builder-workspace/.swiftpm/xcode
    builtin-Swift-Compilation-Requirements -- /Applications/Xcode-16.3.0.app/Contents/Developer/Toolchains/XcodeDefault.xctoolchain/usr/bin/swiftc -module-name Flare -Onone -enforce-exclusivity\=checked @/Users/admin/builder/spi-builder-workspace/.derivedData/Build/Intermediates.noindex/Flare.build/Debug/Flare.build/Objects-normal/arm64/Flare.SwiftFileList -DSWIFT_PACKAGE -DDEBUG -DXcode -plugin-path /Applications/Xcode-16.3.0.app/Contents/Developer/Toolchains/XcodeDefault.xctoolchain/usr/lib/swift/host/plugins/testing -enable-experimental-feature DebugDescriptionMacro -sdk /Applications/Xcode-16.3.0.app/Contents/Developer/Platforms/MacOSX.platform/Developer/SDKs/MacOSX15.4.sdk -target arm64-apple-macos10.15 -g -module-cache-path /Users/admin/builder/spi-builder-workspace/.derivedData/ModuleCache.noindex -Xfrontend -serialize-debugging-options -profile-coverage-mapping -profile-generate -enable-testing -index-store-path /Users/admin/builder/spi-builder-workspace/.derivedData/Index.noindex/DataStore -swift-version 6 -I /Users/admin/builder/spi-builder-workspace/.derivedData/Build/Products/Debug -I /Applications/Xcode-16.3.0.app/Contents/Developer/Platforms/MacOSX.platform/Developer/usr/lib -F /Users/admin/builder/spi-builder-workspace/.derivedData/Build/Products/Debug/PackageFrameworks -F /Users/admin/builder/spi-builder-workspace/.derivedData/Build/Products/Debug/PackageFrameworks -F /Users/admin/builder/spi-builder-workspace/.derivedData/Build/Products/Debug/PackageFrameworks -F /Users/admin/builder/spi-builder-workspace/.derivedData/Build/Products/Debug -F /Applications/Xcode-16.3.0.app/Contents/Developer/Platforms/MacOSX.platform/Developer/Library/Frameworks -emit-localized-strings -emit-localized-strings-path /Users/admin/builder/spi-builder-workspace/.derivedData/Build/Intermediates.noindex/Flare.build/Debug/Flare.build/Objects-normal/arm64 -c -j10 -enable-batch-mode -incremental -Xcc -ivfsstatcache -Xcc /Users/admin/builder/spi-builder-workspace/.derivedData/SDKStatCaches.noindex/macosx15.4-24E241-8287b8f5db97e746a1562fbca0c9d29b.sdkstatcache -output-file-map /Users/admin/builder/spi-builder-workspace/.derivedData/Build/Intermediates.noindex/Flare.build/Debug/Flare.build/Objects-normal/arm64/Flare-OutputFileMap.json -use-frontend-parseable-output -save-temps -no-color-diagnostics -serialize-diagnostics -emit-dependencies -emit-module -emit-module-path /Users/admin/builder/spi-builder-workspace/.derivedData/Build/Intermediates.noindex/Flare.build/Debug/Flare.build/Objects-normal/arm64/Flare.swiftmodule -validate-clang-modules-once -clang-build-session-file /Users/admin/builder/spi-builder-workspace/.derivedData/ModuleCache.noindex/Session.modulevalidation -package-name spi_builder_workspace -Xcc -I/Users/admin/builder/spi-builder-workspace/.derivedData/Build/Intermediates.noindex/Flare.build/Debug/Flare.build/swift-overrides.hmap -emit-const-values -Xfrontend -const-gather-protocols-file -Xfrontend /Users/admin/builder/spi-builder-workspace/.derivedData/Build/Intermediates.noindex/Flare.build/Debug/Flare.build/Objects-normal/arm64/Flare_const_extract_protocols.json -Xcc -I/Users/admin/builder/spi-builder-workspace/.derivedData/Build/Products/Debug/include -Xcc -I/Users/admin/builder/spi-builder-workspace/.derivedData/Build/Intermediates.noindex/Flare.build/Debug/Flare.build/DerivedSources-normal/arm64 -Xcc -I/Users/admin/builder/spi-builder-workspace/.derivedData/Build/Intermediates.noindex/Flare.build/Debug/Flare.build/DerivedSources/arm64 -Xcc -I/Users/admin/builder/spi-builder-workspace/.derivedData/Build/Intermediates.noindex/Flare.build/Debug/Flare.build/DerivedSources -Xcc -DSWIFT_PACKAGE -Xcc -DDEBUG\=1 -emit-objc-header -emit-objc-header-path /Users/admin/builder/spi-builder-workspace/.derivedData/Build/Intermediates.noindex/Flare.build/Debug/Flare.build/Objects-normal/arm64/Flare-Swift.h -working-directory /Users/admin/builder/spi-builder-workspace/.swiftpm/xcode -experimental-emit-module-separately -disable-cmo
SwiftDriverJobDiscovery normal arm64 Compiling SKProduct+.swift, SKRequest+IReceiptRefreshRequest.swift, SKRequest+Identifier.swift, Flare.swift, IUserDefaults.swift, UserDefaults.swift, Strings.swift, AsyncHandler.swift, IFileManager.swift, PaymentQueue.swift, SKPaymentQueue+PaymentQueue.swift (in target 'Flare' from project 'Flare')
Copy /Users/admin/builder/spi-builder-workspace/.derivedData/Build/Products/Debug/Flare.swiftmodule/arm64-apple-macos.abi.json /Users/admin/builder/spi-builder-workspace/.derivedData/Build/Intermediates.noindex/Flare.build/Debug/Flare.build/Objects-normal/arm64/Flare.abi.json (in target 'Flare' from project 'Flare')
    cd /Users/admin/builder/spi-builder-workspace
    builtin-copy -exclude .DS_Store -exclude CVS -exclude .svn -exclude .git -exclude .hg -resolve-src-symlinks -rename /Users/admin/builder/spi-builder-workspace/.derivedData/Build/Intermediates.noindex/Flare.build/Debug/Flare.build/Objects-normal/arm64/Flare.abi.json /Users/admin/builder/spi-builder-workspace/.derivedData/Build/Products/Debug/Flare.swiftmodule/arm64-apple-macos.abi.json
RegisterExecutionPolicyException /Users/admin/builder/spi-builder-workspace/.derivedData/Build/Products/Debug/TestConcurrency.o (in target 'TestConcurrency' from project 'Concurrency')
    cd /Users/admin/builder/spi-builder-workspace/.dependencies/checkouts/concurrency
    builtin-RegisterExecutionPolicyException /Users/admin/builder/spi-builder-workspace/.derivedData/Build/Products/Debug/TestConcurrency.o
SwiftDriver FlareUI normal arm64 com.apple.xcode.tools.swift.compiler (in target 'FlareUI' from project 'Flare')
    cd /Users/admin/builder/spi-builder-workspace/.swiftpm/xcode
    builtin-SwiftDriver -- /Applications/Xcode-16.3.0.app/Contents/Developer/Toolchains/XcodeDefault.xctoolchain/usr/bin/swiftc -module-name FlareUI -Onone -enforce-exclusivity\=checked @/Users/admin/builder/spi-builder-workspace/.derivedData/Build/Intermediates.noindex/Flare.build/Debug/FlareUI.build/Objects-normal/arm64/FlareUI.SwiftFileList -DSWIFT_PACKAGE -DDEBUG -DXcode -plugin-path /Applications/Xcode-16.3.0.app/Contents/Developer/Toolchains/XcodeDefault.xctoolchain/usr/lib/swift/host/plugins/testing -enable-experimental-feature DebugDescriptionMacro -sdk /Applications/Xcode-16.3.0.app/Contents/Developer/Platforms/MacOSX.platform/Developer/SDKs/MacOSX15.4.sdk -target arm64-apple-macos10.15 -g -module-cache-path /Users/admin/builder/spi-builder-workspace/.derivedData/ModuleCache.noindex -Xfrontend -serialize-debugging-options -profile-coverage-mapping -profile-generate -enable-testing -index-store-path /Users/admin/builder/spi-builder-workspace/.derivedData/Index.noindex/DataStore -swift-version 6 -I /Users/admin/builder/spi-builder-workspace/.derivedData/Build/Products/Debug -I /Applications/Xcode-16.3.0.app/Contents/Developer/Platforms/MacOSX.platform/Developer/usr/lib -F /Users/admin/builder/spi-builder-workspace/.derivedData/Build/Products/Debug/PackageFrameworks -F /Users/admin/builder/spi-builder-workspace/.derivedData/Build/Products/Debug/PackageFrameworks -F /Users/admin/builder/spi-builder-workspace/.derivedData/Build/Products/Debug/PackageFrameworks -F /Users/admin/builder/spi-builder-workspace/.derivedData/Build/Products/Debug/PackageFrameworks -F /Users/admin/builder/spi-builder-workspace/.derivedData/Build/Products/Debug -F /Applications/Xcode-16.3.0.app/Contents/Developer/Platforms/MacOSX.platform/Developer/Library/Frameworks -emit-localized-strings -emit-localized-strings-path /Users/admin/builder/spi-builder-workspace/.derivedData/Build/Intermediates.noindex/Flare.build/Debug/FlareUI.build/Objects-normal/arm64 -c -j10 -enable-batch-mode -incremental -Xcc -ivfsstatcache -Xcc /Users/admin/builder/spi-builder-workspace/.derivedData/SDKStatCaches.noindex/macosx15.4-24E241-8287b8f5db97e746a1562fbca0c9d29b.sdkstatcache -output-file-map /Users/admin/builder/spi-builder-workspace/.derivedData/Build/Intermediates.noindex/Flare.build/Debug/FlareUI.build/Objects-normal/arm64/FlareUI-OutputFileMap.json -use-frontend-parseable-output -save-temps -no-color-diagnostics -serialize-diagnostics -emit-dependencies -emit-module -emit-module-path /Users/admin/builder/spi-builder-workspace/.derivedData/Build/Intermediates.noindex/Flare.build/Debug/FlareUI.build/Objects-normal/arm64/FlareUI.swiftmodule -validate-clang-modules-once -clang-build-session-file /Users/admin/builder/spi-builder-workspace/.derivedData/ModuleCache.noindex/Session.modulevalidation -package-name spi_builder_workspace -Xcc -I/Users/admin/builder/spi-builder-workspace/.derivedData/Build/Intermediates.noindex/Flare.build/Debug/FlareUI.build/swift-overrides.hmap -emit-const-values -Xfrontend -const-gather-protocols-file -Xfrontend /Users/admin/builder/spi-builder-workspace/.derivedData/Build/Intermediates.noindex/Flare.build/Debug/FlareUI.build/Objects-normal/arm64/FlareUI_const_extract_protocols.json -Xcc -I/Users/admin/builder/spi-builder-workspace/.derivedData/Build/Products/Debug/include -Xcc -I/Users/admin/builder/spi-builder-workspace/.derivedData/Build/Intermediates.noindex/Flare.build/Debug/FlareUI.build/DerivedSources-normal/arm64 -Xcc -I/Users/admin/builder/spi-builder-workspace/.derivedData/Build/Intermediates.noindex/Flare.build/Debug/FlareUI.build/DerivedSources/arm64 -Xcc -I/Users/admin/builder/spi-builder-workspace/.derivedData/Build/Intermediates.noindex/Flare.build/Debug/FlareUI.build/DerivedSources -Xcc -DSWIFT_PACKAGE -Xcc -DDEBUG\=1 -emit-objc-header -emit-objc-header-path /Users/admin/builder/spi-builder-workspace/.derivedData/Build/Intermediates.noindex/Flare.build/Debug/FlareUI.build/Objects-normal/arm64/FlareUI-Swift.h -working-directory /Users/admin/builder/spi-builder-workspace/.swiftpm/xcode -experimental-emit-module-separately -disable-cmo
SwiftDriver FlareMock normal arm64 com.apple.xcode.tools.swift.compiler (in target 'FlareMock' from project 'Flare')
    cd /Users/admin/builder/spi-builder-workspace/.swiftpm/xcode
    builtin-SwiftDriver -- /Applications/Xcode-16.3.0.app/Contents/Developer/Toolchains/XcodeDefault.xctoolchain/usr/bin/swiftc -module-name FlareMock -Onone -enforce-exclusivity\=checked @/Users/admin/builder/spi-builder-workspace/.derivedData/Build/Intermediates.noindex/Flare.build/Debug/FlareMock.build/Objects-normal/arm64/FlareMock.SwiftFileList -DSWIFT_PACKAGE -DDEBUG -DXcode -plugin-path /Applications/Xcode-16.3.0.app/Contents/Developer/Toolchains/XcodeDefault.xctoolchain/usr/lib/swift/host/plugins/testing -enable-experimental-feature DebugDescriptionMacro -sdk /Applications/Xcode-16.3.0.app/Contents/Developer/Platforms/MacOSX.platform/Developer/SDKs/MacOSX15.4.sdk -target arm64-apple-macos10.15 -g -module-cache-path /Users/admin/builder/spi-builder-workspace/.derivedData/ModuleCache.noindex -Xfrontend -serialize-debugging-options -profile-coverage-mapping -profile-generate -enable-testing -index-store-path /Users/admin/builder/spi-builder-workspace/.derivedData/Index.noindex/DataStore -swift-version 6 -I /Users/admin/builder/spi-builder-workspace/.derivedData/Build/Products/Debug -I /Applications/Xcode-16.3.0.app/Contents/Developer/Platforms/MacOSX.platform/Developer/usr/lib -F /Users/admin/builder/spi-builder-workspace/.derivedData/Build/Products/Debug/PackageFrameworks -F /Users/admin/builder/spi-builder-workspace/.derivedData/Build/Products/Debug/PackageFrameworks -F /Users/admin/builder/spi-builder-workspace/.derivedData/Build/Products/Debug/PackageFrameworks -F /Users/admin/builder/spi-builder-workspace/.derivedData/Build/Products/Debug/PackageFrameworks -F /Users/admin/builder/spi-builder-workspace/.derivedData/Build/Products/Debug -F /Applications/Xcode-16.3.0.app/Contents/Developer/Platforms/MacOSX.platform/Developer/Library/Frameworks -emit-localized-strings -emit-localized-strings-path /Users/admin/builder/spi-builder-workspace/.derivedData/Build/Intermediates.noindex/Flare.build/Debug/FlareMock.build/Objects-normal/arm64 -c -j10 -enable-batch-mode -incremental -Xcc -ivfsstatcache -Xcc /Users/admin/builder/spi-builder-workspace/.derivedData/SDKStatCaches.noindex/macosx15.4-24E241-8287b8f5db97e746a1562fbca0c9d29b.sdkstatcache -output-file-map /Users/admin/builder/spi-builder-workspace/.derivedData/Build/Intermediates.noindex/Flare.build/Debug/FlareMock.build/Objects-normal/arm64/FlareMock-OutputFileMap.json -use-frontend-parseable-output -save-temps -no-color-diagnostics -serialize-diagnostics -emit-dependencies -emit-module -emit-module-path /Users/admin/builder/spi-builder-workspace/.derivedData/Build/Intermediates.noindex/Flare.build/Debug/FlareMock.build/Objects-normal/arm64/FlareMock.swiftmodule -validate-clang-modules-once -clang-build-session-file /Users/admin/builder/spi-builder-workspace/.derivedData/ModuleCache.noindex/Session.modulevalidation -package-name spi_builder_workspace -Xcc -I/Users/admin/builder/spi-builder-workspace/.derivedData/Build/Intermediates.noindex/Flare.build/Debug/FlareMock.build/swift-overrides.hmap -emit-const-values -Xfrontend -const-gather-protocols-file -Xfrontend /Users/admin/builder/spi-builder-workspace/.derivedData/Build/Intermediates.noindex/Flare.build/Debug/FlareMock.build/Objects-normal/arm64/FlareMock_const_extract_protocols.json -Xcc -I/Users/admin/builder/spi-builder-workspace/.derivedData/Build/Products/Debug/include -Xcc -I/Users/admin/builder/spi-builder-workspace/.derivedData/Build/Intermediates.noindex/Flare.build/Debug/FlareMock.build/DerivedSources-normal/arm64 -Xcc -I/Users/admin/builder/spi-builder-workspace/.derivedData/Build/Intermediates.noindex/Flare.build/Debug/FlareMock.build/DerivedSources/arm64 -Xcc -I/Users/admin/builder/spi-builder-workspace/.derivedData/Build/Intermediates.noindex/Flare.build/Debug/FlareMock.build/DerivedSources -Xcc -DSWIFT_PACKAGE -Xcc -DDEBUG\=1 -emit-objc-header -emit-objc-header-path /Users/admin/builder/spi-builder-workspace/.derivedData/Build/Intermediates.noindex/Flare.build/Debug/FlareMock.build/Objects-normal/arm64/FlareMock-Swift.h -working-directory /Users/admin/builder/spi-builder-workspace/.swiftpm/xcode -experimental-emit-module-separately -disable-cmo
SwiftDriverJobDiscovery normal arm64 Compiling PaymentTransaction.swift, ProcessInfo+.swift, IScenesHolder.swift, IFlare.swift, ITransactionListener.swift, TransactionListener.swift, TransactionListenerDelegate.swift, Configuration.swift, DiscountType.swift, ExpirationReason.swift, FetchCachePolicy.swift (in target 'Flare' from project 'Flare')
SwiftDriverJobDiscovery normal arm64 Compiling SK1StoreProduct.swift, SK1StoreProductDiscount.swift, SK1StoreTransaction.swift, SK2RenewalInfo.swift, SK2StoreProduct.swift, SK2StoreProductDiscount.swift, SK2StoreTransaction.swift, SK2SubscriptionInfo.swift, SK2SubscriptionInfoStatus.swift, StoreEnvironment.swift (in target 'Flare' from project 'Flare')
SwiftCompile normal arm64 Compiling\ PaymentTransactionMock.swift /Users/admin/builder/spi-builder-workspace/Sources/FlareMock/Mocks/PaymentTransactionMock.swift (in target 'FlareMock' from project 'Flare')
SwiftCompile normal arm64 /Users/admin/builder/spi-builder-workspace/Sources/FlareMock/Mocks/PaymentTransactionMock.swift (in target 'FlareMock' from project 'Flare')
    cd /Users/admin/builder/spi-builder-workspace/.swiftpm/xcode

SwiftCompile normal arm64 Compiling\ ProductMock.swift /Users/admin/builder/spi-builder-workspace/Sources/FlareMock/Mocks/ProductMock.swift (in target 'FlareMock' from project 'Flare')
SwiftCompile normal arm64 /Users/admin/builder/spi-builder-workspace/Sources/FlareMock/Mocks/ProductMock.swift (in target 'FlareMock' from project 'Flare')
    cd /Users/admin/builder/spi-builder-workspace/.swiftpm/xcode

SwiftEmitModule normal arm64 Emitting\ module\ for\ FlareMock (in target 'FlareMock' from project 'Flare')
EmitSwiftModule normal arm64 (in target 'FlareMock' from project 'Flare')
    cd /Users/admin/builder/spi-builder-workspace/.swiftpm/xcode

/Users/admin/builder/spi-builder-workspace/Sources/FlareMock/Fakes/StoreProduct+Fake.swift:19:29: error: 'SubscriptionPeriod' is ambiguous for type lookup in this context
        subscriptionPeriod: SubscriptionPeriod? = nil,
                            ^~~~~~~~~~~~~~~~~~
/Users/admin/builder/spi-builder-workspace/Sources/Flare/Classes/Models/SubscriptionPeriod.swift:12:20: note: found this candidate
public final class SubscriptionPeriod: NSObject, Sendable {
                   ^
StoreKit.SubscriptionPeriod:2:18: note: found this candidate
public typealias SubscriptionPeriod = Product.SubscriptionPeriod
                 ^
/Users/admin/builder/spi-builder-workspace/Sources/FlareMock/Mocks/ProductMock.swift:114:43: error: 'SubscriptionPeriod' is ambiguous for type lookup in this context
    public var stubbedSubscriptionPeriod: SubscriptionPeriod!
                                          ^~~~~~~~~~~~~~~~~~
/Users/admin/builder/spi-builder-workspace/Sources/Flare/Classes/Models/SubscriptionPeriod.swift:12:20: note: found this candidate
public final class SubscriptionPeriod: NSObject, Sendable {
                   ^
StoreKit.SubscriptionPeriod:2:18: note: found this candidate
public typealias SubscriptionPeriod = Product.SubscriptionPeriod
                 ^
/Users/admin/builder/spi-builder-workspace/Sources/FlareMock/Mocks/ProductMock.swift:116:36: error: 'SubscriptionPeriod' is ambiguous for type lookup in this context
    public var subscriptionPeriod: SubscriptionPeriod? {
                                   ^~~~~~~~~~~~~~~~~~
/Users/admin/builder/spi-builder-workspace/Sources/Flare/Classes/Models/SubscriptionPeriod.swift:12:20: note: found this candidate
public final class SubscriptionPeriod: NSObject, Sendable {
                   ^
StoreKit.SubscriptionPeriod:2:18: note: found this candidate
public typealias SubscriptionPeriod = Product.SubscriptionPeriod
                 ^
/Users/admin/builder/spi-builder-workspace/Sources/FlareMock/Mocks/ProductMock.swift:155:30: error: 'SubscriptionInfo' is ambiguous for type lookup in this context
    public var subscription: SubscriptionInfo? {
                             ^~~~~~~~~~~~~~~~
/Users/admin/builder/spi-builder-workspace/Sources/Flare/Classes/Models/SubscriptionInfo.swift:10:15: note: found this candidate
public struct SubscriptionInfo {
              ^
StoreKit.SubscriptionInfo:2:18: note: found this candidate
public typealias SubscriptionInfo = Product.SubscriptionInfo
                 ^
SwiftCompile normal arm64 Compiling\ StoreTransaction+Fake.swift /Users/admin/builder/spi-builder-workspace/Sources/FlareMock/Fakes/StoreTransaction+Fake.swift (in target 'FlareMock' from project 'Flare')
SwiftCompile normal arm64 /Users/admin/builder/spi-builder-workspace/Sources/FlareMock/Fakes/StoreTransaction+Fake.swift (in target 'FlareMock' from project 'Flare')
    cd /Users/admin/builder/spi-builder-workspace/.swiftpm/xcode

SwiftCompile normal arm64 Compiling\ StoreProduct+Fake.swift /Users/admin/builder/spi-builder-workspace/Sources/FlareMock/Fakes/StoreProduct+Fake.swift (in target 'FlareMock' from project 'Flare')
Failed frontend command:
/Applications/Xcode-16.3.0.app/Contents/Developer/Toolchains/XcodeDefault.xctoolchain/usr/bin/swift-frontend -frontend -c -primary-file /Users/admin/builder/spi-builder-workspace/Sources/FlareMock/Fakes/StoreProduct+Fake.swift /Users/admin/builder/spi-builder-workspace/Sources/FlareMock/Fakes/StoreTransaction+Fake.swift /Users/admin/builder/spi-builder-workspace/Sources/FlareMock/Mocks/PaymentTransactionMock.swift /Users/admin/builder/spi-builder-workspace/Sources/FlareMock/Mocks/ProductMock.swift -emit-dependencies-path /Users/admin/builder/spi-builder-workspace/.derivedData/Build/Intermediates.noindex/Flare.build/Debug/FlareMock.build/Objects-normal/arm64/StoreProduct+Fake.d -emit-const-values-path /Users/admin/builder/spi-builder-workspace/.derivedData/Build/Intermediates.noindex/Flare.build/Debug/FlareMock.build/Objects-normal/arm64/StoreProduct+Fake.swiftconstvalues -emit-reference-dependencies-path /Users/admin/builder/spi-builder-workspace/.derivedData/Build/Intermediates.noindex/Flare.build/Debug/FlareMock.build/Objects-normal/arm64/StoreProduct+Fake.swiftdeps -serialize-diagnostics-path /Users/admin/builder/spi-builder-workspace/.derivedData/Build/Intermediates.noindex/Flare.build/Debug/FlareMock.build/Objects-normal/arm64/StoreProduct+Fake.dia -emit-localized-strings -emit-localized-strings-path /Users/admin/builder/spi-builder-workspace/.derivedData/Build/Intermediates.noindex/Flare.build/Debug/FlareMock.build/Objects-normal/arm64 -target arm64-apple-macos10.15 -Xllvm -aarch64-use-tbi -enable-objc-interop -stack-check -sdk /Applications/Xcode-16.3.0.app/Contents/Developer/Platforms/MacOSX.platform/Developer/SDKs/MacOSX15.4.sdk -I /Users/admin/builder/spi-builder-workspace/.derivedData/Build/Products/Debug -I /Applications/Xcode-16.3.0.app/Contents/Developer/Platforms/MacOSX.platform/Developer/usr/lib -F /Users/admin/builder/spi-builder-workspace/.derivedData/Build/Products/Debug/PackageFrameworks -F /Users/admin/builder/spi-builder-workspace/.derivedData/Build/Products/Debug/PackageFrameworks -F /Users/admin/builder/spi-builder-workspace/.derivedData/Build/Products/Debug/PackageFrameworks -F /Users/admin/builder/spi-builder-workspace/.derivedData/Build/Products/Debug/PackageFrameworks -F /Users/admin/builder/spi-builder-workspace/.derivedData/Build/Products/Debug -F /Applications/Xcode-16.3.0.app/Contents/Developer/Platforms/MacOSX.platform/Developer/Library/Frameworks -no-color-diagnostics -enable-testing -g -debug-info-format\=dwarf -dwarf-version\=4 -module-cache-path /Users/admin/builder/spi-builder-workspace/.derivedData/ModuleCache.noindex -profile-generate -profile-coverage-mapping -swift-version 6 -enforce-exclusivity\=checked -Onone -D SWIFT_PACKAGE -D DEBUG -D Xcode -serialize-debugging-options -const-gather-protocols-file /Users/admin/builder/spi-builder-workspace/.derivedData/Build/Intermediates.noindex/Flare.build/Debug/FlareMock.build/Objects-normal/arm64/FlareMock_const_extract_protocols.json -enable-experimental-feature DebugDescriptionMacro -empty-abi-descriptor -plugin-path /Applications/Xcode-16.3.0.app/Contents/Developer/Toolchains/XcodeDefault.xctoolchain/usr/lib/swift/host/plugins/testing -validate-clang-modules-once -clang-build-session-file /Users/admin/builder/spi-builder-workspace/.derivedData/ModuleCache.noindex/Session.modulevalidation -Xcc -working-directory -Xcc /Users/admin/builder/spi-builder-workspace/.swiftpm/xcode -resource-dir /Applications/Xcode-16.3.0.app/Contents/Developer/Toolchains/XcodeDefault.xctoolchain/usr/lib/swift -enable-anonymous-context-mangled-names -file-compilation-dir /Users/admin/builder/spi-builder-workspace/.swiftpm/xcode -Xcc -ivfsstatcache -Xcc /Users/admin/builder/spi-builder-workspace/.derivedData/SDKStatCaches.noindex/macosx15.4-24E241-8287b8f5db97e746a1562fbca0c9d29b.sdkstatcache -Xcc -I/Users/admin/builder/spi-builder-workspace/.derivedData/Build/Intermediates.noindex/Flare.build/Debug/FlareMock.build/swift-overrides.hmap -Xcc -I/Users/admin/builder/spi-builder-workspace/.derivedData/Build/Products/Debug/include -Xcc -I/Users/admin/builder/spi-builder-workspace/.derivedData/Build/Intermediates.noindex/Flare.build/Debug/FlareMock.build/DerivedSources-normal/arm64 -Xcc -I/Users/admin/builder/spi-builder-workspace/.derivedData/Build/Intermediates.noindex/Flare.build/Debug/FlareMock.build/DerivedSources/arm64 -Xcc -I/Users/admin/builder/spi-builder-workspace/.derivedData/Build/Intermediates.noindex/Flare.build/Debug/FlareMock.build/DerivedSources -Xcc -DSWIFT_PACKAGE -Xcc -DDEBUG\=1 -module-name FlareMock -package-name spi_builder_workspace -frontend-parseable-output -disable-clang-spi -target-sdk-version 15.4 -target-sdk-name macosx15.4 -external-plugin-path /Applications/Xcode-16.3.0.app/Contents/Developer/Platforms/MacOSX.platform/Developer/usr/lib/swift/host/plugins\#/Applications/Xcode-16.3.0.app/Contents/Developer/Platforms/MacOSX.platform/Developer/usr/bin/swift-plugin-server -external-plugin-path /Applications/Xcode-16.3.0.app/Contents/Developer/Platforms/MacOSX.platform/Developer/usr/local/lib/swift/host/plugins\#/Applications/Xcode-16.3.0.app/Contents/Developer/Platforms/MacOSX.platform/Developer/usr/bin/swift-plugin-server -in-process-plugin-server-path /Applications/Xcode-16.3.0.app/Contents/Developer/Toolchains/XcodeDefault.xctoolchain/usr/lib/swift/host/libSwiftInProcPluginServer.dylib -plugin-path /Applications/Xcode-16.3.0.app/Contents/Developer/Toolchains/XcodeDefault.xctoolchain/usr/lib/swift/host/plugins -plugin-path /Applications/Xcode-16.3.0.app/Contents/Developer/Toolchains/XcodeDefault.xctoolchain/usr/local/lib/swift/host/plugins -o /Users/admin/builder/spi-builder-workspace/.derivedData/Build/Intermediates.noindex/Flare.build/Debug/FlareMock.build/Objects-normal/arm64/StoreProduct+Fake.o -index-unit-output-path /Flare.build/Debug/FlareMock.build/Objects-normal/arm64/StoreProduct+Fake.o -index-store-path /Users/admin/builder/spi-builder-workspace/.derivedData/Index.noindex/DataStore -index-system-modules
SwiftCompile normal arm64 /Users/admin/builder/spi-builder-workspace/Sources/FlareMock/Fakes/StoreProduct+Fake.swift (in target 'FlareMock' from project 'Flare')
    cd /Users/admin/builder/spi-builder-workspace/.swiftpm/xcode

/Users/admin/builder/spi-builder-workspace/Sources/FlareMock/Fakes/StoreProduct+Fake.swift:19:29: error: 'SubscriptionPeriod' is ambiguous for type lookup in this context
        subscriptionPeriod: SubscriptionPeriod? = nil,
                            ^~~~~~~~~~~~~~~~~~
/Users/admin/builder/spi-builder-workspace/Sources/Flare/Classes/Models/SubscriptionPeriod.swift:12:20: note: found this candidate
public final class SubscriptionPeriod: NSObject, Sendable {
                   ^
StoreKit.SubscriptionPeriod:2:18: note: found this candidate
public typealias SubscriptionPeriod = Product.SubscriptionPeriod
                 ^
/Users/admin/builder/spi-builder-workspace/Sources/FlareMock/Mocks/ProductMock.swift:114:43: error: 'SubscriptionPeriod' is ambiguous for type lookup in this context
    public var stubbedSubscriptionPeriod: SubscriptionPeriod!
                                          ^~~~~~~~~~~~~~~~~~
/Users/admin/builder/spi-builder-workspace/Sources/Flare/Classes/Models/SubscriptionPeriod.swift:12:20: note: found this candidate
public final class SubscriptionPeriod: NSObject, Sendable {
                   ^
StoreKit.SubscriptionPeriod:2:18: note: found this candidate
public typealias SubscriptionPeriod = Product.SubscriptionPeriod
                 ^
SwiftDriverJobDiscovery normal arm64 Compiling ICacheProvider.swift, ConfigurationProvider.swift, IConfigurationProvider.swift, EligibilityProvider.swift, IEligibilityProvider.swift, IAPProvider.swift, IIAPProvider.swift, IPaymentProvider.swift, PaymentProvider.swift, CachingProductsProviderDecorator.swift (in target 'Flare' from project 'Flare')
SwiftDriverJobDiscovery normal arm64 Compiling ICachingProductsProviderDecorator.swift, ISortingProductsProviderDecorator.swift, SortingProductsProviderDecorator.swift, IProductProvider.swift, ProductProvider.swift, IPurchaseProvider.swift, PurchaseProvider.swift, IReceiptRefreshRequest.swift, IReceiptRefreshRequestFactory.swift, ReceiptRefreshRequestFactory.swift (in target 'Flare' from project 'Flare')
SwiftCompile normal arm64 Compiling\ SubscriptionStoreButtonLabelKey.swift,\ SubscriptionTermsOfServiceDestinationKey.swift,\ SubscriptionTermsOfServiceURLKey.swift,\ SubscriptionViewTintKey.swift,\ SubscriptionsWrapperViewStyleKey.swift,\ TintColorKey.swift,\ Array+RemoveDuplicates.swift,\ String+SubSequence.swift,\ StringProtocol+Words.swift,\ View+EraseToAnyView.swift,\ DateComponentsFormatter+Full.swift,\ IDateComponentsFormatter.swift,\ Array+StoreProduct.swift,\ Color+UIColor.swift,\ Error+IAP.swift,\ Value.swift,\ PriceDisplayFormat.swift,\ ProductStyle.swift,\ PaywallType.swift /Users/admin/builder/spi-builder-workspace/Sources/FlareUI/Classes/Core/EnvironmentKey/SubscriptionStoreButtonLabelKey.swift /Users/admin/builder/spi-builder-workspace/Sources/FlareUI/Classes/Core/EnvironmentKey/SubscriptionTermsOfServiceDestinationKey.swift /Users/admin/builder/spi-builder-workspace/Sources/FlareUI/Classes/Core/EnvironmentKey/SubscriptionTermsOfServiceURLKey.swift /Users/admin/builder/spi-builder-workspace/Sources/FlareUI/Classes/Core/EnvironmentKey/SubscriptionViewTintKey.swift /Users/admin/builder/spi-builder-workspace/Sources/FlareUI/Classes/Core/EnvironmentKey/SubscriptionsWrapperViewStyleKey.swift /Users/admin/builder/spi-builder-workspace/Sources/FlareUI/Classes/Core/EnvironmentKey/TintColorKey.swift /Users/admin/builder/spi-builder-workspace/Sources/FlareUI/Classes/Core/Extensions/Array+RemoveDuplicates.swift /Users/admin/builder/spi-builder-workspace/Sources/FlareUI/Classes/Core/Extensions/String+SubSequence.swift /Users/admin/builder/spi-builder-workspace/Sources/FlareUI/Classes/Core/Extensions/StringProtocol+Words.swift /Users/admin/builder/spi-builder-workspace/Sources/FlareUI/Classes/Core/Extensions/View+EraseToAnyView.swift /Users/admin/builder/spi-builder-workspace/Sources/FlareUI/Classes/Core/Formatters/DateComponentsFormatter+Full.swift /Users/admin/builder/spi-builder-workspace/Sources/FlareUI/Classes/Core/Formatters/IDateComponentsFormatter.swift /Users/admin/builder/spi-builder-workspace/Sources/FlareUI/Classes/Core/Helpers/Array+StoreProduct.swift /Users/admin/builder/spi-builder-workspace/Sources/FlareUI/Classes/Core/Helpers/Color+UIColor.swift /Users/admin/builder/spi-builder-workspace/Sources/FlareUI/Classes/Core/Helpers/Error+IAP.swift /Users/admin/builder/spi-builder-workspace/Sources/FlareUI/Classes/Core/Helpers/Value.swift /Users/admin/builder/spi-builder-workspace/Sources/FlareUI/Classes/Core/Models/Internal/PriceDisplayFormat.swift /Users/admin/builder/spi-builder-workspace/Sources/FlareUI/Classes/Core/Models/Internal/ProductStyle.swift /Users/admin/builder/spi-builder-workspace/Sources/FlareUI/Classes/Core/Models/PaywallType.swift (in target 'FlareUI' from project 'Flare')
SwiftCompile normal arm64 /Users/admin/builder/spi-builder-workspace/Sources/FlareUI/Classes/Core/EnvironmentKey/SubscriptionStoreButtonLabelKey.swift (in target 'FlareUI' from project 'Flare')
    cd /Users/admin/builder/spi-builder-workspace/.swiftpm/xcode

SwiftCompile normal arm64 /Users/admin/builder/spi-builder-workspace/Sources/FlareUI/Classes/Core/EnvironmentKey/SubscriptionTermsOfServiceDestinationKey.swift (in target 'FlareUI' from project 'Flare')
    cd /Users/admin/builder/spi-builder-workspace/.swiftpm/xcode

SwiftCompile normal arm64 /Users/admin/builder/spi-builder-workspace/Sources/FlareUI/Classes/Core/EnvironmentKey/SubscriptionTermsOfServiceURLKey.swift (in target 'FlareUI' from project 'Flare')
    cd /Users/admin/builder/spi-builder-workspace/.swiftpm/xcode

SwiftCompile normal arm64 /Users/admin/builder/spi-builder-workspace/Sources/FlareUI/Classes/Core/EnvironmentKey/SubscriptionViewTintKey.swift (in target 'FlareUI' from project 'Flare')
    cd /Users/admin/builder/spi-builder-workspace/.swiftpm/xcode

SwiftCompile normal arm64 /Users/admin/builder/spi-builder-workspace/Sources/FlareUI/Classes/Core/EnvironmentKey/SubscriptionsWrapperViewStyleKey.swift (in target 'FlareUI' from project 'Flare')
    cd /Users/admin/builder/spi-builder-workspace/.swiftpm/xcode

SwiftCompile normal arm64 /Users/admin/builder/spi-builder-workspace/Sources/FlareUI/Classes/Core/EnvironmentKey/TintColorKey.swift (in target 'FlareUI' from project 'Flare')
    cd /Users/admin/builder/spi-builder-workspace/.swiftpm/xcode

SwiftCompile normal arm64 /Users/admin/builder/spi-builder-workspace/Sources/FlareUI/Classes/Core/Extensions/Array+RemoveDuplicates.swift (in target 'FlareUI' from project 'Flare')
    cd /Users/admin/builder/spi-builder-workspace/.swiftpm/xcode

SwiftCompile normal arm64 /Users/admin/builder/spi-builder-workspace/Sources/FlareUI/Classes/Core/Extensions/String+SubSequence.swift (in target 'FlareUI' from project 'Flare')
    cd /Users/admin/builder/spi-builder-workspace/.swiftpm/xcode

SwiftCompile normal arm64 /Users/admin/builder/spi-builder-workspace/Sources/FlareUI/Classes/Core/Extensions/StringProtocol+Words.swift (in target 'FlareUI' from project 'Flare')
    cd /Users/admin/builder/spi-builder-workspace/.swiftpm/xcode

SwiftCompile normal arm64 /Users/admin/builder/spi-builder-workspace/Sources/FlareUI/Classes/Core/Extensions/View+EraseToAnyView.swift (in target 'FlareUI' from project 'Flare')
    cd /Users/admin/builder/spi-builder-workspace/.swiftpm/xcode

SwiftCompile normal arm64 /Users/admin/builder/spi-builder-workspace/Sources/FlareUI/Classes/Core/Formatters/DateComponentsFormatter+Full.swift (in target 'FlareUI' from project 'Flare')
    cd /Users/admin/builder/spi-builder-workspace/.swiftpm/xcode

SwiftCompile normal arm64 /Users/admin/builder/spi-builder-workspace/Sources/FlareUI/Classes/Core/Formatters/IDateComponentsFormatter.swift (in target 'FlareUI' from project 'Flare')
    cd /Users/admin/builder/spi-builder-workspace/.swiftpm/xcode

SwiftCompile normal arm64 /Users/admin/builder/spi-builder-workspace/Sources/FlareUI/Classes/Core/Helpers/Array+StoreProduct.swift (in target 'FlareUI' from project 'Flare')
    cd /Users/admin/builder/spi-builder-workspace/.swiftpm/xcode

SwiftCompile normal arm64 /Users/admin/builder/spi-builder-workspace/Sources/FlareUI/Classes/Core/Helpers/Color+UIColor.swift (in target 'FlareUI' from project 'Flare')
    cd /Users/admin/builder/spi-builder-workspace/.swiftpm/xcode

SwiftCompile normal arm64 /Users/admin/builder/spi-builder-workspace/Sources/FlareUI/Classes/Core/Helpers/Error+IAP.swift (in target 'FlareUI' from project 'Flare')
    cd /Users/admin/builder/spi-builder-workspace/.swiftpm/xcode

SwiftCompile normal arm64 /Users/admin/builder/spi-builder-workspace/Sources/FlareUI/Classes/Core/Helpers/Value.swift (in target 'FlareUI' from project 'Flare')
    cd /Users/admin/builder/spi-builder-workspace/.swiftpm/xcode

SwiftCompile normal arm64 /Users/admin/builder/spi-builder-workspace/Sources/FlareUI/Classes/Core/Models/Internal/PriceDisplayFormat.swift (in target 'FlareUI' from project 'Flare')
    cd /Users/admin/builder/spi-builder-workspace/.swiftpm/xcode

SwiftCompile normal arm64 /Users/admin/builder/spi-builder-workspace/Sources/FlareUI/Classes/Core/Models/Internal/ProductStyle.swift (in target 'FlareUI' from project 'Flare')
    cd /Users/admin/builder/spi-builder-workspace/.swiftpm/xcode

SwiftCompile normal arm64 /Users/admin/builder/spi-builder-workspace/Sources/FlareUI/Classes/Core/Models/PaywallType.swift (in target 'FlareUI' from project 'Flare')
    cd /Users/admin/builder/spi-builder-workspace/.swiftpm/xcode

SwiftEmitModule normal arm64 Emitting\ module\ for\ FlareUI (in target 'FlareUI' from project 'Flare')
EmitSwiftModule normal arm64 (in target 'FlareUI' from project 'Flare')
    cd /Users/admin/builder/spi-builder-workspace/.swiftpm/xcode

SwiftCompile normal arm64 Compiling\ resource_bundle_accessor.swift,\ AnyProductStyle.swift,\ AnySubscriptionControlStyle.swift,\ ProductAssemblyKey.swift,\ StoreButtonsAssemblyKey.swift,\ BlurEffectStyleKey.swift,\ PoliciesButtonStyleKey.swift,\ ProductStyleKey.swift,\ PurchaseCompletionKey.swift,\ PurchaseOptionKey.swift,\ StoreButtonKey.swift,\ StoreButtonViewFontWeightKey.swift,\ SubscriptionBackgroundKey.swift,\ SubscriptionControlStyleKey.swift,\ SubscriptionHeaderContentBackgroundKey.swift,\ SubscriptionMarketingContentKey.swift,\ SubscriptionPickerItemBackgroundKey.swift,\ SubscriptionPrivacyPolicyDestinationKey.swift,\ SubscriptionPrivacyPolicyURLKey.swift /Users/admin/builder/spi-builder-workspace/.derivedData/Build/Intermediates.noindex/Flare.build/Debug/FlareUI.build/DerivedSources/resource_bundle_accessor.swift /Users/admin/builder/spi-builder-workspace/Sources/FlareUI/Classes/Core/EnvironmentKey/AnyProductStyle.swift /Users/admin/builder/spi-builder-workspace/Sources/FlareUI/Classes/Core/EnvironmentKey/AnySubscriptionControlStyle.swift /Users/admin/builder/spi-builder-workspace/Sources/FlareUI/Classes/Core/EnvironmentKey/Assemblies/ProductAssemblyKey.swift /Users/admin/builder/spi-builder-workspace/Sources/FlareUI/Classes/Core/EnvironmentKey/Assemblies/StoreButtonsAssemblyKey.swift /Users/admin/builder/spi-builder-workspace/Sources/FlareUI/Classes/Core/EnvironmentKey/BlurEffectStyleKey.swift /Users/admin/builder/spi-builder-workspace/Sources/FlareUI/Classes/Core/EnvironmentKey/PoliciesButtonStyleKey.swift /Users/admin/builder/spi-builder-workspace/Sources/FlareUI/Classes/Core/EnvironmentKey/ProductStyleKey.swift /Users/admin/builder/spi-builder-workspace/Sources/FlareUI/Classes/Core/EnvironmentKey/PurchaseCompletionKey.swift /Users/admin/builder/spi-builder-workspace/Sources/FlareUI/Classes/Core/EnvironmentKey/PurchaseOptionKey.swift /Users/admin/builder/spi-builder-workspace/Sources/FlareUI/Classes/Core/EnvironmentKey/StoreButtonKey.swift /Users/admin/builder/spi-builder-workspace/Sources/FlareUI/Classes/Core/EnvironmentKey/StoreButtonViewFontWeightKey.swift /Users/admin/builder/spi-builder-workspace/Sources/FlareUI/Classes/Core/EnvironmentKey/SubscriptionBackgroundKey.swift /Users/admin/builder/spi-builder-workspace/Sources/FlareUI/Classes/Core/EnvironmentKey/SubscriptionControlStyleKey.swift /Users/admin/builder/spi-builder-workspace/Sources/FlareUI/Classes/Core/EnvironmentKey/SubscriptionHeaderContentBackgroundKey.swift /Users/admin/builder/spi-builder-workspace/Sources/FlareUI/Classes/Core/EnvironmentKey/SubscriptionMarketingContentKey.swift /Users/admin/builder/spi-builder-workspace/Sources/FlareUI/Classes/Core/EnvironmentKey/SubscriptionPickerItemBackgroundKey.swift /Users/admin/builder/spi-builder-workspace/Sources/FlareUI/Classes/Core/EnvironmentKey/SubscriptionPrivacyPolicyDestinationKey.swift /Users/admin/builder/spi-builder-workspace/Sources/FlareUI/Classes/Core/EnvironmentKey/SubscriptionPrivacyPolicyURLKey.swift (in target 'FlareUI' from project 'Flare')
SwiftCompile normal arm64 /Users/admin/builder/spi-builder-workspace/.derivedData/Build/Intermediates.noindex/Flare.build/Debug/FlareUI.build/DerivedSources/resource_bundle_accessor.swift (in target 'FlareUI' from project 'Flare')
    cd /Users/admin/builder/spi-builder-workspace/.swiftpm/xcode

SwiftCompile normal arm64 /Users/admin/builder/spi-builder-workspace/Sources/FlareUI/Classes/Core/EnvironmentKey/AnyProductStyle.swift (in target 'FlareUI' from project 'Flare')
    cd /Users/admin/builder/spi-builder-workspace/.swiftpm/xcode

SwiftCompile normal arm64 /Users/admin/builder/spi-builder-workspace/Sources/FlareUI/Classes/Core/EnvironmentKey/AnySubscriptionControlStyle.swift (in target 'FlareUI' from project 'Flare')
    cd /Users/admin/builder/spi-builder-workspace/.swiftpm/xcode

SwiftCompile normal arm64 /Users/admin/builder/spi-builder-workspace/Sources/FlareUI/Classes/Core/EnvironmentKey/Assemblies/ProductAssemblyKey.swift (in target 'FlareUI' from project 'Flare')
    cd /Users/admin/builder/spi-builder-workspace/.swiftpm/xcode

SwiftCompile normal arm64 /Users/admin/builder/spi-builder-workspace/Sources/FlareUI/Classes/Core/EnvironmentKey/Assemblies/StoreButtonsAssemblyKey.swift (in target 'FlareUI' from project 'Flare')
    cd /Users/admin/builder/spi-builder-workspace/.swiftpm/xcode

SwiftCompile normal arm64 /Users/admin/builder/spi-builder-workspace/Sources/FlareUI/Classes/Core/EnvironmentKey/BlurEffectStyleKey.swift (in target 'FlareUI' from project 'Flare')
    cd /Users/admin/builder/spi-builder-workspace/.swiftpm/xcode

SwiftCompile normal arm64 /Users/admin/builder/spi-builder-workspace/Sources/FlareUI/Classes/Core/EnvironmentKey/PoliciesButtonStyleKey.swift (in target 'FlareUI' from project 'Flare')
    cd /Users/admin/builder/spi-builder-workspace/.swiftpm/xcode

SwiftCompile normal arm64 /Users/admin/builder/spi-builder-workspace/Sources/FlareUI/Classes/Core/EnvironmentKey/ProductStyleKey.swift (in target 'FlareUI' from project 'Flare')
    cd /Users/admin/builder/spi-builder-workspace/.swiftpm/xcode

SwiftCompile normal arm64 /Users/admin/builder/spi-builder-workspace/Sources/FlareUI/Classes/Core/EnvironmentKey/PurchaseCompletionKey.swift (in target 'FlareUI' from project 'Flare')
    cd /Users/admin/builder/spi-builder-workspace/.swiftpm/xcode

SwiftCompile normal arm64 /Users/admin/builder/spi-builder-workspace/Sources/FlareUI/Classes/Core/EnvironmentKey/PurchaseOptionKey.swift (in target 'FlareUI' from project 'Flare')
    cd /Users/admin/builder/spi-builder-workspace/.swiftpm/xcode

SwiftCompile normal arm64 /Users/admin/builder/spi-builder-workspace/Sources/FlareUI/Classes/Core/EnvironmentKey/StoreButtonKey.swift (in target 'FlareUI' from project 'Flare')
    cd /Users/admin/builder/spi-builder-workspace/.swiftpm/xcode

SwiftCompile normal arm64 /Users/admin/builder/spi-builder-workspace/Sources/FlareUI/Classes/Core/EnvironmentKey/StoreButtonViewFontWeightKey.swift (in target 'FlareUI' from project 'Flare')
    cd /Users/admin/builder/spi-builder-workspace/.swiftpm/xcode

SwiftCompile normal arm64 /Users/admin/builder/spi-builder-workspace/Sources/FlareUI/Classes/Core/EnvironmentKey/SubscriptionBackgroundKey.swift (in target 'FlareUI' from project 'Flare')
    cd /Users/admin/builder/spi-builder-workspace/.swiftpm/xcode

SwiftCompile normal arm64 /Users/admin/builder/spi-builder-workspace/Sources/FlareUI/Classes/Core/EnvironmentKey/SubscriptionControlStyleKey.swift (in target 'FlareUI' from project 'Flare')
    cd /Users/admin/builder/spi-builder-workspace/.swiftpm/xcode

SwiftCompile normal arm64 /Users/admin/builder/spi-builder-workspace/Sources/FlareUI/Classes/Core/EnvironmentKey/SubscriptionHeaderContentBackgroundKey.swift (in target 'FlareUI' from project 'Flare')
    cd /Users/admin/builder/spi-builder-workspace/.swiftpm/xcode

SwiftCompile normal arm64 /Users/admin/builder/spi-builder-workspace/Sources/FlareUI/Classes/Core/EnvironmentKey/SubscriptionMarketingContentKey.swift (in target 'FlareUI' from project 'Flare')
    cd /Users/admin/builder/spi-builder-workspace/.swiftpm/xcode

SwiftCompile normal arm64 /Users/admin/builder/spi-builder-workspace/Sources/FlareUI/Classes/Core/EnvironmentKey/SubscriptionPickerItemBackgroundKey.swift (in target 'FlareUI' from project 'Flare')
    cd /Users/admin/builder/spi-builder-workspace/.swiftpm/xcode

SwiftCompile normal arm64 /Users/admin/builder/spi-builder-workspace/Sources/FlareUI/Classes/Core/EnvironmentKey/SubscriptionPrivacyPolicyDestinationKey.swift (in target 'FlareUI' from project 'Flare')
    cd /Users/admin/builder/spi-builder-workspace/.swiftpm/xcode

SwiftCompile normal arm64 /Users/admin/builder/spi-builder-workspace/Sources/FlareUI/Classes/Core/EnvironmentKey/SubscriptionPrivacyPolicyURLKey.swift (in target 'FlareUI' from project 'Flare')
    cd /Users/admin/builder/spi-builder-workspace/.swiftpm/xcode

SwiftCompile normal arm64 Compiling\ View+SubscriptionViewTint.swift,\ View+TintColor.swift,\ ViewController+Child.swift,\ BorderedButtonStyle.swift,\ PrimaryButtonStyle.swift,\ CompactProductStyle.swift,\ ProductStyleConfiguration.swift,\ LargeProductStyle.swift,\ IProductStyle+Compact.swift,\ IProductStyle+Large.swift,\ IProductStyle.swift,\ SubscriptionStoreControlStyleConfiguration.swift,\ ISubscriptionControlStyle+Bordered.swift,\ ISubscriptionControlStyle+PickerSubscriptionStoreControlStyle+PickerSubscriptionStoreControlStyle.swift,\ ISubscriptionControlStyle+ProminentPickerSubscriptionStoreControlStyle.swift,\ ISubscriptionControlStyle.swift,\ AutomaticSubscriptionControlStyle.swift,\ BorderedSubscriptionStoreControlStyle.swift,\ BorderedSubscriptionStoreControlStyleView.swift /Users/admin/builder/spi-builder-workspace/Sources/FlareUI/Classes/Presentation/Components/Helpers/SUI/View+SubscriptionViewTint.swift /Users/admin/builder/spi-builder-workspace/Sources/FlareUI/Classes/Presentation/Components/Helpers/SUI/View+TintColor.swift /Users/admin/builder/spi-builder-workspace/Sources/FlareUI/Classes/Presentation/Components/Helpers/UIKit/ViewController+Child.swift /Users/admin/builder/spi-builder-workspace/Sources/FlareUI/Classes/Presentation/Components/Styles/BorderedButtonStyle.swift /Users/admin/builder/spi-builder-workspace/Sources/FlareUI/Classes/Presentation/Components/Styles/PrimaryButtonStyle.swift /Users/admin/builder/spi-builder-workspace/Sources/FlareUI/Classes/Presentation/Components/Styles/Product/CompactProductStyle.swift /Users/admin/builder/spi-builder-workspace/Sources/FlareUI/Classes/Presentation/Components/Styles/Product/Configuration/ProductStyleConfiguration.swift /Users/admin/builder/spi-builder-workspace/Sources/FlareUI/Classes/Presentation/Components/Styles/Product/LargeProductStyle.swift /Users/admin/builder/spi-builder-workspace/Sources/FlareUI/Classes/Presentation/Components/Styles/Product/Protocols/IProductStyle+Compact.swift /Users/admin/builder/spi-builder-workspace/Sources/FlareUI/Classes/Presentation/Components/Styles/Product/Protocols/IProductStyle+Large.swift /Users/admin/builder/spi-builder-workspace/Sources/FlareUI/Classes/Presentation/Components/Styles/Product/Protocols/IProductStyle.swift /Users/admin/builder/spi-builder-workspace/Sources/FlareUI/Classes/Presentation/Components/Styles/Subscription/Configuration/SubscriptionStoreControlStyleConfiguration.swift /Users/admin/builder/spi-builder-workspace/Sources/FlareUI/Classes/Presentation/Components/Styles/Subscription/Extensions/ISubscriptionControlStyle+Bordered.swift /Users/admin/builder/spi-builder-workspace/Sources/FlareUI/Classes/Presentation/Components/Styles/Subscription/Extensions/ISubscriptionControlStyle+PickerSubscriptionStoreControlStyle+PickerSubscriptionStoreControlStyle.swift /Users/admin/builder/spi-builder-workspace/Sources/FlareUI/Classes/Presentation/Components/Styles/Subscription/Extensions/ISubscriptionControlStyle+ProminentPickerSubscriptionStoreControlStyle.swift /Users/admin/builder/spi-builder-workspace/Sources/FlareUI/Classes/Presentation/Components/Styles/Subscription/Protocols/ISubscriptionControlStyle.swift /Users/admin/builder/spi-builder-workspace/Sources/FlareUI/Classes/Presentation/Components/Styles/Subscription/SubscriptionStoreControlStyle/AutomaticSubscriptionControlStyle.swift /Users/admin/builder/spi-builder-workspace/Sources/FlareUI/Classes/Presentation/Components/Styles/Subscription/SubscriptionStoreControlStyle/BorderedSubscriptionStoreControlStyle/BorderedSubscriptionStoreControlStyle.swift /Users/admin/builder/spi-builder-workspace/Sources/FlareUI/Classes/Presentation/Components/Styles/Subscription/SubscriptionStoreControlStyle/BorderedSubscriptionStoreControlStyle/BorderedSubscriptionStoreControlStyleView.swift (in target 'FlareUI' from project 'Flare')
SwiftDriverJobDiscovery normal arm64 Compiling IReceiptRefreshProvider.swift, ReceiptRefreshProvider.swift, IRedeemCodeProvider.swift, RedeemCodeProvider.swift, IRefundProvider.swift, RefundProvider.swift, IRefundRequestProvider.swift, RefundRequestProvider.swift, ISystemInfoProvider.swift, SystemInfoProvider.swift (in target 'Flare' from project 'Flare')
SwiftCompile normal arm64 Compiling\ ButtonSubscriptionStoreControlStyle.swift,\ CardButtonSubscriptionStoreControlStyle.swift,\ CardButtonSubscriptionStoreControlView.swift,\ PickerSubscriptionStoreControlStyle.swift,\ PickerSubscriptionStoreControlStyleView.swift,\ ProminentPickerSubscriptionStoreControlStyle.swift,\ ProminentPickerSubscriptionStoreControlStyleView.swift,\ ActivityIndicatorModifier.swift,\ BlurEffectModifier.swift,\ ErrorAlertViewModifier.swift,\ LoadViewModifier.swift,\ PaywallViewModifier.swift,\ ActivityIndicatorView.swift,\ BlurVisualEffectView.swift,\ ImageView.swift,\ ProductPlaceholderView.swift,\ SafariWebView.swift,\ ViewWrapper.swift /Users/admin/builder/spi-builder-workspace/Sources/FlareUI/Classes/Presentation/Components/Styles/Subscription/SubscriptionStoreControlStyle/ButtonSubscriptionStoreControlStyle/ButtonSubscriptionStoreControlStyle.swift /Users/admin/builder/spi-builder-workspace/Sources/FlareUI/Classes/Presentation/Components/Styles/Subscription/SubscriptionStoreControlStyle/CardButtonSubscriptionStoreControlStyle/CardButtonSubscriptionStoreControlStyle.swift /Users/admin/builder/spi-builder-workspace/Sources/FlareUI/Classes/Presentation/Components/Styles/Subscription/SubscriptionStoreControlStyle/CardButtonSubscriptionStoreControlStyle/CardButtonSubscriptionStoreControlView.swift /Users/admin/builder/spi-builder-workspace/Sources/FlareUI/Classes/Presentation/Components/Styles/Subscription/SubscriptionStoreControlStyle/PickerSubscriptionStoreControlStyle/PickerSubscriptionStoreControlStyle.swift /Users/admin/builder/spi-builder-workspace/Sources/FlareUI/Classes/Presentation/Components/Styles/Subscription/SubscriptionStoreControlStyle/PickerSubscriptionStoreControlStyle/PickerSubscriptionStoreControlStyleView.swift /Users/admin/builder/spi-builder-workspace/Sources/FlareUI/Classes/Presentation/Components/Styles/Subscription/SubscriptionStoreControlStyle/ProminentPickerSubscriptionStoreControlStyle/ProminentPickerSubscriptionStoreControlStyle.swift /Users/admin/builder/spi-builder-workspace/Sources/FlareUI/Classes/Presentation/Components/Styles/Subscription/SubscriptionStoreControlStyle/ProminentPickerSubscriptionStoreControlStyle/ProminentPickerSubscriptionStoreControlStyleView.swift /Users/admin/builder/spi-builder-workspace/Sources/FlareUI/Classes/Presentation/Components/ViewModifiers/ActivityIndicatorModifier.swift /Users/admin/builder/spi-builder-workspace/Sources/FlareUI/Classes/Presentation/Components/ViewModifiers/BlurEffectModifier.swift /Users/admin/builder/spi-builder-workspace/Sources/FlareUI/Classes/Presentation/Components/ViewModifiers/ErrorAlertViewModifier.swift /Users/admin/builder/spi-builder-workspace/Sources/FlareUI/Classes/Presentation/Components/ViewModifiers/LoadViewModifier.swift /Users/admin/builder/spi-builder-workspace/Sources/FlareUI/Classes/Presentation/Components/ViewModifiers/PaywallViewModifier.swift /Users/admin/builder/spi-builder-workspace/Sources/FlareUI/Classes/Presentation/Components/Views/ActivityIndicator/ActivityIndicatorView.swift /Users/admin/builder/spi-builder-workspace/Sources/FlareUI/Classes/Presentation/Components/Views/BlurVisualEffectView/BlurVisualEffectView.swift /Users/admin/builder/spi-builder-workspace/Sources/FlareUI/Classes/Presentation/Components/Views/ImageView/ImageView.swift /Users/admin/builder/spi-builder-workspace/Sources/FlareUI/Classes/Presentation/Components/Views/ProductPlaceholderView/ProductPlaceholderView.swift /Users/admin/builder/spi-builder-workspace/Sources/FlareUI/Classes/Presentation/Components/Views/SafariWebView/SafariWebView.swift /Users/admin/builder/spi-builder-workspace/Sources/FlareUI/Classes/Presentation/Helpers/ViewWrapper.swift (in target 'FlareUI' from project 'Flare')
Command SwiftCompile failed with a nonzero exit code
--- xcodebuild: WARNING: Using the first of multiple matching destinations:
{ platform:macOS, arch:arm64, id:3bcd22806c0d1809fdc2d48cc4defc51f321eb0f, name:My Mac }
{ platform:macOS, arch:arm64, variant:Mac Catalyst, id:3bcd22806c0d1809fdc2d48cc4defc51f321eb0f, name:My Mac }
{ platform:macOS, arch:arm64, variant:DriverKit, id:3bcd22806c0d1809fdc2d48cc4defc51f321eb0f, name:My Mac }
{ platform:macOS, arch:arm64, variant:Designed for [iPad,iPhone], id:3bcd22806c0d1809fdc2d48cc4defc51f321eb0f, name:My Mac }
** BUILD FAILED **
The following build commands failed:
	EmitSwiftModule normal arm64 (in target 'FlareMock' from project 'Flare')
	SwiftCompile normal arm64 Compiling\ StoreProduct+Fake.swift /Users/admin/builder/spi-builder-workspace/Sources/FlareMock/Fakes/StoreProduct+Fake.swift (in target 'FlareMock' from project 'Flare')
	SwiftCompile normal arm64 /Users/admin/builder/spi-builder-workspace/Sources/FlareMock/Fakes/StoreProduct+Fake.swift (in target 'FlareMock' from project 'Flare')
	SwiftCompile normal arm64 Compiling\ ButtonSubscriptionStoreControlStyle.swift,\ CardButtonSubscriptionStoreControlStyle.swift,\ CardButtonSubscriptionStoreControlView.swift,\ PickerSubscriptionStoreControlStyle.swift,\ PickerSubscriptionStoreControlStyleView.swift,\ ProminentPickerSubscriptionStoreControlStyle.swift,\ ProminentPickerSubscriptionStoreControlStyleView.swift,\ ActivityIndicatorModifier.swift,\ BlurEffectModifier.swift,\ ErrorAlertViewModifier.swift,\ LoadViewModifier.swift,\ PaywallViewModifier.swift,\ ActivityIndicatorView.swift,\ BlurVisualEffectView.swift,\ ImageView.swift,\ ProductPlaceholderView.swift,\ SafariWebView.swift,\ ViewWrapper.swift /Users/admin/builder/spi-builder-workspace/Sources/FlareUI/Classes/Presentation/Components/Styles/Subscription/SubscriptionStoreControlStyle/ButtonSubscriptionStoreControlStyle/ButtonSubscriptionStoreControlStyle.swift /Users/admin/builder/spi-builder-workspace/Sources/FlareUI/Classes/Presentation/Components/Styles/Subscription/SubscriptionStoreControlStyle/CardButtonSubscriptionStoreControlStyle/CardButtonSubscriptionStoreControlStyle.swift /Users/admin/builder/spi-builder-workspace/Sources/FlareUI/Classes/Presentation/Components/Styles/Subscription/SubscriptionStoreControlStyle/CardButtonSubscriptionStoreControlStyle/CardButtonSubscriptionStoreControlView.swift /Users/admin/builder/spi-builder-workspace/Sources/FlareUI/Classes/Presentation/Components/Styles/Subscription/SubscriptionStoreControlStyle/PickerSubscriptionStoreControlStyle/PickerSubscriptionStoreControlStyle.swift /Users/admin/builder/spi-builder-workspace/Sources/FlareUI/Classes/Presentation/Components/Styles/Subscription/SubscriptionStoreControlStyle/PickerSubscriptionStoreControlStyle/PickerSubscriptionStoreControlStyleView.swift /Users/admin/builder/spi-builder-workspace/Sources/FlareUI/Classes/Presentation/Components/Styles/Subscription/SubscriptionStoreControlStyle/ProminentPickerSubscriptionStoreControlStyle/ProminentPickerSubscriptionStoreControlStyle.swift /Users/admin/builder/spi-builder-workspace/Sources/FlareUI/Classes/Presentation/Components/Styles/Subscription/SubscriptionStoreControlStyle/ProminentPickerSubscriptionStoreControlStyle/ProminentPickerSubscriptionStoreControlStyleView.swift /Users/admin/builder/spi-builder-workspace/Sources/FlareUI/Classes/Presentation/Components/ViewModifiers/ActivityIndicatorModifier.swift /Users/admin/builder/spi-builder-workspace/Sources/FlareUI/Classes/Presentation/Components/ViewModifiers/BlurEffectModifier.swift /Users/admin/builder/spi-builder-workspace/Sources/FlareUI/Classes/Presentation/Components/ViewModifiers/ErrorAlertViewModifier.swift /Users/admin/builder/spi-builder-workspace/Sources/FlareUI/Classes/Presentation/Components/ViewModifiers/LoadViewModifier.swift /Users/admin/builder/spi-builder-workspace/Sources/FlareUI/Classes/Presentation/Components/ViewModifiers/PaywallViewModifier.swift /Users/admin/builder/spi-builder-workspace/Sources/FlareUI/Classes/Presentation/Components/Views/ActivityIndicator/ActivityIndicatorView.swift /Users/admin/builder/spi-builder-workspace/Sources/FlareUI/Classes/Presentation/Components/Views/BlurVisualEffectView/BlurVisualEffectView.swift /Users/admin/builder/spi-builder-workspace/Sources/FlareUI/Classes/Presentation/Components/Views/ImageView/ImageView.swift /Users/admin/builder/spi-builder-workspace/Sources/FlareUI/Classes/Presentation/Components/Views/ProductPlaceholderView/ProductPlaceholderView.swift /Users/admin/builder/spi-builder-workspace/Sources/FlareUI/Classes/Presentation/Components/Views/SafariWebView/SafariWebView.swift /Users/admin/builder/spi-builder-workspace/Sources/FlareUI/Classes/Presentation/Helpers/ViewWrapper.swift (in target 'FlareUI' from project 'Flare')
	Building workspace spi-builder-workspace with scheme Flare-Package
(5 failures)
BUILD FAILURE 6.1 macosXcodebuild