Build Information
Failed to build ViewController, reference develop (526dbb
), with Swift 6.1 for visionOS using Xcode 16.3 on 26 Apr 2025 23:04:01 UTC.
Build Command
env DEVELOPER_DIR=/Applications/Xcode-16.3.0.app xcrun xcodebuild -IDEClonedSourcePackagesDirPathOverride=$PWD/.dependencies -skipMacroValidation -skipPackagePluginValidation -derivedDataPath $PWD/.derivedData build -scheme ViewController -destination generic/platform=xrOS
Build Log
========================================
RunAll
========================================
Builder version: 4.61.0
Interrupt handler set up.
========================================
Checkout
========================================
Clone URL: https://github.com/ZeeZide/ViewController.git
Reference: develop
Initialized empty Git repository in /Users/admin/builder/spi-builder-workspace/.git/
From https://github.com/ZeeZide/ViewController
* branch develop -> FETCH_HEAD
* [new branch] develop -> origin/develop
HEAD is now at 526dbb0 Add support for VC specific loglevel
Cloned https://github.com/ZeeZide/ViewController.git
Revision (git rev-parse @):
526dbb0a929fc73518b87a4e3d354dac8d074044
SUCCESS checkout https://github.com/ZeeZide/ViewController.git at develop
========================================
Build
========================================
Selected platform: visionOS
Swift version: 6.1
Building package at path: $PWD
https://github.com/ZeeZide/ViewController.git
https://github.com/ZeeZide/ViewController.git
{
"dependencies" : [
],
"manifest_display_name" : "ViewController",
"name" : "ViewController",
"path" : "/Users/admin/builder/spi-builder-workspace",
"platforms" : [
{
"name" : "macos",
"version" : "11.0"
},
{
"name" : "ios",
"version" : "15.0"
}
],
"products" : [
{
"name" : "ViewController",
"targets" : [
"ViewController"
],
"type" : {
"library" : [
"automatic"
]
}
}
],
"targets" : [
{
"c99name" : "ViewController",
"module_type" : "SwiftTarget",
"name" : "ViewController",
"path" : "Sources/ViewController",
"product_memberships" : [
"ViewController"
],
"sources" : [
"AnyViewController.swift",
"ContainerViewControllers/NavigationController.swift",
"Debugging/DebugMode.swift",
"Debugging/DebugOverlay.swift",
"Debugging/HierarchyView.swift",
"Debugging/TypeMismatchInfoView.swift",
"Debugging/ViewControllerInfo.swift",
"Logger.swift",
"MainViewController.swift",
"NavigationLink/PushLink.swift",
"Presentations/AutoPresentation.swift",
"Presentations/Presentation.swift",
"Presentations/PresentationMode.swift",
"Presentations/ViewControllerPresentation.swift",
"ReExports.swift",
"RenderContentView.swift",
"ViewController.swift",
"ViewController/Containment.swift",
"ViewController/ContentView.swift",
"ViewController/DefaultDescription.swift",
"ViewController/RepresentedObject.swift",
"ViewController/Subscriptions.swift",
"ViewController/Title.swift",
"ViewController/TypeErasure.swift",
"ViewController/ViewControllerStorage.swift",
"ViewController/_ViewController.swift",
"ViewControllerEnvironment.swift",
"ViewControllerView.swift"
],
"type" : "library"
}
],
"tools_version" : "5.5"
}
Command line invocation:
/Applications/Xcode-16.3.0.app/Contents/Developer/usr/bin/xcodebuild -IDEClonedSourcePackagesDirPathOverride=/Users/admin/builder/spi-builder-workspace/.dependencies -resolvePackageDependencies
resolved source packages:
{
"dependencies" : [
],
"manifest_display_name" : "ViewController",
"name" : "ViewController",
"path" : "/Users/admin/builder/spi-builder-workspace",
"platforms" : [
{
"name" : "macos",
"version" : "11.0"
},
{
"name" : "ios",
"version" : "15.0"
}
],
"products" : [
{
"name" : "ViewController",
"targets" : [
"ViewController"
],
"type" : {
"library" : [
"automatic"
]
}
}
],
"targets" : [
{
"c99name" : "ViewController",
"module_type" : "SwiftTarget",
"name" : "ViewController",
"path" : "Sources/ViewController",
"product_memberships" : [
"ViewController"
],
"sources" : [
"AnyViewController.swift",
"ContainerViewControllers/NavigationController.swift",
"Debugging/DebugMode.swift",
"Debugging/DebugOverlay.swift",
"Debugging/HierarchyView.swift",
"Debugging/TypeMismatchInfoView.swift",
"Debugging/ViewControllerInfo.swift",
"Logger.swift",
"MainViewController.swift",
"NavigationLink/PushLink.swift",
"Presentations/AutoPresentation.swift",
"Presentations/Presentation.swift",
"Presentations/PresentationMode.swift",
"Presentations/ViewControllerPresentation.swift",
"ReExports.swift",
"RenderContentView.swift",
"ViewController.swift",
"ViewController/Containment.swift",
"ViewController/ContentView.swift",
"ViewController/DefaultDescription.swift",
"ViewController/RepresentedObject.swift",
"ViewController/Subscriptions.swift",
"ViewController/Title.swift",
"ViewController/TypeErasure.swift",
"ViewController/ViewControllerStorage.swift",
"ViewController/_ViewController.swift",
"ViewControllerEnvironment.swift",
"ViewControllerView.swift"
],
"type" : "library"
}
],
"tools_version" : "5.5"
}
{
"project" : {
"configurations" : [
"Debug",
"Release"
],
"name" : "ViewController",
"schemes" : [
"ViewController-iOS",
"ViewController-macOS"
],
"targets" : [
"ViewController-macOS",
"ViewController-iOS"
]
}
}
{
"workspace" : {
"name" : "spi-builder-workspace",
"schemes" : [
"ViewController"
]
}
}
Running build ...
env DEVELOPER_DIR=/Applications/Xcode-16.3.0.app xcrun xcodebuild -IDEClonedSourcePackagesDirPathOverride=$PWD/.dependencies -skipMacroValidation -skipPackagePluginValidation -derivedDataPath $PWD/.derivedData build -scheme ViewController -destination generic/platform=xrOS OTHER_SWIFT_FLAGS=-stats-output-dir .stats -strict-concurrency=complete -enable-upcoming-feature StrictConcurrency -enable-upcoming-feature DisableOutwardActorInference -enable-upcoming-feature GlobalActorIsolatedTypesUsability -enable-upcoming-feature InferSendableFromCaptures
Command line invocation:
/Applications/Xcode-16.3.0.app/Contents/Developer/usr/bin/xcodebuild -IDEClonedSourcePackagesDirPathOverride=/Users/admin/builder/spi-builder-workspace/.dependencies -skipMacroValidation -skipPackagePluginValidation -derivedDataPath /Users/admin/builder/spi-builder-workspace/.derivedData build -scheme ViewController -destination generic/platform=xrOS "OTHER_SWIFT_FLAGS=-stats-output-dir .stats -strict-concurrency=complete -enable-upcoming-feature StrictConcurrency -enable-upcoming-feature DisableOutwardActorInference -enable-upcoming-feature GlobalActorIsolatedTypesUsability -enable-upcoming-feature InferSendableFromCaptures"
Build settings from command line:
OTHER_SWIFT_FLAGS = -stats-output-dir .stats -strict-concurrency=complete -enable-upcoming-feature StrictConcurrency -enable-upcoming-feature DisableOutwardActorInference -enable-upcoming-feature GlobalActorIsolatedTypesUsability -enable-upcoming-feature InferSendableFromCaptures
Resolve Package Graph
Resolved source packages:
ViewController: /Users/admin/builder/spi-builder-workspace
ComputePackagePrebuildTargetDependencyGraph
Prepare packages
CreateBuildRequest
SendProjectDescription
CreateBuildOperation
ComputeTargetDependencyGraph
note: Building targets in dependency order
note: Target dependency graph (2 targets)
Target 'ViewController' in project 'ViewController'
➜ Explicit dependency on target 'ViewController' in project 'ViewController'
Target 'ViewController' in project 'ViewController' (no dependencies)
GatherProvisioningInputs
CreateBuildDescription
ExecuteExternalTool /Applications/Xcode-16.3.0.app/Contents/Developer/Toolchains/XcodeDefault.xctoolchain/usr/bin/clang -v -E -dM -isysroot /Applications/Xcode-16.3.0.app/Contents/Developer/Platforms/XROS.platform/Developer/SDKs/XROS2.4.sdk -x c -c /dev/null
ExecuteExternalTool /Applications/Xcode-16.3.0.app/Contents/Developer/Toolchains/XcodeDefault.xctoolchain/usr/bin/swiftc --version
ExecuteExternalTool /Applications/Xcode-16.3.0.app/Contents/Developer/Toolchains/XcodeDefault.xctoolchain/usr/bin/ld -version_details
Build description signature: 67d05f0bcbaa7c4e31eed5ed060f169c
Build description path: /Users/admin/builder/spi-builder-workspace/.derivedData/Build/Intermediates.noindex/XCBuildData/67d05f0bcbaa7c4e31eed5ed060f169c.xcbuilddata
ClangStatCache /Applications/Xcode-16.3.0.app/Contents/Developer/Toolchains/XcodeDefault.xctoolchain/usr/bin/clang-stat-cache /Applications/Xcode-16.3.0.app/Contents/Developer/Platforms/XROS.platform/Developer/SDKs/XROS2.4.sdk /Users/admin/builder/spi-builder-workspace/.derivedData/SDKStatCaches.noindex/xros2.4-22O233-407b76dbb837030756cbe1ab3f0b01b6.sdkstatcache
cd /Users/admin/builder/spi-builder-workspace/.swiftpm/xcode
/Applications/Xcode-16.3.0.app/Contents/Developer/Toolchains/XcodeDefault.xctoolchain/usr/bin/clang-stat-cache /Applications/Xcode-16.3.0.app/Contents/Developer/Platforms/XROS.platform/Developer/SDKs/XROS2.4.sdk -o /Users/admin/builder/spi-builder-workspace/.derivedData/SDKStatCaches.noindex/xros2.4-22O233-407b76dbb837030756cbe1ab3f0b01b6.sdkstatcache
CreateBuildDirectory /Users/admin/builder/spi-builder-workspace/.derivedData/Build/Products
cd /Users/admin/builder/spi-builder-workspace/.swiftpm/xcode
builtin-create-build-directory /Users/admin/builder/spi-builder-workspace/.derivedData/Build/Products
CreateBuildDirectory /Users/admin/builder/spi-builder-workspace/.derivedData/Build/Intermediates.noindex
cd /Users/admin/builder/spi-builder-workspace/.swiftpm/xcode
builtin-create-build-directory /Users/admin/builder/spi-builder-workspace/.derivedData/Build/Intermediates.noindex
CreateBuildDirectory /Users/admin/builder/spi-builder-workspace/.derivedData/Build/Products/Debug-xros
cd /Users/admin/builder/spi-builder-workspace/.swiftpm/xcode
builtin-create-build-directory /Users/admin/builder/spi-builder-workspace/.derivedData/Build/Products/Debug-xros
CreateBuildDirectory /Users/admin/builder/spi-builder-workspace/.derivedData/Build/Intermediates.noindex/EagerLinkingTBDs/Debug-xros
cd /Users/admin/builder/spi-builder-workspace/.swiftpm/xcode
builtin-create-build-directory /Users/admin/builder/spi-builder-workspace/.derivedData/Build/Intermediates.noindex/EagerLinkingTBDs/Debug-xros
CreateBuildDirectory /Users/admin/builder/spi-builder-workspace/.derivedData/Build/Products/Debug-xros/PackageFrameworks
cd /Users/admin/builder/spi-builder-workspace/.swiftpm/xcode
builtin-create-build-directory /Users/admin/builder/spi-builder-workspace/.derivedData/Build/Products/Debug-xros/PackageFrameworks
WriteAuxiliaryFile /Users/admin/builder/spi-builder-workspace/.derivedData/Build/Intermediates.noindex/ViewController.build/Debug-xros/ViewController.build/ViewController.DependencyMetadataFileList (in target 'ViewController' from project 'ViewController')
cd /Users/admin/builder/spi-builder-workspace
write-file /Users/admin/builder/spi-builder-workspace/.derivedData/Build/Intermediates.noindex/ViewController.build/Debug-xros/ViewController.build/ViewController.DependencyMetadataFileList
WriteAuxiliaryFile /Users/admin/builder/spi-builder-workspace/.derivedData/Build/Intermediates.noindex/ViewController.build/Debug-xros/ViewController.build/ViewController.DependencyStaticMetadataFileList (in target 'ViewController' from project 'ViewController')
cd /Users/admin/builder/spi-builder-workspace
write-file /Users/admin/builder/spi-builder-workspace/.derivedData/Build/Intermediates.noindex/ViewController.build/Debug-xros/ViewController.build/ViewController.DependencyStaticMetadataFileList
WriteAuxiliaryFile /Users/admin/builder/spi-builder-workspace/.derivedData/Build/Intermediates.noindex/ViewController.build/Debug-xros/ViewController.build/ViewController.modulemap (in target 'ViewController' from project 'ViewController')
cd /Users/admin/builder/spi-builder-workspace
write-file /Users/admin/builder/spi-builder-workspace/.derivedData/Build/Intermediates.noindex/ViewController.build/Debug-xros/ViewController.build/ViewController.modulemap
WriteAuxiliaryFile /Users/admin/builder/spi-builder-workspace/.derivedData/Build/Intermediates.noindex/ViewController.build/Debug-xros/ViewController.build/Objects-normal/arm64/ViewController.SwiftFileList (in target 'ViewController' from project 'ViewController')
cd /Users/admin/builder/spi-builder-workspace
write-file /Users/admin/builder/spi-builder-workspace/.derivedData/Build/Intermediates.noindex/ViewController.build/Debug-xros/ViewController.build/Objects-normal/arm64/ViewController.SwiftFileList
WriteAuxiliaryFile /Users/admin/builder/spi-builder-workspace/.derivedData/Build/Intermediates.noindex/ViewController.build/Debug-xros/ViewController.build/Objects-normal/arm64/ViewController-OutputFileMap.json (in target 'ViewController' from project 'ViewController')
cd /Users/admin/builder/spi-builder-workspace
write-file /Users/admin/builder/spi-builder-workspace/.derivedData/Build/Intermediates.noindex/ViewController.build/Debug-xros/ViewController.build/Objects-normal/arm64/ViewController-OutputFileMap.json
WriteAuxiliaryFile /Users/admin/builder/spi-builder-workspace/.derivedData/Build/Intermediates.noindex/ViewController.build/Debug-xros/ViewController.build/Objects-normal/arm64/ViewController.SwiftConstValuesFileList (in target 'ViewController' from project 'ViewController')
cd /Users/admin/builder/spi-builder-workspace
write-file /Users/admin/builder/spi-builder-workspace/.derivedData/Build/Intermediates.noindex/ViewController.build/Debug-xros/ViewController.build/Objects-normal/arm64/ViewController.SwiftConstValuesFileList
WriteAuxiliaryFile /Users/admin/builder/spi-builder-workspace/.derivedData/Build/Intermediates.noindex/ViewController.build/Debug-xros/ViewController.build/Objects-normal/arm64/ViewController.LinkFileList (in target 'ViewController' from project 'ViewController')
cd /Users/admin/builder/spi-builder-workspace
write-file /Users/admin/builder/spi-builder-workspace/.derivedData/Build/Intermediates.noindex/ViewController.build/Debug-xros/ViewController.build/Objects-normal/arm64/ViewController.LinkFileList
WriteAuxiliaryFile /Users/admin/builder/spi-builder-workspace/.derivedData/Build/Intermediates.noindex/ViewController.build/Debug-xros/ViewController.build/Objects-normal/arm64/ViewController_const_extract_protocols.json (in target 'ViewController' from project 'ViewController')
cd /Users/admin/builder/spi-builder-workspace
write-file /Users/admin/builder/spi-builder-workspace/.derivedData/Build/Intermediates.noindex/ViewController.build/Debug-xros/ViewController.build/Objects-normal/arm64/ViewController_const_extract_protocols.json
Copy /Users/admin/builder/spi-builder-workspace/.derivedData/Build/Intermediates.noindex/GeneratedModuleMaps-xros/ViewController.modulemap /Users/admin/builder/spi-builder-workspace/.derivedData/Build/Intermediates.noindex/ViewController.build/Debug-xros/ViewController.build/ViewController.modulemap (in target 'ViewController' from project 'ViewController')
cd /Users/admin/builder/spi-builder-workspace
builtin-copy -exclude .DS_Store -exclude CVS -exclude .svn -exclude .git -exclude .hg -resolve-src-symlinks /Users/admin/builder/spi-builder-workspace/.derivedData/Build/Intermediates.noindex/ViewController.build/Debug-xros/ViewController.build/ViewController.modulemap /Users/admin/builder/spi-builder-workspace/.derivedData/Build/Intermediates.noindex/GeneratedModuleMaps-xros
SwiftDriver ViewController normal arm64 com.apple.xcode.tools.swift.compiler (in target 'ViewController' from project 'ViewController')
cd /Users/admin/builder/spi-builder-workspace/.swiftpm/xcode
builtin-SwiftDriver -- /Applications/Xcode-16.3.0.app/Contents/Developer/Toolchains/XcodeDefault.xctoolchain/usr/bin/swiftc -module-name ViewController -Onone -enforce-exclusivity\=checked @/Users/admin/builder/spi-builder-workspace/.derivedData/Build/Intermediates.noindex/ViewController.build/Debug-xros/ViewController.build/Objects-normal/arm64/ViewController.SwiftFileList -DSWIFT_PACKAGE -DDEBUG -stats-output-dir .stats -strict-concurrency\=complete -enable-upcoming-feature StrictConcurrency -enable-upcoming-feature DisableOutwardActorInference -enable-upcoming-feature GlobalActorIsolatedTypesUsability -enable-upcoming-feature InferSendableFromCaptures -plugin-path /Applications/Xcode-16.3.0.app/Contents/Developer/Toolchains/XcodeDefault.xctoolchain/usr/lib/swift/host/plugins/testing -enable-experimental-feature DebugDescriptionMacro -sdk /Applications/Xcode-16.3.0.app/Contents/Developer/Platforms/XROS.platform/Developer/SDKs/XROS2.4.sdk -target arm64-apple-xros1.0 -g -module-cache-path /Users/admin/builder/spi-builder-workspace/.derivedData/ModuleCache.noindex -Xfrontend -serialize-debugging-options -enable-testing -index-store-path /Users/admin/builder/spi-builder-workspace/.derivedData/Index.noindex/DataStore -swift-version 5 -I /Users/admin/builder/spi-builder-workspace/.derivedData/Build/Products/Debug-xros -I /Applications/Xcode-16.3.0.app/Contents/Developer/Platforms/XROS.platform/Developer/usr/lib -F /Users/admin/builder/spi-builder-workspace/.derivedData/Build/Products/Debug-xros -F /Applications/Xcode-16.3.0.app/Contents/Developer/Platforms/XROS.platform/Developer/Library/Frameworks -F /Applications/Xcode-16.3.0.app/Contents/Developer/Platforms/XROS.platform/Developer/SDKs/XROS2.4.sdk/Developer/Library/Frameworks -c -j10 -enable-batch-mode -incremental -Xcc -ivfsstatcache -Xcc /Users/admin/builder/spi-builder-workspace/.derivedData/SDKStatCaches.noindex/xros2.4-22O233-407b76dbb837030756cbe1ab3f0b01b6.sdkstatcache -output-file-map /Users/admin/builder/spi-builder-workspace/.derivedData/Build/Intermediates.noindex/ViewController.build/Debug-xros/ViewController.build/Objects-normal/arm64/ViewController-OutputFileMap.json -use-frontend-parseable-output -save-temps -no-color-diagnostics -serialize-diagnostics -emit-dependencies -emit-module -emit-module-path /Users/admin/builder/spi-builder-workspace/.derivedData/Build/Intermediates.noindex/ViewController.build/Debug-xros/ViewController.build/Objects-normal/arm64/ViewController.swiftmodule -validate-clang-modules-once -clang-build-session-file /Users/admin/builder/spi-builder-workspace/.derivedData/ModuleCache.noindex/Session.modulevalidation -Xcc -I/Users/admin/builder/spi-builder-workspace/.derivedData/Build/Intermediates.noindex/ViewController.build/Debug-xros/ViewController.build/swift-overrides.hmap -emit-const-values -Xfrontend -const-gather-protocols-file -Xfrontend /Users/admin/builder/spi-builder-workspace/.derivedData/Build/Intermediates.noindex/ViewController.build/Debug-xros/ViewController.build/Objects-normal/arm64/ViewController_const_extract_protocols.json -Xcc -I/Users/admin/builder/spi-builder-workspace/.derivedData/Build/Products/Debug-xros/include -Xcc -I/Users/admin/builder/spi-builder-workspace/.derivedData/Build/Intermediates.noindex/ViewController.build/Debug-xros/ViewController.build/DerivedSources-normal/arm64 -Xcc -I/Users/admin/builder/spi-builder-workspace/.derivedData/Build/Intermediates.noindex/ViewController.build/Debug-xros/ViewController.build/DerivedSources/arm64 -Xcc -I/Users/admin/builder/spi-builder-workspace/.derivedData/Build/Intermediates.noindex/ViewController.build/Debug-xros/ViewController.build/DerivedSources -Xcc -DSWIFT_PACKAGE -Xcc -DDEBUG\=1 -emit-objc-header -emit-objc-header-path /Users/admin/builder/spi-builder-workspace/.derivedData/Build/Intermediates.noindex/ViewController.build/Debug-xros/ViewController.build/Objects-normal/arm64/ViewController-Swift.h -working-directory /Users/admin/builder/spi-builder-workspace/.swiftpm/xcode -experimental-emit-module-separately -disable-cmo
SwiftCompile normal arm64 Compiling\ DebugOverlay.swift,\ HierarchyView.swift,\ TypeMismatchInfoView.swift /Users/admin/builder/spi-builder-workspace/Sources/ViewController/Debugging/DebugOverlay.swift /Users/admin/builder/spi-builder-workspace/Sources/ViewController/Debugging/HierarchyView.swift /Users/admin/builder/spi-builder-workspace/Sources/ViewController/Debugging/TypeMismatchInfoView.swift (in target 'ViewController' from project 'ViewController')
SwiftCompile normal arm64 /Users/admin/builder/spi-builder-workspace/Sources/ViewController/Debugging/DebugOverlay.swift (in target 'ViewController' from project 'ViewController')
cd /Users/admin/builder/spi-builder-workspace/.swiftpm/xcode
SwiftCompile normal arm64 /Users/admin/builder/spi-builder-workspace/Sources/ViewController/Debugging/HierarchyView.swift (in target 'ViewController' from project 'ViewController')
cd /Users/admin/builder/spi-builder-workspace/.swiftpm/xcode
SwiftCompile normal arm64 /Users/admin/builder/spi-builder-workspace/Sources/ViewController/Debugging/TypeMismatchInfoView.swift (in target 'ViewController' from project 'ViewController')
cd /Users/admin/builder/spi-builder-workspace/.swiftpm/xcode
SwiftCompile normal arm64 Compiling\ AnyViewController.swift,\ NavigationController.swift,\ DebugMode.swift /Users/admin/builder/spi-builder-workspace/Sources/ViewController/AnyViewController.swift /Users/admin/builder/spi-builder-workspace/Sources/ViewController/ContainerViewControllers/NavigationController.swift /Users/admin/builder/spi-builder-workspace/Sources/ViewController/Debugging/DebugMode.swift (in target 'ViewController' from project 'ViewController')
SwiftCompile normal arm64 /Users/admin/builder/spi-builder-workspace/Sources/ViewController/AnyViewController.swift (in target 'ViewController' from project 'ViewController')
cd /Users/admin/builder/spi-builder-workspace/.swiftpm/xcode
SwiftCompile normal arm64 /Users/admin/builder/spi-builder-workspace/Sources/ViewController/ContainerViewControllers/NavigationController.swift (in target 'ViewController' from project 'ViewController')
cd /Users/admin/builder/spi-builder-workspace/.swiftpm/xcode
SwiftCompile normal arm64 /Users/admin/builder/spi-builder-workspace/Sources/ViewController/Debugging/DebugMode.swift (in target 'ViewController' from project 'ViewController')
cd /Users/admin/builder/spi-builder-workspace/.swiftpm/xcode
SwiftCompile normal arm64 Compiling\ ViewControllerInfo.swift,\ Logger.swift,\ MainViewController.swift /Users/admin/builder/spi-builder-workspace/Sources/ViewController/Debugging/ViewControllerInfo.swift /Users/admin/builder/spi-builder-workspace/Sources/ViewController/Logger.swift /Users/admin/builder/spi-builder-workspace/Sources/ViewController/MainViewController.swift (in target 'ViewController' from project 'ViewController')
SwiftCompile normal arm64 /Users/admin/builder/spi-builder-workspace/Sources/ViewController/Debugging/ViewControllerInfo.swift (in target 'ViewController' from project 'ViewController')
cd /Users/admin/builder/spi-builder-workspace/.swiftpm/xcode
SwiftCompile normal arm64 /Users/admin/builder/spi-builder-workspace/Sources/ViewController/Logger.swift (in target 'ViewController' from project 'ViewController')
cd /Users/admin/builder/spi-builder-workspace/.swiftpm/xcode
SwiftCompile normal arm64 /Users/admin/builder/spi-builder-workspace/Sources/ViewController/MainViewController.swift (in target 'ViewController' from project 'ViewController')
cd /Users/admin/builder/spi-builder-workspace/.swiftpm/xcode
SwiftCompile normal arm64 Compiling\ PushLink.swift,\ AutoPresentation.swift,\ Presentation.swift /Users/admin/builder/spi-builder-workspace/Sources/ViewController/NavigationLink/PushLink.swift /Users/admin/builder/spi-builder-workspace/Sources/ViewController/Presentations/AutoPresentation.swift /Users/admin/builder/spi-builder-workspace/Sources/ViewController/Presentations/Presentation.swift (in target 'ViewController' from project 'ViewController')
SwiftCompile normal arm64 /Users/admin/builder/spi-builder-workspace/Sources/ViewController/NavigationLink/PushLink.swift (in target 'ViewController' from project 'ViewController')
cd /Users/admin/builder/spi-builder-workspace/.swiftpm/xcode
SwiftCompile normal arm64 /Users/admin/builder/spi-builder-workspace/Sources/ViewController/Presentations/AutoPresentation.swift (in target 'ViewController' from project 'ViewController')
cd /Users/admin/builder/spi-builder-workspace/.swiftpm/xcode
SwiftCompile normal arm64 /Users/admin/builder/spi-builder-workspace/Sources/ViewController/Presentations/Presentation.swift (in target 'ViewController' from project 'ViewController')
cd /Users/admin/builder/spi-builder-workspace/.swiftpm/xcode
SwiftCompile normal arm64 Compiling\ RenderContentView.swift,\ ViewController.swift,\ Containment.swift /Users/admin/builder/spi-builder-workspace/Sources/ViewController/RenderContentView.swift /Users/admin/builder/spi-builder-workspace/Sources/ViewController/ViewController.swift /Users/admin/builder/spi-builder-workspace/Sources/ViewController/ViewController/Containment.swift (in target 'ViewController' from project 'ViewController')
SwiftCompile normal arm64 /Users/admin/builder/spi-builder-workspace/Sources/ViewController/RenderContentView.swift (in target 'ViewController' from project 'ViewController')
cd /Users/admin/builder/spi-builder-workspace/.swiftpm/xcode
SwiftCompile normal arm64 /Users/admin/builder/spi-builder-workspace/Sources/ViewController/ViewController.swift (in target 'ViewController' from project 'ViewController')
cd /Users/admin/builder/spi-builder-workspace/.swiftpm/xcode
SwiftCompile normal arm64 /Users/admin/builder/spi-builder-workspace/Sources/ViewController/ViewController/Containment.swift (in target 'ViewController' from project 'ViewController')
cd /Users/admin/builder/spi-builder-workspace/.swiftpm/xcode
SwiftCompile normal arm64 Compiling\ Subscriptions.swift,\ Title.swift,\ TypeErasure.swift /Users/admin/builder/spi-builder-workspace/Sources/ViewController/ViewController/Subscriptions.swift /Users/admin/builder/spi-builder-workspace/Sources/ViewController/ViewController/Title.swift /Users/admin/builder/spi-builder-workspace/Sources/ViewController/ViewController/TypeErasure.swift (in target 'ViewController' from project 'ViewController')
SwiftCompile normal arm64 /Users/admin/builder/spi-builder-workspace/Sources/ViewController/ViewController/Subscriptions.swift (in target 'ViewController' from project 'ViewController')
cd /Users/admin/builder/spi-builder-workspace/.swiftpm/xcode
SwiftCompile normal arm64 /Users/admin/builder/spi-builder-workspace/Sources/ViewController/ViewController/Title.swift (in target 'ViewController' from project 'ViewController')
cd /Users/admin/builder/spi-builder-workspace/.swiftpm/xcode
SwiftCompile normal arm64 /Users/admin/builder/spi-builder-workspace/Sources/ViewController/ViewController/TypeErasure.swift (in target 'ViewController' from project 'ViewController')
cd /Users/admin/builder/spi-builder-workspace/.swiftpm/xcode
SwiftCompile normal arm64 Compiling\ ViewControllerStorage.swift,\ _ViewController.swift /Users/admin/builder/spi-builder-workspace/Sources/ViewController/ViewController/ViewControllerStorage.swift /Users/admin/builder/spi-builder-workspace/Sources/ViewController/ViewController/_ViewController.swift (in target 'ViewController' from project 'ViewController')
SwiftCompile normal arm64 /Users/admin/builder/spi-builder-workspace/Sources/ViewController/ViewController/ViewControllerStorage.swift (in target 'ViewController' from project 'ViewController')
cd /Users/admin/builder/spi-builder-workspace/.swiftpm/xcode
SwiftCompile normal arm64 /Users/admin/builder/spi-builder-workspace/Sources/ViewController/ViewController/_ViewController.swift (in target 'ViewController' from project 'ViewController')
cd /Users/admin/builder/spi-builder-workspace/.swiftpm/xcode
SwiftEmitModule normal arm64 Emitting\ module\ for\ ViewController (in target 'ViewController' from project 'ViewController')
Failed frontend command:
/Applications/Xcode-16.3.0.app/Contents/Developer/Toolchains/XcodeDefault.xctoolchain/usr/bin/swift-frontend -frontend -emit-module -experimental-skip-non-inlinable-function-bodies-without-types /Users/admin/builder/spi-builder-workspace/Sources/ViewController/AnyViewController.swift /Users/admin/builder/spi-builder-workspace/Sources/ViewController/ContainerViewControllers/NavigationController.swift /Users/admin/builder/spi-builder-workspace/Sources/ViewController/Debugging/DebugMode.swift /Users/admin/builder/spi-builder-workspace/Sources/ViewController/Debugging/DebugOverlay.swift /Users/admin/builder/spi-builder-workspace/Sources/ViewController/Debugging/HierarchyView.swift /Users/admin/builder/spi-builder-workspace/Sources/ViewController/Debugging/TypeMismatchInfoView.swift /Users/admin/builder/spi-builder-workspace/Sources/ViewController/Debugging/ViewControllerInfo.swift /Users/admin/builder/spi-builder-workspace/Sources/ViewController/Logger.swift /Users/admin/builder/spi-builder-workspace/Sources/ViewController/MainViewController.swift /Users/admin/builder/spi-builder-workspace/Sources/ViewController/NavigationLink/PushLink.swift /Users/admin/builder/spi-builder-workspace/Sources/ViewController/Presentations/AutoPresentation.swift /Users/admin/builder/spi-builder-workspace/Sources/ViewController/Presentations/Presentation.swift /Users/admin/builder/spi-builder-workspace/Sources/ViewController/Presentations/PresentationMode.swift /Users/admin/builder/spi-builder-workspace/Sources/ViewController/Presentations/ViewControllerPresentation.swift /Users/admin/builder/spi-builder-workspace/Sources/ViewController/ReExports.swift /Users/admin/builder/spi-builder-workspace/Sources/ViewController/RenderContentView.swift /Users/admin/builder/spi-builder-workspace/Sources/ViewController/ViewController.swift /Users/admin/builder/spi-builder-workspace/Sources/ViewController/ViewController/Containment.swift /Users/admin/builder/spi-builder-workspace/Sources/ViewController/ViewController/ContentView.swift /Users/admin/builder/spi-builder-workspace/Sources/ViewController/ViewController/DefaultDescription.swift /Users/admin/builder/spi-builder-workspace/Sources/ViewController/ViewController/RepresentedObject.swift /Users/admin/builder/spi-builder-workspace/Sources/ViewController/ViewController/Subscriptions.swift /Users/admin/builder/spi-builder-workspace/Sources/ViewController/ViewController/Title.swift /Users/admin/builder/spi-builder-workspace/Sources/ViewController/ViewController/TypeErasure.swift /Users/admin/builder/spi-builder-workspace/Sources/ViewController/ViewController/ViewControllerStorage.swift /Users/admin/builder/spi-builder-workspace/Sources/ViewController/ViewController/_ViewController.swift /Users/admin/builder/spi-builder-workspace/Sources/ViewController/ViewControllerEnvironment.swift /Users/admin/builder/spi-builder-workspace/Sources/ViewController/ViewControllerView.swift -target arm64-apple-xros1.0 -Xllvm -aarch64-use-tbi -enable-objc-interop -stack-check -sdk /Applications/Xcode-16.3.0.app/Contents/Developer/Platforms/XROS.platform/Developer/SDKs/XROS2.4.sdk -I /Users/admin/builder/spi-builder-workspace/.derivedData/Build/Products/Debug-xros -I /Applications/Xcode-16.3.0.app/Contents/Developer/Platforms/XROS.platform/Developer/usr/lib -F /Users/admin/builder/spi-builder-workspace/.derivedData/Build/Products/Debug-xros -F /Applications/Xcode-16.3.0.app/Contents/Developer/Platforms/XROS.platform/Developer/Library/Frameworks -F /Applications/Xcode-16.3.0.app/Contents/Developer/Platforms/XROS.platform/Developer/SDKs/XROS2.4.sdk/Developer/Library/Frameworks -no-color-diagnostics -enable-testing -g -debug-info-format\=dwarf -dwarf-version\=4 -module-cache-path /Users/admin/builder/spi-builder-workspace/.derivedData/ModuleCache.noindex -swift-version 5 -enforce-exclusivity\=checked -stats-output-dir /Users/admin/builder/spi-builder-workspace/.swiftpm/xcode/.stats -Onone -D SWIFT_PACKAGE -D DEBUG -serialize-debugging-options -const-gather-protocols-file /Users/admin/builder/spi-builder-workspace/.derivedData/Build/Intermediates.noindex/ViewController.build/Debug-xros/ViewController.build/Objects-normal/arm64/ViewController_const_extract_protocols.json -enable-upcoming-feature StrictConcurrency -enable-upcoming-feature DisableOutwardActorInference -enable-upcoming-feature GlobalActorIsolatedTypesUsability -enable-upcoming-feature InferSendableFromCaptures -enable-experimental-feature DebugDescriptionMacro -strict-concurrency\=complete -empty-abi-descriptor -plugin-path /Applications/Xcode-16.3.0.app/Contents/Developer/Toolchains/XcodeDefault.xctoolchain/usr/lib/swift/host/plugins/testing -validate-clang-modules-once -clang-build-session-file /Users/admin/builder/spi-builder-workspace/.derivedData/ModuleCache.noindex/Session.modulevalidation -Xcc -working-directory -Xcc /Users/admin/builder/spi-builder-workspace/.swiftpm/xcode -resource-dir /Applications/Xcode-16.3.0.app/Contents/Developer/Toolchains/XcodeDefault.xctoolchain/usr/lib/swift -enable-anonymous-context-mangled-names -file-compilation-dir /Users/admin/builder/spi-builder-workspace/.swiftpm/xcode -Xcc -ivfsstatcache -Xcc /Users/admin/builder/spi-builder-workspace/.derivedData/SDKStatCaches.noindex/xros2.4-22O233-407b76dbb837030756cbe1ab3f0b01b6.sdkstatcache -Xcc -I/Users/admin/builder/spi-builder-workspace/.derivedData/Build/Intermediates.noindex/ViewController.build/Debug-xros/ViewController.build/swift-overrides.hmap -Xcc -I/Users/admin/builder/spi-builder-workspace/.derivedData/Build/Products/Debug-xros/include -Xcc -I/Users/admin/builder/spi-builder-workspace/.derivedData/Build/Intermediates.noindex/ViewController.build/Debug-xros/ViewController.build/DerivedSources-normal/arm64 -Xcc -I/Users/admin/builder/spi-builder-workspace/.derivedData/Build/Intermediates.noindex/ViewController.build/Debug-xros/ViewController.build/DerivedSources/arm64 -Xcc -I/Users/admin/builder/spi-builder-workspace/.derivedData/Build/Intermediates.noindex/ViewController.build/Debug-xros/ViewController.build/DerivedSources -Xcc -DSWIFT_PACKAGE -Xcc -DDEBUG\=1 -module-name ViewController -frontend-parseable-output -disable-clang-spi -target-sdk-version 2.4 -target-sdk-name xros2.4 -external-plugin-path /Applications/Xcode-16.3.0.app/Contents/Developer/Platforms/XROS.platform/Developer/usr/lib/swift/host/plugins\#/Applications/Xcode-16.3.0.app/Contents/Developer/Platforms/XROS.platform/Developer/usr/bin/swift-plugin-server -external-plugin-path /Applications/Xcode-16.3.0.app/Contents/Developer/Platforms/XROS.platform/Developer/usr/local/lib/swift/host/plugins\#/Applications/Xcode-16.3.0.app/Contents/Developer/Platforms/XROS.platform/Developer/usr/bin/swift-plugin-server -in-process-plugin-server-path /Applications/Xcode-16.3.0.app/Contents/Developer/Toolchains/XcodeDefault.xctoolchain/usr/lib/swift/host/libSwiftInProcPluginServer.dylib -plugin-path /Applications/Xcode-16.3.0.app/Contents/Developer/Toolchains/XcodeDefault.xctoolchain/usr/lib/swift/host/plugins -plugin-path /Applications/Xcode-16.3.0.app/Contents/Developer/Toolchains/XcodeDefault.xctoolchain/usr/local/lib/swift/host/plugins -emit-module-doc-path /Users/admin/builder/spi-builder-workspace/.derivedData/Build/Intermediates.noindex/ViewController.build/Debug-xros/ViewController.build/Objects-normal/arm64/ViewController.swiftdoc -emit-module-source-info-path /Users/admin/builder/spi-builder-workspace/.derivedData/Build/Intermediates.noindex/ViewController.build/Debug-xros/ViewController.build/Objects-normal/arm64/ViewController.swiftsourceinfo -emit-objc-header-path /Users/admin/builder/spi-builder-workspace/.derivedData/Build/Intermediates.noindex/ViewController.build/Debug-xros/ViewController.build/Objects-normal/arm64/ViewController-Swift.h -serialize-diagnostics-path /Users/admin/builder/spi-builder-workspace/.derivedData/Build/Intermediates.noindex/ViewController.build/Debug-xros/ViewController.build/Objects-normal/arm64/ViewController-master-emit-module.dia -emit-dependencies-path /Users/admin/builder/spi-builder-workspace/.derivedData/Build/Intermediates.noindex/ViewController.build/Debug-xros/ViewController.build/Objects-normal/arm64/ViewController-master-emit-module.d -o /Users/admin/builder/spi-builder-workspace/.derivedData/Build/Intermediates.noindex/ViewController.build/Debug-xros/ViewController.build/Objects-normal/arm64/ViewController.swiftmodule -emit-abi-descriptor-path /Users/admin/builder/spi-builder-workspace/.derivedData/Build/Intermediates.noindex/ViewController.build/Debug-xros/ViewController.build/Objects-normal/arm64/ViewController.abi.json
EmitSwiftModule normal arm64 (in target 'ViewController' from project 'ViewController')
cd /Users/admin/builder/spi-builder-workspace/.swiftpm/xcode
/Users/admin/builder/spi-builder-workspace/Sources/ViewController/ViewController.swift:201:48: error: 'PresentationMode' is ambiguous for type lookup in this context
func present<VC>(_ viewController: VC, mode: PresentationMode)
^~~~~~~~~~~~~~~~
/Users/admin/builder/spi-builder-workspace/Sources/ViewController/Presentations/PresentationMode.swift:91:13: note: found this candidate
typealias PresentationMode = ViewControllerPresentationMode
^
/Users/admin/builder/spi-builder-workspace/Sources/ViewController/ViewController/_ViewController.swift:25:13: note: found this candidate
typealias PresentationMode = ViewControllerPresentationMode
^
/Users/admin/builder/spi-builder-workspace/Sources/ViewController/Debugging/DebugMode.swift:22:18: warning: static property 'defaultValue' is not concurrency-safe because non-'Sendable' type 'ViewControllerDebugMode' may have shared mutable state; this is an error in the Swift 6 language mode
static let defaultValue = ViewControllerDebugMode.overlay
^
/Users/admin/builder/spi-builder-workspace/Sources/ViewController/Debugging/DebugMode.swift:11:13: note: consider making enum 'ViewControllerDebugMode' conform to the 'Sendable' protocol
public enum ViewControllerDebugMode: Equatable {
^
, Sendable
/Users/admin/builder/spi-builder-workspace/Sources/ViewController/Debugging/DebugMode.swift:22:18: note: add '@MainActor' to make static property 'defaultValue' part of global actor 'MainActor'
static let defaultValue = ViewControllerDebugMode.overlay
^
/Users/admin/builder/spi-builder-workspace/Sources/ViewController/Debugging/DebugMode.swift:22:18: note: disable concurrency-safety checks if accesses are protected by an external synchronization mechanism
static let defaultValue = ViewControllerDebugMode.overlay
^
nonisolated(unsafe)
/Users/admin/builder/spi-builder-workspace/Sources/ViewController/Logger.swift:51:5: warning: let 'logger' is not concurrency-safe because non-'Sendable' type 'PrintLogger' may have shared mutable state; this is an error in the Swift 6 language mode
let logger = PrintLogger()
^
/Users/admin/builder/spi-builder-workspace/Sources/ViewController/Logger.swift:17:8: note: consider making struct 'PrintLogger' conform to the 'Sendable' protocol
struct PrintLogger {
^
: Sendable
/Users/admin/builder/spi-builder-workspace/Sources/ViewController/Logger.swift:51:5: note: add '@MainActor' to make let 'logger' part of global actor 'MainActor'
let logger = PrintLogger()
^
/Users/admin/builder/spi-builder-workspace/Sources/ViewController/Logger.swift:51:5: note: disable concurrency-safety checks if accesses are protected by an external synchronization mechanism
let logger = PrintLogger()
^
nonisolated(unsafe)
/Users/admin/builder/spi-builder-workspace/Sources/ViewController/Presentations/Presentation.swift:105:34: warning: capture of 'self' with non-sendable type 'Self' in a '@Sendable' closure
guard let presentation = self.activePresentation(for: mode) else {
^
ViewController._ViewController.Self:2:1: note: consider making generic parameter 'Self' conform to the 'Sendable' protocol
Self : ViewController._ViewController}
^
/Users/admin/builder/spi-builder-workspace/Sources/ViewController/Presentations/Presentation.swift:105:63: warning: capture of 'mode' with non-sendable type 'ViewControllerPresentationMode?' in a '@Sendable' closure
guard let presentation = self.activePresentation(for: mode) else {
^
/Users/admin/builder/spi-builder-workspace/Sources/ViewController/Presentations/PresentationMode.swift:29:13: note: consider making enum 'ViewControllerPresentationMode' conform to the 'Sendable' protocol
public enum ViewControllerPresentationMode: Hashable {
^
, Sendable
/Users/admin/builder/spi-builder-workspace/Sources/ViewController/Presentations/Presentation.swift:109:16: warning: capture of 'condition' with non-sendable type '(any _ViewController) -> Bool' in a '@Sendable' closure
return condition(presentation.viewController)
^
/Users/admin/builder/spi-builder-workspace/Sources/ViewController/Presentations/Presentation.swift:109:16: note: a function type must be marked '@Sendable' to conform to 'Sendable'
return condition(presentation.viewController)
^
/Users/admin/builder/spi-builder-workspace/Sources/ViewController/Presentations/Presentation.swift:117:34: warning: capture of 'self' with non-sendable type 'Self' in a '@Sendable' closure
guard let presentation = self.activePresentation(for: mode) else {
^
ViewController._ViewController.Self:2:1: note: consider making generic parameter 'Self' conform to the 'Sendable' protocol
Self : ViewController._ViewController}
^
/Users/admin/builder/spi-builder-workspace/Sources/ViewController/Presentations/Presentation.swift:117:63: warning: capture of 'mode' with non-sendable type 'ViewControllerPresentationMode?' in a '@Sendable' closure
guard let presentation = self.activePresentation(for: mode) else {
^
/Users/admin/builder/spi-builder-workspace/Sources/ViewController/Presentations/PresentationMode.swift:29:13: note: consider making enum 'ViewControllerPresentationMode' conform to the 'Sendable' protocol
public enum ViewControllerPresentationMode: Hashable {
^
, Sendable
/Users/admin/builder/spi-builder-workspace/Sources/ViewController/Presentations/Presentation.swift:127:15: warning: capture of 'condition' with non-sendable type '(any _ViewController) -> Bool' in a '@Sendable' closure
guard condition(presentation.viewController) else { return }
^
/Users/admin/builder/spi-builder-workspace/Sources/ViewController/Presentations/Presentation.swift:127:15: note: a function type must be marked '@Sendable' to conform to 'Sendable'
guard condition(presentation.viewController) else { return }
^
/Users/admin/builder/spi-builder-workspace/Sources/ViewController/Presentations/Presentation.swift:119:68: warning: implicit capture of 'self' requires that 'Self' conforms to 'Sendable'; this is an error in the Swift 6 language mode
return logger.debug("Did not find VC to deactivate in: \(self)")
^
ViewController._ViewController.Self:2:1: note: consider making generic parameter 'Self' conform to the 'Sendable' protocol
Self : ViewController._ViewController}
^
/Users/admin/builder/spi-builder-workspace/Sources/ViewController/Presentations/Presentation.swift:122:16: warning: implicit capture of 'mode' requires that 'ViewControllerPresentationMode?' conforms to 'Sendable'; this is an error in the Swift 6 language mode
assert(mode != .automatic)
^
/Users/admin/builder/spi-builder-workspace/Sources/ViewController/Presentations/PresentationMode.swift:29:13: note: consider making enum 'ViewControllerPresentationMode' conform to the 'Sendable' protocol
public enum ViewControllerPresentationMode: Hashable {
^
, Sendable
/Users/admin/builder/spi-builder-workspace/Sources/ViewController/Presentations/Presentation.swift:157:12: warning: capture of 'self' with non-sendable type 'Self' in a '@Sendable' closure
if self.activePresentations.contains(where: { $0.mode == mode }) {
^
ViewController._ViewController.Self:2:1: note: consider making generic parameter 'Self' conform to the 'Sendable' protocol
Self : ViewController._ViewController}
^
/Users/admin/builder/spi-builder-workspace/Sources/ViewController/Presentations/Presentation.swift:157:66: warning: capture of 'mode' with non-sendable type 'ViewControllerPresentationMode' in a '@Sendable' closure
if self.activePresentations.contains(where: { $0.mode == mode }) {
^
/Users/admin/builder/spi-builder-workspace/Sources/ViewController/Presentations/PresentationMode.swift:29:13: note: consider making enum 'ViewControllerPresentationMode' conform to the 'Sendable' protocol
public enum ViewControllerPresentationMode: Hashable {
^
, Sendable
/Users/admin/builder/spi-builder-workspace/Sources/ViewController/Presentations/Presentation.swift:157:66: warning: capture of 'mode' with non-sendable type 'ViewControllerPresentationMode' in an isolated closure; this is an error in the Swift 6 language mode
if self.activePresentations.contains(where: { $0.mode == mode }) {
^
/Users/admin/builder/spi-builder-workspace/Sources/ViewController/Presentations/PresentationMode.swift:29:13: note: consider making enum 'ViewControllerPresentationMode' conform to the 'Sendable' protocol
public enum ViewControllerPresentationMode: Hashable {
^
, Sendable
/Users/admin/builder/spi-builder-workspace/Sources/ViewController/Presentations/Presentation.swift:158:49: warning: implicit capture of 'mode' requires that 'ViewControllerPresentationMode' conforms to 'Sendable'; this is an error in the Swift 6 language mode
logger.debug("Is presenting in mode \(mode): \(self)")
^
/Users/admin/builder/spi-builder-workspace/Sources/ViewController/Presentations/PresentationMode.swift:29:13: note: consider making enum 'ViewControllerPresentationMode' conform to the 'Sendable' protocol
public enum ViewControllerPresentationMode: Hashable {
^
, Sendable
/Users/admin/builder/spi-builder-workspace/Sources/ViewController/Presentations/Presentation.swift:158:58: warning: implicit capture of 'self' requires that 'Self' conforms to 'Sendable'; this is an error in the Swift 6 language mode
logger.debug("Is presenting in mode \(mode): \(self)")
^
ViewController._ViewController.Self:2:1: note: consider making generic parameter 'Self' conform to the 'Sendable' protocol
Self : ViewController._ViewController}
^
/Users/admin/builder/spi-builder-workspace/Sources/ViewController/Presentations/Presentation.swift:162:50: warning: implicit capture of 'mode' requires that 'ViewControllerPresentationMode' conforms to 'Sendable'; this is an error in the Swift 6 language mode
logger.debug("Not presenting in mode \(mode): \(self)")
^
/Users/admin/builder/spi-builder-workspace/Sources/ViewController/Presentations/PresentationMode.swift:29:13: note: consider making enum 'ViewControllerPresentationMode' conform to the 'Sendable' protocol
public enum ViewControllerPresentationMode: Hashable {
^
, Sendable
/Users/admin/builder/spi-builder-workspace/Sources/ViewController/Presentations/Presentation.swift:162:59: warning: implicit capture of 'self' requires that 'Self' conforms to 'Sendable'; this is an error in the Swift 6 language mode
logger.debug("Not presenting in mode \(mode): \(self)")
^
ViewController._ViewController.Self:2:1: note: consider making generic parameter 'Self' conform to the 'Sendable' protocol
Self : ViewController._ViewController}
^
/Users/admin/builder/spi-builder-workspace/Sources/ViewController/Presentations/Presentation.swift:172:14: warning: capture of 'self' with non-sendable type 'Self' in a '@Sendable' closure
if self.activePresentations.contains(where: { $0.mode == mode }) {
^
ViewController._ViewController.Self:2:1: note: consider making generic parameter 'Self' conform to the 'Sendable' protocol
Self : ViewController._ViewController}
^
/Users/admin/builder/spi-builder-workspace/Sources/ViewController/Presentations/Presentation.swift:172:68: warning: capture of 'mode' with non-sendable type 'ViewControllerPresentationMode' in a '@Sendable' closure
if self.activePresentations.contains(where: { $0.mode == mode }) {
^
/Users/admin/builder/spi-builder-workspace/Sources/ViewController/Presentations/PresentationMode.swift:29:13: note: consider making enum 'ViewControllerPresentationMode' conform to the 'Sendable' protocol
public enum ViewControllerPresentationMode: Hashable {
^
, Sendable
/Users/admin/builder/spi-builder-workspace/Sources/ViewController/Presentations/Presentation.swift:172:68: warning: capture of 'mode' with non-sendable type 'ViewControllerPresentationMode' in an isolated closure; this is an error in the Swift 6 language mode
if self.activePresentations.contains(where: { $0.mode == mode }) {
^
/Users/admin/builder/spi-builder-workspace/Sources/ViewController/Presentations/PresentationMode.swift:29:13: note: consider making enum 'ViewControllerPresentationMode' conform to the 'Sendable' protocol
public enum ViewControllerPresentationMode: Hashable {
^
, Sendable
/Users/admin/builder/spi-builder-workspace/Sources/ViewController/Presentations/Presentation.swift:179:65: warning: implicit capture of 'self' requires that 'Self' conforms to 'Sendable'; this is an error in the Swift 6 language mode
"Attempt to activate VC via Binding, won't work \(self)!")
^
ViewController._ViewController.Self:2:1: note: consider making generic parameter 'Self' conform to the 'Sendable' protocol
Self : ViewController._ViewController}
^
/Users/admin/builder/spi-builder-workspace/Sources/ViewController/Presentations/Presentation.swift:189:41: warning: implicit capture of 'mode' requires that 'ViewControllerPresentationMode' conforms to 'Sendable'; this is an error in the Swift 6 language mode
"did not find VC for mode \(mode) to deactivate in: \(self)?")
^
/Users/admin/builder/spi-builder-workspace/Sources/ViewController/Presentations/PresentationMode.swift:29:13: note: consider making enum 'ViewControllerPresentationMode' conform to the 'Sendable' protocol
public enum ViewControllerPresentationMode: Hashable {
^
, Sendable
/Users/admin/builder/spi-builder-workspace/Sources/ViewController/Presentations/Presentation.swift:189:67: warning: implicit capture of 'self' requires that 'Self' conforms to 'Sendable'; this is an error in the Swift 6 language mode
"did not find VC for mode \(mode) to deactivate in: \(self)?")
^
ViewController._ViewController.Self:2:1: note: consider making generic parameter 'Self' conform to the 'Sendable' protocol
Self : ViewController._ViewController}
^
/Users/admin/builder/spi-builder-workspace/Sources/ViewController/Presentations/Presentation.swift:195:37: warning: implicit capture of 'mode' requires that 'ViewControllerPresentationMode' conforms to 'Sendable'; this is an error in the Swift 6 language mode
assert(presentation.mode == mode, "internal inconsistency!")
^
/Users/admin/builder/spi-builder-workspace/Sources/ViewController/Presentations/PresentationMode.swift:29:13: note: consider making enum 'ViewControllerPresentationMode' conform to the 'Sendable' protocol
public enum ViewControllerPresentationMode: Hashable {
^
, Sendable
/Users/admin/builder/spi-builder-workspace/Sources/ViewController/Presentations/PresentationMode.swift:98:23: warning: static property 'defaultValue' is not concurrency-safe because non-'Sendable' type 'ViewControllerPresentationMode' may have shared mutable state; this is an error in the Swift 6 language mode
public static let defaultValue = ViewController.PresentationMode.custom
^
/Users/admin/builder/spi-builder-workspace/Sources/ViewController/Presentations/PresentationMode.swift:29:13: note: consider making enum 'ViewControllerPresentationMode' conform to the 'Sendable' protocol
public enum ViewControllerPresentationMode: Hashable {
^
, Sendable
/Users/admin/builder/spi-builder-workspace/Sources/ViewController/Presentations/PresentationMode.swift:98:23: note: add '@MainActor' to make static property 'defaultValue' part of global actor 'MainActor'
public static let defaultValue = ViewController.PresentationMode.custom
^
@MainActor
/Users/admin/builder/spi-builder-workspace/Sources/ViewController/Presentations/PresentationMode.swift:98:23: note: disable concurrency-safety checks if accesses are protected by an external synchronization mechanism
public static let defaultValue = ViewController.PresentationMode.custom
^
nonisolated(unsafe)
/Users/admin/builder/spi-builder-workspace/Sources/ViewController/ViewController/ContentView.swift:20:41: warning: call to main actor-isolated initializer 'init()' in a synchronous nonisolated context; this is an error in the Swift 6 language mode
@ViewBuilder var view : ContentView { ContentView() }
^
/Users/admin/builder/spi-builder-workspace/Sources/ViewController/ViewControllerView.swift:18:3: note: calls to initializer 'init()' from outside of its actor context are implicitly asynchronous
init()
^
/Users/admin/builder/spi-builder-workspace/Sources/ViewController/ViewControllerView.swift:18:3: note: main actor isolation inferred from conformance to protocol 'View'
init()
^
/Users/admin/builder/spi-builder-workspace/Sources/ViewController/ViewController/ContentView.swift:49:5: warning: call to main actor-isolated initializer 'init(viewController:)' in a synchronous nonisolated context; this is an error in the Swift 6 language mode
ControlWrapper(viewController: self)
^
/Users/admin/builder/spi-builder-workspace/Sources/ViewController/ViewController/ContentView.swift:36:3: note: calls to initializer 'init(viewController:)' from outside of its actor context are implicitly asynchronous
init(viewController: VC) { self.viewController = viewController }
^
/Users/admin/builder/spi-builder-workspace/Sources/ViewController/ViewController/ContentView.swift:36:3: note: main actor isolation inferred from conformance to protocol 'View'
init(viewController: VC) { self.viewController = viewController }
^
/Users/admin/builder/spi-builder-workspace/Sources/ViewController/ViewController/ViewControllerStorage.swift:191:17: warning: var 'associatedObjectToken' is not concurrency-safe because it is nonisolated global shared mutable state; this is an error in the Swift 6 language mode
fileprivate var associatedObjectToken = 42
^
/Users/admin/builder/spi-builder-workspace/Sources/ViewController/ViewController/ViewControllerStorage.swift:191:17: note: convert 'associatedObjectToken' to a 'let' constant to make 'Sendable' shared state immutable
fileprivate var associatedObjectToken = 42
~~~ ^
let
/Users/admin/builder/spi-builder-workspace/Sources/ViewController/ViewController/ViewControllerStorage.swift:191:17: note: add '@MainActor' to make var 'associatedObjectToken' part of global actor 'MainActor'
fileprivate var associatedObjectToken = 42
^
@MainActor
/Users/admin/builder/spi-builder-workspace/Sources/ViewController/ViewController/ViewControllerStorage.swift:191:17: note: disable concurrency-safety checks if accesses are protected by an external synchronization mechanism
fileprivate var associatedObjectToken = 42
^
nonisolated(unsafe)
/Users/admin/builder/spi-builder-workspace/Sources/ViewController/ViewControllerEnvironment.swift:15:23: warning: static property 'defaultValue' is not concurrency-safe because non-'Sendable' type '(any _ViewController)?' may have shared mutable state; this is an error in the Swift 6 language mode
public static let defaultValue : _ViewController? = nil
^
/Users/admin/builder/spi-builder-workspace/Sources/ViewController/ViewController/_ViewController.swift:20:17: note: protocol '_ViewController' does not conform to the 'Sendable' protocol
public protocol _ViewController: AnyObject, CustomStringConvertible {
^
/Users/admin/builder/spi-builder-workspace/Sources/ViewController/ViewControllerEnvironment.swift:15:23: note: add '@MainActor' to make static property 'defaultValue' part of global actor 'MainActor'
public static let defaultValue : _ViewController? = nil
^
@MainActor
/Users/admin/builder/spi-builder-workspace/Sources/ViewController/ViewControllerEnvironment.swift:15:23: note: disable concurrency-safety checks if accesses are protected by an external synchronization mechanism
public static let defaultValue : _ViewController? = nil
^
nonisolated(unsafe)
SwiftCompile normal arm64 Compiling\ ViewControllerEnvironment.swift,\ ViewControllerView.swift /Users/admin/builder/spi-builder-workspace/Sources/ViewController/ViewControllerEnvironment.swift /Users/admin/builder/spi-builder-workspace/Sources/ViewController/ViewControllerView.swift (in target 'ViewController' from project 'ViewController')
SwiftCompile normal arm64 /Users/admin/builder/spi-builder-workspace/Sources/ViewController/ViewControllerEnvironment.swift (in target 'ViewController' from project 'ViewController')
cd /Users/admin/builder/spi-builder-workspace/.swiftpm/xcode
SwiftCompile normal arm64 /Users/admin/builder/spi-builder-workspace/Sources/ViewController/ViewControllerView.swift (in target 'ViewController' from project 'ViewController')
cd /Users/admin/builder/spi-builder-workspace/.swiftpm/xcode
SwiftCompile normal arm64 Compiling\ ContentView.swift,\ DefaultDescription.swift,\ RepresentedObject.swift /Users/admin/builder/spi-builder-workspace/Sources/ViewController/ViewController/ContentView.swift /Users/admin/builder/spi-builder-workspace/Sources/ViewController/ViewController/DefaultDescription.swift /Users/admin/builder/spi-builder-workspace/Sources/ViewController/ViewController/RepresentedObject.swift (in target 'ViewController' from project 'ViewController')
SwiftCompile normal arm64 /Users/admin/builder/spi-builder-workspace/Sources/ViewController/ViewController/ContentView.swift (in target 'ViewController' from project 'ViewController')
cd /Users/admin/builder/spi-builder-workspace/.swiftpm/xcode
SwiftCompile normal arm64 /Users/admin/builder/spi-builder-workspace/Sources/ViewController/ViewController/DefaultDescription.swift (in target 'ViewController' from project 'ViewController')
cd /Users/admin/builder/spi-builder-workspace/.swiftpm/xcode
SwiftCompile normal arm64 /Users/admin/builder/spi-builder-workspace/Sources/ViewController/ViewController/RepresentedObject.swift (in target 'ViewController' from project 'ViewController')
cd /Users/admin/builder/spi-builder-workspace/.swiftpm/xcode
SwiftCompile normal arm64 Compiling\ PresentationMode.swift,\ ViewControllerPresentation.swift,\ ReExports.swift /Users/admin/builder/spi-builder-workspace/Sources/ViewController/Presentations/PresentationMode.swift /Users/admin/builder/spi-builder-workspace/Sources/ViewController/Presentations/ViewControllerPresentation.swift /Users/admin/builder/spi-builder-workspace/Sources/ViewController/ReExports.swift (in target 'ViewController' from project 'ViewController')
Command SwiftCompile failed with a nonzero exit code
** BUILD FAILED **
The following build commands failed:
SwiftEmitModule normal arm64 Emitting\ module\ for\ ViewController (in target 'ViewController' from project 'ViewController')
EmitSwiftModule normal arm64 (in target 'ViewController' from project 'ViewController')
SwiftCompile normal arm64 Compiling\ PresentationMode.swift,\ ViewControllerPresentation.swift,\ ReExports.swift /Users/admin/builder/spi-builder-workspace/Sources/ViewController/Presentations/PresentationMode.swift /Users/admin/builder/spi-builder-workspace/Sources/ViewController/Presentations/ViewControllerPresentation.swift /Users/admin/builder/spi-builder-workspace/Sources/ViewController/ReExports.swift (in target 'ViewController' from project 'ViewController')
Building workspace spi-builder-workspace with scheme ViewController
(4 failures)
Command line invocation:
/Applications/Xcode-16.3.0.app/Contents/Developer/usr/bin/xcodebuild -IDEClonedSourcePackagesDirPathOverride=/Users/admin/builder/spi-builder-workspace/.dependencies -resolvePackageDependencies
Resolve Package Graph
Resolved source packages:
ViewController: /Users/admin/builder/spi-builder-workspace
resolved source packages: ViewController
{
"dependencies" : [
],
"manifest_display_name" : "ViewController",
"name" : "ViewController",
"path" : "/Users/admin/builder/spi-builder-workspace",
"platforms" : [
{
"name" : "macos",
"version" : "11.0"
},
{
"name" : "ios",
"version" : "15.0"
}
],
"products" : [
{
"name" : "ViewController",
"targets" : [
"ViewController"
],
"type" : {
"library" : [
"automatic"
]
}
}
],
"targets" : [
{
"c99name" : "ViewController",
"module_type" : "SwiftTarget",
"name" : "ViewController",
"path" : "Sources/ViewController",
"product_memberships" : [
"ViewController"
],
"sources" : [
"AnyViewController.swift",
"ContainerViewControllers/NavigationController.swift",
"Debugging/DebugMode.swift",
"Debugging/DebugOverlay.swift",
"Debugging/HierarchyView.swift",
"Debugging/TypeMismatchInfoView.swift",
"Debugging/ViewControllerInfo.swift",
"Logger.swift",
"MainViewController.swift",
"NavigationLink/PushLink.swift",
"Presentations/AutoPresentation.swift",
"Presentations/Presentation.swift",
"Presentations/PresentationMode.swift",
"Presentations/ViewControllerPresentation.swift",
"ReExports.swift",
"RenderContentView.swift",
"ViewController.swift",
"ViewController/Containment.swift",
"ViewController/ContentView.swift",
"ViewController/DefaultDescription.swift",
"ViewController/RepresentedObject.swift",
"ViewController/Subscriptions.swift",
"ViewController/Title.swift",
"ViewController/TypeErasure.swift",
"ViewController/ViewControllerStorage.swift",
"ViewController/_ViewController.swift",
"ViewControllerEnvironment.swift",
"ViewControllerView.swift"
],
"type" : "library"
}
],
"tools_version" : "5.5"
}
{
"workspace" : {
"name" : "spi-builder-workspace",
"schemes" : [
"ViewController"
]
}
}
Running build ...
env DEVELOPER_DIR=/Applications/Xcode-16.3.0.app xcrun xcodebuild -IDEClonedSourcePackagesDirPathOverride=$PWD/.dependencies -skipMacroValidation -skipPackagePluginValidation -derivedDataPath $PWD/.derivedData build -scheme ViewController -destination generic/platform=xrOS
Command line invocation:
/Applications/Xcode-16.3.0.app/Contents/Developer/usr/bin/xcodebuild -IDEClonedSourcePackagesDirPathOverride=/Users/admin/builder/spi-builder-workspace/.dependencies -skipMacroValidation -skipPackagePluginValidation -derivedDataPath /Users/admin/builder/spi-builder-workspace/.derivedData build -scheme ViewController -destination generic/platform=xrOS
Resolve Package Graph
Resolved source packages:
ViewController: /Users/admin/builder/spi-builder-workspace
ComputePackagePrebuildTargetDependencyGraph
Prepare packages
CreateBuildRequest
SendProjectDescription
CreateBuildOperation
ComputeTargetDependencyGraph
note: Building targets in dependency order
note: Target dependency graph (2 targets)
Target 'ViewController' in project 'ViewController'
➜ Explicit dependency on target 'ViewController' in project 'ViewController'
Target 'ViewController' in project 'ViewController' (no dependencies)
GatherProvisioningInputs
CreateBuildDescription
ExecuteExternalTool /Applications/Xcode-16.3.0.app/Contents/Developer/Toolchains/XcodeDefault.xctoolchain/usr/bin/clang -v -E -dM -isysroot /Applications/Xcode-16.3.0.app/Contents/Developer/Platforms/XROS.platform/Developer/SDKs/XROS2.4.sdk -x c -c /dev/null
ExecuteExternalTool /Applications/Xcode-16.3.0.app/Contents/Developer/Toolchains/XcodeDefault.xctoolchain/usr/bin/swiftc --version
ExecuteExternalTool /Applications/Xcode-16.3.0.app/Contents/Developer/Toolchains/XcodeDefault.xctoolchain/usr/bin/ld -version_details
Build description signature: 5227ac84f202cf1f6fe95b143d2b9799
Build description path: /Users/admin/builder/spi-builder-workspace/.derivedData/Build/Intermediates.noindex/XCBuildData/5227ac84f202cf1f6fe95b143d2b9799.xcbuilddata
ClangStatCache /Applications/Xcode-16.3.0.app/Contents/Developer/Toolchains/XcodeDefault.xctoolchain/usr/bin/clang-stat-cache /Applications/Xcode-16.3.0.app/Contents/Developer/Platforms/XROS.platform/Developer/SDKs/XROS2.4.sdk /Users/admin/builder/spi-builder-workspace/.derivedData/SDKStatCaches.noindex/xros2.4-22O233-407b76dbb837030756cbe1ab3f0b01b6.sdkstatcache
cd /Users/admin/builder/spi-builder-workspace/.swiftpm/xcode
/Applications/Xcode-16.3.0.app/Contents/Developer/Toolchains/XcodeDefault.xctoolchain/usr/bin/clang-stat-cache /Applications/Xcode-16.3.0.app/Contents/Developer/Platforms/XROS.platform/Developer/SDKs/XROS2.4.sdk -o /Users/admin/builder/spi-builder-workspace/.derivedData/SDKStatCaches.noindex/xros2.4-22O233-407b76dbb837030756cbe1ab3f0b01b6.sdkstatcache
SwiftDriver ViewController normal arm64 com.apple.xcode.tools.swift.compiler (in target 'ViewController' from project 'ViewController')
cd /Users/admin/builder/spi-builder-workspace/.swiftpm/xcode
builtin-SwiftDriver -- /Applications/Xcode-16.3.0.app/Contents/Developer/Toolchains/XcodeDefault.xctoolchain/usr/bin/swiftc -module-name ViewController -Onone -enforce-exclusivity\=checked @/Users/admin/builder/spi-builder-workspace/.derivedData/Build/Intermediates.noindex/ViewController.build/Debug-xros/ViewController.build/Objects-normal/arm64/ViewController.SwiftFileList -DSWIFT_PACKAGE -DDEBUG -DXcode -plugin-path /Applications/Xcode-16.3.0.app/Contents/Developer/Toolchains/XcodeDefault.xctoolchain/usr/lib/swift/host/plugins/testing -enable-experimental-feature DebugDescriptionMacro -sdk /Applications/Xcode-16.3.0.app/Contents/Developer/Platforms/XROS.platform/Developer/SDKs/XROS2.4.sdk -target arm64-apple-xros1.0 -g -module-cache-path /Users/admin/builder/spi-builder-workspace/.derivedData/ModuleCache.noindex -Xfrontend -serialize-debugging-options -enable-testing -index-store-path /Users/admin/builder/spi-builder-workspace/.derivedData/Index.noindex/DataStore -swift-version 5 -I /Users/admin/builder/spi-builder-workspace/.derivedData/Build/Products/Debug-xros -I /Applications/Xcode-16.3.0.app/Contents/Developer/Platforms/XROS.platform/Developer/usr/lib -F /Users/admin/builder/spi-builder-workspace/.derivedData/Build/Products/Debug-xros -F /Applications/Xcode-16.3.0.app/Contents/Developer/Platforms/XROS.platform/Developer/Library/Frameworks -F /Applications/Xcode-16.3.0.app/Contents/Developer/Platforms/XROS.platform/Developer/SDKs/XROS2.4.sdk/Developer/Library/Frameworks -c -j10 -enable-batch-mode -incremental -Xcc -ivfsstatcache -Xcc /Users/admin/builder/spi-builder-workspace/.derivedData/SDKStatCaches.noindex/xros2.4-22O233-407b76dbb837030756cbe1ab3f0b01b6.sdkstatcache -output-file-map /Users/admin/builder/spi-builder-workspace/.derivedData/Build/Intermediates.noindex/ViewController.build/Debug-xros/ViewController.build/Objects-normal/arm64/ViewController-OutputFileMap.json -use-frontend-parseable-output -save-temps -no-color-diagnostics -serialize-diagnostics -emit-dependencies -emit-module -emit-module-path /Users/admin/builder/spi-builder-workspace/.derivedData/Build/Intermediates.noindex/ViewController.build/Debug-xros/ViewController.build/Objects-normal/arm64/ViewController.swiftmodule -validate-clang-modules-once -clang-build-session-file /Users/admin/builder/spi-builder-workspace/.derivedData/ModuleCache.noindex/Session.modulevalidation -Xcc -I/Users/admin/builder/spi-builder-workspace/.derivedData/Build/Intermediates.noindex/ViewController.build/Debug-xros/ViewController.build/swift-overrides.hmap -emit-const-values -Xfrontend -const-gather-protocols-file -Xfrontend /Users/admin/builder/spi-builder-workspace/.derivedData/Build/Intermediates.noindex/ViewController.build/Debug-xros/ViewController.build/Objects-normal/arm64/ViewController_const_extract_protocols.json -Xcc -I/Users/admin/builder/spi-builder-workspace/.derivedData/Build/Products/Debug-xros/include -Xcc -I/Users/admin/builder/spi-builder-workspace/.derivedData/Build/Intermediates.noindex/ViewController.build/Debug-xros/ViewController.build/DerivedSources-normal/arm64 -Xcc -I/Users/admin/builder/spi-builder-workspace/.derivedData/Build/Intermediates.noindex/ViewController.build/Debug-xros/ViewController.build/DerivedSources/arm64 -Xcc -I/Users/admin/builder/spi-builder-workspace/.derivedData/Build/Intermediates.noindex/ViewController.build/Debug-xros/ViewController.build/DerivedSources -Xcc -DSWIFT_PACKAGE -Xcc -DDEBUG\=1 -emit-objc-header -emit-objc-header-path /Users/admin/builder/spi-builder-workspace/.derivedData/Build/Intermediates.noindex/ViewController.build/Debug-xros/ViewController.build/Objects-normal/arm64/ViewController-Swift.h -working-directory /Users/admin/builder/spi-builder-workspace/.swiftpm/xcode -experimental-emit-module-separately -disable-cmo
SwiftCompile normal arm64 Compiling\ PushLink.swift,\ AutoPresentation.swift,\ Presentation.swift /Users/admin/builder/spi-builder-workspace/Sources/ViewController/NavigationLink/PushLink.swift /Users/admin/builder/spi-builder-workspace/Sources/ViewController/Presentations/AutoPresentation.swift /Users/admin/builder/spi-builder-workspace/Sources/ViewController/Presentations/Presentation.swift (in target 'ViewController' from project 'ViewController')
SwiftCompile normal arm64 /Users/admin/builder/spi-builder-workspace/Sources/ViewController/NavigationLink/PushLink.swift (in target 'ViewController' from project 'ViewController')
cd /Users/admin/builder/spi-builder-workspace/.swiftpm/xcode
SwiftCompile normal arm64 /Users/admin/builder/spi-builder-workspace/Sources/ViewController/Presentations/AutoPresentation.swift (in target 'ViewController' from project 'ViewController')
cd /Users/admin/builder/spi-builder-workspace/.swiftpm/xcode
SwiftCompile normal arm64 /Users/admin/builder/spi-builder-workspace/Sources/ViewController/Presentations/Presentation.swift (in target 'ViewController' from project 'ViewController')
cd /Users/admin/builder/spi-builder-workspace/.swiftpm/xcode
SwiftCompile normal arm64 Compiling\ PresentationMode.swift,\ ViewControllerPresentation.swift,\ ReExports.swift /Users/admin/builder/spi-builder-workspace/Sources/ViewController/Presentations/PresentationMode.swift /Users/admin/builder/spi-builder-workspace/Sources/ViewController/Presentations/ViewControllerPresentation.swift /Users/admin/builder/spi-builder-workspace/Sources/ViewController/ReExports.swift (in target 'ViewController' from project 'ViewController')
SwiftCompile normal arm64 /Users/admin/builder/spi-builder-workspace/Sources/ViewController/Presentations/PresentationMode.swift (in target 'ViewController' from project 'ViewController')
cd /Users/admin/builder/spi-builder-workspace/.swiftpm/xcode
SwiftCompile normal arm64 /Users/admin/builder/spi-builder-workspace/Sources/ViewController/Presentations/ViewControllerPresentation.swift (in target 'ViewController' from project 'ViewController')
cd /Users/admin/builder/spi-builder-workspace/.swiftpm/xcode
SwiftCompile normal arm64 /Users/admin/builder/spi-builder-workspace/Sources/ViewController/ReExports.swift (in target 'ViewController' from project 'ViewController')
cd /Users/admin/builder/spi-builder-workspace/.swiftpm/xcode
SwiftCompile normal arm64 Compiling\ DebugOverlay.swift,\ HierarchyView.swift,\ TypeMismatchInfoView.swift /Users/admin/builder/spi-builder-workspace/Sources/ViewController/Debugging/DebugOverlay.swift /Users/admin/builder/spi-builder-workspace/Sources/ViewController/Debugging/HierarchyView.swift /Users/admin/builder/spi-builder-workspace/Sources/ViewController/Debugging/TypeMismatchInfoView.swift (in target 'ViewController' from project 'ViewController')
SwiftCompile normal arm64 /Users/admin/builder/spi-builder-workspace/Sources/ViewController/Debugging/DebugOverlay.swift (in target 'ViewController' from project 'ViewController')
cd /Users/admin/builder/spi-builder-workspace/.swiftpm/xcode
SwiftCompile normal arm64 /Users/admin/builder/spi-builder-workspace/Sources/ViewController/Debugging/HierarchyView.swift (in target 'ViewController' from project 'ViewController')
cd /Users/admin/builder/spi-builder-workspace/.swiftpm/xcode
SwiftCompile normal arm64 /Users/admin/builder/spi-builder-workspace/Sources/ViewController/Debugging/TypeMismatchInfoView.swift (in target 'ViewController' from project 'ViewController')
cd /Users/admin/builder/spi-builder-workspace/.swiftpm/xcode
SwiftCompile normal arm64 Compiling\ ViewControllerInfo.swift,\ Logger.swift,\ MainViewController.swift /Users/admin/builder/spi-builder-workspace/Sources/ViewController/Debugging/ViewControllerInfo.swift /Users/admin/builder/spi-builder-workspace/Sources/ViewController/Logger.swift /Users/admin/builder/spi-builder-workspace/Sources/ViewController/MainViewController.swift (in target 'ViewController' from project 'ViewController')
SwiftCompile normal arm64 /Users/admin/builder/spi-builder-workspace/Sources/ViewController/Debugging/ViewControllerInfo.swift (in target 'ViewController' from project 'ViewController')
cd /Users/admin/builder/spi-builder-workspace/.swiftpm/xcode
SwiftCompile normal arm64 /Users/admin/builder/spi-builder-workspace/Sources/ViewController/Logger.swift (in target 'ViewController' from project 'ViewController')
cd /Users/admin/builder/spi-builder-workspace/.swiftpm/xcode
SwiftCompile normal arm64 /Users/admin/builder/spi-builder-workspace/Sources/ViewController/MainViewController.swift (in target 'ViewController' from project 'ViewController')
cd /Users/admin/builder/spi-builder-workspace/.swiftpm/xcode
SwiftCompile normal arm64 Compiling\ AnyViewController.swift,\ NavigationController.swift,\ DebugMode.swift /Users/admin/builder/spi-builder-workspace/Sources/ViewController/AnyViewController.swift /Users/admin/builder/spi-builder-workspace/Sources/ViewController/ContainerViewControllers/NavigationController.swift /Users/admin/builder/spi-builder-workspace/Sources/ViewController/Debugging/DebugMode.swift (in target 'ViewController' from project 'ViewController')
SwiftCompile normal arm64 /Users/admin/builder/spi-builder-workspace/Sources/ViewController/AnyViewController.swift (in target 'ViewController' from project 'ViewController')
cd /Users/admin/builder/spi-builder-workspace/.swiftpm/xcode
SwiftCompile normal arm64 /Users/admin/builder/spi-builder-workspace/Sources/ViewController/ContainerViewControllers/NavigationController.swift (in target 'ViewController' from project 'ViewController')
cd /Users/admin/builder/spi-builder-workspace/.swiftpm/xcode
SwiftCompile normal arm64 /Users/admin/builder/spi-builder-workspace/Sources/ViewController/Debugging/DebugMode.swift (in target 'ViewController' from project 'ViewController')
cd /Users/admin/builder/spi-builder-workspace/.swiftpm/xcode
SwiftCompile normal arm64 Compiling\ Subscriptions.swift,\ Title.swift,\ TypeErasure.swift /Users/admin/builder/spi-builder-workspace/Sources/ViewController/ViewController/Subscriptions.swift /Users/admin/builder/spi-builder-workspace/Sources/ViewController/ViewController/Title.swift /Users/admin/builder/spi-builder-workspace/Sources/ViewController/ViewController/TypeErasure.swift (in target 'ViewController' from project 'ViewController')
SwiftCompile normal arm64 /Users/admin/builder/spi-builder-workspace/Sources/ViewController/ViewController/Subscriptions.swift (in target 'ViewController' from project 'ViewController')
cd /Users/admin/builder/spi-builder-workspace/.swiftpm/xcode
SwiftCompile normal arm64 /Users/admin/builder/spi-builder-workspace/Sources/ViewController/ViewController/Title.swift (in target 'ViewController' from project 'ViewController')
cd /Users/admin/builder/spi-builder-workspace/.swiftpm/xcode
SwiftCompile normal arm64 /Users/admin/builder/spi-builder-workspace/Sources/ViewController/ViewController/TypeErasure.swift (in target 'ViewController' from project 'ViewController')
cd /Users/admin/builder/spi-builder-workspace/.swiftpm/xcode
SwiftCompile normal arm64 Compiling\ ViewControllerEnvironment.swift,\ ViewControllerView.swift /Users/admin/builder/spi-builder-workspace/Sources/ViewController/ViewControllerEnvironment.swift /Users/admin/builder/spi-builder-workspace/Sources/ViewController/ViewControllerView.swift (in target 'ViewController' from project 'ViewController')
SwiftCompile normal arm64 /Users/admin/builder/spi-builder-workspace/Sources/ViewController/ViewControllerEnvironment.swift (in target 'ViewController' from project 'ViewController')
cd /Users/admin/builder/spi-builder-workspace/.swiftpm/xcode
SwiftCompile normal arm64 /Users/admin/builder/spi-builder-workspace/Sources/ViewController/ViewControllerView.swift (in target 'ViewController' from project 'ViewController')
cd /Users/admin/builder/spi-builder-workspace/.swiftpm/xcode
SwiftCompile normal arm64 Compiling\ ContentView.swift,\ DefaultDescription.swift,\ RepresentedObject.swift /Users/admin/builder/spi-builder-workspace/Sources/ViewController/ViewController/ContentView.swift /Users/admin/builder/spi-builder-workspace/Sources/ViewController/ViewController/DefaultDescription.swift /Users/admin/builder/spi-builder-workspace/Sources/ViewController/ViewController/RepresentedObject.swift (in target 'ViewController' from project 'ViewController')
SwiftCompile normal arm64 /Users/admin/builder/spi-builder-workspace/Sources/ViewController/ViewController/ContentView.swift (in target 'ViewController' from project 'ViewController')
cd /Users/admin/builder/spi-builder-workspace/.swiftpm/xcode
SwiftCompile normal arm64 /Users/admin/builder/spi-builder-workspace/Sources/ViewController/ViewController/DefaultDescription.swift (in target 'ViewController' from project 'ViewController')
cd /Users/admin/builder/spi-builder-workspace/.swiftpm/xcode
SwiftCompile normal arm64 /Users/admin/builder/spi-builder-workspace/Sources/ViewController/ViewController/RepresentedObject.swift (in target 'ViewController' from project 'ViewController')
cd /Users/admin/builder/spi-builder-workspace/.swiftpm/xcode
SwiftCompile normal arm64 Compiling\ ViewControllerStorage.swift,\ _ViewController.swift /Users/admin/builder/spi-builder-workspace/Sources/ViewController/ViewController/ViewControllerStorage.swift /Users/admin/builder/spi-builder-workspace/Sources/ViewController/ViewController/_ViewController.swift (in target 'ViewController' from project 'ViewController')
SwiftCompile normal arm64 /Users/admin/builder/spi-builder-workspace/Sources/ViewController/ViewController/ViewControllerStorage.swift (in target 'ViewController' from project 'ViewController')
cd /Users/admin/builder/spi-builder-workspace/.swiftpm/xcode
SwiftCompile normal arm64 /Users/admin/builder/spi-builder-workspace/Sources/ViewController/ViewController/_ViewController.swift (in target 'ViewController' from project 'ViewController')
cd /Users/admin/builder/spi-builder-workspace/.swiftpm/xcode
SwiftEmitModule normal arm64 Emitting\ module\ for\ ViewController (in target 'ViewController' from project 'ViewController')
Failed frontend command:
/Applications/Xcode-16.3.0.app/Contents/Developer/Toolchains/XcodeDefault.xctoolchain/usr/bin/swift-frontend -frontend -emit-module -experimental-skip-non-inlinable-function-bodies-without-types /Users/admin/builder/spi-builder-workspace/Sources/ViewController/AnyViewController.swift /Users/admin/builder/spi-builder-workspace/Sources/ViewController/ContainerViewControllers/NavigationController.swift /Users/admin/builder/spi-builder-workspace/Sources/ViewController/Debugging/DebugMode.swift /Users/admin/builder/spi-builder-workspace/Sources/ViewController/Debugging/DebugOverlay.swift /Users/admin/builder/spi-builder-workspace/Sources/ViewController/Debugging/HierarchyView.swift /Users/admin/builder/spi-builder-workspace/Sources/ViewController/Debugging/TypeMismatchInfoView.swift /Users/admin/builder/spi-builder-workspace/Sources/ViewController/Debugging/ViewControllerInfo.swift /Users/admin/builder/spi-builder-workspace/Sources/ViewController/Logger.swift /Users/admin/builder/spi-builder-workspace/Sources/ViewController/MainViewController.swift /Users/admin/builder/spi-builder-workspace/Sources/ViewController/NavigationLink/PushLink.swift /Users/admin/builder/spi-builder-workspace/Sources/ViewController/Presentations/AutoPresentation.swift /Users/admin/builder/spi-builder-workspace/Sources/ViewController/Presentations/Presentation.swift /Users/admin/builder/spi-builder-workspace/Sources/ViewController/Presentations/PresentationMode.swift /Users/admin/builder/spi-builder-workspace/Sources/ViewController/Presentations/ViewControllerPresentation.swift /Users/admin/builder/spi-builder-workspace/Sources/ViewController/ReExports.swift /Users/admin/builder/spi-builder-workspace/Sources/ViewController/RenderContentView.swift /Users/admin/builder/spi-builder-workspace/Sources/ViewController/ViewController.swift /Users/admin/builder/spi-builder-workspace/Sources/ViewController/ViewController/Containment.swift /Users/admin/builder/spi-builder-workspace/Sources/ViewController/ViewController/ContentView.swift /Users/admin/builder/spi-builder-workspace/Sources/ViewController/ViewController/DefaultDescription.swift /Users/admin/builder/spi-builder-workspace/Sources/ViewController/ViewController/RepresentedObject.swift /Users/admin/builder/spi-builder-workspace/Sources/ViewController/ViewController/Subscriptions.swift /Users/admin/builder/spi-builder-workspace/Sources/ViewController/ViewController/Title.swift /Users/admin/builder/spi-builder-workspace/Sources/ViewController/ViewController/TypeErasure.swift /Users/admin/builder/spi-builder-workspace/Sources/ViewController/ViewController/ViewControllerStorage.swift /Users/admin/builder/spi-builder-workspace/Sources/ViewController/ViewController/_ViewController.swift /Users/admin/builder/spi-builder-workspace/Sources/ViewController/ViewControllerEnvironment.swift /Users/admin/builder/spi-builder-workspace/Sources/ViewController/ViewControllerView.swift -target arm64-apple-xros1.0 -Xllvm -aarch64-use-tbi -enable-objc-interop -stack-check -sdk /Applications/Xcode-16.3.0.app/Contents/Developer/Platforms/XROS.platform/Developer/SDKs/XROS2.4.sdk -I /Users/admin/builder/spi-builder-workspace/.derivedData/Build/Products/Debug-xros -I /Applications/Xcode-16.3.0.app/Contents/Developer/Platforms/XROS.platform/Developer/usr/lib -F /Users/admin/builder/spi-builder-workspace/.derivedData/Build/Products/Debug-xros -F /Applications/Xcode-16.3.0.app/Contents/Developer/Platforms/XROS.platform/Developer/Library/Frameworks -F /Applications/Xcode-16.3.0.app/Contents/Developer/Platforms/XROS.platform/Developer/SDKs/XROS2.4.sdk/Developer/Library/Frameworks -no-color-diagnostics -enable-testing -g -debug-info-format\=dwarf -dwarf-version\=4 -module-cache-path /Users/admin/builder/spi-builder-workspace/.derivedData/ModuleCache.noindex -swift-version 5 -enforce-exclusivity\=checked -Onone -D SWIFT_PACKAGE -D DEBUG -D Xcode -serialize-debugging-options -const-gather-protocols-file /Users/admin/builder/spi-builder-workspace/.derivedData/Build/Intermediates.noindex/ViewController.build/Debug-xros/ViewController.build/Objects-normal/arm64/ViewController_const_extract_protocols.json -enable-experimental-feature DebugDescriptionMacro -empty-abi-descriptor -plugin-path /Applications/Xcode-16.3.0.app/Contents/Developer/Toolchains/XcodeDefault.xctoolchain/usr/lib/swift/host/plugins/testing -validate-clang-modules-once -clang-build-session-file /Users/admin/builder/spi-builder-workspace/.derivedData/ModuleCache.noindex/Session.modulevalidation -Xcc -working-directory -Xcc /Users/admin/builder/spi-builder-workspace/.swiftpm/xcode -resource-dir /Applications/Xcode-16.3.0.app/Contents/Developer/Toolchains/XcodeDefault.xctoolchain/usr/lib/swift -enable-anonymous-context-mangled-names -file-compilation-dir /Users/admin/builder/spi-builder-workspace/.swiftpm/xcode -Xcc -ivfsstatcache -Xcc /Users/admin/builder/spi-builder-workspace/.derivedData/SDKStatCaches.noindex/xros2.4-22O233-407b76dbb837030756cbe1ab3f0b01b6.sdkstatcache -Xcc -I/Users/admin/builder/spi-builder-workspace/.derivedData/Build/Intermediates.noindex/ViewController.build/Debug-xros/ViewController.build/swift-overrides.hmap -Xcc -I/Users/admin/builder/spi-builder-workspace/.derivedData/Build/Products/Debug-xros/include -Xcc -I/Users/admin/builder/spi-builder-workspace/.derivedData/Build/Intermediates.noindex/ViewController.build/Debug-xros/ViewController.build/DerivedSources-normal/arm64 -Xcc -I/Users/admin/builder/spi-builder-workspace/.derivedData/Build/Intermediates.noindex/ViewController.build/Debug-xros/ViewController.build/DerivedSources/arm64 -Xcc -I/Users/admin/builder/spi-builder-workspace/.derivedData/Build/Intermediates.noindex/ViewController.build/Debug-xros/ViewController.build/DerivedSources -Xcc -DSWIFT_PACKAGE -Xcc -DDEBUG\=1 -module-name ViewController -frontend-parseable-output -disable-clang-spi -target-sdk-version 2.4 -target-sdk-name xros2.4 -external-plugin-path /Applications/Xcode-16.3.0.app/Contents/Developer/Platforms/XROS.platform/Developer/usr/lib/swift/host/plugins\#/Applications/Xcode-16.3.0.app/Contents/Developer/Platforms/XROS.platform/Developer/usr/bin/swift-plugin-server -external-plugin-path /Applications/Xcode-16.3.0.app/Contents/Developer/Platforms/XROS.platform/Developer/usr/local/lib/swift/host/plugins\#/Applications/Xcode-16.3.0.app/Contents/Developer/Platforms/XROS.platform/Developer/usr/bin/swift-plugin-server -in-process-plugin-server-path /Applications/Xcode-16.3.0.app/Contents/Developer/Toolchains/XcodeDefault.xctoolchain/usr/lib/swift/host/libSwiftInProcPluginServer.dylib -plugin-path /Applications/Xcode-16.3.0.app/Contents/Developer/Toolchains/XcodeDefault.xctoolchain/usr/lib/swift/host/plugins -plugin-path /Applications/Xcode-16.3.0.app/Contents/Developer/Toolchains/XcodeDefault.xctoolchain/usr/local/lib/swift/host/plugins -emit-module-doc-path /Users/admin/builder/spi-builder-workspace/.derivedData/Build/Intermediates.noindex/ViewController.build/Debug-xros/ViewController.build/Objects-normal/arm64/ViewController.swiftdoc -emit-module-source-info-path /Users/admin/builder/spi-builder-workspace/.derivedData/Build/Intermediates.noindex/ViewController.build/Debug-xros/ViewController.build/Objects-normal/arm64/ViewController.swiftsourceinfo -emit-objc-header-path /Users/admin/builder/spi-builder-workspace/.derivedData/Build/Intermediates.noindex/ViewController.build/Debug-xros/ViewController.build/Objects-normal/arm64/ViewController-Swift.h -serialize-diagnostics-path /Users/admin/builder/spi-builder-workspace/.derivedData/Build/Intermediates.noindex/ViewController.build/Debug-xros/ViewController.build/Objects-normal/arm64/ViewController-master-emit-module.dia -emit-dependencies-path /Users/admin/builder/spi-builder-workspace/.derivedData/Build/Intermediates.noindex/ViewController.build/Debug-xros/ViewController.build/Objects-normal/arm64/ViewController-master-emit-module.d -o /Users/admin/builder/spi-builder-workspace/.derivedData/Build/Intermediates.noindex/ViewController.build/Debug-xros/ViewController.build/Objects-normal/arm64/ViewController.swiftmodule -emit-abi-descriptor-path /Users/admin/builder/spi-builder-workspace/.derivedData/Build/Intermediates.noindex/ViewController.build/Debug-xros/ViewController.build/Objects-normal/arm64/ViewController.abi.json
EmitSwiftModule normal arm64 (in target 'ViewController' from project 'ViewController')
cd /Users/admin/builder/spi-builder-workspace/.swiftpm/xcode
/Users/admin/builder/spi-builder-workspace/Sources/ViewController/ViewController.swift:201:48: error: 'PresentationMode' is ambiguous for type lookup in this context
func present<VC>(_ viewController: VC, mode: PresentationMode)
^~~~~~~~~~~~~~~~
/Users/admin/builder/spi-builder-workspace/Sources/ViewController/Presentations/PresentationMode.swift:91:13: note: found this candidate
typealias PresentationMode = ViewControllerPresentationMode
^
/Users/admin/builder/spi-builder-workspace/Sources/ViewController/ViewController/_ViewController.swift:25:13: note: found this candidate
typealias PresentationMode = ViewControllerPresentationMode
^
SwiftCompile normal arm64 Compiling\ RenderContentView.swift,\ ViewController.swift,\ Containment.swift /Users/admin/builder/spi-builder-workspace/Sources/ViewController/RenderContentView.swift /Users/admin/builder/spi-builder-workspace/Sources/ViewController/ViewController.swift /Users/admin/builder/spi-builder-workspace/Sources/ViewController/ViewController/Containment.swift (in target 'ViewController' from project 'ViewController')
Command SwiftCompile failed with a nonzero exit code
** BUILD FAILED **
The following build commands failed:
SwiftEmitModule normal arm64 Emitting\ module\ for\ ViewController (in target 'ViewController' from project 'ViewController')
EmitSwiftModule normal arm64 (in target 'ViewController' from project 'ViewController')
SwiftCompile normal arm64 Compiling\ RenderContentView.swift,\ ViewController.swift,\ Containment.swift /Users/admin/builder/spi-builder-workspace/Sources/ViewController/RenderContentView.swift /Users/admin/builder/spi-builder-workspace/Sources/ViewController/ViewController.swift /Users/admin/builder/spi-builder-workspace/Sources/ViewController/ViewController/Containment.swift (in target 'ViewController' from project 'ViewController')
Building workspace spi-builder-workspace with scheme ViewController
(4 failures)
BUILD FAILURE 6.1 visionOS