Build Information
Failed to build ZeeQL3PG, reference 0.9.2 (c31b78
), with Swift 5.9 for macOS (SPM) on 2 Dec 2024 19:09:20 UTC.
Build Command
env DEVELOPER_DIR=/Applications/Xcode-15.2.0.app xcrun swift build --arch arm64
Build Log
========================================
RunAll
========================================
Builder version: 4.58.3
Interrupt handler set up.
========================================
Checkout
========================================
Clone URL: https://github.com/ZeeQL/ZeeQL3PG.git
Reference: 0.9.2
Initialized empty Git repository in /Users/admin/builder/spi-builder-workspace/.git/
From https://github.com/ZeeQL/ZeeQL3PG
* tag 0.9.2 -> FETCH_HEAD
HEAD is now at c31b785 Merge branch 'develop'
Cloned https://github.com/ZeeQL/ZeeQL3PG.git
Revision (git rev-parse @):
c31b78543226d2afebf6f0df478a9459b087911a
SUCCESS checkout https://github.com/ZeeQL/ZeeQL3PG.git at 0.9.2
========================================
Build
========================================
Selected platform: macosSpm
Swift version: 5.9
Building package at path: $PWD
https://github.com/ZeeQL/ZeeQL3PG.git
Running build ...
env DEVELOPER_DIR=/Applications/Xcode-15.2.0.app xcrun swift build --arch arm64
Building for debugging...
[1/90] Compiling ZeeQL Key.swift
[2/90] Compiling ZeeQL KeyComparisonQualifier.swift
[3/90] Compiling ZeeQL KeyValueQualifier.swift
[4/90] Compiling ZeeQL ModelFetchSpecification.swift
[5/90] Compiling ZeeQL NotQualifier.swift
[6/90] Compiling ZeeQL ObjectStore.swift
[7/90] Compiling ZeeQL ObjectTrackingContext.swift
[8/90] Compiling ZeeQL Qualifier.swift
[9/90] Compiling ZeeQL QualifierEvaluation.swift
[10/90] Compiling ZeeQL QualifierParser.swift
[11/99] Emitting module ZeeQL
[12/99] Compiling ZeeQL AdaptorError.swift
[13/99] Compiling ZeeQL AdaptorModelFetch.swift
[14/99] Compiling ZeeQL AdaptorOperation.swift
[15/99] Compiling ZeeQL AdaptorQueryColumnRepresentable.swift
[16/99] Compiling ZeeQL AdaptorQueryType.swift
[17/99] Compiling ZeeQL AdaptorRecord.swift
[18/99] Compiling ZeeQL AdaptorRecordSchema.swift
[19/99] Compiling ZeeQL Attribute.swift
[20/99] Compiling ZeeQL AttributeKey.swift
[21/99] Compiling ZeeQL AttributeValue.swift
[22/99] Compiling ZeeQL Pluralize.swift
[23/99] Compiling ZeeQL SimpleKVC.swift
[24/99] Compiling ZeeQL SmartDescription.swift
[25/99] Compiling ZeeQL TimeRange.swift
[26/99] Compiling ZeeQL SQLite3Adaptor.swift
[27/99] Compiling ZeeQL SQLite3AdaptorChannel.swift
[28/99] Compiling ZeeQL SQLite3Expression.swift
[29/99] Compiling ZeeQL SQLite3ModelFetch.swift
[30/99] Compiling ZeeQL SQLite3SchemaSynchronizationFactory.swift
[31/99] Compiling ZeeQL BooleanQualifier.swift
[32/99] Compiling ZeeQL ComparisonOperation.swift
[33/99] Compiling ZeeQL CompoundQualifier.swift
[34/99] Compiling ZeeQL Constant.swift
[35/99] Compiling ZeeQL DataSource.swift
[36/99] Compiling ZeeQL EntityType.swift
[37/99] Compiling ZeeQL Expression.swift
[38/99] Compiling ZeeQL ExpressionEvaluation.swift
[39/99] Compiling ZeeQL FetchSpecification.swift
[40/99] Compiling ZeeQL GlobalID.swift
[41/99] Compiling ZeeQL QualifierVariable.swift
[42/99] Compiling ZeeQL QueryBuilder.swift
[43/99] Compiling ZeeQL SQLQualifier.swift
[44/99] Compiling ZeeQL SortOrdering.swift
[45/99] Compiling ZeeQL StoreKeyValueCoding.swift
[46/99] Compiling ZeeQL Dictionary+Extensions.swift
[47/99] Compiling ZeeQL EquatableType.swift
[48/99] Compiling ZeeQL KeyValueStringFormatter.swift
[49/99] Compiling ZeeQL Logger.swift
[50/99] Compiling ZeeQL AccessDataSource.swift
[51/99] Compiling ZeeQL AccessDataSourceError.swift
[52/99] Compiling ZeeQL AccessDataSourceFinders.swift
[53/99] Compiling ZeeQL ActiveDataSource.swift
[54/99] Compiling ZeeQL ActiveRecord.swift
[55/99] Compiling ZeeQL ActiveRecordType.swift
[56/99] Compiling ZeeQL Adaptor.swift
[57/99] Compiling ZeeQL AdaptorChannel.swift
[58/99] Compiling ZeeQL AdaptorChannelPool.swift
[59/99] Compiling ZeeQL AdaptorDataSource.swift
[60/99] Compiling ZeeQL AdaptorRecordDecoder.swift
[61/99] Compiling ZeeQL CodableEntity.swift
[62/99] Compiling ZeeQL CodableModel.swift
[63/99] Compiling ZeeQL CodableModelDecoder.swift
[64/99] Compiling ZeeQL CodableModelEntityDecoder.swift
[65/99] Compiling ZeeQL CodableModelPostProcessor.swift
[66/99] Compiling ZeeQL CodableRelationship.swift
[67/99] Compiling ZeeQL EntityPropertyReflectionContainer.swift
[68/99] Compiling ZeeQL CodeAttribute.swift
[69/99] Compiling ZeeQL CodeEntity.swift
[70/99] Compiling ZeeQL SQLExpression.swift
[71/99] Compiling ZeeQL SQLExpressionFactory.swift
[72/99] Compiling ZeeQL SQLForeignKey.swift
[73/99] Compiling ZeeQL SQLTableGroups.swift
[74/99] Compiling ZeeQL SchemaGeneration.swift
[75/99] Compiling ZeeQL SchemaSynchronization.swift
[76/99] Compiling ZeeQL SchemaSynchronizationFactory.swift
[77/99] Compiling ZeeQL TypedFetchSpecification.swift
[78/99] Compiling ZeeQL ZeeQLTypes.swift
[79/99] Compiling ZeeQL ArrayDataSource.swift
[80/99] Compiling ZeeQL CodeFetchSpecification.swift
[81/99] Compiling ZeeQL CodeRelationship.swift
[82/99] Compiling ZeeQL CodeValueAttribute.swift
[83/99] Compiling ZeeQL Database.swift
[84/99] Compiling ZeeQL DatabaseChannel.swift
[85/99] Compiling ZeeQL DatabaseContext.swift
[86/99] Compiling ZeeQL DatabaseDataSource.swift
[87/99] Compiling ZeeQL DatabaseObject.swift
[88/99] Compiling ZeeQL DatabaseOperation.swift
[89/99] Compiling ZeeQL Entity.swift
[90/99] Compiling ZeeQL FancyModelMaker.swift
[91/99] Compiling ZeeQL Join.swift
[92/99] Compiling ZeeQL MirrorHelpers.swift
[93/99] Compiling ZeeQL Model.swift
[94/99] Compiling ZeeQL ModelLoader.swift
[95/99] Compiling ZeeQL ModelPattern.swift
[96/99] Compiling ZeeQL ModelSQLizer.swift
[97/99] Compiling ZeeQL Property.swift
[98/99] Compiling ZeeQL Relationship.swift
[99/99] Compiling ZeeQL SQLAttributeChange.swift
[100/105] Compiling PostgreSQLAdaptor PostgreSQLOIDs.swift
<module-includes>:1:9: note: in file included from <module-includes>:1:
#import "CLibPQShim.h"
^
/Users/admin/builder/spi-builder-workspace/.build/checkouts/CLibPQ/Sources/CLibPQ/CLibPQShim.h:9:14: error: '/opt/homebrew/include/libpq-fe.h' file not found
# include "/opt/homebrew/include/libpq-fe.h"
^
/Users/admin/builder/spi-builder-workspace/Sources/PostgreSQLAdaptor/PostgreSQLAdaptor.swift:11:8: error: could not build Objective-C module 'CLibPQ'
import CLibPQ
^
error: emit-module command failed with exit code 1 (use -v to see invocation)
[101/105] Emitting module PostgreSQLAdaptor
<module-includes>:1:9: note: in file included from <module-includes>:1:
#import "CLibPQShim.h"
^
/Users/admin/builder/spi-builder-workspace/.build/checkouts/CLibPQ/Sources/CLibPQ/CLibPQShim.h:9:14: error: '/opt/homebrew/include/libpq-fe.h' file not found
# include "/opt/homebrew/include/libpq-fe.h"
^
/Users/admin/builder/spi-builder-workspace/Sources/PostgreSQLAdaptor/PostgreSQLAdaptor.swift:11:8: error: could not build Objective-C module 'CLibPQ'
import CLibPQ
^
[102/105] Compiling PostgreSQLAdaptor PostgreSQLAdaptorChannel.swift
<module-includes>:1:9: note: in file included from <module-includes>:1:
#import "CLibPQShim.h"
^
/Users/admin/builder/spi-builder-workspace/.build/checkouts/CLibPQ/Sources/CLibPQ/CLibPQShim.h:9:14: error: '/opt/homebrew/include/libpq-fe.h' file not found
# include "/opt/homebrew/include/libpq-fe.h"
^
/Users/admin/builder/spi-builder-workspace/Sources/PostgreSQLAdaptor/PostgreSQLAdaptor.swift:11:8: error: could not build Objective-C module 'CLibPQ'
import CLibPQ
^
[103/105] Compiling PostgreSQLAdaptor PostgreSQLAdaptor.swift
<module-includes>:1:9: note: in file included from <module-includes>:1:
#import "CLibPQShim.h"
^
/Users/admin/builder/spi-builder-workspace/.build/checkouts/CLibPQ/Sources/CLibPQ/CLibPQShim.h:9:14: error: '/opt/homebrew/include/libpq-fe.h' file not found
# include "/opt/homebrew/include/libpq-fe.h"
^
/Users/admin/builder/spi-builder-workspace/Sources/PostgreSQLAdaptor/PostgreSQLAdaptor.swift:11:8: error: could not build Objective-C module 'CLibPQ'
import CLibPQ
^
[104/105] Compiling PostgreSQLAdaptor PostgreSQLModelFetch.swift
<module-includes>:1:9: note: in file included from <module-includes>:1:
#import "CLibPQShim.h"
^
/Users/admin/builder/spi-builder-workspace/.build/checkouts/CLibPQ/Sources/CLibPQ/CLibPQShim.h:9:14: error: '/opt/homebrew/include/libpq-fe.h' file not found
# include "/opt/homebrew/include/libpq-fe.h"
^
/Users/admin/builder/spi-builder-workspace/Sources/PostgreSQLAdaptor/PostgreSQLAdaptor.swift:11:8: error: could not build Objective-C module 'CLibPQ'
import CLibPQ
^
[105/105] Compiling PostgreSQLAdaptor PostgreSQLExpression.swift
<module-includes>:1:9: note: in file included from <module-includes>:1:
#import "CLibPQShim.h"
^
/Users/admin/builder/spi-builder-workspace/.build/checkouts/CLibPQ/Sources/CLibPQ/CLibPQShim.h:9:14: error: '/opt/homebrew/include/libpq-fe.h' file not found
# include "/opt/homebrew/include/libpq-fe.h"
^
/Users/admin/builder/spi-builder-workspace/Sources/PostgreSQLAdaptor/PostgreSQLAdaptor.swift:11:8: error: could not build Objective-C module 'CLibPQ'
import CLibPQ
^
error: fatalError
Fetching https://github.com/ZeeQL/ZeeQL3.git
Fetching https://github.com/ZeeQL/CLibPQ.git
[1/45] Fetching clibpq
[46/3051] Fetching clibpq, zeeql3
Fetched https://github.com/ZeeQL/CLibPQ.git (5.75s)
Fetched https://github.com/ZeeQL/ZeeQL3.git (5.75s)
Computing version for https://github.com/ZeeQL/CLibPQ.git
Computed https://github.com/ZeeQL/CLibPQ.git at 2.0.5 (2.01s)
Computing version for https://github.com/ZeeQL/ZeeQL3.git
Computed https://github.com/ZeeQL/ZeeQL3.git at 0.9.13 (0.47s)
Fetching https://github.com/ZeeQL/CSQLite3.git
[1/41] Fetching csqlite3
Fetched https://github.com/ZeeQL/CSQLite3.git (0.56s)
Computing version for https://github.com/ZeeQL/CSQLite3.git
Computed https://github.com/ZeeQL/CSQLite3.git at 2.0.3 (0.49s)
Creating working copy for https://github.com/ZeeQL/ZeeQL3.git
Working copy of https://github.com/ZeeQL/ZeeQL3.git resolved at 0.9.13
Creating working copy for https://github.com/ZeeQL/CSQLite3.git
Working copy of https://github.com/ZeeQL/CSQLite3.git resolved at 2.0.3
Creating working copy for https://github.com/ZeeQL/CLibPQ.git
Working copy of https://github.com/ZeeQL/CLibPQ.git resolved at 2.0.5
warning: failed to retrieve search paths with pkg-config; maybe pkg-config is not installed
warning: you may be able to install libpq using your system-packager:
brew install postgresql libpq
BUILD FAILURE 5.9 macosSpm