The Swift Package Index logo.Swift Package Index

Track the adoption of Swift 6 strict concurrency checks for data race safety. How many packages are Ready for Swift 6?

Build Information

Failed to build LocalizableUI, reference master (d6dfe2), with Swift 6.1 for watchOS using Xcode 16.3 on 24 Apr 2025 22:55:04 UTC.

Build Command

No build command. This typically means the build failed at an early stage where we determine the build command.

Build Log

========================================
RunAll
========================================
Builder version: 4.61.0
Interrupt handler set up.
========================================
Checkout
========================================
Clone URL: https://github.com/weiss19ja/LocalizableUI.git
Reference: master
Initialized empty Git repository in /Users/admin/builder/spi-builder-workspace/.git/
From https://github.com/weiss19ja/LocalizableUI
 * branch            master     -> FETCH_HEAD
 * [new branch]      master     -> origin/master
HEAD is now at d6dfe24 Release 0.3.8
Cloned https://github.com/weiss19ja/LocalizableUI.git
Revision (git rev-parse @):
d6dfe242e6a44d1a2726ddbf79a18ccb878508dc
SUCCESS checkout https://github.com/weiss19ja/LocalizableUI.git at master
========================================
Build
========================================
Selected platform:         watchOS
Swift version:             6.1
Building package at path:  $PWD
https://github.com/weiss19ja/LocalizableUI.git
https://github.com/weiss19ja/LocalizableUI.git
error: Source files for target LocalizableUI should be located under 'Sources/LocalizableUI', or a custom sources path can be set with the 'path' property in Package.swift
Command line invocation:
    /Applications/Xcode-16.3.0.app/Contents/Developer/usr/bin/xcodebuild -IDEClonedSourcePackagesDirPathOverride=/Users/admin/builder/spi-builder-workspace/.dependencies -resolvePackageDependencies
2025-04-24 15:55:03.953 xcodebuild[517:2893] Writing error result bundle to /var/folders/5k/5yc19ymj0jqd5v0zvgfqz0xw0000gn/T/ResultBundle_2025-24-04_15-55-0003.xcresult
xcodebuild: error: The directory /Users/admin/builder/spi-builder-workspace contains 2 projects, including multiple projects with the current extension (.xcodeproj). Specify the project to use with the -project option.
Command line invocation:
    /Applications/Xcode-16.3.0.app/Contents/Developer/usr/bin/xcodebuild -IDEClonedSourcePackagesDirPathOverride=/Users/admin/builder/spi-builder-workspace/.dependencies -resolvePackageDependencies
2025-04-24 15:55:04.607 xcodebuild[521:2952] Writing error result bundle to /var/folders/5k/5yc19ymj0jqd5v0zvgfqz0xw0000gn/T/ResultBundle_2025-24-04_15-55-0004.xcresult
xcodebuild: error: The directory /Users/admin/builder/spi-builder-workspace contains 2 projects, including multiple projects with the current extension (.xcodeproj). Specify the project to use with the -project option.
BUILD FAILURE 6.1 watchOS