Build Information
Failed to build Helical, reference 0.1.2 (2d178b
), with Swift 6.1 for watchOS using Xcode 16.3 on 30 Apr 2025 01:08:19 UTC.
Build Command
env DEVELOPER_DIR=/Applications/Xcode-16.3.0.app xcrun xcodebuild -IDEClonedSourcePackagesDirPathOverride=$PWD/.dependencies -skipMacroValidation -skipPackagePluginValidation -derivedDataPath $PWD/.derivedData build -scheme Helical-Package -destination generic/platform=watchOS
Build Log
SwiftCompile normal arm64_32 Compiling\ Deque._UnsafeHandle.swift,\ Deque.swift /Users/admin/builder/spi-builder-workspace/.dependencies/checkouts/swift-collections/Sources/DequeModule/Deque._UnsafeHandle.swift /Users/admin/builder/spi-builder-workspace/.dependencies/checkouts/swift-collections/Sources/DequeModule/Deque.swift (in target 'DequeModule' from project 'swift-collections')
SwiftCompile normal arm64_32 /Users/admin/builder/spi-builder-workspace/.dependencies/checkouts/swift-collections/Sources/DequeModule/Deque._UnsafeHandle.swift (in target 'DequeModule' from project 'swift-collections')
cd /Users/admin/builder/spi-builder-workspace/.swiftpm/xcode
SwiftCompile normal arm64_32 /Users/admin/builder/spi-builder-workspace/.dependencies/checkouts/swift-collections/Sources/DequeModule/Deque.swift (in target 'DequeModule' from project 'swift-collections')
cd /Users/admin/builder/spi-builder-workspace/.swiftpm/xcode
SwiftDriverJobDiscovery normal arm64_32 Compiling _DequeBufferHeader.swift (in target 'DequeModule' from project 'swift-collections')
SwiftCompile normal arm64_32 Compiling\ Deque+CustomReflectable.swift,\ Deque+Descriptions.swift /Users/admin/builder/spi-builder-workspace/.dependencies/checkouts/swift-collections/Sources/DequeModule/Deque+CustomReflectable.swift /Users/admin/builder/spi-builder-workspace/.dependencies/checkouts/swift-collections/Sources/DequeModule/Deque+Descriptions.swift (in target 'DequeModule' from project 'swift-collections')
SwiftCompile normal arm64_32 /Users/admin/builder/spi-builder-workspace/.dependencies/checkouts/swift-collections/Sources/DequeModule/Deque+CustomReflectable.swift (in target 'DequeModule' from project 'swift-collections')
cd /Users/admin/builder/spi-builder-workspace/.swiftpm/xcode
SwiftCompile normal arm64_32 /Users/admin/builder/spi-builder-workspace/.dependencies/checkouts/swift-collections/Sources/DequeModule/Deque+Descriptions.swift (in target 'DequeModule' from project 'swift-collections')
cd /Users/admin/builder/spi-builder-workspace/.swiftpm/xcode
SwiftDriverJobDiscovery normal arm64_32 Compiling _DequeSlot.swift (in target 'DequeModule' from project 'swift-collections')
SwiftCompile normal arm64_32 Compiling\ Deque+Codable.swift,\ Deque+Collection.swift /Users/admin/builder/spi-builder-workspace/.dependencies/checkouts/swift-collections/Sources/DequeModule/Deque+Codable.swift /Users/admin/builder/spi-builder-workspace/.dependencies/checkouts/swift-collections/Sources/DequeModule/Deque+Collection.swift (in target 'DequeModule' from project 'swift-collections')
SwiftCompile normal arm64_32 /Users/admin/builder/spi-builder-workspace/.dependencies/checkouts/swift-collections/Sources/DequeModule/Deque+Codable.swift (in target 'DequeModule' from project 'swift-collections')
cd /Users/admin/builder/spi-builder-workspace/.swiftpm/xcode
SwiftCompile normal arm64_32 /Users/admin/builder/spi-builder-workspace/.dependencies/checkouts/swift-collections/Sources/DequeModule/Deque+Collection.swift (in target 'DequeModule' from project 'swift-collections')
cd /Users/admin/builder/spi-builder-workspace/.swiftpm/xcode
SwiftDriverJobDiscovery normal arm64_32 Compiling _Hashtable+Header.swift, OrderedDictionary+Codable.swift, OrderedDictionary+CustomReflectable.swift, OrderedDictionary+Deprecations.swift, OrderedDictionary+Descriptions.swift, OrderedDictionary+Elements.SubSequence.swift (in target 'OrderedCollections' from project 'swift-collections')
SwiftCompile normal arm64_32 Compiling\ Deque+Extras.swift,\ Deque+Hashable.swift /Users/admin/builder/spi-builder-workspace/.dependencies/checkouts/swift-collections/Sources/DequeModule/Deque+Extras.swift /Users/admin/builder/spi-builder-workspace/.dependencies/checkouts/swift-collections/Sources/DequeModule/Deque+Hashable.swift (in target 'DequeModule' from project 'swift-collections')
SwiftCompile normal arm64_32 /Users/admin/builder/spi-builder-workspace/.dependencies/checkouts/swift-collections/Sources/DequeModule/Deque+Extras.swift (in target 'DequeModule' from project 'swift-collections')
cd /Users/admin/builder/spi-builder-workspace/.swiftpm/xcode
SwiftCompile normal arm64_32 /Users/admin/builder/spi-builder-workspace/.dependencies/checkouts/swift-collections/Sources/DequeModule/Deque+Hashable.swift (in target 'DequeModule' from project 'swift-collections')
cd /Users/admin/builder/spi-builder-workspace/.swiftpm/xcode
SwiftDriverJobDiscovery normal arm64_32 Compiling _UnsafeWrappedBuffer.swift (in target 'DequeModule' from project 'swift-collections')
SwiftCompile normal arm64_32 Compiling\ Deque+Equatable.swift,\ Deque+ExpressibleByArrayLiteral.swift /Users/admin/builder/spi-builder-workspace/.dependencies/checkouts/swift-collections/Sources/DequeModule/Deque+Equatable.swift /Users/admin/builder/spi-builder-workspace/.dependencies/checkouts/swift-collections/Sources/DequeModule/Deque+ExpressibleByArrayLiteral.swift (in target 'DequeModule' from project 'swift-collections')
SwiftCompile normal arm64_32 /Users/admin/builder/spi-builder-workspace/.dependencies/checkouts/swift-collections/Sources/DequeModule/Deque+Equatable.swift (in target 'DequeModule' from project 'swift-collections')
cd /Users/admin/builder/spi-builder-workspace/.swiftpm/xcode
SwiftCompile normal arm64_32 /Users/admin/builder/spi-builder-workspace/.dependencies/checkouts/swift-collections/Sources/DequeModule/Deque+ExpressibleByArrayLiteral.swift (in target 'DequeModule' from project 'swift-collections')
cd /Users/admin/builder/spi-builder-workspace/.swiftpm/xcode
SwiftDriverJobDiscovery normal arm64_32 Compiling _DequeBuffer.swift (in target 'DequeModule' from project 'swift-collections')
SwiftCompile normal armv7k Compiling\ BitSet+Hashable.swift,\ BitSet+Initializers.swift,\ BitSet+Invariants.swift,\ BitSet+Random.swift,\ BitSet+SetAlgebra\ basics.swift,\ BitSet+SetAlgebra\ conformance.swift /Users/admin/builder/spi-builder-workspace/.dependencies/checkouts/swift-collections/Sources/BitCollections/BitSet/BitSet+Hashable.swift /Users/admin/builder/spi-builder-workspace/.dependencies/checkouts/swift-collections/Sources/BitCollections/BitSet/BitSet+Initializers.swift /Users/admin/builder/spi-builder-workspace/.dependencies/checkouts/swift-collections/Sources/BitCollections/BitSet/BitSet+Invariants.swift /Users/admin/builder/spi-builder-workspace/.dependencies/checkouts/swift-collections/Sources/BitCollections/BitSet/BitSet+Random.swift /Users/admin/builder/spi-builder-workspace/.dependencies/checkouts/swift-collections/Sources/BitCollections/BitSet/BitSet+SetAlgebra\ basics.swift /Users/admin/builder/spi-builder-workspace/.dependencies/checkouts/swift-collections/Sources/BitCollections/BitSet/BitSet+SetAlgebra\ conformance.swift (in target 'BitCollections' from project 'swift-collections')
SwiftCompile normal armv7k /Users/admin/builder/spi-builder-workspace/.dependencies/checkouts/swift-collections/Sources/BitCollections/BitSet/BitSet+Hashable.swift (in target 'BitCollections' from project 'swift-collections')
cd /Users/admin/builder/spi-builder-workspace/.swiftpm/xcode
SwiftCompile normal armv7k /Users/admin/builder/spi-builder-workspace/.dependencies/checkouts/swift-collections/Sources/BitCollections/BitSet/BitSet+Initializers.swift (in target 'BitCollections' from project 'swift-collections')
cd /Users/admin/builder/spi-builder-workspace/.swiftpm/xcode
SwiftCompile normal armv7k /Users/admin/builder/spi-builder-workspace/.dependencies/checkouts/swift-collections/Sources/BitCollections/BitSet/BitSet+Invariants.swift (in target 'BitCollections' from project 'swift-collections')
cd /Users/admin/builder/spi-builder-workspace/.swiftpm/xcode
SwiftCompile normal armv7k /Users/admin/builder/spi-builder-workspace/.dependencies/checkouts/swift-collections/Sources/BitCollections/BitSet/BitSet+Random.swift (in target 'BitCollections' from project 'swift-collections')
cd /Users/admin/builder/spi-builder-workspace/.swiftpm/xcode
SwiftCompile normal armv7k /Users/admin/builder/spi-builder-workspace/.dependencies/checkouts/swift-collections/Sources/BitCollections/BitSet/BitSet+SetAlgebra\ basics.swift (in target 'BitCollections' from project 'swift-collections')
cd /Users/admin/builder/spi-builder-workspace/.swiftpm/xcode
SwiftCompile normal armv7k /Users/admin/builder/spi-builder-workspace/.dependencies/checkouts/swift-collections/Sources/BitCollections/BitSet/BitSet+SetAlgebra\ conformance.swift (in target 'BitCollections' from project 'swift-collections')
cd /Users/admin/builder/spi-builder-workspace/.swiftpm/xcode
SwiftDriverJobDiscovery normal arm64_32 Compiling OrderedSet+Hashable.swift, OrderedSet+Initializers.swift, OrderedSet+Insertions.swift, OrderedSet+Invariants.swift, OrderedSet+Partial MutableCollection.swift, OrderedSet+Partial RangeReplaceableCollection.swift (in target 'OrderedCollections' from project 'swift-collections')
SwiftDriver SwiftSCAD normal armv7k com.apple.xcode.tools.swift.compiler (in target 'SwiftSCAD' from project 'SwiftSCAD')
cd /Users/admin/builder/spi-builder-workspace/.swiftpm/xcode
builtin-SwiftDriver -- /Applications/Xcode-16.3.0.app/Contents/Developer/Toolchains/XcodeDefault.xctoolchain/usr/bin/swiftc -module-name SwiftSCAD -Onone -enforce-exclusivity\=checked @/Users/admin/builder/spi-builder-workspace/.derivedData/Build/Intermediates.noindex/SwiftSCAD.build/Debug-watchos/SwiftSCAD.build/Objects-normal/armv7k/SwiftSCAD.SwiftFileList -DSWIFT_PACKAGE -DDEBUG -DXcode -plugin-path /Applications/Xcode-16.3.0.app/Contents/Developer/Toolchains/XcodeDefault.xctoolchain/usr/lib/swift/host/plugins/testing -enable-experimental-feature DebugDescriptionMacro -sdk /Applications/Xcode-16.3.0.app/Contents/Developer/Platforms/WatchOS.platform/Developer/SDKs/WatchOS11.4.sdk -target armv7k-apple-watchos5.0 -g -module-cache-path /Users/admin/builder/spi-builder-workspace/.derivedData/ModuleCache.noindex -Xfrontend -serialize-debugging-options -enable-testing -suppress-warnings -index-store-path /Users/admin/builder/spi-builder-workspace/.derivedData/Index.noindex/DataStore -swift-version 6 -I /Users/admin/builder/spi-builder-workspace/.derivedData/Build/Products/Debug-watchos -I /Applications/Xcode-16.3.0.app/Contents/Developer/Platforms/WatchOS.platform/Developer/usr/lib -F /Users/admin/builder/spi-builder-workspace/.derivedData/Build/Products/Debug-watchos/PackageFrameworks -F /Users/admin/builder/spi-builder-workspace/.derivedData/Build/Products/Debug-watchos/PackageFrameworks -F /Users/admin/builder/spi-builder-workspace/.derivedData/Build/Products/Debug-watchos/PackageFrameworks -F /Users/admin/builder/spi-builder-workspace/.derivedData/Build/Products/Debug-watchos/PackageFrameworks -F /Users/admin/builder/spi-builder-workspace/.derivedData/Build/Products/Debug-watchos/PackageFrameworks -F /Users/admin/builder/spi-builder-workspace/.derivedData/Build/Products/Debug-watchos/PackageFrameworks -F /Users/admin/builder/spi-builder-workspace/.derivedData/Build/Products/Debug-watchos/PackageFrameworks -F /Users/admin/builder/spi-builder-workspace/.derivedData/Build/Products/Debug-watchos/PackageFrameworks -F /Users/admin/builder/spi-builder-workspace/.derivedData/Build/Products/Debug-watchos/PackageFrameworks -F /Users/admin/builder/spi-builder-workspace/.derivedData/Build/Products/Debug-watchos -F /Applications/Xcode-16.3.0.app/Contents/Developer/Platforms/WatchOS.platform/Developer/Library/Frameworks -F /Applications/Xcode-16.3.0.app/Contents/Developer/Platforms/WatchOS.platform/Developer/SDKs/WatchOS11.4.sdk/Developer/Library/Frameworks -c -j10 -enable-batch-mode -incremental -Xcc -ivfsstatcache -Xcc /Users/admin/builder/spi-builder-workspace/.derivedData/SDKStatCaches.noindex/watchos11.4-22T246-43efb940ff07ba2497b70ec94253f576.sdkstatcache -output-file-map /Users/admin/builder/spi-builder-workspace/.derivedData/Build/Intermediates.noindex/SwiftSCAD.build/Debug-watchos/SwiftSCAD.build/Objects-normal/armv7k/SwiftSCAD-OutputFileMap.json -use-frontend-parseable-output -save-temps -no-color-diagnostics -serialize-diagnostics -emit-dependencies -emit-module -emit-module-path /Users/admin/builder/spi-builder-workspace/.derivedData/Build/Intermediates.noindex/SwiftSCAD.build/Debug-watchos/SwiftSCAD.build/Objects-normal/armv7k/SwiftSCAD.swiftmodule -user-module-version 0.9.0 -validate-clang-modules-once -clang-build-session-file /Users/admin/builder/spi-builder-workspace/.derivedData/ModuleCache.noindex/Session.modulevalidation -package-name swiftscad -Xcc -I/Users/admin/builder/spi-builder-workspace/.derivedData/Build/Intermediates.noindex/SwiftSCAD.build/Debug-watchos/SwiftSCAD.build/swift-overrides.hmap -emit-const-values -Xfrontend -const-gather-protocols-file -Xfrontend /Users/admin/builder/spi-builder-workspace/.derivedData/Build/Intermediates.noindex/SwiftSCAD.build/Debug-watchos/SwiftSCAD.build/Objects-normal/armv7k/SwiftSCAD_const_extract_protocols.json -Xcc -I/Users/admin/builder/spi-builder-workspace/.derivedData/Build/Products/Debug-watchos/include -Xcc -I/Users/admin/builder/spi-builder-workspace/.derivedData/Build/Intermediates.noindex/SwiftSCAD.build/Debug-watchos/SwiftSCAD.build/DerivedSources-normal/armv7k -Xcc -I/Users/admin/builder/spi-builder-workspace/.derivedData/Build/Intermediates.noindex/SwiftSCAD.build/Debug-watchos/SwiftSCAD.build/DerivedSources/armv7k -Xcc -I/Users/admin/builder/spi-builder-workspace/.derivedData/Build/Intermediates.noindex/SwiftSCAD.build/Debug-watchos/SwiftSCAD.build/DerivedSources -Xcc -DSWIFT_PACKAGE -Xcc -DDEBUG\=1 -emit-objc-header -emit-objc-header-path /Users/admin/builder/spi-builder-workspace/.derivedData/Build/Intermediates.noindex/SwiftSCAD.build/Debug-watchos/SwiftSCAD.build/Objects-normal/armv7k/SwiftSCAD-Swift.h -working-directory /Users/admin/builder/spi-builder-workspace/.swiftpm/xcode -experimental-emit-module-separately -disable-cmo
SwiftDriverJobDiscovery normal arm64_32 Compiling OrderedDictionary+Partial MutableCollection.swift, OrderedDictionary+Partial RangeReplaceableCollection.swift, OrderedDictionary+Sendable.swift, OrderedDictionary+Sequence.swift, OrderedDictionary+Values.swift, OrderedDictionary.swift (in target 'OrderedCollections' from project 'swift-collections')
SwiftDriver SwiftSCAD normal arm64 com.apple.xcode.tools.swift.compiler (in target 'SwiftSCAD' from project 'SwiftSCAD')
cd /Users/admin/builder/spi-builder-workspace/.swiftpm/xcode
builtin-SwiftDriver -- /Applications/Xcode-16.3.0.app/Contents/Developer/Toolchains/XcodeDefault.xctoolchain/usr/bin/swiftc -module-name SwiftSCAD -Onone -enforce-exclusivity\=checked @/Users/admin/builder/spi-builder-workspace/.derivedData/Build/Intermediates.noindex/SwiftSCAD.build/Debug-watchos/SwiftSCAD.build/Objects-normal/arm64/SwiftSCAD.SwiftFileList -DSWIFT_PACKAGE -DDEBUG -DXcode -plugin-path /Applications/Xcode-16.3.0.app/Contents/Developer/Toolchains/XcodeDefault.xctoolchain/usr/lib/swift/host/plugins/testing -enable-experimental-feature DebugDescriptionMacro -sdk /Applications/Xcode-16.3.0.app/Contents/Developer/Platforms/WatchOS.platform/Developer/SDKs/WatchOS11.4.sdk -target arm64-apple-watchos5.0 -g -module-cache-path /Users/admin/builder/spi-builder-workspace/.derivedData/ModuleCache.noindex -Xfrontend -serialize-debugging-options -enable-testing -suppress-warnings -index-store-path /Users/admin/builder/spi-builder-workspace/.derivedData/Index.noindex/DataStore -swift-version 6 -I /Users/admin/builder/spi-builder-workspace/.derivedData/Build/Products/Debug-watchos -I /Applications/Xcode-16.3.0.app/Contents/Developer/Platforms/WatchOS.platform/Developer/usr/lib -F /Users/admin/builder/spi-builder-workspace/.derivedData/Build/Products/Debug-watchos/PackageFrameworks -F /Users/admin/builder/spi-builder-workspace/.derivedData/Build/Products/Debug-watchos/PackageFrameworks -F /Users/admin/builder/spi-builder-workspace/.derivedData/Build/Products/Debug-watchos/PackageFrameworks -F /Users/admin/builder/spi-builder-workspace/.derivedData/Build/Products/Debug-watchos/PackageFrameworks -F /Users/admin/builder/spi-builder-workspace/.derivedData/Build/Products/Debug-watchos/PackageFrameworks -F /Users/admin/builder/spi-builder-workspace/.derivedData/Build/Products/Debug-watchos/PackageFrameworks -F /Users/admin/builder/spi-builder-workspace/.derivedData/Build/Products/Debug-watchos/PackageFrameworks -F /Users/admin/builder/spi-builder-workspace/.derivedData/Build/Products/Debug-watchos/PackageFrameworks -F /Users/admin/builder/spi-builder-workspace/.derivedData/Build/Products/Debug-watchos/PackageFrameworks -F /Users/admin/builder/spi-builder-workspace/.derivedData/Build/Products/Debug-watchos -F /Applications/Xcode-16.3.0.app/Contents/Developer/Platforms/WatchOS.platform/Developer/Library/Frameworks -F /Applications/Xcode-16.3.0.app/Contents/Developer/Platforms/WatchOS.platform/Developer/SDKs/WatchOS11.4.sdk/Developer/Library/Frameworks -c -j10 -enable-batch-mode -incremental -Xcc -ivfsstatcache -Xcc /Users/admin/builder/spi-builder-workspace/.derivedData/SDKStatCaches.noindex/watchos11.4-22T246-43efb940ff07ba2497b70ec94253f576.sdkstatcache -output-file-map /Users/admin/builder/spi-builder-workspace/.derivedData/Build/Intermediates.noindex/SwiftSCAD.build/Debug-watchos/SwiftSCAD.build/Objects-normal/arm64/SwiftSCAD-OutputFileMap.json -use-frontend-parseable-output -save-temps -no-color-diagnostics -serialize-diagnostics -emit-dependencies -emit-module -emit-module-path /Users/admin/builder/spi-builder-workspace/.derivedData/Build/Intermediates.noindex/SwiftSCAD.build/Debug-watchos/SwiftSCAD.build/Objects-normal/arm64/SwiftSCAD.swiftmodule -user-module-version 0.9.0 -validate-clang-modules-once -clang-build-session-file /Users/admin/builder/spi-builder-workspace/.derivedData/ModuleCache.noindex/Session.modulevalidation -package-name swiftscad -Xcc -I/Users/admin/builder/spi-builder-workspace/.derivedData/Build/Intermediates.noindex/SwiftSCAD.build/Debug-watchos/SwiftSCAD.build/swift-overrides.hmap -emit-const-values -Xfrontend -const-gather-protocols-file -Xfrontend /Users/admin/builder/spi-builder-workspace/.derivedData/Build/Intermediates.noindex/SwiftSCAD.build/Debug-watchos/SwiftSCAD.build/Objects-normal/arm64/SwiftSCAD_const_extract_protocols.json -Xcc -I/Users/admin/builder/spi-builder-workspace/.derivedData/Build/Products/Debug-watchos/include -Xcc -I/Users/admin/builder/spi-builder-workspace/.derivedData/Build/Intermediates.noindex/SwiftSCAD.build/Debug-watchos/SwiftSCAD.build/DerivedSources-normal/arm64 -Xcc -I/Users/admin/builder/spi-builder-workspace/.derivedData/Build/Intermediates.noindex/SwiftSCAD.build/Debug-watchos/SwiftSCAD.build/DerivedSources/arm64 -Xcc -I/Users/admin/builder/spi-builder-workspace/.derivedData/Build/Intermediates.noindex/SwiftSCAD.build/Debug-watchos/SwiftSCAD.build/DerivedSources -Xcc -DSWIFT_PACKAGE -Xcc -DDEBUG\=1 -emit-objc-header -emit-objc-header-path /Users/admin/builder/spi-builder-workspace/.derivedData/Build/Intermediates.noindex/SwiftSCAD.build/Debug-watchos/SwiftSCAD.build/Objects-normal/arm64/SwiftSCAD-Swift.h -working-directory /Users/admin/builder/spi-builder-workspace/.swiftpm/xcode -experimental-emit-module-separately -disable-cmo
SwiftDriverJobDiscovery normal arm64_32 Compiling Deque+Testing.swift, Deque._Storage.swift (in target 'DequeModule' from project 'swift-collections')
SwiftDriver SwiftSCAD normal arm64_32 com.apple.xcode.tools.swift.compiler (in target 'SwiftSCAD' from project 'SwiftSCAD')
cd /Users/admin/builder/spi-builder-workspace/.swiftpm/xcode
builtin-SwiftDriver -- /Applications/Xcode-16.3.0.app/Contents/Developer/Toolchains/XcodeDefault.xctoolchain/usr/bin/swiftc -module-name SwiftSCAD -Onone -enforce-exclusivity\=checked @/Users/admin/builder/spi-builder-workspace/.derivedData/Build/Intermediates.noindex/SwiftSCAD.build/Debug-watchos/SwiftSCAD.build/Objects-normal/arm64_32/SwiftSCAD.SwiftFileList -DSWIFT_PACKAGE -DDEBUG -DXcode -plugin-path /Applications/Xcode-16.3.0.app/Contents/Developer/Toolchains/XcodeDefault.xctoolchain/usr/lib/swift/host/plugins/testing -enable-experimental-feature DebugDescriptionMacro -sdk /Applications/Xcode-16.3.0.app/Contents/Developer/Platforms/WatchOS.platform/Developer/SDKs/WatchOS11.4.sdk -target arm64_32-apple-watchos5.0 -g -module-cache-path /Users/admin/builder/spi-builder-workspace/.derivedData/ModuleCache.noindex -Xfrontend -serialize-debugging-options -enable-testing -suppress-warnings -index-store-path /Users/admin/builder/spi-builder-workspace/.derivedData/Index.noindex/DataStore -swift-version 6 -I /Users/admin/builder/spi-builder-workspace/.derivedData/Build/Products/Debug-watchos -I /Applications/Xcode-16.3.0.app/Contents/Developer/Platforms/WatchOS.platform/Developer/usr/lib -F /Users/admin/builder/spi-builder-workspace/.derivedData/Build/Products/Debug-watchos/PackageFrameworks -F /Users/admin/builder/spi-builder-workspace/.derivedData/Build/Products/Debug-watchos/PackageFrameworks -F /Users/admin/builder/spi-builder-workspace/.derivedData/Build/Products/Debug-watchos/PackageFrameworks -F /Users/admin/builder/spi-builder-workspace/.derivedData/Build/Products/Debug-watchos/PackageFrameworks -F /Users/admin/builder/spi-builder-workspace/.derivedData/Build/Products/Debug-watchos/PackageFrameworks -F /Users/admin/builder/spi-builder-workspace/.derivedData/Build/Products/Debug-watchos/PackageFrameworks -F /Users/admin/builder/spi-builder-workspace/.derivedData/Build/Products/Debug-watchos/PackageFrameworks -F /Users/admin/builder/spi-builder-workspace/.derivedData/Build/Products/Debug-watchos/PackageFrameworks -F /Users/admin/builder/spi-builder-workspace/.derivedData/Build/Products/Debug-watchos/PackageFrameworks -F /Users/admin/builder/spi-builder-workspace/.derivedData/Build/Products/Debug-watchos -F /Applications/Xcode-16.3.0.app/Contents/Developer/Platforms/WatchOS.platform/Developer/Library/Frameworks -F /Applications/Xcode-16.3.0.app/Contents/Developer/Platforms/WatchOS.platform/Developer/SDKs/WatchOS11.4.sdk/Developer/Library/Frameworks -c -j10 -enable-batch-mode -incremental -Xcc -ivfsstatcache -Xcc /Users/admin/builder/spi-builder-workspace/.derivedData/SDKStatCaches.noindex/watchos11.4-22T246-43efb940ff07ba2497b70ec94253f576.sdkstatcache -output-file-map /Users/admin/builder/spi-builder-workspace/.derivedData/Build/Intermediates.noindex/SwiftSCAD.build/Debug-watchos/SwiftSCAD.build/Objects-normal/arm64_32/SwiftSCAD-OutputFileMap.json -use-frontend-parseable-output -save-temps -no-color-diagnostics -serialize-diagnostics -emit-dependencies -emit-module -emit-module-path /Users/admin/builder/spi-builder-workspace/.derivedData/Build/Intermediates.noindex/SwiftSCAD.build/Debug-watchos/SwiftSCAD.build/Objects-normal/arm64_32/SwiftSCAD.swiftmodule -user-module-version 0.9.0 -validate-clang-modules-once -clang-build-session-file /Users/admin/builder/spi-builder-workspace/.derivedData/ModuleCache.noindex/Session.modulevalidation -package-name swiftscad -Xcc -I/Users/admin/builder/spi-builder-workspace/.derivedData/Build/Intermediates.noindex/SwiftSCAD.build/Debug-watchos/SwiftSCAD.build/swift-overrides.hmap -emit-const-values -Xfrontend -const-gather-protocols-file -Xfrontend /Users/admin/builder/spi-builder-workspace/.derivedData/Build/Intermediates.noindex/SwiftSCAD.build/Debug-watchos/SwiftSCAD.build/Objects-normal/arm64_32/SwiftSCAD_const_extract_protocols.json -Xcc -I/Users/admin/builder/spi-builder-workspace/.derivedData/Build/Products/Debug-watchos/include -Xcc -I/Users/admin/builder/spi-builder-workspace/.derivedData/Build/Intermediates.noindex/SwiftSCAD.build/Debug-watchos/SwiftSCAD.build/DerivedSources-normal/arm64_32 -Xcc -I/Users/admin/builder/spi-builder-workspace/.derivedData/Build/Intermediates.noindex/SwiftSCAD.build/Debug-watchos/SwiftSCAD.build/DerivedSources/arm64_32 -Xcc -I/Users/admin/builder/spi-builder-workspace/.derivedData/Build/Intermediates.noindex/SwiftSCAD.build/Debug-watchos/SwiftSCAD.build/DerivedSources -Xcc -DSWIFT_PACKAGE -Xcc -DDEBUG\=1 -emit-objc-header -emit-objc-header-path /Users/admin/builder/spi-builder-workspace/.derivedData/Build/Intermediates.noindex/SwiftSCAD.build/Debug-watchos/SwiftSCAD.build/Objects-normal/arm64_32/SwiftSCAD-Swift.h -working-directory /Users/admin/builder/spi-builder-workspace/.swiftpm/xcode -experimental-emit-module-separately -disable-cmo
SwiftDriverJobDiscovery normal arm64_32 Compiling Deque+CustomReflectable.swift, Deque+Descriptions.swift (in target 'DequeModule' from project 'swift-collections')
SwiftCompile normal armv7k Compiling\ BitSet+SetAlgebra\ formIntersection.swift,\ BitSet+SetAlgebra\ formSymmetricDifference.swift,\ BitSet+SetAlgebra\ formUnion.swift,\ BitSet+SetAlgebra\ intersection.swift,\ BitSet+SetAlgebra\ isDisjoint.swift,\ BitSet+SetAlgebra\ isEqualSet.swift /Users/admin/builder/spi-builder-workspace/.dependencies/checkouts/swift-collections/Sources/BitCollections/BitSet/BitSet+SetAlgebra\ formIntersection.swift /Users/admin/builder/spi-builder-workspace/.dependencies/checkouts/swift-collections/Sources/BitCollections/BitSet/BitSet+SetAlgebra\ formSymmetricDifference.swift /Users/admin/builder/spi-builder-workspace/.dependencies/checkouts/swift-collections/Sources/BitCollections/BitSet/BitSet+SetAlgebra\ formUnion.swift /Users/admin/builder/spi-builder-workspace/.dependencies/checkouts/swift-collections/Sources/BitCollections/BitSet/BitSet+SetAlgebra\ intersection.swift /Users/admin/builder/spi-builder-workspace/.dependencies/checkouts/swift-collections/Sources/BitCollections/BitSet/BitSet+SetAlgebra\ isDisjoint.swift /Users/admin/builder/spi-builder-workspace/.dependencies/checkouts/swift-collections/Sources/BitCollections/BitSet/BitSet+SetAlgebra\ isEqualSet.swift (in target 'BitCollections' from project 'swift-collections')
SwiftCompile normal armv7k /Users/admin/builder/spi-builder-workspace/.dependencies/checkouts/swift-collections/Sources/BitCollections/BitSet/BitSet+SetAlgebra\ formIntersection.swift (in target 'BitCollections' from project 'swift-collections')
cd /Users/admin/builder/spi-builder-workspace/.swiftpm/xcode
SwiftCompile normal armv7k /Users/admin/builder/spi-builder-workspace/.dependencies/checkouts/swift-collections/Sources/BitCollections/BitSet/BitSet+SetAlgebra\ formSymmetricDifference.swift (in target 'BitCollections' from project 'swift-collections')
cd /Users/admin/builder/spi-builder-workspace/.swiftpm/xcode
SwiftCompile normal armv7k /Users/admin/builder/spi-builder-workspace/.dependencies/checkouts/swift-collections/Sources/BitCollections/BitSet/BitSet+SetAlgebra\ formUnion.swift (in target 'BitCollections' from project 'swift-collections')
cd /Users/admin/builder/spi-builder-workspace/.swiftpm/xcode
SwiftCompile normal armv7k /Users/admin/builder/spi-builder-workspace/.dependencies/checkouts/swift-collections/Sources/BitCollections/BitSet/BitSet+SetAlgebra\ intersection.swift (in target 'BitCollections' from project 'swift-collections')
cd /Users/admin/builder/spi-builder-workspace/.swiftpm/xcode
SwiftCompile normal armv7k /Users/admin/builder/spi-builder-workspace/.dependencies/checkouts/swift-collections/Sources/BitCollections/BitSet/BitSet+SetAlgebra\ isDisjoint.swift (in target 'BitCollections' from project 'swift-collections')
cd /Users/admin/builder/spi-builder-workspace/.swiftpm/xcode
SwiftCompile normal armv7k /Users/admin/builder/spi-builder-workspace/.dependencies/checkouts/swift-collections/Sources/BitCollections/BitSet/BitSet+SetAlgebra\ isEqualSet.swift (in target 'BitCollections' from project 'swift-collections')
cd /Users/admin/builder/spi-builder-workspace/.swiftpm/xcode
SwiftDriverJobDiscovery normal arm64_32 Compiling Deque+Equatable.swift, Deque+ExpressibleByArrayLiteral.swift (in target 'DequeModule' from project 'swift-collections')
SwiftCompile normal armv7k Compiling\ BitArray+Shifts.swift,\ BitArray+Testing.swift,\ BitArray._UnsafeHandle.swift,\ BitArray.swift,\ BitSet+BidirectionalCollection.swift,\ BitSet+Codable.swift /Users/admin/builder/spi-builder-workspace/.dependencies/checkouts/swift-collections/Sources/BitCollections/BitArray/BitArray+Shifts.swift /Users/admin/builder/spi-builder-workspace/.dependencies/checkouts/swift-collections/Sources/BitCollections/BitArray/BitArray+Testing.swift /Users/admin/builder/spi-builder-workspace/.dependencies/checkouts/swift-collections/Sources/BitCollections/BitArray/BitArray._UnsafeHandle.swift /Users/admin/builder/spi-builder-workspace/.dependencies/checkouts/swift-collections/Sources/BitCollections/BitArray/BitArray.swift /Users/admin/builder/spi-builder-workspace/.dependencies/checkouts/swift-collections/Sources/BitCollections/BitSet/BitSet+BidirectionalCollection.swift /Users/admin/builder/spi-builder-workspace/.dependencies/checkouts/swift-collections/Sources/BitCollections/BitSet/BitSet+Codable.swift (in target 'BitCollections' from project 'swift-collections')
SwiftCompile normal armv7k /Users/admin/builder/spi-builder-workspace/.dependencies/checkouts/swift-collections/Sources/BitCollections/BitArray/BitArray+Shifts.swift (in target 'BitCollections' from project 'swift-collections')
cd /Users/admin/builder/spi-builder-workspace/.swiftpm/xcode
SwiftCompile normal armv7k /Users/admin/builder/spi-builder-workspace/.dependencies/checkouts/swift-collections/Sources/BitCollections/BitArray/BitArray+Testing.swift (in target 'BitCollections' from project 'swift-collections')
cd /Users/admin/builder/spi-builder-workspace/.swiftpm/xcode
SwiftCompile normal armv7k /Users/admin/builder/spi-builder-workspace/.dependencies/checkouts/swift-collections/Sources/BitCollections/BitArray/BitArray._UnsafeHandle.swift (in target 'BitCollections' from project 'swift-collections')
cd /Users/admin/builder/spi-builder-workspace/.swiftpm/xcode
SwiftCompile normal armv7k /Users/admin/builder/spi-builder-workspace/.dependencies/checkouts/swift-collections/Sources/BitCollections/BitArray/BitArray.swift (in target 'BitCollections' from project 'swift-collections')
cd /Users/admin/builder/spi-builder-workspace/.swiftpm/xcode
SwiftCompile normal armv7k /Users/admin/builder/spi-builder-workspace/.dependencies/checkouts/swift-collections/Sources/BitCollections/BitSet/BitSet+BidirectionalCollection.swift (in target 'BitCollections' from project 'swift-collections')
cd /Users/admin/builder/spi-builder-workspace/.swiftpm/xcode
SwiftCompile normal armv7k /Users/admin/builder/spi-builder-workspace/.dependencies/checkouts/swift-collections/Sources/BitCollections/BitSet/BitSet+Codable.swift (in target 'BitCollections' from project 'swift-collections')
cd /Users/admin/builder/spi-builder-workspace/.swiftpm/xcode
SwiftDriverJobDiscovery normal arm64_32 Compiling Deque+Extras.swift, Deque+Hashable.swift (in target 'DequeModule' from project 'swift-collections')
SwiftDriverJobDiscovery normal arm64_32 Compiling _HashTable+Bucket.swift, _HashTable+BucketIterator.swift, _HashTable+Constants.swift, _HashTable+CustomStringConvertible.swift, _HashTable+Testing.swift, _HashTable+UnsafeHandle.swift, _HashTable.swift (in target 'OrderedCollections' from project 'swift-collections')
SwiftDriverJobDiscovery normal armv7k Compiling BitSet+Hashable.swift, BitSet+Initializers.swift, BitSet+Invariants.swift, BitSet+Random.swift, BitSet+SetAlgebra basics.swift, BitSet+SetAlgebra conformance.swift (in target 'BitCollections' from project 'swift-collections')
SwiftCompile normal armv7k Compiling\ TreeDictionary+Sequence.swift,\ TreeDictionary+Values.swift,\ TreeDictionary.swift,\ TreeSet+Codable.swift,\ TreeSet+Collection.swift,\ TreeSet+CustomReflectable.swift,\ TreeSet+Debugging.swift,\ TreeSet+Descriptions.swift /Users/admin/builder/spi-builder-workspace/.dependencies/checkouts/swift-collections/Sources/HashTreeCollections/TreeDictionary/TreeDictionary+Sequence.swift /Users/admin/builder/spi-builder-workspace/.dependencies/checkouts/swift-collections/Sources/HashTreeCollections/TreeDictionary/TreeDictionary+Values.swift /Users/admin/builder/spi-builder-workspace/.dependencies/checkouts/swift-collections/Sources/HashTreeCollections/TreeDictionary/TreeDictionary.swift /Users/admin/builder/spi-builder-workspace/.dependencies/checkouts/swift-collections/Sources/HashTreeCollections/TreeSet/TreeSet+Codable.swift /Users/admin/builder/spi-builder-workspace/.dependencies/checkouts/swift-collections/Sources/HashTreeCollections/TreeSet/TreeSet+Collection.swift /Users/admin/builder/spi-builder-workspace/.dependencies/checkouts/swift-collections/Sources/HashTreeCollections/TreeSet/TreeSet+CustomReflectable.swift /Users/admin/builder/spi-builder-workspace/.dependencies/checkouts/swift-collections/Sources/HashTreeCollections/TreeSet/TreeSet+Debugging.swift /Users/admin/builder/spi-builder-workspace/.dependencies/checkouts/swift-collections/Sources/HashTreeCollections/TreeSet/TreeSet+Descriptions.swift (in target 'HashTreeCollections' from project 'swift-collections')
SwiftCompile normal armv7k /Users/admin/builder/spi-builder-workspace/.dependencies/checkouts/swift-collections/Sources/HashTreeCollections/TreeDictionary/TreeDictionary+Sequence.swift (in target 'HashTreeCollections' from project 'swift-collections')
cd /Users/admin/builder/spi-builder-workspace/.swiftpm/xcode
SwiftCompile normal armv7k /Users/admin/builder/spi-builder-workspace/.dependencies/checkouts/swift-collections/Sources/HashTreeCollections/TreeDictionary/TreeDictionary+Values.swift (in target 'HashTreeCollections' from project 'swift-collections')
cd /Users/admin/builder/spi-builder-workspace/.swiftpm/xcode
SwiftCompile normal armv7k /Users/admin/builder/spi-builder-workspace/.dependencies/checkouts/swift-collections/Sources/HashTreeCollections/TreeDictionary/TreeDictionary.swift (in target 'HashTreeCollections' from project 'swift-collections')
cd /Users/admin/builder/spi-builder-workspace/.swiftpm/xcode
SwiftCompile normal armv7k /Users/admin/builder/spi-builder-workspace/.dependencies/checkouts/swift-collections/Sources/HashTreeCollections/TreeSet/TreeSet+Codable.swift (in target 'HashTreeCollections' from project 'swift-collections')
cd /Users/admin/builder/spi-builder-workspace/.swiftpm/xcode
SwiftCompile normal armv7k /Users/admin/builder/spi-builder-workspace/.dependencies/checkouts/swift-collections/Sources/HashTreeCollections/TreeSet/TreeSet+Collection.swift (in target 'HashTreeCollections' from project 'swift-collections')
cd /Users/admin/builder/spi-builder-workspace/.swiftpm/xcode
SwiftCompile normal armv7k /Users/admin/builder/spi-builder-workspace/.dependencies/checkouts/swift-collections/Sources/HashTreeCollections/TreeSet/TreeSet+CustomReflectable.swift (in target 'HashTreeCollections' from project 'swift-collections')
cd /Users/admin/builder/spi-builder-workspace/.swiftpm/xcode
SwiftCompile normal armv7k /Users/admin/builder/spi-builder-workspace/.dependencies/checkouts/swift-collections/Sources/HashTreeCollections/TreeSet/TreeSet+Debugging.swift (in target 'HashTreeCollections' from project 'swift-collections')
cd /Users/admin/builder/spi-builder-workspace/.swiftpm/xcode
SwiftCompile normal armv7k /Users/admin/builder/spi-builder-workspace/.dependencies/checkouts/swift-collections/Sources/HashTreeCollections/TreeSet/TreeSet+Descriptions.swift (in target 'HashTreeCollections' from project 'swift-collections')
cd /Users/admin/builder/spi-builder-workspace/.swiftpm/xcode
SwiftCompile normal armv7k Compiling\ _HashNode+Subtree\ Removals.swift,\ _HashNode+UnsafeHandle.swift,\ _HashNode.swift,\ _HashNodeHeader.swift,\ _HashSlot.swift,\ _HashStack.swift,\ _HashTreeIterator.swift,\ _HashTreeStatistics.swift,\ _RawHashNode+UnsafeHandle.swift /Users/admin/builder/spi-builder-workspace/.dependencies/checkouts/swift-collections/Sources/HashTreeCollections/HashNode/_HashNode+Subtree\ Removals.swift /Users/admin/builder/spi-builder-workspace/.dependencies/checkouts/swift-collections/Sources/HashTreeCollections/HashNode/_HashNode+UnsafeHandle.swift /Users/admin/builder/spi-builder-workspace/.dependencies/checkouts/swift-collections/Sources/HashTreeCollections/HashNode/_HashNode.swift /Users/admin/builder/spi-builder-workspace/.dependencies/checkouts/swift-collections/Sources/HashTreeCollections/HashNode/_HashNodeHeader.swift /Users/admin/builder/spi-builder-workspace/.dependencies/checkouts/swift-collections/Sources/HashTreeCollections/HashNode/_HashSlot.swift /Users/admin/builder/spi-builder-workspace/.dependencies/checkouts/swift-collections/Sources/HashTreeCollections/HashNode/_HashStack.swift /Users/admin/builder/spi-builder-workspace/.dependencies/checkouts/swift-collections/Sources/HashTreeCollections/HashNode/_HashTreeIterator.swift /Users/admin/builder/spi-builder-workspace/.dependencies/checkouts/swift-collections/Sources/HashTreeCollections/HashNode/_HashTreeStatistics.swift /Users/admin/builder/spi-builder-workspace/.dependencies/checkouts/swift-collections/Sources/HashTreeCollections/HashNode/_RawHashNode+UnsafeHandle.swift (in target 'HashTreeCollections' from project 'swift-collections')
SwiftCompile normal armv7k /Users/admin/builder/spi-builder-workspace/.dependencies/checkouts/swift-collections/Sources/HashTreeCollections/HashNode/_HashNode+Subtree\ Removals.swift (in target 'HashTreeCollections' from project 'swift-collections')
cd /Users/admin/builder/spi-builder-workspace/.swiftpm/xcode
SwiftCompile normal armv7k /Users/admin/builder/spi-builder-workspace/.dependencies/checkouts/swift-collections/Sources/HashTreeCollections/HashNode/_HashNode+UnsafeHandle.swift (in target 'HashTreeCollections' from project 'swift-collections')
cd /Users/admin/builder/spi-builder-workspace/.swiftpm/xcode
SwiftCompile normal armv7k /Users/admin/builder/spi-builder-workspace/.dependencies/checkouts/swift-collections/Sources/HashTreeCollections/HashNode/_HashNode.swift (in target 'HashTreeCollections' from project 'swift-collections')
cd /Users/admin/builder/spi-builder-workspace/.swiftpm/xcode
SwiftCompile normal armv7k /Users/admin/builder/spi-builder-workspace/.dependencies/checkouts/swift-collections/Sources/HashTreeCollections/HashNode/_HashNodeHeader.swift (in target 'HashTreeCollections' from project 'swift-collections')
cd /Users/admin/builder/spi-builder-workspace/.swiftpm/xcode
SwiftCompile normal armv7k /Users/admin/builder/spi-builder-workspace/.dependencies/checkouts/swift-collections/Sources/HashTreeCollections/HashNode/_HashSlot.swift (in target 'HashTreeCollections' from project 'swift-collections')
cd /Users/admin/builder/spi-builder-workspace/.swiftpm/xcode
SwiftCompile normal armv7k /Users/admin/builder/spi-builder-workspace/.dependencies/checkouts/swift-collections/Sources/HashTreeCollections/HashNode/_HashStack.swift (in target 'HashTreeCollections' from project 'swift-collections')
cd /Users/admin/builder/spi-builder-workspace/.swiftpm/xcode
SwiftCompile normal armv7k /Users/admin/builder/spi-builder-workspace/.dependencies/checkouts/swift-collections/Sources/HashTreeCollections/HashNode/_HashTreeIterator.swift (in target 'HashTreeCollections' from project 'swift-collections')
cd /Users/admin/builder/spi-builder-workspace/.swiftpm/xcode
SwiftCompile normal armv7k /Users/admin/builder/spi-builder-workspace/.dependencies/checkouts/swift-collections/Sources/HashTreeCollections/HashNode/_HashTreeStatistics.swift (in target 'HashTreeCollections' from project 'swift-collections')
cd /Users/admin/builder/spi-builder-workspace/.swiftpm/xcode
SwiftCompile normal armv7k /Users/admin/builder/spi-builder-workspace/.dependencies/checkouts/swift-collections/Sources/HashTreeCollections/HashNode/_RawHashNode+UnsafeHandle.swift (in target 'HashTreeCollections' from project 'swift-collections')
cd /Users/admin/builder/spi-builder-workspace/.swiftpm/xcode
SwiftCompile normal armv7k Compiling\ TreeSet+SetAlgebra\ isStrictSuperset.swift,\ TreeSet+SetAlgebra\ isSubset.swift,\ TreeSet+SetAlgebra\ isSuperset.swift,\ TreeSet+SetAlgebra\ subtract.swift,\ TreeSet+SetAlgebra\ subtracting.swift,\ TreeSet+SetAlgebra\ symmetricDifference.swift,\ TreeSet+SetAlgebra\ union.swift,\ TreeSet.swift /Users/admin/builder/spi-builder-workspace/.dependencies/checkouts/swift-collections/Sources/HashTreeCollections/TreeSet/TreeSet+SetAlgebra\ isStrictSuperset.swift /Users/admin/builder/spi-builder-workspace/.dependencies/checkouts/swift-collections/Sources/HashTreeCollections/TreeSet/TreeSet+SetAlgebra\ isSubset.swift /Users/admin/builder/spi-builder-workspace/.dependencies/checkouts/swift-collections/Sources/HashTreeCollections/TreeSet/TreeSet+SetAlgebra\ isSuperset.swift /Users/admin/builder/spi-builder-workspace/.dependencies/checkouts/swift-collections/Sources/HashTreeCollections/TreeSet/TreeSet+SetAlgebra\ subtract.swift /Users/admin/builder/spi-builder-workspace/.dependencies/checkouts/swift-collections/Sources/HashTreeCollections/TreeSet/TreeSet+SetAlgebra\ subtracting.swift /Users/admin/builder/spi-builder-workspace/.dependencies/checkouts/swift-collections/Sources/HashTreeCollections/TreeSet/TreeSet+SetAlgebra\ symmetricDifference.swift /Users/admin/builder/spi-builder-workspace/.dependencies/checkouts/swift-collections/Sources/HashTreeCollections/TreeSet/TreeSet+SetAlgebra\ union.swift /Users/admin/builder/spi-builder-workspace/.dependencies/checkouts/swift-collections/Sources/HashTreeCollections/TreeSet/TreeSet.swift (in target 'HashTreeCollections' from project 'swift-collections')
SwiftCompile normal armv7k /Users/admin/builder/spi-builder-workspace/.dependencies/checkouts/swift-collections/Sources/HashTreeCollections/TreeSet/TreeSet+SetAlgebra\ isStrictSuperset.swift (in target 'HashTreeCollections' from project 'swift-collections')
cd /Users/admin/builder/spi-builder-workspace/.swiftpm/xcode
SwiftCompile normal armv7k /Users/admin/builder/spi-builder-workspace/.dependencies/checkouts/swift-collections/Sources/HashTreeCollections/TreeSet/TreeSet+SetAlgebra\ isSubset.swift (in target 'HashTreeCollections' from project 'swift-collections')
cd /Users/admin/builder/spi-builder-workspace/.swiftpm/xcode
SwiftCompile normal armv7k /Users/admin/builder/spi-builder-workspace/.dependencies/checkouts/swift-collections/Sources/HashTreeCollections/TreeSet/TreeSet+SetAlgebra\ isSuperset.swift (in target 'HashTreeCollections' from project 'swift-collections')
cd /Users/admin/builder/spi-builder-workspace/.swiftpm/xcode
SwiftCompile normal armv7k /Users/admin/builder/spi-builder-workspace/.dependencies/checkouts/swift-collections/Sources/HashTreeCollections/TreeSet/TreeSet+SetAlgebra\ subtract.swift (in target 'HashTreeCollections' from project 'swift-collections')
cd /Users/admin/builder/spi-builder-workspace/.swiftpm/xcode
SwiftCompile normal armv7k /Users/admin/builder/spi-builder-workspace/.dependencies/checkouts/swift-collections/Sources/HashTreeCollections/TreeSet/TreeSet+SetAlgebra\ subtracting.swift (in target 'HashTreeCollections' from project 'swift-collections')
cd /Users/admin/builder/spi-builder-workspace/.swiftpm/xcode
SwiftCompile normal armv7k /Users/admin/builder/spi-builder-workspace/.dependencies/checkouts/swift-collections/Sources/HashTreeCollections/TreeSet/TreeSet+SetAlgebra\ symmetricDifference.swift (in target 'HashTreeCollections' from project 'swift-collections')
cd /Users/admin/builder/spi-builder-workspace/.swiftpm/xcode
SwiftCompile normal armv7k /Users/admin/builder/spi-builder-workspace/.dependencies/checkouts/swift-collections/Sources/HashTreeCollections/TreeSet/TreeSet+SetAlgebra\ union.swift (in target 'HashTreeCollections' from project 'swift-collections')
cd /Users/admin/builder/spi-builder-workspace/.swiftpm/xcode
SwiftCompile normal armv7k /Users/admin/builder/spi-builder-workspace/.dependencies/checkouts/swift-collections/Sources/HashTreeCollections/TreeSet/TreeSet.swift (in target 'HashTreeCollections' from project 'swift-collections')
cd /Users/admin/builder/spi-builder-workspace/.swiftpm/xcode
SwiftDriverJobDiscovery normal arm64_32 Compiling Deque._UnsafeHandle.swift, Deque.swift (in target 'DequeModule' from project 'swift-collections')
SwiftCompile normal armv7k Compiling\ TreeDictionary+ExpressibleByDictionaryLiteral.swift,\ TreeDictionary+Filter.swift,\ TreeDictionary+Hashable.swift,\ TreeDictionary+Initializers.swift,\ TreeDictionary+Keys.swift,\ TreeDictionary+MapValues.swift,\ TreeDictionary+Merge.swift,\ TreeDictionary+Sendable.swift /Users/admin/builder/spi-builder-workspace/.dependencies/checkouts/swift-collections/Sources/HashTreeCollections/TreeDictionary/TreeDictionary+ExpressibleByDictionaryLiteral.swift /Users/admin/builder/spi-builder-workspace/.dependencies/checkouts/swift-collections/Sources/HashTreeCollections/TreeDictionary/TreeDictionary+Filter.swift /Users/admin/builder/spi-builder-workspace/.dependencies/checkouts/swift-collections/Sources/HashTreeCollections/TreeDictionary/TreeDictionary+Hashable.swift /Users/admin/builder/spi-builder-workspace/.dependencies/checkouts/swift-collections/Sources/HashTreeCollections/TreeDictionary/TreeDictionary+Initializers.swift /Users/admin/builder/spi-builder-workspace/.dependencies/checkouts/swift-collections/Sources/HashTreeCollections/TreeDictionary/TreeDictionary+Keys.swift /Users/admin/builder/spi-builder-workspace/.dependencies/checkouts/swift-collections/Sources/HashTreeCollections/TreeDictionary/TreeDictionary+MapValues.swift /Users/admin/builder/spi-builder-workspace/.dependencies/checkouts/swift-collections/Sources/HashTreeCollections/TreeDictionary/TreeDictionary+Merge.swift /Users/admin/builder/spi-builder-workspace/.dependencies/checkouts/swift-collections/Sources/HashTreeCollections/TreeDictionary/TreeDictionary+Sendable.swift (in target 'HashTreeCollections' from project 'swift-collections')
SwiftCompile normal armv7k /Users/admin/builder/spi-builder-workspace/.dependencies/checkouts/swift-collections/Sources/HashTreeCollections/TreeDictionary/TreeDictionary+ExpressibleByDictionaryLiteral.swift (in target 'HashTreeCollections' from project 'swift-collections')
cd /Users/admin/builder/spi-builder-workspace/.swiftpm/xcode
SwiftCompile normal armv7k /Users/admin/builder/spi-builder-workspace/.dependencies/checkouts/swift-collections/Sources/HashTreeCollections/TreeDictionary/TreeDictionary+Filter.swift (in target 'HashTreeCollections' from project 'swift-collections')
cd /Users/admin/builder/spi-builder-workspace/.swiftpm/xcode
SwiftCompile normal armv7k /Users/admin/builder/spi-builder-workspace/.dependencies/checkouts/swift-collections/Sources/HashTreeCollections/TreeDictionary/TreeDictionary+Hashable.swift (in target 'HashTreeCollections' from project 'swift-collections')
cd /Users/admin/builder/spi-builder-workspace/.swiftpm/xcode
SwiftCompile normal armv7k /Users/admin/builder/spi-builder-workspace/.dependencies/checkouts/swift-collections/Sources/HashTreeCollections/TreeDictionary/TreeDictionary+Initializers.swift (in target 'HashTreeCollections' from project 'swift-collections')
cd /Users/admin/builder/spi-builder-workspace/.swiftpm/xcode
SwiftCompile normal armv7k /Users/admin/builder/spi-builder-workspace/.dependencies/checkouts/swift-collections/Sources/HashTreeCollections/TreeDictionary/TreeDictionary+Keys.swift (in target 'HashTreeCollections' from project 'swift-collections')
cd /Users/admin/builder/spi-builder-workspace/.swiftpm/xcode
SwiftCompile normal armv7k /Users/admin/builder/spi-builder-workspace/.dependencies/checkouts/swift-collections/Sources/HashTreeCollections/TreeDictionary/TreeDictionary+MapValues.swift (in target 'HashTreeCollections' from project 'swift-collections')
cd /Users/admin/builder/spi-builder-workspace/.swiftpm/xcode
SwiftCompile normal armv7k /Users/admin/builder/spi-builder-workspace/.dependencies/checkouts/swift-collections/Sources/HashTreeCollections/TreeDictionary/TreeDictionary+Merge.swift (in target 'HashTreeCollections' from project 'swift-collections')
cd /Users/admin/builder/spi-builder-workspace/.swiftpm/xcode
SwiftCompile normal armv7k /Users/admin/builder/spi-builder-workspace/.dependencies/checkouts/swift-collections/Sources/HashTreeCollections/TreeDictionary/TreeDictionary+Sendable.swift (in target 'HashTreeCollections' from project 'swift-collections')
cd /Users/admin/builder/spi-builder-workspace/.swiftpm/xcode
SwiftDriverJobDiscovery normal arm64_32 Compiling OrderedSet+SubSequence.swift, OrderedSet+Testing.swift, OrderedSet+UnorderedView.swift, OrderedSet+UnstableInternals.swift, OrderedSet.swift, _UnsafeBitset.swift (in target 'OrderedCollections' from project 'swift-collections')
SwiftDriverJobDiscovery normal arm64_32 Compiling Deque+Codable.swift, Deque+Collection.swift (in target 'DequeModule' from project 'swift-collections')
SwiftDriver\ Compilation OrderedCollections normal arm64_32 com.apple.xcode.tools.swift.compiler (in target 'OrderedCollections' from project 'swift-collections')
cd /Users/admin/builder/spi-builder-workspace/.swiftpm/xcode
builtin-Swift-Compilation -- /Applications/Xcode-16.3.0.app/Contents/Developer/Toolchains/XcodeDefault.xctoolchain/usr/bin/swiftc -module-name OrderedCollections -Onone -enforce-exclusivity\=checked @/Users/admin/builder/spi-builder-workspace/.derivedData/Build/Intermediates.noindex/swift-collections.build/Debug-watchos/OrderedCollections.build/Objects-normal/arm64_32/OrderedCollections.SwiftFileList -DSWIFT_PACKAGE -DDEBUG -DCOLLECTIONS_RANDOMIZED_TESTING -DXcode -plugin-path /Applications/Xcode-16.3.0.app/Contents/Developer/Toolchains/XcodeDefault.xctoolchain/usr/lib/swift/host/plugins/testing -enable-experimental-feature DebugDescriptionMacro -sdk /Applications/Xcode-16.3.0.app/Contents/Developer/Platforms/WatchOS.platform/Developer/SDKs/WatchOS11.4.sdk -target arm64_32-apple-watchos5.0 -g -module-cache-path /Users/admin/builder/spi-builder-workspace/.derivedData/ModuleCache.noindex -Xfrontend -serialize-debugging-options -enable-testing -suppress-warnings -index-store-path /Users/admin/builder/spi-builder-workspace/.derivedData/Index.noindex/DataStore -swift-version 5 -I /Users/admin/builder/spi-builder-workspace/.derivedData/Build/Products/Debug-watchos -I /Applications/Xcode-16.3.0.app/Contents/Developer/Platforms/WatchOS.platform/Developer/usr/lib -F /Users/admin/builder/spi-builder-workspace/.derivedData/Build/Products/Debug-watchos/PackageFrameworks -F /Users/admin/builder/spi-builder-workspace/.derivedData/Build/Products/Debug-watchos -F /Applications/Xcode-16.3.0.app/Contents/Developer/Platforms/WatchOS.platform/Developer/Library/Frameworks -F /Applications/Xcode-16.3.0.app/Contents/Developer/Platforms/WatchOS.platform/Developer/SDKs/WatchOS11.4.sdk/Developer/Library/Frameworks -c -j10 -enable-batch-mode -incremental -Xcc -ivfsstatcache -Xcc /Users/admin/builder/spi-builder-workspace/.derivedData/SDKStatCaches.noindex/watchos11.4-22T246-43efb940ff07ba2497b70ec94253f576.sdkstatcache -output-file-map /Users/admin/builder/spi-builder-workspace/.derivedData/Build/Intermediates.noindex/swift-collections.build/Debug-watchos/OrderedCollections.build/Objects-normal/arm64_32/OrderedCollections-OutputFileMap.json -use-frontend-parseable-output -save-temps -no-color-diagnostics -serialize-diagnostics -emit-dependencies -emit-module -emit-module-path /Users/admin/builder/spi-builder-workspace/.derivedData/Build/Intermediates.noindex/swift-collections.build/Debug-watchos/OrderedCollections.build/Objects-normal/arm64_32/OrderedCollections.swiftmodule -validate-clang-modules-once -clang-build-session-file /Users/admin/builder/spi-builder-workspace/.derivedData/ModuleCache.noindex/Session.modulevalidation -Xcc -I/Users/admin/builder/spi-builder-workspace/.derivedData/Build/Intermediates.noindex/swift-collections.build/Debug-watchos/OrderedCollections.build/swift-overrides.hmap -emit-const-values -Xfrontend -const-gather-protocols-file -Xfrontend /Users/admin/builder/spi-builder-workspace/.derivedData/Build/Intermediates.noindex/swift-collections.build/Debug-watchos/OrderedCollections.build/Objects-normal/arm64_32/OrderedCollections_const_extract_protocols.json -Xcc -I/Users/admin/builder/spi-builder-workspace/.derivedData/Build/Products/Debug-watchos/include -Xcc -I/Users/admin/builder/spi-builder-workspace/.derivedData/Build/Intermediates.noindex/swift-collections.build/Debug-watchos/OrderedCollections.build/DerivedSources-normal/arm64_32 -Xcc -I/Users/admin/builder/spi-builder-workspace/.derivedData/Build/Intermediates.noindex/swift-collections.build/Debug-watchos/OrderedCollections.build/DerivedSources/arm64_32 -Xcc -I/Users/admin/builder/spi-builder-workspace/.derivedData/Build/Intermediates.noindex/swift-collections.build/Debug-watchos/OrderedCollections.build/DerivedSources -Xcc -DSWIFT_PACKAGE -Xcc -DDEBUG\=1 -emit-objc-header -emit-objc-header-path /Users/admin/builder/spi-builder-workspace/.derivedData/Build/Intermediates.noindex/swift-collections.build/Debug-watchos/OrderedCollections.build/Objects-normal/arm64_32/OrderedCollections-Swift.h -working-directory /Users/admin/builder/spi-builder-workspace/.swiftpm/xcode -experimental-emit-module-separately -disable-cmo
SwiftCompile normal armv7k Compiling\ _RawHashNode.swift,\ _UnmanagedHashNode.swift,\ _UnsafePath.swift,\ TreeDictionary+Codable.swift,\ TreeDictionary+Collection.swift,\ TreeDictionary+CustomReflectable.swift,\ TreeDictionary+Debugging.swift,\ TreeDictionary+Descriptions.swift,\ TreeDictionary+Equatable.swift /Users/admin/builder/spi-builder-workspace/.dependencies/checkouts/swift-collections/Sources/HashTreeCollections/HashNode/_RawHashNode.swift /Users/admin/builder/spi-builder-workspace/.dependencies/checkouts/swift-collections/Sources/HashTreeCollections/HashNode/_UnmanagedHashNode.swift /Users/admin/builder/spi-builder-workspace/.dependencies/checkouts/swift-collections/Sources/HashTreeCollections/HashNode/_UnsafePath.swift /Users/admin/builder/spi-builder-workspace/.dependencies/checkouts/swift-collections/Sources/HashTreeCollections/TreeDictionary/TreeDictionary+Codable.swift /Users/admin/builder/spi-builder-workspace/.dependencies/checkouts/swift-collections/Sources/HashTreeCollections/TreeDictionary/TreeDictionary+Collection.swift /Users/admin/builder/spi-builder-workspace/.dependencies/checkouts/swift-collections/Sources/HashTreeCollections/TreeDictionary/TreeDictionary+CustomReflectable.swift /Users/admin/builder/spi-builder-workspace/.dependencies/checkouts/swift-collections/Sources/HashTreeCollections/TreeDictionary/TreeDictionary+Debugging.swift /Users/admin/builder/spi-builder-workspace/.dependencies/checkouts/swift-collections/Sources/HashTreeCollections/TreeDictionary/TreeDictionary+Descriptions.swift /Users/admin/builder/spi-builder-workspace/.dependencies/checkouts/swift-collections/Sources/HashTreeCollections/TreeDictionary/TreeDictionary+Equatable.swift (in target 'HashTreeCollections' from project 'swift-collections')
SwiftCompile normal armv7k /Users/admin/builder/spi-builder-workspace/.dependencies/checkouts/swift-collections/Sources/HashTreeCollections/HashNode/_RawHashNode.swift (in target 'HashTreeCollections' from project 'swift-collections')
cd /Users/admin/builder/spi-builder-workspace/.swiftpm/xcode
SwiftCompile normal armv7k /Users/admin/builder/spi-builder-workspace/.dependencies/checkouts/swift-collections/Sources/HashTreeCollections/HashNode/_UnmanagedHashNode.swift (in target 'HashTreeCollections' from project 'swift-collections')
cd /Users/admin/builder/spi-builder-workspace/.swiftpm/xcode
SwiftCompile normal armv7k /Users/admin/builder/spi-builder-workspace/.dependencies/checkouts/swift-collections/Sources/HashTreeCollections/HashNode/_UnsafePath.swift (in target 'HashTreeCollections' from project 'swift-collections')
cd /Users/admin/builder/spi-builder-workspace/.swiftpm/xcode
SwiftCompile normal armv7k /Users/admin/builder/spi-builder-workspace/.dependencies/checkouts/swift-collections/Sources/HashTreeCollections/TreeDictionary/TreeDictionary+Codable.swift (in target 'HashTreeCollections' from project 'swift-collections')
cd /Users/admin/builder/spi-builder-workspace/.swiftpm/xcode
SwiftCompile normal armv7k /Users/admin/builder/spi-builder-workspace/.dependencies/checkouts/swift-collections/Sources/HashTreeCollections/TreeDictionary/TreeDictionary+Collection.swift (in target 'HashTreeCollections' from project 'swift-collections')
cd /Users/admin/builder/spi-builder-workspace/.swiftpm/xcode
SwiftCompile normal armv7k /Users/admin/builder/spi-builder-workspace/.dependencies/checkouts/swift-collections/Sources/HashTreeCollections/TreeDictionary/TreeDictionary+CustomReflectable.swift (in target 'HashTreeCollections' from project 'swift-collections')
cd /Users/admin/builder/spi-builder-workspace/.swiftpm/xcode
SwiftCompile normal armv7k /Users/admin/builder/spi-builder-workspace/.dependencies/checkouts/swift-collections/Sources/HashTreeCollections/TreeDictionary/TreeDictionary+Debugging.swift (in target 'HashTreeCollections' from project 'swift-collections')
cd /Users/admin/builder/spi-builder-workspace/.swiftpm/xcode
SwiftCompile normal armv7k /Users/admin/builder/spi-builder-workspace/.dependencies/checkouts/swift-collections/Sources/HashTreeCollections/TreeDictionary/TreeDictionary+Descriptions.swift (in target 'HashTreeCollections' from project 'swift-collections')
cd /Users/admin/builder/spi-builder-workspace/.swiftpm/xcode
SwiftCompile normal armv7k /Users/admin/builder/spi-builder-workspace/.dependencies/checkouts/swift-collections/Sources/HashTreeCollections/TreeDictionary/TreeDictionary+Equatable.swift (in target 'HashTreeCollections' from project 'swift-collections')
cd /Users/admin/builder/spi-builder-workspace/.swiftpm/xcode
SwiftCompile normal armv7k Compiling\ _HashNode+Structural\ isEqualSet.swift,\ _HashNode+Structural\ isSubset.swift,\ _HashNode+Structural\ mapValues.swift,\ _HashNode+Structural\ merge.swift,\ _HashNode+Structural\ subtracting.swift,\ _HashNode+Structural\ symmetricDifference.swift,\ _HashNode+Structural\ union.swift,\ _HashNode+Subtree\ Insertions.swift,\ _HashNode+Subtree\ Modify.swift /Users/admin/builder/spi-builder-workspace/.dependencies/checkouts/swift-collections/Sources/HashTreeCollections/HashNode/_HashNode+Structural\ isEqualSet.swift /Users/admin/builder/spi-builder-workspace/.dependencies/checkouts/swift-collections/Sources/HashTreeCollections/HashNode/_HashNode+Structural\ isSubset.swift /Users/admin/builder/spi-builder-workspace/.dependencies/checkouts/swift-collections/Sources/HashTreeCollections/HashNode/_HashNode+Structural\ mapValues.swift /Users/admin/builder/spi-builder-workspace/.dependencies/checkouts/swift-collections/Sources/HashTreeCollections/HashNode/_HashNode+Structural\ merge.swift /Users/admin/builder/spi-builder-workspace/.dependencies/checkouts/swift-collections/Sources/HashTreeCollections/HashNode/_HashNode+Structural\ subtracting.swift /Users/admin/builder/spi-builder-workspace/.dependencies/checkouts/swift-collections/Sources/HashTreeCollections/HashNode/_HashNode+Structural\ symmetricDifference.swift /Users/admin/builder/spi-builder-workspace/.dependencies/checkouts/swift-collections/Sources/HashTreeCollections/HashNode/_HashNode+Structural\ union.swift /Users/admin/builder/spi-builder-workspace/.dependencies/checkouts/swift-collections/Sources/HashTreeCollections/HashNode/_HashNode+Subtree\ Insertions.swift /Users/admin/builder/spi-builder-workspace/.dependencies/checkouts/swift-collections/Sources/HashTreeCollections/HashNode/_HashNode+Subtree\ Modify.swift (in target 'HashTreeCollections' from project 'swift-collections')
SwiftCompile normal armv7k /Users/admin/builder/spi-builder-workspace/.dependencies/checkouts/swift-collections/Sources/HashTreeCollections/HashNode/_HashNode+Structural\ isEqualSet.swift (in target 'HashTreeCollections' from project 'swift-collections')
cd /Users/admin/builder/spi-builder-workspace/.swiftpm/xcode
SwiftCompile normal armv7k /Users/admin/builder/spi-builder-workspace/.dependencies/checkouts/swift-collections/Sources/HashTreeCollections/HashNode/_HashNode+Structural\ isSubset.swift (in target 'HashTreeCollections' from project 'swift-collections')
cd /Users/admin/builder/spi-builder-workspace/.swiftpm/xcode
SwiftCompile normal armv7k /Users/admin/builder/spi-builder-workspace/.dependencies/checkouts/swift-collections/Sources/HashTreeCollections/HashNode/_HashNode+Structural\ mapValues.swift (in target 'HashTreeCollections' from project 'swift-collections')
cd /Users/admin/builder/spi-builder-workspace/.swiftpm/xcode
SwiftCompile normal armv7k /Users/admin/builder/spi-builder-workspace/.dependencies/checkouts/swift-collections/Sources/HashTreeCollections/HashNode/_HashNode+Structural\ merge.swift (in target 'HashTreeCollections' from project 'swift-collections')
cd /Users/admin/builder/spi-builder-workspace/.swiftpm/xcode
SwiftCompile normal armv7k /Users/admin/builder/spi-builder-workspace/.dependencies/checkouts/swift-collections/Sources/HashTreeCollections/HashNode/_HashNode+Structural\ subtracting.swift (in target 'HashTreeCollections' from project 'swift-collections')
cd /Users/admin/builder/spi-builder-workspace/.swiftpm/xcode
SwiftCompile normal armv7k /Users/admin/builder/spi-builder-workspace/.dependencies/checkouts/swift-collections/Sources/HashTreeCollections/HashNode/_HashNode+Structural\ symmetricDifference.swift (in target 'HashTreeCollections' from project 'swift-collections')
cd /Users/admin/builder/spi-builder-workspace/.swiftpm/xcode
SwiftCompile normal armv7k /Users/admin/builder/spi-builder-workspace/.dependencies/checkouts/swift-collections/Sources/HashTreeCollections/HashNode/_HashNode+Structural\ union.swift (in target 'HashTreeCollections' from project 'swift-collections')
cd /Users/admin/builder/spi-builder-workspace/.swiftpm/xcode
SwiftCompile normal armv7k /Users/admin/builder/spi-builder-workspace/.dependencies/checkouts/swift-collections/Sources/HashTreeCollections/HashNode/_HashNode+Subtree\ Insertions.swift (in target 'HashTreeCollections' from project 'swift-collections')
cd /Users/admin/builder/spi-builder-workspace/.swiftpm/xcode
SwiftCompile normal armv7k /Users/admin/builder/spi-builder-workspace/.dependencies/checkouts/swift-collections/Sources/HashTreeCollections/HashNode/_HashNode+Subtree\ Modify.swift (in target 'HashTreeCollections' from project 'swift-collections')
cd /Users/admin/builder/spi-builder-workspace/.swiftpm/xcode
SwiftEmitModule normal armv7k Emitting\ module\ for\ SwiftSCAD (in target 'SwiftSCAD' from project 'SwiftSCAD')
EmitSwiftModule normal armv7k (in target 'SwiftSCAD' from project 'SwiftSCAD')
cd /Users/admin/builder/spi-builder-workspace/.swiftpm/xcode
SwiftEmitModule normal arm64 Emitting\ module\ for\ SwiftSCAD (in target 'SwiftSCAD' from project 'SwiftSCAD')
EmitSwiftModule normal arm64 (in target 'SwiftSCAD' from project 'SwiftSCAD')
cd /Users/admin/builder/spi-builder-workspace/.swiftpm/xcode
SwiftDriverJobDiscovery normal armv7k Compiling BitSet+SetAlgebra formIntersection.swift, BitSet+SetAlgebra formSymmetricDifference.swift, BitSet+SetAlgebra formUnion.swift, BitSet+SetAlgebra intersection.swift, BitSet+SetAlgebra isDisjoint.swift, BitSet+SetAlgebra isEqualSet.swift (in target 'BitCollections' from project 'swift-collections')
SwiftCompile normal arm64 Compiling\ Boundary.swift,\ BoundingBox+Visualization.swift,\ BoundingBox.swift,\ Color.swift,\ Box.Corner.swift,\ Box.Edge.swift,\ Box.Side.swift,\ OrthogonalCorner.swift,\ Rectangle.Corner.swift,\ RoundedCornerStyle.swift,\ Chamfer.swift,\ ChamferedFillet.swift,\ EdgeProfile.swift,\ EdgeProfileShape.swift,\ Fillet.swift,\ SCADValue.swift,\ AffineTransform2D+Creation.swift /Users/admin/builder/spi-builder-workspace/.dependencies/checkouts/SwiftSCAD/Sources/SwiftSCAD/Values/Boundary/Boundary.swift /Users/admin/builder/spi-builder-workspace/.dependencies/checkouts/SwiftSCAD/Sources/SwiftSCAD/Values/Boundary/BoundingBox+Visualization.swift /Users/admin/builder/spi-builder-workspace/.dependencies/checkouts/SwiftSCAD/Sources/SwiftSCAD/Values/Boundary/BoundingBox.swift /Users/admin/builder/spi-builder-workspace/.dependencies/checkouts/SwiftSCAD/Sources/SwiftSCAD/Values/Color.swift /Users/admin/builder/spi-builder-workspace/.dependencies/checkouts/SwiftSCAD/Sources/SwiftSCAD/Values/Corners,\ Edges\ and\ Sides/Box.Corner.swift /Users/admin/builder/spi-builder-workspace/.dependencies/checkouts/SwiftSCAD/Sources/SwiftSCAD/Values/Corners,\ Edges\ and\ Sides/Box.Edge.swift /Users/admin/builder/spi-builder-workspace/.dependencies/checkouts/SwiftSCAD/Sources/SwiftSCAD/Values/Corners,\ Edges\ and\ Sides/Box.Side.swift /Users/admin/builder/spi-builder-workspace/.dependencies/checkouts/SwiftSCAD/Sources/SwiftSCAD/Values/Corners,\ Edges\ and\ Sides/OrthogonalCorner.swift /Users/admin/builder/spi-builder-workspace/.dependencies/checkouts/SwiftSCAD/Sources/SwiftSCAD/Values/Corners,\ Edges\ and\ Sides/Rectangle.Corner.swift /Users/admin/builder/spi-builder-workspace/.dependencies/checkouts/SwiftSCAD/Sources/SwiftSCAD/Values/Corners,\ Edges\ and\ Sides/RoundedCornerStyle.swift /Users/admin/builder/spi-builder-workspace/.dependencies/checkouts/SwiftSCAD/Sources/SwiftSCAD/Values/Edge\ Profiles/Chamfer.swift /Users/admin/builder/spi-builder-workspace/.dependencies/checkouts/SwiftSCAD/Sources/SwiftSCAD/Values/Edge\ Profiles/ChamferedFillet.swift /Users/admin/builder/spi-builder-workspace/.dependencies/checkouts/SwiftSCAD/Sources/SwiftSCAD/Values/Edge\ Profiles/EdgeProfile.swift /Users/admin/builder/spi-builder-workspace/.dependencies/checkouts/SwiftSCAD/Sources/SwiftSCAD/Values/Edge\ Profiles/EdgeProfileShape.swift /Users/admin/builder/spi-builder-workspace/.dependencies/checkouts/SwiftSCAD/Sources/SwiftSCAD/Values/Edge\ Profiles/Fillet.swift /Users/admin/builder/spi-builder-workspace/.dependencies/checkouts/SwiftSCAD/Sources/SwiftSCAD/Values/SCADValue.swift /Users/admin/builder/spi-builder-workspace/.dependencies/checkouts/SwiftSCAD/Sources/SwiftSCAD/Values/Transforms/2D/AffineTransform2D+Creation.swift (in target 'SwiftSCAD' from project 'SwiftSCAD')
SwiftCompile normal arm64 /Users/admin/builder/spi-builder-workspace/.dependencies/checkouts/SwiftSCAD/Sources/SwiftSCAD/Values/Boundary/Boundary.swift (in target 'SwiftSCAD' from project 'SwiftSCAD')
cd /Users/admin/builder/spi-builder-workspace/.swiftpm/xcode
SwiftCompile normal arm64 /Users/admin/builder/spi-builder-workspace/.dependencies/checkouts/SwiftSCAD/Sources/SwiftSCAD/Values/Boundary/BoundingBox+Visualization.swift (in target 'SwiftSCAD' from project 'SwiftSCAD')
cd /Users/admin/builder/spi-builder-workspace/.swiftpm/xcode
SwiftCompile normal arm64 /Users/admin/builder/spi-builder-workspace/.dependencies/checkouts/SwiftSCAD/Sources/SwiftSCAD/Values/Boundary/BoundingBox.swift (in target 'SwiftSCAD' from project 'SwiftSCAD')
cd /Users/admin/builder/spi-builder-workspace/.swiftpm/xcode
SwiftCompile normal arm64 /Users/admin/builder/spi-builder-workspace/.dependencies/checkouts/SwiftSCAD/Sources/SwiftSCAD/Values/Color.swift (in target 'SwiftSCAD' from project 'SwiftSCAD')
cd /Users/admin/builder/spi-builder-workspace/.swiftpm/xcode
SwiftCompile normal arm64 /Users/admin/builder/spi-builder-workspace/.dependencies/checkouts/SwiftSCAD/Sources/SwiftSCAD/Values/Corners,\ Edges\ and\ Sides/Box.Corner.swift (in target 'SwiftSCAD' from project 'SwiftSCAD')
cd /Users/admin/builder/spi-builder-workspace/.swiftpm/xcode
SwiftCompile normal arm64 /Users/admin/builder/spi-builder-workspace/.dependencies/checkouts/SwiftSCAD/Sources/SwiftSCAD/Values/Corners,\ Edges\ and\ Sides/Box.Edge.swift (in target 'SwiftSCAD' from project 'SwiftSCAD')
cd /Users/admin/builder/spi-builder-workspace/.swiftpm/xcode
SwiftCompile normal arm64 /Users/admin/builder/spi-builder-workspace/.dependencies/checkouts/SwiftSCAD/Sources/SwiftSCAD/Values/Corners,\ Edges\ and\ Sides/Box.Side.swift (in target 'SwiftSCAD' from project 'SwiftSCAD')
cd /Users/admin/builder/spi-builder-workspace/.swiftpm/xcode
SwiftCompile normal arm64 /Users/admin/builder/spi-builder-workspace/.dependencies/checkouts/SwiftSCAD/Sources/SwiftSCAD/Values/Corners,\ Edges\ and\ Sides/OrthogonalCorner.swift (in target 'SwiftSCAD' from project 'SwiftSCAD')
cd /Users/admin/builder/spi-builder-workspace/.swiftpm/xcode
SwiftCompile normal arm64 /Users/admin/builder/spi-builder-workspace/.dependencies/checkouts/SwiftSCAD/Sources/SwiftSCAD/Values/Corners,\ Edges\ and\ Sides/Rectangle.Corner.swift (in target 'SwiftSCAD' from project 'SwiftSCAD')
cd /Users/admin/builder/spi-builder-workspace/.swiftpm/xcode
SwiftCompile normal arm64 /Users/admin/builder/spi-builder-workspace/.dependencies/checkouts/SwiftSCAD/Sources/SwiftSCAD/Values/Corners,\ Edges\ and\ Sides/RoundedCornerStyle.swift (in target 'SwiftSCAD' from project 'SwiftSCAD')
cd /Users/admin/builder/spi-builder-workspace/.swiftpm/xcode
SwiftCompile normal arm64 /Users/admin/builder/spi-builder-workspace/.dependencies/checkouts/SwiftSCAD/Sources/SwiftSCAD/Values/Edge\ Profiles/Chamfer.swift (in target 'SwiftSCAD' from project 'SwiftSCAD')
cd /Users/admin/builder/spi-builder-workspace/.swiftpm/xcode
SwiftCompile normal arm64 /Users/admin/builder/spi-builder-workspace/.dependencies/checkouts/SwiftSCAD/Sources/SwiftSCAD/Values/Edge\ Profiles/ChamferedFillet.swift (in target 'SwiftSCAD' from project 'SwiftSCAD')
cd /Users/admin/builder/spi-builder-workspace/.swiftpm/xcode
SwiftCompile normal arm64 /Users/admin/builder/spi-builder-workspace/.dependencies/checkouts/SwiftSCAD/Sources/SwiftSCAD/Values/Edge\ Profiles/EdgeProfile.swift (in target 'SwiftSCAD' from project 'SwiftSCAD')
cd /Users/admin/builder/spi-builder-workspace/.swiftpm/xcode
SwiftCompile normal arm64 /Users/admin/builder/spi-builder-workspace/.dependencies/checkouts/SwiftSCAD/Sources/SwiftSCAD/Values/Edge\ Profiles/EdgeProfileShape.swift (in target 'SwiftSCAD' from project 'SwiftSCAD')
cd /Users/admin/builder/spi-builder-workspace/.swiftpm/xcode
SwiftCompile normal arm64 /Users/admin/builder/spi-builder-workspace/.dependencies/checkouts/SwiftSCAD/Sources/SwiftSCAD/Values/Edge\ Profiles/Fillet.swift (in target 'SwiftSCAD' from project 'SwiftSCAD')
cd /Users/admin/builder/spi-builder-workspace/.swiftpm/xcode
SwiftCompile normal arm64 /Users/admin/builder/spi-builder-workspace/.dependencies/checkouts/SwiftSCAD/Sources/SwiftSCAD/Values/SCADValue.swift (in target 'SwiftSCAD' from project 'SwiftSCAD')
cd /Users/admin/builder/spi-builder-workspace/.swiftpm/xcode
SwiftCompile normal arm64 /Users/admin/builder/spi-builder-workspace/.dependencies/checkouts/SwiftSCAD/Sources/SwiftSCAD/Values/Transforms/2D/AffineTransform2D+Creation.swift (in target 'SwiftSCAD' from project 'SwiftSCAD')
cd /Users/admin/builder/spi-builder-workspace/.swiftpm/xcode
SwiftEmitModule normal arm64_32 Emitting\ module\ for\ SwiftSCAD (in target 'SwiftSCAD' from project 'SwiftSCAD')
EmitSwiftModule normal arm64_32 (in target 'SwiftSCAD' from project 'SwiftSCAD')
cd /Users/admin/builder/spi-builder-workspace/.swiftpm/xcode
SwiftDriverJobDiscovery normal armv7k Compiling TreeSet+SetAlgebra isStrictSuperset.swift, TreeSet+SetAlgebra isSubset.swift, TreeSet+SetAlgebra isSuperset.swift, TreeSet+SetAlgebra subtract.swift, TreeSet+SetAlgebra subtracting.swift, TreeSet+SetAlgebra symmetricDifference.swift, TreeSet+SetAlgebra union.swift, TreeSet.swift (in target 'HashTreeCollections' from project 'swift-collections')
SwiftCompile normal armv7k Compiling\ ResultModifier.swift,\ ResultReader.swift,\ Logging.swift,\ Aligned.swift,\ Adding.swift,\ AddingExclusive.swift,\ Difference.swift,\ Intersection.swift,\ Union.swift,\ Measure.swift,\ OffsetBounds.swift,\ Resize2D.swift,\ Resize3D.swift,\ SetBounds.swift,\ SetBoundsSize.swift,\ Clone.swift,\ Distribute.swift /Users/admin/builder/spi-builder-workspace/.dependencies/checkouts/SwiftSCAD/Sources/SwiftSCAD/Geometry/ResultElement/ResultModifier.swift /Users/admin/builder/spi-builder-workspace/.dependencies/checkouts/SwiftSCAD/Sources/SwiftSCAD/Geometry/ResultElement/ResultReader.swift /Users/admin/builder/spi-builder-workspace/.dependencies/checkouts/SwiftSCAD/Sources/SwiftSCAD/Logging.swift /Users/admin/builder/spi-builder-workspace/.dependencies/checkouts/SwiftSCAD/Sources/SwiftSCAD/Operations/Aligned.swift /Users/admin/builder/spi-builder-workspace/.dependencies/checkouts/SwiftSCAD/Sources/SwiftSCAD/Operations/Boolean/Adding.swift /Users/admin/builder/spi-builder-workspace/.dependencies/checkouts/SwiftSCAD/Sources/SwiftSCAD/Operations/Boolean/AddingExclusive.swift /Users/admin/builder/spi-builder-workspace/.dependencies/checkouts/SwiftSCAD/Sources/SwiftSCAD/Operations/Boolean/Difference.swift /Users/admin/builder/spi-builder-workspace/.dependencies/checkouts/SwiftSCAD/Sources/SwiftSCAD/Operations/Boolean/Intersection.swift /Users/admin/builder/spi-builder-workspace/.dependencies/checkouts/SwiftSCAD/Sources/SwiftSCAD/Operations/Boolean/Union.swift /Users/admin/builder/spi-builder-workspace/.dependencies/checkouts/SwiftSCAD/Sources/SwiftSCAD/Operations/Bounds/Measure.swift /Users/admin/builder/spi-builder-workspace/.dependencies/checkouts/SwiftSCAD/Sources/SwiftSCAD/Operations/Bounds/OffsetBounds.swift /Users/admin/builder/spi-builder-workspace/.dependencies/checkouts/SwiftSCAD/Sources/SwiftSCAD/Operations/Bounds/Resize2D.swift /Users/admin/builder/spi-builder-workspace/.dependencies/checkouts/SwiftSCAD/Sources/SwiftSCAD/Operations/Bounds/Resize3D.swift /Users/admin/builder/spi-builder-workspace/.dependencies/checkouts/SwiftSCAD/Sources/SwiftSCAD/Operations/Bounds/SetBounds.swift /Users/admin/builder/spi-builder-workspace/.dependencies/checkouts/SwiftSCAD/Sources/SwiftSCAD/Operations/Bounds/SetBoundsSize.swift /Users/admin/builder/spi-builder-workspace/.dependencies/checkouts/SwiftSCAD/Sources/SwiftSCAD/Operations/Duplication/Clone.swift /Users/admin/builder/spi-builder-workspace/.dependencies/checkouts/SwiftSCAD/Sources/SwiftSCAD/Operations/Duplication/Distribute.swift (in target 'SwiftSCAD' from project 'SwiftSCAD')
SwiftCompile normal armv7k /Users/admin/builder/spi-builder-workspace/.dependencies/checkouts/SwiftSCAD/Sources/SwiftSCAD/Geometry/ResultElement/ResultModifier.swift (in target 'SwiftSCAD' from project 'SwiftSCAD')
cd /Users/admin/builder/spi-builder-workspace/.swiftpm/xcode
SwiftCompile normal armv7k /Users/admin/builder/spi-builder-workspace/.dependencies/checkouts/SwiftSCAD/Sources/SwiftSCAD/Geometry/ResultElement/ResultReader.swift (in target 'SwiftSCAD' from project 'SwiftSCAD')
cd /Users/admin/builder/spi-builder-workspace/.swiftpm/xcode
SwiftCompile normal armv7k /Users/admin/builder/spi-builder-workspace/.dependencies/checkouts/SwiftSCAD/Sources/SwiftSCAD/Logging.swift (in target 'SwiftSCAD' from project 'SwiftSCAD')
cd /Users/admin/builder/spi-builder-workspace/.swiftpm/xcode
SwiftCompile normal armv7k /Users/admin/builder/spi-builder-workspace/.dependencies/checkouts/SwiftSCAD/Sources/SwiftSCAD/Operations/Aligned.swift (in target 'SwiftSCAD' from project 'SwiftSCAD')
cd /Users/admin/builder/spi-builder-workspace/.swiftpm/xcode
SwiftCompile normal armv7k /Users/admin/builder/spi-builder-workspace/.dependencies/checkouts/SwiftSCAD/Sources/SwiftSCAD/Operations/Boolean/Adding.swift (in target 'SwiftSCAD' from project 'SwiftSCAD')
cd /Users/admin/builder/spi-builder-workspace/.swiftpm/xcode
SwiftCompile normal armv7k /Users/admin/builder/spi-builder-workspace/.dependencies/checkouts/SwiftSCAD/Sources/SwiftSCAD/Operations/Boolean/AddingExclusive.swift (in target 'SwiftSCAD' from project 'SwiftSCAD')
cd /Users/admin/builder/spi-builder-workspace/.swiftpm/xcode
SwiftCompile normal armv7k /Users/admin/builder/spi-builder-workspace/.dependencies/checkouts/SwiftSCAD/Sources/SwiftSCAD/Operations/Boolean/Difference.swift (in target 'SwiftSCAD' from project 'SwiftSCAD')
cd /Users/admin/builder/spi-builder-workspace/.swiftpm/xcode
SwiftCompile normal armv7k /Users/admin/builder/spi-builder-workspace/.dependencies/checkouts/SwiftSCAD/Sources/SwiftSCAD/Operations/Boolean/Intersection.swift (in target 'SwiftSCAD' from project 'SwiftSCAD')
cd /Users/admin/builder/spi-builder-workspace/.swiftpm/xcode
SwiftCompile normal armv7k /Users/admin/builder/spi-builder-workspace/.dependencies/checkouts/SwiftSCAD/Sources/SwiftSCAD/Operations/Boolean/Union.swift (in target 'SwiftSCAD' from project 'SwiftSCAD')
cd /Users/admin/builder/spi-builder-workspace/.swiftpm/xcode
SwiftCompile normal armv7k /Users/admin/builder/spi-builder-workspace/.dependencies/checkouts/SwiftSCAD/Sources/SwiftSCAD/Operations/Bounds/Measure.swift (in target 'SwiftSCAD' from project 'SwiftSCAD')
cd /Users/admin/builder/spi-builder-workspace/.swiftpm/xcode
SwiftCompile normal armv7k /Users/admin/builder/spi-builder-workspace/.dependencies/checkouts/SwiftSCAD/Sources/SwiftSCAD/Operations/Bounds/OffsetBounds.swift (in target 'SwiftSCAD' from project 'SwiftSCAD')
cd /Users/admin/builder/spi-builder-workspace/.swiftpm/xcode
SwiftCompile normal armv7k /Users/admin/builder/spi-builder-workspace/.dependencies/checkouts/SwiftSCAD/Sources/SwiftSCAD/Operations/Bounds/Resize2D.swift (in target 'SwiftSCAD' from project 'SwiftSCAD')
cd /Users/admin/builder/spi-builder-workspace/.swiftpm/xcode
SwiftCompile normal armv7k /Users/admin/builder/spi-builder-workspace/.dependencies/checkouts/SwiftSCAD/Sources/SwiftSCAD/Operations/Bounds/Resize3D.swift (in target 'SwiftSCAD' from project 'SwiftSCAD')
cd /Users/admin/builder/spi-builder-workspace/.swiftpm/xcode
SwiftCompile normal armv7k /Users/admin/builder/spi-builder-workspace/.dependencies/checkouts/SwiftSCAD/Sources/SwiftSCAD/Operations/Bounds/SetBounds.swift (in target 'SwiftSCAD' from project 'SwiftSCAD')
cd /Users/admin/builder/spi-builder-workspace/.swiftpm/xcode
SwiftCompile normal armv7k /Users/admin/builder/spi-builder-workspace/.dependencies/checkouts/SwiftSCAD/Sources/SwiftSCAD/Operations/Bounds/SetBoundsSize.swift (in target 'SwiftSCAD' from project 'SwiftSCAD')
cd /Users/admin/builder/spi-builder-workspace/.swiftpm/xcode
SwiftCompile normal armv7k /Users/admin/builder/spi-builder-workspace/.dependencies/checkouts/SwiftSCAD/Sources/SwiftSCAD/Operations/Duplication/Clone.swift (in target 'SwiftSCAD' from project 'SwiftSCAD')
cd /Users/admin/builder/spi-builder-workspace/.swiftpm/xcode
SwiftCompile normal armv7k /Users/admin/builder/spi-builder-workspace/.dependencies/checkouts/SwiftSCAD/Sources/SwiftSCAD/Operations/Duplication/Distribute.swift (in target 'SwiftSCAD' from project 'SwiftSCAD')
cd /Users/admin/builder/spi-builder-workspace/.swiftpm/xcode
SwiftDriverJobDiscovery normal armv7k Compiling BitArray+Shifts.swift, BitArray+Testing.swift, BitArray._UnsafeHandle.swift, BitArray.swift, BitSet+BidirectionalCollection.swift, BitSet+Codable.swift (in target 'BitCollections' from project 'swift-collections')
SwiftCompile normal arm64 Compiling\ ArrayBuilder.swift,\ Compatibility.swift,\ Concurrency.swift,\ Colored.swift,\ ForceRender.swift,\ Prefix.swift,\ VisualizeAxes.swift,\ Environment.swift,\ EnvironmentContext.swift,\ EnvironmentModifier.swift,\ EnvironmentValues.swift,\ ReadEnvironment.swift,\ Environment+Color.swift,\ Environment+Transform.swift,\ Facets.swift,\ NaturalUpDirection.swift,\ Operation.swift,\ PreviewConvexity.swift /Users/admin/builder/spi-builder-workspace/.dependencies/checkouts/SwiftSCAD/Sources/SwiftSCAD/ArrayBuilder.swift /Users/admin/builder/spi-builder-workspace/.dependencies/checkouts/SwiftSCAD/Sources/SwiftSCAD/Compatibility.swift /Users/admin/builder/spi-builder-workspace/.dependencies/checkouts/SwiftSCAD/Sources/SwiftSCAD/Concurrency.swift /Users/admin/builder/spi-builder-workspace/.dependencies/checkouts/SwiftSCAD/Sources/SwiftSCAD/Development/Colored.swift /Users/admin/builder/spi-builder-workspace/.dependencies/checkouts/SwiftSCAD/Sources/SwiftSCAD/Development/ForceRender.swift /Users/admin/builder/spi-builder-workspace/.dependencies/checkouts/SwiftSCAD/Sources/SwiftSCAD/Development/Prefix.swift /Users/admin/builder/spi-builder-workspace/.dependencies/checkouts/SwiftSCAD/Sources/SwiftSCAD/Development/VisualizeAxes.swift /Users/admin/builder/spi-builder-workspace/.dependencies/checkouts/SwiftSCAD/Sources/SwiftSCAD/Environment/Environment.swift /Users/admin/builder/spi-builder-workspace/.dependencies/checkouts/SwiftSCAD/Sources/SwiftSCAD/Environment/EnvironmentContext.swift /Users/admin/builder/spi-builder-workspace/.dependencies/checkouts/SwiftSCAD/Sources/SwiftSCAD/Environment/EnvironmentModifier.swift /Users/admin/builder/spi-builder-workspace/.dependencies/checkouts/SwiftSCAD/Sources/SwiftSCAD/Environment/EnvironmentValues.swift /Users/admin/builder/spi-builder-workspace/.dependencies/checkouts/SwiftSCAD/Sources/SwiftSCAD/Environment/ReadEnvironment.swift /Users/admin/builder/spi-builder-workspace/.dependencies/checkouts/SwiftSCAD/Sources/SwiftSCAD/Environment/Values/Environment+Color.swift /Users/admin/builder/spi-builder-workspace/.dependencies/checkouts/SwiftSCAD/Sources/SwiftSCAD/Environment/Values/Environment+Transform.swift /Users/admin/builder/spi-builder-workspace/.dependencies/checkouts/SwiftSCAD/Sources/SwiftSCAD/Environment/Values/Facets.swift /Users/admin/builder/spi-builder-workspace/.dependencies/checkouts/SwiftSCAD/Sources/SwiftSCAD/Environment/Values/NaturalUpDirection.swift /Users/admin/builder/spi-builder-workspace/.dependencies/checkouts/SwiftSCAD/Sources/SwiftSCAD/Environment/Values/Operation.swift /Users/admin/builder/spi-builder-workspace/.dependencies/checkouts/SwiftSCAD/Sources/SwiftSCAD/Environment/Values/PreviewConvexity.swift (in target 'SwiftSCAD' from project 'SwiftSCAD')
SwiftCompile normal arm64 /Users/admin/builder/spi-builder-workspace/.dependencies/checkouts/SwiftSCAD/Sources/SwiftSCAD/ArrayBuilder.swift (in target 'SwiftSCAD' from project 'SwiftSCAD')
cd /Users/admin/builder/spi-builder-workspace/.swiftpm/xcode
SwiftCompile normal arm64 /Users/admin/builder/spi-builder-workspace/.dependencies/checkouts/SwiftSCAD/Sources/SwiftSCAD/Compatibility.swift (in target 'SwiftSCAD' from project 'SwiftSCAD')
cd /Users/admin/builder/spi-builder-workspace/.swiftpm/xcode
SwiftCompile normal arm64 /Users/admin/builder/spi-builder-workspace/.dependencies/checkouts/SwiftSCAD/Sources/SwiftSCAD/Concurrency.swift (in target 'SwiftSCAD' from project 'SwiftSCAD')
cd /Users/admin/builder/spi-builder-workspace/.swiftpm/xcode
SwiftCompile normal arm64 /Users/admin/builder/spi-builder-workspace/.dependencies/checkouts/SwiftSCAD/Sources/SwiftSCAD/Development/Colored.swift (in target 'SwiftSCAD' from project 'SwiftSCAD')
cd /Users/admin/builder/spi-builder-workspace/.swiftpm/xcode
SwiftCompile normal arm64 /Users/admin/builder/spi-builder-workspace/.dependencies/checkouts/SwiftSCAD/Sources/SwiftSCAD/Development/ForceRender.swift (in target 'SwiftSCAD' from project 'SwiftSCAD')
cd /Users/admin/builder/spi-builder-workspace/.swiftpm/xcode
SwiftCompile normal arm64 /Users/admin/builder/spi-builder-workspace/.dependencies/checkouts/SwiftSCAD/Sources/SwiftSCAD/Development/Prefix.swift (in target 'SwiftSCAD' from project 'SwiftSCAD')
cd /Users/admin/builder/spi-builder-workspace/.swiftpm/xcode
SwiftCompile normal arm64 /Users/admin/builder/spi-builder-workspace/.dependencies/checkouts/SwiftSCAD/Sources/SwiftSCAD/Development/VisualizeAxes.swift (in target 'SwiftSCAD' from project 'SwiftSCAD')
cd /Users/admin/builder/spi-builder-workspace/.swiftpm/xcode
SwiftCompile normal arm64 /Users/admin/builder/spi-builder-workspace/.dependencies/checkouts/SwiftSCAD/Sources/SwiftSCAD/Environment/Environment.swift (in target 'SwiftSCAD' from project 'SwiftSCAD')
cd /Users/admin/builder/spi-builder-workspace/.swiftpm/xcode
SwiftCompile normal arm64 /Users/admin/builder/spi-builder-workspace/.dependencies/checkouts/SwiftSCAD/Sources/SwiftSCAD/Environment/EnvironmentContext.swift (in target 'SwiftSCAD' from project 'SwiftSCAD')
cd /Users/admin/builder/spi-builder-workspace/.swiftpm/xcode
SwiftCompile normal arm64 /Users/admin/builder/spi-builder-workspace/.dependencies/checkouts/SwiftSCAD/Sources/SwiftSCAD/Environment/EnvironmentModifier.swift (in target 'SwiftSCAD' from project 'SwiftSCAD')
cd /Users/admin/builder/spi-builder-workspace/.swiftpm/xcode
SwiftCompile normal arm64 /Users/admin/builder/spi-builder-workspace/.dependencies/checkouts/SwiftSCAD/Sources/SwiftSCAD/Environment/EnvironmentValues.swift (in target 'SwiftSCAD' from project 'SwiftSCAD')
cd /Users/admin/builder/spi-builder-workspace/.swiftpm/xcode
SwiftCompile normal arm64 /Users/admin/builder/spi-builder-workspace/.dependencies/checkouts/SwiftSCAD/Sources/SwiftSCAD/Environment/ReadEnvironment.swift (in target 'SwiftSCAD' from project 'SwiftSCAD')
cd /Users/admin/builder/spi-builder-workspace/.swiftpm/xcode
SwiftCompile normal arm64 /Users/admin/builder/spi-builder-workspace/.dependencies/checkouts/SwiftSCAD/Sources/SwiftSCAD/Environment/Values/Environment+Color.swift (in target 'SwiftSCAD' from project 'SwiftSCAD')
cd /Users/admin/builder/spi-builder-workspace/.swiftpm/xcode
SwiftCompile normal arm64 /Users/admin/builder/spi-builder-workspace/.dependencies/checkouts/SwiftSCAD/Sources/SwiftSCAD/Environment/Values/Environment+Transform.swift (in target 'SwiftSCAD' from project 'SwiftSCAD')
cd /Users/admin/builder/spi-builder-workspace/.swiftpm/xcode
SwiftCompile normal arm64 /Users/admin/builder/spi-builder-workspace/.dependencies/checkouts/SwiftSCAD/Sources/SwiftSCAD/Environment/Values/Facets.swift (in target 'SwiftSCAD' from project 'SwiftSCAD')
cd /Users/admin/builder/spi-builder-workspace/.swiftpm/xcode
SwiftCompile normal arm64 /Users/admin/builder/spi-builder-workspace/.dependencies/checkouts/SwiftSCAD/Sources/SwiftSCAD/Environment/Values/NaturalUpDirection.swift (in target 'SwiftSCAD' from project 'SwiftSCAD')
cd /Users/admin/builder/spi-builder-workspace/.swiftpm/xcode
SwiftCompile normal arm64 /Users/admin/builder/spi-builder-workspace/.dependencies/checkouts/SwiftSCAD/Sources/SwiftSCAD/Environment/Values/Operation.swift (in target 'SwiftSCAD' from project 'SwiftSCAD')
cd /Users/admin/builder/spi-builder-workspace/.swiftpm/xcode
SwiftCompile normal arm64 /Users/admin/builder/spi-builder-workspace/.dependencies/checkouts/SwiftSCAD/Sources/SwiftSCAD/Environment/Values/PreviewConvexity.swift (in target 'SwiftSCAD' from project 'SwiftSCAD')
cd /Users/admin/builder/spi-builder-workspace/.swiftpm/xcode
SwiftDriverJobDiscovery normal armv7k Compiling TreeDictionary+ExpressibleByDictionaryLiteral.swift, TreeDictionary+Filter.swift, TreeDictionary+Hashable.swift, TreeDictionary+Initializers.swift, TreeDictionary+Keys.swift, TreeDictionary+MapValues.swift, TreeDictionary+Merge.swift, TreeDictionary+Sendable.swift (in target 'HashTreeCollections' from project 'swift-collections')
SwiftCompile normal arm64 Compiling\ RepeatAlong.swift,\ RepeatAround.swift,\ Symmetry.swift,\ ApplyBoxEdgeProfile.swift,\ ApplyEdgeProfile.swift,\ ExtrudePolygon.swift,\ ExtrudeWithEdgeProfiles.swift,\ ExtrudedAlong.swift,\ ExtrudedHull.swift,\ LinearExtrude.swift,\ LinearExtrudeScaling.swift,\ RotateExtrude.swift,\ ConvexHull.swift,\ Fill.swift,\ Import.swift,\ Name.swift,\ MinkowskiSum.swift /Users/admin/builder/spi-builder-workspace/.dependencies/checkouts/SwiftSCAD/Sources/SwiftSCAD/Operations/Duplication/RepeatAlong.swift /Users/admin/builder/spi-builder-workspace/.dependencies/checkouts/SwiftSCAD/Sources/SwiftSCAD/Operations/Duplication/RepeatAround.swift /Users/admin/builder/spi-builder-workspace/.dependencies/checkouts/SwiftSCAD/Sources/SwiftSCAD/Operations/Duplication/Symmetry.swift /Users/admin/builder/spi-builder-workspace/.dependencies/checkouts/SwiftSCAD/Sources/SwiftSCAD/Operations/Edge\ Profile\ Application/ApplyBoxEdgeProfile.swift /Users/admin/builder/spi-builder-workspace/.dependencies/checkouts/SwiftSCAD/Sources/SwiftSCAD/Operations/Edge\ Profile\ Application/ApplyEdgeProfile.swift /Users/admin/builder/spi-builder-workspace/.dependencies/checkouts/SwiftSCAD/Sources/SwiftSCAD/Operations/Extrude/ExtrudePolygon.swift /Users/admin/builder/spi-builder-workspace/.dependencies/checkouts/SwiftSCAD/Sources/SwiftSCAD/Operations/Extrude/ExtrudeWithEdgeProfiles.swift /Users/admin/builder/spi-builder-workspace/.dependencies/checkouts/SwiftSCAD/Sources/SwiftSCAD/Operations/Extrude/ExtrudedAlong.swift /Users/admin/builder/spi-builder-workspace/.dependencies/checkouts/SwiftSCAD/Sources/SwiftSCAD/Operations/Extrude/ExtrudedHull.swift /Users/admin/builder/spi-builder-workspace/.dependencies/checkouts/SwiftSCAD/Sources/SwiftSCAD/Operations/Extrude/LinearExtrude.swift /Users/admin/builder/spi-builder-workspace/.dependencies/checkouts/SwiftSCAD/Sources/SwiftSCAD/Operations/Extrude/LinearExtrudeScaling.swift /Users/admin/builder/spi-builder-workspace/.dependencies/checkouts/SwiftSCAD/Sources/SwiftSCAD/Operations/Extrude/RotateExtrude.swift /Users/admin/builder/spi-builder-workspace/.dependencies/checkouts/SwiftSCAD/Sources/SwiftSCAD/Operations/Filling/ConvexHull.swift /Users/admin/builder/spi-builder-workspace/.dependencies/checkouts/SwiftSCAD/Sources/SwiftSCAD/Operations/Filling/Fill.swift /Users/admin/builder/spi-builder-workspace/.dependencies/checkouts/SwiftSCAD/Sources/SwiftSCAD/Operations/Import.swift /Users/admin/builder/spi-builder-workspace/.dependencies/checkouts/SwiftSCAD/Sources/SwiftSCAD/Operations/Name.swift /Users/admin/builder/spi-builder-workspace/.dependencies/checkouts/SwiftSCAD/Sources/SwiftSCAD/Operations/Offsetting/MinkowskiSum.swift (in target 'SwiftSCAD' from project 'SwiftSCAD')
SwiftCompile normal arm64 /Users/admin/builder/spi-builder-workspace/.dependencies/checkouts/SwiftSCAD/Sources/SwiftSCAD/Operations/Duplication/RepeatAlong.swift (in target 'SwiftSCAD' from project 'SwiftSCAD')
cd /Users/admin/builder/spi-builder-workspace/.swiftpm/xcode
SwiftCompile normal arm64 /Users/admin/builder/spi-builder-workspace/.dependencies/checkouts/SwiftSCAD/Sources/SwiftSCAD/Operations/Duplication/RepeatAround.swift (in target 'SwiftSCAD' from project 'SwiftSCAD')
cd /Users/admin/builder/spi-builder-workspace/.swiftpm/xcode
SwiftCompile normal arm64 /Users/admin/builder/spi-builder-workspace/.dependencies/checkouts/SwiftSCAD/Sources/SwiftSCAD/Operations/Duplication/Symmetry.swift (in target 'SwiftSCAD' from project 'SwiftSCAD')
cd /Users/admin/builder/spi-builder-workspace/.swiftpm/xcode
SwiftCompile normal arm64 /Users/admin/builder/spi-builder-workspace/.dependencies/checkouts/SwiftSCAD/Sources/SwiftSCAD/Operations/Edge\ Profile\ Application/ApplyBoxEdgeProfile.swift (in target 'SwiftSCAD' from project 'SwiftSCAD')
cd /Users/admin/builder/spi-builder-workspace/.swiftpm/xcode
SwiftCompile normal arm64 /Users/admin/builder/spi-builder-workspace/.dependencies/checkouts/SwiftSCAD/Sources/SwiftSCAD/Operations/Edge\ Profile\ Application/ApplyEdgeProfile.swift (in target 'SwiftSCAD' from project 'SwiftSCAD')
cd /Users/admin/builder/spi-builder-workspace/.swiftpm/xcode
SwiftCompile normal arm64 /Users/admin/builder/spi-builder-workspace/.dependencies/checkouts/SwiftSCAD/Sources/SwiftSCAD/Operations/Extrude/ExtrudePolygon.swift (in target 'SwiftSCAD' from project 'SwiftSCAD')
cd /Users/admin/builder/spi-builder-workspace/.swiftpm/xcode
SwiftCompile normal arm64 /Users/admin/builder/spi-builder-workspace/.dependencies/checkouts/SwiftSCAD/Sources/SwiftSCAD/Operations/Extrude/ExtrudeWithEdgeProfiles.swift (in target 'SwiftSCAD' from project 'SwiftSCAD')
cd /Users/admin/builder/spi-builder-workspace/.swiftpm/xcode
SwiftCompile normal arm64 /Users/admin/builder/spi-builder-workspace/.dependencies/checkouts/SwiftSCAD/Sources/SwiftSCAD/Operations/Extrude/ExtrudedAlong.swift (in target 'SwiftSCAD' from project 'SwiftSCAD')
cd /Users/admin/builder/spi-builder-workspace/.swiftpm/xcode
SwiftCompile normal arm64 /Users/admin/builder/spi-builder-workspace/.dependencies/checkouts/SwiftSCAD/Sources/SwiftSCAD/Operations/Extrude/ExtrudedHull.swift (in target 'SwiftSCAD' from project 'SwiftSCAD')
cd /Users/admin/builder/spi-builder-workspace/.swiftpm/xcode
SwiftCompile normal arm64 /Users/admin/builder/spi-builder-workspace/.dependencies/checkouts/SwiftSCAD/Sources/SwiftSCAD/Operations/Extrude/LinearExtrude.swift (in target 'SwiftSCAD' from project 'SwiftSCAD')
cd /Users/admin/builder/spi-builder-workspace/.swiftpm/xcode
SwiftCompile normal arm64 /Users/admin/builder/spi-builder-workspace/.dependencies/checkouts/SwiftSCAD/Sources/SwiftSCAD/Operations/Extrude/LinearExtrudeScaling.swift (in target 'SwiftSCAD' from project 'SwiftSCAD')
cd /Users/admin/builder/spi-builder-workspace/.swiftpm/xcode
SwiftCompile normal arm64 /Users/admin/builder/spi-builder-workspace/.dependencies/checkouts/SwiftSCAD/Sources/SwiftSCAD/Operations/Extrude/RotateExtrude.swift (in target 'SwiftSCAD' from project 'SwiftSCAD')
cd /Users/admin/builder/spi-builder-workspace/.swiftpm/xcode
SwiftCompile normal arm64 /Users/admin/builder/spi-builder-workspace/.dependencies/checkouts/SwiftSCAD/Sources/SwiftSCAD/Operations/Filling/ConvexHull.swift (in target 'SwiftSCAD' from project 'SwiftSCAD')
cd /Users/admin/builder/spi-builder-workspace/.swiftpm/xcode
SwiftCompile normal arm64 /Users/admin/builder/spi-builder-workspace/.dependencies/checkouts/SwiftSCAD/Sources/SwiftSCAD/Operations/Filling/Fill.swift (in target 'SwiftSCAD' from project 'SwiftSCAD')
cd /Users/admin/builder/spi-builder-workspace/.swiftpm/xcode
SwiftCompile normal arm64 /Users/admin/builder/spi-builder-workspace/.dependencies/checkouts/SwiftSCAD/Sources/SwiftSCAD/Operations/Import.swift (in target 'SwiftSCAD' from project 'SwiftSCAD')
cd /Users/admin/builder/spi-builder-workspace/.swiftpm/xcode
SwiftCompile normal arm64 /Users/admin/builder/spi-builder-workspace/.dependencies/checkouts/SwiftSCAD/Sources/SwiftSCAD/Operations/Name.swift (in target 'SwiftSCAD' from project 'SwiftSCAD')
cd /Users/admin/builder/spi-builder-workspace/.swiftpm/xcode
SwiftCompile normal arm64 /Users/admin/builder/spi-builder-workspace/.dependencies/checkouts/SwiftSCAD/Sources/SwiftSCAD/Operations/Offsetting/MinkowskiSum.swift (in target 'SwiftSCAD' from project 'SwiftSCAD')
cd /Users/admin/builder/spi-builder-workspace/.swiftpm/xcode
SwiftDriverJobDiscovery normal armv7k Compiling TreeDictionary+Sequence.swift, TreeDictionary+Values.swift, TreeDictionary.swift, TreeSet+Codable.swift, TreeSet+Collection.swift, TreeSet+CustomReflectable.swift, TreeSet+Debugging.swift, TreeSet+Descriptions.swift (in target 'HashTreeCollections' from project 'swift-collections')
SwiftCompile normal arm64 Compiling\ ResultModifier.swift,\ ResultReader.swift,\ Logging.swift,\ Aligned.swift,\ Adding.swift,\ AddingExclusive.swift,\ Difference.swift,\ Intersection.swift,\ Union.swift,\ Measure.swift,\ OffsetBounds.swift,\ Resize2D.swift,\ Resize3D.swift,\ SetBounds.swift,\ SetBoundsSize.swift,\ Clone.swift,\ Distribute.swift /Users/admin/builder/spi-builder-workspace/.dependencies/checkouts/SwiftSCAD/Sources/SwiftSCAD/Geometry/ResultElement/ResultModifier.swift /Users/admin/builder/spi-builder-workspace/.dependencies/checkouts/SwiftSCAD/Sources/SwiftSCAD/Geometry/ResultElement/ResultReader.swift /Users/admin/builder/spi-builder-workspace/.dependencies/checkouts/SwiftSCAD/Sources/SwiftSCAD/Logging.swift /Users/admin/builder/spi-builder-workspace/.dependencies/checkouts/SwiftSCAD/Sources/SwiftSCAD/Operations/Aligned.swift /Users/admin/builder/spi-builder-workspace/.dependencies/checkouts/SwiftSCAD/Sources/SwiftSCAD/Operations/Boolean/Adding.swift /Users/admin/builder/spi-builder-workspace/.dependencies/checkouts/SwiftSCAD/Sources/SwiftSCAD/Operations/Boolean/AddingExclusive.swift /Users/admin/builder/spi-builder-workspace/.dependencies/checkouts/SwiftSCAD/Sources/SwiftSCAD/Operations/Boolean/Difference.swift /Users/admin/builder/spi-builder-workspace/.dependencies/checkouts/SwiftSCAD/Sources/SwiftSCAD/Operations/Boolean/Intersection.swift /Users/admin/builder/spi-builder-workspace/.dependencies/checkouts/SwiftSCAD/Sources/SwiftSCAD/Operations/Boolean/Union.swift /Users/admin/builder/spi-builder-workspace/.dependencies/checkouts/SwiftSCAD/Sources/SwiftSCAD/Operations/Bounds/Measure.swift /Users/admin/builder/spi-builder-workspace/.dependencies/checkouts/SwiftSCAD/Sources/SwiftSCAD/Operations/Bounds/OffsetBounds.swift /Users/admin/builder/spi-builder-workspace/.dependencies/checkouts/SwiftSCAD/Sources/SwiftSCAD/Operations/Bounds/Resize2D.swift /Users/admin/builder/spi-builder-workspace/.dependencies/checkouts/SwiftSCAD/Sources/SwiftSCAD/Operations/Bounds/Resize3D.swift /Users/admin/builder/spi-builder-workspace/.dependencies/checkouts/SwiftSCAD/Sources/SwiftSCAD/Operations/Bounds/SetBounds.swift /Users/admin/builder/spi-builder-workspace/.dependencies/checkouts/SwiftSCAD/Sources/SwiftSCAD/Operations/Bounds/SetBoundsSize.swift /Users/admin/builder/spi-builder-workspace/.dependencies/checkouts/SwiftSCAD/Sources/SwiftSCAD/Operations/Duplication/Clone.swift /Users/admin/builder/spi-builder-workspace/.dependencies/checkouts/SwiftSCAD/Sources/SwiftSCAD/Operations/Duplication/Distribute.swift (in target 'SwiftSCAD' from project 'SwiftSCAD')
SwiftCompile normal arm64 /Users/admin/builder/spi-builder-workspace/.dependencies/checkouts/SwiftSCAD/Sources/SwiftSCAD/Geometry/ResultElement/ResultModifier.swift (in target 'SwiftSCAD' from project 'SwiftSCAD')
cd /Users/admin/builder/spi-builder-workspace/.swiftpm/xcode
SwiftCompile normal arm64 /Users/admin/builder/spi-builder-workspace/.dependencies/checkouts/SwiftSCAD/Sources/SwiftSCAD/Geometry/ResultElement/ResultReader.swift (in target 'SwiftSCAD' from project 'SwiftSCAD')
cd /Users/admin/builder/spi-builder-workspace/.swiftpm/xcode
SwiftCompile normal arm64 /Users/admin/builder/spi-builder-workspace/.dependencies/checkouts/SwiftSCAD/Sources/SwiftSCAD/Logging.swift (in target 'SwiftSCAD' from project 'SwiftSCAD')
cd /Users/admin/builder/spi-builder-workspace/.swiftpm/xcode
SwiftCompile normal arm64 /Users/admin/builder/spi-builder-workspace/.dependencies/checkouts/SwiftSCAD/Sources/SwiftSCAD/Operations/Aligned.swift (in target 'SwiftSCAD' from project 'SwiftSCAD')
cd /Users/admin/builder/spi-builder-workspace/.swiftpm/xcode
SwiftCompile normal arm64 /Users/admin/builder/spi-builder-workspace/.dependencies/checkouts/SwiftSCAD/Sources/SwiftSCAD/Operations/Boolean/Adding.swift (in target 'SwiftSCAD' from project 'SwiftSCAD')
cd /Users/admin/builder/spi-builder-workspace/.swiftpm/xcode
SwiftCompile normal arm64 /Users/admin/builder/spi-builder-workspace/.dependencies/checkouts/SwiftSCAD/Sources/SwiftSCAD/Operations/Boolean/AddingExclusive.swift (in target 'SwiftSCAD' from project 'SwiftSCAD')
cd /Users/admin/builder/spi-builder-workspace/.swiftpm/xcode
SwiftCompile normal arm64 /Users/admin/builder/spi-builder-workspace/.dependencies/checkouts/SwiftSCAD/Sources/SwiftSCAD/Operations/Boolean/Difference.swift (in target 'SwiftSCAD' from project 'SwiftSCAD')
cd /Users/admin/builder/spi-builder-workspace/.swiftpm/xcode
SwiftCompile normal arm64 /Users/admin/builder/spi-builder-workspace/.dependencies/checkouts/SwiftSCAD/Sources/SwiftSCAD/Operations/Boolean/Intersection.swift (in target 'SwiftSCAD' from project 'SwiftSCAD')
cd /Users/admin/builder/spi-builder-workspace/.swiftpm/xcode
SwiftCompile normal arm64 /Users/admin/builder/spi-builder-workspace/.dependencies/checkouts/SwiftSCAD/Sources/SwiftSCAD/Operations/Boolean/Union.swift (in target 'SwiftSCAD' from project 'SwiftSCAD')
cd /Users/admin/builder/spi-builder-workspace/.swiftpm/xcode
SwiftCompile normal arm64 /Users/admin/builder/spi-builder-workspace/.dependencies/checkouts/SwiftSCAD/Sources/SwiftSCAD/Operations/Bounds/Measure.swift (in target 'SwiftSCAD' from project 'SwiftSCAD')
cd /Users/admin/builder/spi-builder-workspace/.swiftpm/xcode
SwiftCompile normal arm64 /Users/admin/builder/spi-builder-workspace/.dependencies/checkouts/SwiftSCAD/Sources/SwiftSCAD/Operations/Bounds/OffsetBounds.swift (in target 'SwiftSCAD' from project 'SwiftSCAD')
cd /Users/admin/builder/spi-builder-workspace/.swiftpm/xcode
SwiftCompile normal arm64 /Users/admin/builder/spi-builder-workspace/.dependencies/checkouts/SwiftSCAD/Sources/SwiftSCAD/Operations/Bounds/Resize2D.swift (in target 'SwiftSCAD' from project 'SwiftSCAD')
cd /Users/admin/builder/spi-builder-workspace/.swiftpm/xcode
SwiftCompile normal arm64 /Users/admin/builder/spi-builder-workspace/.dependencies/checkouts/SwiftSCAD/Sources/SwiftSCAD/Operations/Bounds/Resize3D.swift (in target 'SwiftSCAD' from project 'SwiftSCAD')
cd /Users/admin/builder/spi-builder-workspace/.swiftpm/xcode
SwiftCompile normal arm64 /Users/admin/builder/spi-builder-workspace/.dependencies/checkouts/SwiftSCAD/Sources/SwiftSCAD/Operations/Bounds/SetBounds.swift (in target 'SwiftSCAD' from project 'SwiftSCAD')
cd /Users/admin/builder/spi-builder-workspace/.swiftpm/xcode
SwiftCompile normal arm64 /Users/admin/builder/spi-builder-workspace/.dependencies/checkouts/SwiftSCAD/Sources/SwiftSCAD/Operations/Bounds/SetBoundsSize.swift (in target 'SwiftSCAD' from project 'SwiftSCAD')
cd /Users/admin/builder/spi-builder-workspace/.swiftpm/xcode
SwiftCompile normal arm64 /Users/admin/builder/spi-builder-workspace/.dependencies/checkouts/SwiftSCAD/Sources/SwiftSCAD/Operations/Duplication/Clone.swift (in target 'SwiftSCAD' from project 'SwiftSCAD')
cd /Users/admin/builder/spi-builder-workspace/.swiftpm/xcode
SwiftCompile normal arm64 /Users/admin/builder/spi-builder-workspace/.dependencies/checkouts/SwiftSCAD/Sources/SwiftSCAD/Operations/Duplication/Distribute.swift (in target 'SwiftSCAD' from project 'SwiftSCAD')
cd /Users/admin/builder/spi-builder-workspace/.swiftpm/xcode
SwiftDriverJobDiscovery normal armv7k Compiling _HashNode+Subtree Removals.swift, _HashNode+UnsafeHandle.swift, _HashNode.swift, _HashNodeHeader.swift, _HashSlot.swift, _HashStack.swift, _HashTreeIterator.swift, _HashTreeStatistics.swift, _RawHashNode+UnsafeHandle.swift (in target 'HashTreeCollections' from project 'swift-collections')
SwiftCompile normal arm64 Compiling\ Text.swift,\ TextModifiers.swift,\ Box.swift,\ Cylinder+Angles.swift,\ Cylinder.swift,\ Polyhedron.swift,\ Sphere.swift,\ Torus.swift,\ Tube.swift,\ Rotate.swift,\ RotateAround.swift,\ Scale.swift,\ Transform.swift,\ Translate.swift,\ AxisAlignment.swift,\ GeometryAlignment+Presets.swift,\ GeometryAlignment.swift /Users/admin/builder/spi-builder-workspace/.dependencies/checkouts/SwiftSCAD/Sources/SwiftSCAD/Shapes/2D/Text/Text.swift /Users/admin/builder/spi-builder-workspace/.dependencies/checkouts/SwiftSCAD/Sources/SwiftSCAD/Shapes/2D/Text/TextModifiers.swift /Users/admin/builder/spi-builder-workspace/.dependencies/checkouts/SwiftSCAD/Sources/SwiftSCAD/Shapes/3D/Box.swift /Users/admin/builder/spi-builder-workspace/.dependencies/checkouts/SwiftSCAD/Sources/SwiftSCAD/Shapes/3D/Cylinder+Angles.swift /Users/admin/builder/spi-builder-workspace/.dependencies/checkouts/SwiftSCAD/Sources/SwiftSCAD/Shapes/3D/Cylinder.swift /Users/admin/builder/spi-builder-workspace/.dependencies/checkouts/SwiftSCAD/Sources/SwiftSCAD/Shapes/3D/Polyhedron.swift /Users/admin/builder/spi-builder-workspace/.dependencies/checkouts/SwiftSCAD/Sources/SwiftSCAD/Shapes/3D/Sphere.swift /Users/admin/builder/spi-builder-workspace/.dependencies/checkouts/SwiftSCAD/Sources/SwiftSCAD/Shapes/3D/Torus.swift /Users/admin/builder/spi-builder-workspace/.dependencies/checkouts/SwiftSCAD/Sources/SwiftSCAD/Shapes/3D/Tube.swift /Users/admin/builder/spi-builder-workspace/.dependencies/checkouts/SwiftSCAD/Sources/SwiftSCAD/Transformations/Rotate.swift /Users/admin/builder/spi-builder-workspace/.dependencies/checkouts/SwiftSCAD/Sources/SwiftSCAD/Transformations/RotateAround.swift /Users/admin/builder/spi-builder-workspace/.dependencies/checkouts/SwiftSCAD/Sources/SwiftSCAD/Transformations/Scale.swift /Users/admin/builder/spi-builder-workspace/.dependencies/checkouts/SwiftSCAD/Sources/SwiftSCAD/Transformations/Transform.swift /Users/admin/builder/spi-builder-workspace/.dependencies/checkouts/SwiftSCAD/Sources/SwiftSCAD/Transformations/Translate.swift /Users/admin/builder/spi-builder-workspace/.dependencies/checkouts/SwiftSCAD/Sources/SwiftSCAD/Values/Alignment/AxisAlignment.swift /Users/admin/builder/spi-builder-workspace/.dependencies/checkouts/SwiftSCAD/Sources/SwiftSCAD/Values/Alignment/GeometryAlignment+Presets.swift /Users/admin/builder/spi-builder-workspace/.dependencies/checkouts/SwiftSCAD/Sources/SwiftSCAD/Values/Alignment/GeometryAlignment.swift (in target 'SwiftSCAD' from project 'SwiftSCAD')
SwiftCompile normal arm64 /Users/admin/builder/spi-builder-workspace/.dependencies/checkouts/SwiftSCAD/Sources/SwiftSCAD/Shapes/2D/Text/Text.swift (in target 'SwiftSCAD' from project 'SwiftSCAD')
cd /Users/admin/builder/spi-builder-workspace/.swiftpm/xcode
SwiftCompile normal arm64 /Users/admin/builder/spi-builder-workspace/.dependencies/checkouts/SwiftSCAD/Sources/SwiftSCAD/Shapes/2D/Text/TextModifiers.swift (in target 'SwiftSCAD' from project 'SwiftSCAD')
cd /Users/admin/builder/spi-builder-workspace/.swiftpm/xcode
SwiftCompile normal arm64 /Users/admin/builder/spi-builder-workspace/.dependencies/checkouts/SwiftSCAD/Sources/SwiftSCAD/Shapes/3D/Box.swift (in target 'SwiftSCAD' from project 'SwiftSCAD')
cd /Users/admin/builder/spi-builder-workspace/.swiftpm/xcode
SwiftCompile normal arm64 /Users/admin/builder/spi-builder-workspace/.dependencies/checkouts/SwiftSCAD/Sources/SwiftSCAD/Shapes/3D/Cylinder+Angles.swift (in target 'SwiftSCAD' from project 'SwiftSCAD')
cd /Users/admin/builder/spi-builder-workspace/.swiftpm/xcode
SwiftCompile normal arm64 /Users/admin/builder/spi-builder-workspace/.dependencies/checkouts/SwiftSCAD/Sources/SwiftSCAD/Shapes/3D/Cylinder.swift (in target 'SwiftSCAD' from project 'SwiftSCAD')
cd /Users/admin/builder/spi-builder-workspace/.swiftpm/xcode
SwiftCompile normal arm64 /Users/admin/builder/spi-builder-workspace/.dependencies/checkouts/SwiftSCAD/Sources/SwiftSCAD/Shapes/3D/Polyhedron.swift (in target 'SwiftSCAD' from project 'SwiftSCAD')
cd /Users/admin/builder/spi-builder-workspace/.swiftpm/xcode
SwiftCompile normal arm64 /Users/admin/builder/spi-builder-workspace/.dependencies/checkouts/SwiftSCAD/Sources/SwiftSCAD/Shapes/3D/Sphere.swift (in target 'SwiftSCAD' from project 'SwiftSCAD')
cd /Users/admin/builder/spi-builder-workspace/.swiftpm/xcode
SwiftCompile normal arm64 /Users/admin/builder/spi-builder-workspace/.dependencies/checkouts/SwiftSCAD/Sources/SwiftSCAD/Shapes/3D/Torus.swift (in target 'SwiftSCAD' from project 'SwiftSCAD')
cd /Users/admin/builder/spi-builder-workspace/.swiftpm/xcode
SwiftCompile normal arm64 /Users/admin/builder/spi-builder-workspace/.dependencies/checkouts/SwiftSCAD/Sources/SwiftSCAD/Shapes/3D/Tube.swift (in target 'SwiftSCAD' from project 'SwiftSCAD')
cd /Users/admin/builder/spi-builder-workspace/.swiftpm/xcode
SwiftCompile normal arm64 /Users/admin/builder/spi-builder-workspace/.dependencies/checkouts/SwiftSCAD/Sources/SwiftSCAD/Transformations/Rotate.swift (in target 'SwiftSCAD' from project 'SwiftSCAD')
cd /Users/admin/builder/spi-builder-workspace/.swiftpm/xcode
SwiftCompile normal arm64 /Users/admin/builder/spi-builder-workspace/.dependencies/checkouts/SwiftSCAD/Sources/SwiftSCAD/Transformations/RotateAround.swift (in target 'SwiftSCAD' from project 'SwiftSCAD')
cd /Users/admin/builder/spi-builder-workspace/.swiftpm/xcode
SwiftCompile normal arm64 /Users/admin/builder/spi-builder-workspace/.dependencies/checkouts/SwiftSCAD/Sources/SwiftSCAD/Transformations/Scale.swift (in target 'SwiftSCAD' from project 'SwiftSCAD')
cd /Users/admin/builder/spi-builder-workspace/.swiftpm/xcode
SwiftCompile normal arm64 /Users/admin/builder/spi-builder-workspace/.dependencies/checkouts/SwiftSCAD/Sources/SwiftSCAD/Transformations/Transform.swift (in target 'SwiftSCAD' from project 'SwiftSCAD')
cd /Users/admin/builder/spi-builder-workspace/.swiftpm/xcode
SwiftCompile normal arm64 /Users/admin/builder/spi-builder-workspace/.dependencies/checkouts/SwiftSCAD/Sources/SwiftSCAD/Transformations/Translate.swift (in target 'SwiftSCAD' from project 'SwiftSCAD')
cd /Users/admin/builder/spi-builder-workspace/.swiftpm/xcode
SwiftCompile normal arm64 /Users/admin/builder/spi-builder-workspace/.dependencies/checkouts/SwiftSCAD/Sources/SwiftSCAD/Values/Alignment/AxisAlignment.swift (in target 'SwiftSCAD' from project 'SwiftSCAD')
cd /Users/admin/builder/spi-builder-workspace/.swiftpm/xcode
SwiftCompile normal arm64 /Users/admin/builder/spi-builder-workspace/.dependencies/checkouts/SwiftSCAD/Sources/SwiftSCAD/Values/Alignment/GeometryAlignment+Presets.swift (in target 'SwiftSCAD' from project 'SwiftSCAD')
cd /Users/admin/builder/spi-builder-workspace/.swiftpm/xcode
SwiftCompile normal arm64 /Users/admin/builder/spi-builder-workspace/.dependencies/checkouts/SwiftSCAD/Sources/SwiftSCAD/Values/Alignment/GeometryAlignment.swift (in target 'SwiftSCAD' from project 'SwiftSCAD')
cd /Users/admin/builder/spi-builder-workspace/.swiftpm/xcode
SwiftDriverJobDiscovery normal armv7k Compiling _RawHashNode.swift, _UnmanagedHashNode.swift, _UnsafePath.swift, TreeDictionary+Codable.swift, TreeDictionary+Collection.swift, TreeDictionary+CustomReflectable.swift, TreeDictionary+Debugging.swift, TreeDictionary+Descriptions.swift, TreeDictionary+Equatable.swift (in target 'HashTreeCollections' from project 'swift-collections')
SwiftCompile normal arm64_32 Compiling\ ResultModifier.swift,\ ResultReader.swift,\ Logging.swift,\ Aligned.swift,\ Adding.swift,\ AddingExclusive.swift,\ Difference.swift,\ Intersection.swift,\ Union.swift,\ Measure.swift,\ OffsetBounds.swift,\ Resize2D.swift,\ Resize3D.swift,\ SetBounds.swift,\ SetBoundsSize.swift,\ Clone.swift,\ Distribute.swift /Users/admin/builder/spi-builder-workspace/.dependencies/checkouts/SwiftSCAD/Sources/SwiftSCAD/Geometry/ResultElement/ResultModifier.swift /Users/admin/builder/spi-builder-workspace/.dependencies/checkouts/SwiftSCAD/Sources/SwiftSCAD/Geometry/ResultElement/ResultReader.swift /Users/admin/builder/spi-builder-workspace/.dependencies/checkouts/SwiftSCAD/Sources/SwiftSCAD/Logging.swift /Users/admin/builder/spi-builder-workspace/.dependencies/checkouts/SwiftSCAD/Sources/SwiftSCAD/Operations/Aligned.swift /Users/admin/builder/spi-builder-workspace/.dependencies/checkouts/SwiftSCAD/Sources/SwiftSCAD/Operations/Boolean/Adding.swift /Users/admin/builder/spi-builder-workspace/.dependencies/checkouts/SwiftSCAD/Sources/SwiftSCAD/Operations/Boolean/AddingExclusive.swift /Users/admin/builder/spi-builder-workspace/.dependencies/checkouts/SwiftSCAD/Sources/SwiftSCAD/Operations/Boolean/Difference.swift /Users/admin/builder/spi-builder-workspace/.dependencies/checkouts/SwiftSCAD/Sources/SwiftSCAD/Operations/Boolean/Intersection.swift /Users/admin/builder/spi-builder-workspace/.dependencies/checkouts/SwiftSCAD/Sources/SwiftSCAD/Operations/Boolean/Union.swift /Users/admin/builder/spi-builder-workspace/.dependencies/checkouts/SwiftSCAD/Sources/SwiftSCAD/Operations/Bounds/Measure.swift /Users/admin/builder/spi-builder-workspace/.dependencies/checkouts/SwiftSCAD/Sources/SwiftSCAD/Operations/Bounds/OffsetBounds.swift /Users/admin/builder/spi-builder-workspace/.dependencies/checkouts/SwiftSCAD/Sources/SwiftSCAD/Operations/Bounds/Resize2D.swift /Users/admin/builder/spi-builder-workspace/.dependencies/checkouts/SwiftSCAD/Sources/SwiftSCAD/Operations/Bounds/Resize3D.swift /Users/admin/builder/spi-builder-workspace/.dependencies/checkouts/SwiftSCAD/Sources/SwiftSCAD/Operations/Bounds/SetBounds.swift /Users/admin/builder/spi-builder-workspace/.dependencies/checkouts/SwiftSCAD/Sources/SwiftSCAD/Operations/Bounds/SetBoundsSize.swift /Users/admin/builder/spi-builder-workspace/.dependencies/checkouts/SwiftSCAD/Sources/SwiftSCAD/Operations/Duplication/Clone.swift /Users/admin/builder/spi-builder-workspace/.dependencies/checkouts/SwiftSCAD/Sources/SwiftSCAD/Operations/Duplication/Distribute.swift (in target 'SwiftSCAD' from project 'SwiftSCAD')
SwiftCompile normal arm64_32 /Users/admin/builder/spi-builder-workspace/.dependencies/checkouts/SwiftSCAD/Sources/SwiftSCAD/Geometry/ResultElement/ResultModifier.swift (in target 'SwiftSCAD' from project 'SwiftSCAD')
cd /Users/admin/builder/spi-builder-workspace/.swiftpm/xcode
SwiftCompile normal arm64_32 /Users/admin/builder/spi-builder-workspace/.dependencies/checkouts/SwiftSCAD/Sources/SwiftSCAD/Geometry/ResultElement/ResultReader.swift (in target 'SwiftSCAD' from project 'SwiftSCAD')
cd /Users/admin/builder/spi-builder-workspace/.swiftpm/xcode
SwiftCompile normal arm64_32 /Users/admin/builder/spi-builder-workspace/.dependencies/checkouts/SwiftSCAD/Sources/SwiftSCAD/Logging.swift (in target 'SwiftSCAD' from project 'SwiftSCAD')
cd /Users/admin/builder/spi-builder-workspace/.swiftpm/xcode
SwiftCompile normal arm64_32 /Users/admin/builder/spi-builder-workspace/.dependencies/checkouts/SwiftSCAD/Sources/SwiftSCAD/Operations/Aligned.swift (in target 'SwiftSCAD' from project 'SwiftSCAD')
cd /Users/admin/builder/spi-builder-workspace/.swiftpm/xcode
SwiftCompile normal arm64_32 /Users/admin/builder/spi-builder-workspace/.dependencies/checkouts/SwiftSCAD/Sources/SwiftSCAD/Operations/Boolean/Adding.swift (in target 'SwiftSCAD' from project 'SwiftSCAD')
cd /Users/admin/builder/spi-builder-workspace/.swiftpm/xcode
SwiftCompile normal arm64_32 /Users/admin/builder/spi-builder-workspace/.dependencies/checkouts/SwiftSCAD/Sources/SwiftSCAD/Operations/Boolean/AddingExclusive.swift (in target 'SwiftSCAD' from project 'SwiftSCAD')
cd /Users/admin/builder/spi-builder-workspace/.swiftpm/xcode
SwiftCompile normal arm64_32 /Users/admin/builder/spi-builder-workspace/.dependencies/checkouts/SwiftSCAD/Sources/SwiftSCAD/Operations/Boolean/Difference.swift (in target 'SwiftSCAD' from project 'SwiftSCAD')
cd /Users/admin/builder/spi-builder-workspace/.swiftpm/xcode
SwiftCompile normal arm64_32 /Users/admin/builder/spi-builder-workspace/.dependencies/checkouts/SwiftSCAD/Sources/SwiftSCAD/Operations/Boolean/Intersection.swift (in target 'SwiftSCAD' from project 'SwiftSCAD')
cd /Users/admin/builder/spi-builder-workspace/.swiftpm/xcode
SwiftCompile normal arm64_32 /Users/admin/builder/spi-builder-workspace/.dependencies/checkouts/SwiftSCAD/Sources/SwiftSCAD/Operations/Boolean/Union.swift (in target 'SwiftSCAD' from project 'SwiftSCAD')
cd /Users/admin/builder/spi-builder-workspace/.swiftpm/xcode
SwiftCompile normal arm64_32 /Users/admin/builder/spi-builder-workspace/.dependencies/checkouts/SwiftSCAD/Sources/SwiftSCAD/Operations/Bounds/Measure.swift (in target 'SwiftSCAD' from project 'SwiftSCAD')
cd /Users/admin/builder/spi-builder-workspace/.swiftpm/xcode
SwiftCompile normal arm64_32 /Users/admin/builder/spi-builder-workspace/.dependencies/checkouts/SwiftSCAD/Sources/SwiftSCAD/Operations/Bounds/OffsetBounds.swift (in target 'SwiftSCAD' from project 'SwiftSCAD')
cd /Users/admin/builder/spi-builder-workspace/.swiftpm/xcode
SwiftCompile normal arm64_32 /Users/admin/builder/spi-builder-workspace/.dependencies/checkouts/SwiftSCAD/Sources/SwiftSCAD/Operations/Bounds/Resize2D.swift (in target 'SwiftSCAD' from project 'SwiftSCAD')
cd /Users/admin/builder/spi-builder-workspace/.swiftpm/xcode
SwiftCompile normal arm64_32 /Users/admin/builder/spi-builder-workspace/.dependencies/checkouts/SwiftSCAD/Sources/SwiftSCAD/Operations/Bounds/Resize3D.swift (in target 'SwiftSCAD' from project 'SwiftSCAD')
cd /Users/admin/builder/spi-builder-workspace/.swiftpm/xcode
SwiftCompile normal arm64_32 /Users/admin/builder/spi-builder-workspace/.dependencies/checkouts/SwiftSCAD/Sources/SwiftSCAD/Operations/Bounds/SetBounds.swift (in target 'SwiftSCAD' from project 'SwiftSCAD')
cd /Users/admin/builder/spi-builder-workspace/.swiftpm/xcode
SwiftCompile normal arm64_32 /Users/admin/builder/spi-builder-workspace/.dependencies/checkouts/SwiftSCAD/Sources/SwiftSCAD/Operations/Bounds/SetBoundsSize.swift (in target 'SwiftSCAD' from project 'SwiftSCAD')
cd /Users/admin/builder/spi-builder-workspace/.swiftpm/xcode
SwiftCompile normal arm64_32 /Users/admin/builder/spi-builder-workspace/.dependencies/checkouts/SwiftSCAD/Sources/SwiftSCAD/Operations/Duplication/Clone.swift (in target 'SwiftSCAD' from project 'SwiftSCAD')
cd /Users/admin/builder/spi-builder-workspace/.swiftpm/xcode
SwiftCompile normal arm64_32 /Users/admin/builder/spi-builder-workspace/.dependencies/checkouts/SwiftSCAD/Sources/SwiftSCAD/Operations/Duplication/Distribute.swift (in target 'SwiftSCAD' from project 'SwiftSCAD')
cd /Users/admin/builder/spi-builder-workspace/.swiftpm/xcode
SwiftDriverJobDiscovery normal armv7k Emitting module for SwiftSCAD (in target 'SwiftSCAD' from project 'SwiftSCAD')
SwiftDriver\ Compilation\ Requirements SwiftSCAD normal armv7k com.apple.xcode.tools.swift.compiler (in target 'SwiftSCAD' from project 'SwiftSCAD')
cd /Users/admin/builder/spi-builder-workspace/.swiftpm/xcode
builtin-Swift-Compilation-Requirements -- /Applications/Xcode-16.3.0.app/Contents/Developer/Toolchains/XcodeDefault.xctoolchain/usr/bin/swiftc -module-name SwiftSCAD -Onone -enforce-exclusivity\=checked @/Users/admin/builder/spi-builder-workspace/.derivedData/Build/Intermediates.noindex/SwiftSCAD.build/Debug-watchos/SwiftSCAD.build/Objects-normal/armv7k/SwiftSCAD.SwiftFileList -DSWIFT_PACKAGE -DDEBUG -DXcode -plugin-path /Applications/Xcode-16.3.0.app/Contents/Developer/Toolchains/XcodeDefault.xctoolchain/usr/lib/swift/host/plugins/testing -enable-experimental-feature DebugDescriptionMacro -sdk /Applications/Xcode-16.3.0.app/Contents/Developer/Platforms/WatchOS.platform/Developer/SDKs/WatchOS11.4.sdk -target armv7k-apple-watchos5.0 -g -module-cache-path /Users/admin/builder/spi-builder-workspace/.derivedData/ModuleCache.noindex -Xfrontend -serialize-debugging-options -enable-testing -suppress-warnings -index-store-path /Users/admin/builder/spi-builder-workspace/.derivedData/Index.noindex/DataStore -swift-version 6 -I /Users/admin/builder/spi-builder-workspace/.derivedData/Build/Products/Debug-watchos -I /Applications/Xcode-16.3.0.app/Contents/Developer/Platforms/WatchOS.platform/Developer/usr/lib -F /Users/admin/builder/spi-builder-workspace/.derivedData/Build/Products/Debug-watchos/PackageFrameworks -F /Users/admin/builder/spi-builder-workspace/.derivedData/Build/Products/Debug-watchos/PackageFrameworks -F /Users/admin/builder/spi-builder-workspace/.derivedData/Build/Products/Debug-watchos/PackageFrameworks -F /Users/admin/builder/spi-builder-workspace/.derivedData/Build/Products/Debug-watchos/PackageFrameworks -F /Users/admin/builder/spi-builder-workspace/.derivedData/Build/Products/Debug-watchos/PackageFrameworks -F /Users/admin/builder/spi-builder-workspace/.derivedData/Build/Products/Debug-watchos/PackageFrameworks -F /Users/admin/builder/spi-builder-workspace/.derivedData/Build/Products/Debug-watchos/PackageFrameworks -F /Users/admin/builder/spi-builder-workspace/.derivedData/Build/Products/Debug-watchos/PackageFrameworks -F /Users/admin/builder/spi-builder-workspace/.derivedData/Build/Products/Debug-watchos/PackageFrameworks -F /Users/admin/builder/spi-builder-workspace/.derivedData/Build/Products/Debug-watchos -F /Applications/Xcode-16.3.0.app/Contents/Developer/Platforms/WatchOS.platform/Developer/Library/Frameworks -F /Applications/Xcode-16.3.0.app/Contents/Developer/Platforms/WatchOS.platform/Developer/SDKs/WatchOS11.4.sdk/Developer/Library/Frameworks -c -j10 -enable-batch-mode -incremental -Xcc -ivfsstatcache -Xcc /Users/admin/builder/spi-builder-workspace/.derivedData/SDKStatCaches.noindex/watchos11.4-22T246-43efb940ff07ba2497b70ec94253f576.sdkstatcache -output-file-map /Users/admin/builder/spi-builder-workspace/.derivedData/Build/Intermediates.noindex/SwiftSCAD.build/Debug-watchos/SwiftSCAD.build/Objects-normal/armv7k/SwiftSCAD-OutputFileMap.json -use-frontend-parseable-output -save-temps -no-color-diagnostics -serialize-diagnostics -emit-dependencies -emit-module -emit-module-path /Users/admin/builder/spi-builder-workspace/.derivedData/Build/Intermediates.noindex/SwiftSCAD.build/Debug-watchos/SwiftSCAD.build/Objects-normal/armv7k/SwiftSCAD.swiftmodule -user-module-version 0.9.0 -validate-clang-modules-once -clang-build-session-file /Users/admin/builder/spi-builder-workspace/.derivedData/ModuleCache.noindex/Session.modulevalidation -package-name swiftscad -Xcc -I/Users/admin/builder/spi-builder-workspace/.derivedData/Build/Intermediates.noindex/SwiftSCAD.build/Debug-watchos/SwiftSCAD.build/swift-overrides.hmap -emit-const-values -Xfrontend -const-gather-protocols-file -Xfrontend /Users/admin/builder/spi-builder-workspace/.derivedData/Build/Intermediates.noindex/SwiftSCAD.build/Debug-watchos/SwiftSCAD.build/Objects-normal/armv7k/SwiftSCAD_const_extract_protocols.json -Xcc -I/Users/admin/builder/spi-builder-workspace/.derivedData/Build/Products/Debug-watchos/include -Xcc -I/Users/admin/builder/spi-builder-workspace/.derivedData/Build/Intermediates.noindex/SwiftSCAD.build/Debug-watchos/SwiftSCAD.build/DerivedSources-normal/armv7k -Xcc -I/Users/admin/builder/spi-builder-workspace/.derivedData/Build/Intermediates.noindex/SwiftSCAD.build/Debug-watchos/SwiftSCAD.build/DerivedSources/armv7k -Xcc -I/Users/admin/builder/spi-builder-workspace/.derivedData/Build/Intermediates.noindex/SwiftSCAD.build/Debug-watchos/SwiftSCAD.build/DerivedSources -Xcc -DSWIFT_PACKAGE -Xcc -DDEBUG\=1 -emit-objc-header -emit-objc-header-path /Users/admin/builder/spi-builder-workspace/.derivedData/Build/Intermediates.noindex/SwiftSCAD.build/Debug-watchos/SwiftSCAD.build/Objects-normal/armv7k/SwiftSCAD-Swift.h -working-directory /Users/admin/builder/spi-builder-workspace/.swiftpm/xcode -experimental-emit-module-separately -disable-cmo
SwiftDriverJobDiscovery normal arm64 Emitting module for SwiftSCAD (in target 'SwiftSCAD' from project 'SwiftSCAD')
SwiftDriver\ Compilation\ Requirements SwiftSCAD normal arm64 com.apple.xcode.tools.swift.compiler (in target 'SwiftSCAD' from project 'SwiftSCAD')
cd /Users/admin/builder/spi-builder-workspace/.swiftpm/xcode
builtin-Swift-Compilation-Requirements -- /Applications/Xcode-16.3.0.app/Contents/Developer/Toolchains/XcodeDefault.xctoolchain/usr/bin/swiftc -module-name SwiftSCAD -Onone -enforce-exclusivity\=checked @/Users/admin/builder/spi-builder-workspace/.derivedData/Build/Intermediates.noindex/SwiftSCAD.build/Debug-watchos/SwiftSCAD.build/Objects-normal/arm64/SwiftSCAD.SwiftFileList -DSWIFT_PACKAGE -DDEBUG -DXcode -plugin-path /Applications/Xcode-16.3.0.app/Contents/Developer/Toolchains/XcodeDefault.xctoolchain/usr/lib/swift/host/plugins/testing -enable-experimental-feature DebugDescriptionMacro -sdk /Applications/Xcode-16.3.0.app/Contents/Developer/Platforms/WatchOS.platform/Developer/SDKs/WatchOS11.4.sdk -target arm64-apple-watchos5.0 -g -module-cache-path /Users/admin/builder/spi-builder-workspace/.derivedData/ModuleCache.noindex -Xfrontend -serialize-debugging-options -enable-testing -suppress-warnings -index-store-path /Users/admin/builder/spi-builder-workspace/.derivedData/Index.noindex/DataStore -swift-version 6 -I /Users/admin/builder/spi-builder-workspace/.derivedData/Build/Products/Debug-watchos -I /Applications/Xcode-16.3.0.app/Contents/Developer/Platforms/WatchOS.platform/Developer/usr/lib -F /Users/admin/builder/spi-builder-workspace/.derivedData/Build/Products/Debug-watchos/PackageFrameworks -F /Users/admin/builder/spi-builder-workspace/.derivedData/Build/Products/Debug-watchos/PackageFrameworks -F /Users/admin/builder/spi-builder-workspace/.derivedData/Build/Products/Debug-watchos/PackageFrameworks -F /Users/admin/builder/spi-builder-workspace/.derivedData/Build/Products/Debug-watchos/PackageFrameworks -F /Users/admin/builder/spi-builder-workspace/.derivedData/Build/Products/Debug-watchos/PackageFrameworks -F /Users/admin/builder/spi-builder-workspace/.derivedData/Build/Products/Debug-watchos/PackageFrameworks -F /Users/admin/builder/spi-builder-workspace/.derivedData/Build/Products/Debug-watchos/PackageFrameworks -F /Users/admin/builder/spi-builder-workspace/.derivedData/Build/Products/Debug-watchos/PackageFrameworks -F /Users/admin/builder/spi-builder-workspace/.derivedData/Build/Products/Debug-watchos/PackageFrameworks -F /Users/admin/builder/spi-builder-workspace/.derivedData/Build/Products/Debug-watchos -F /Applications/Xcode-16.3.0.app/Contents/Developer/Platforms/WatchOS.platform/Developer/Library/Frameworks -F /Applications/Xcode-16.3.0.app/Contents/Developer/Platforms/WatchOS.platform/Developer/SDKs/WatchOS11.4.sdk/Developer/Library/Frameworks -c -j10 -enable-batch-mode -incremental -Xcc -ivfsstatcache -Xcc /Users/admin/builder/spi-builder-workspace/.derivedData/SDKStatCaches.noindex/watchos11.4-22T246-43efb940ff07ba2497b70ec94253f576.sdkstatcache -output-file-map /Users/admin/builder/spi-builder-workspace/.derivedData/Build/Intermediates.noindex/SwiftSCAD.build/Debug-watchos/SwiftSCAD.build/Objects-normal/arm64/SwiftSCAD-OutputFileMap.json -use-frontend-parseable-output -save-temps -no-color-diagnostics -serialize-diagnostics -emit-dependencies -emit-module -emit-module-path /Users/admin/builder/spi-builder-workspace/.derivedData/Build/Intermediates.noindex/SwiftSCAD.build/Debug-watchos/SwiftSCAD.build/Objects-normal/arm64/SwiftSCAD.swiftmodule -user-module-version 0.9.0 -validate-clang-modules-once -clang-build-session-file /Users/admin/builder/spi-builder-workspace/.derivedData/ModuleCache.noindex/Session.modulevalidation -package-name swiftscad -Xcc -I/Users/admin/builder/spi-builder-workspace/.derivedData/Build/Intermediates.noindex/SwiftSCAD.build/Debug-watchos/SwiftSCAD.build/swift-overrides.hmap -emit-const-values -Xfrontend -const-gather-protocols-file -Xfrontend /Users/admin/builder/spi-builder-workspace/.derivedData/Build/Intermediates.noindex/SwiftSCAD.build/Debug-watchos/SwiftSCAD.build/Objects-normal/arm64/SwiftSCAD_const_extract_protocols.json -Xcc -I/Users/admin/builder/spi-builder-workspace/.derivedData/Build/Products/Debug-watchos/include -Xcc -I/Users/admin/builder/spi-builder-workspace/.derivedData/Build/Intermediates.noindex/SwiftSCAD.build/Debug-watchos/SwiftSCAD.build/DerivedSources-normal/arm64 -Xcc -I/Users/admin/builder/spi-builder-workspace/.derivedData/Build/Intermediates.noindex/SwiftSCAD.build/Debug-watchos/SwiftSCAD.build/DerivedSources/arm64 -Xcc -I/Users/admin/builder/spi-builder-workspace/.derivedData/Build/Intermediates.noindex/SwiftSCAD.build/Debug-watchos/SwiftSCAD.build/DerivedSources -Xcc -DSWIFT_PACKAGE -Xcc -DDEBUG\=1 -emit-objc-header -emit-objc-header-path /Users/admin/builder/spi-builder-workspace/.derivedData/Build/Intermediates.noindex/SwiftSCAD.build/Debug-watchos/SwiftSCAD.build/Objects-normal/arm64/SwiftSCAD-Swift.h -working-directory /Users/admin/builder/spi-builder-workspace/.swiftpm/xcode -experimental-emit-module-separately -disable-cmo
Copy /Users/admin/builder/spi-builder-workspace/.derivedData/Build/Products/Debug-watchos/SwiftSCAD.swiftmodule/armv7k-apple-watchos.abi.json /Users/admin/builder/spi-builder-workspace/.derivedData/Build/Intermediates.noindex/SwiftSCAD.build/Debug-watchos/SwiftSCAD.build/Objects-normal/armv7k/SwiftSCAD.abi.json (in target 'SwiftSCAD' from project 'SwiftSCAD')
cd /Users/admin/builder/spi-builder-workspace/.dependencies/checkouts/SwiftSCAD
builtin-copy -exclude .DS_Store -exclude CVS -exclude .svn -exclude .git -exclude .hg -resolve-src-symlinks -rename /Users/admin/builder/spi-builder-workspace/.derivedData/Build/Intermediates.noindex/SwiftSCAD.build/Debug-watchos/SwiftSCAD.build/Objects-normal/armv7k/SwiftSCAD.abi.json /Users/admin/builder/spi-builder-workspace/.derivedData/Build/Products/Debug-watchos/SwiftSCAD.swiftmodule/armv7k-apple-watchos.abi.json
Copy /Users/admin/builder/spi-builder-workspace/.derivedData/Build/Products/Debug-watchos/SwiftSCAD.swiftmodule/arm64-apple-watchos.abi.json /Users/admin/builder/spi-builder-workspace/.derivedData/Build/Intermediates.noindex/SwiftSCAD.build/Debug-watchos/SwiftSCAD.build/Objects-normal/arm64/SwiftSCAD.abi.json (in target 'SwiftSCAD' from project 'SwiftSCAD')
cd /Users/admin/builder/spi-builder-workspace/.dependencies/checkouts/SwiftSCAD
builtin-copy -exclude .DS_Store -exclude CVS -exclude .svn -exclude .git -exclude .hg -resolve-src-symlinks -rename /Users/admin/builder/spi-builder-workspace/.derivedData/Build/Intermediates.noindex/SwiftSCAD.build/Debug-watchos/SwiftSCAD.build/Objects-normal/arm64/SwiftSCAD.abi.json /Users/admin/builder/spi-builder-workspace/.derivedData/Build/Products/Debug-watchos/SwiftSCAD.swiftmodule/arm64-apple-watchos.abi.json
SwiftCompile normal armv7k Compiling\ Angle+Operators.swift,\ Angle+Trigonometry.swift,\ Angle.swift,\ Axes.swift,\ Axis.swift,\ AxisDirection.swift,\ BezierPath+Adding.swift,\ BezierPath+Operations.swift,\ BezierPath+Visualization.swift,\ BezierPath.Curve.swift,\ BezierPath.swift,\ BezierPath.Builder.swift,\ ComponentFunctions.swift,\ PathBuilderValue.swift,\ PathBuilderVector.swift,\ Boundary+Shapes.swift,\ Boundary+Visualization.swift /Users/admin/builder/spi-builder-workspace/.dependencies/checkouts/SwiftSCAD/Sources/SwiftSCAD/Values/Angle/Angle+Operators.swift /Users/admin/builder/spi-builder-workspace/.dependencies/checkouts/SwiftSCAD/Sources/SwiftSCAD/Values/Angle/Angle+Trigonometry.swift /Users/admin/builder/spi-builder-workspace/.dependencies/checkouts/SwiftSCAD/Sources/SwiftSCAD/Values/Angle/Angle.swift /Users/admin/builder/spi-builder-workspace/.dependencies/checkouts/SwiftSCAD/Sources/SwiftSCAD/Values/Axis/Axes.swift /Users/admin/builder/spi-builder-workspace/.dependencies/checkouts/SwiftSCAD/Sources/SwiftSCAD/Values/Axis/Axis.swift /Users/admin/builder/spi-builder-workspace/.dependencies/checkouts/SwiftSCAD/Sources/SwiftSCAD/Values/Axis/AxisDirection.swift /Users/admin/builder/spi-builder-workspace/.dependencies/checkouts/SwiftSCAD/Sources/SwiftSCAD/Values/Bezier/BezierPath+Adding.swift /Users/admin/builder/spi-builder-workspace/.dependencies/checkouts/SwiftSCAD/Sources/SwiftSCAD/Values/Bezier/BezierPath+Operations.swift /Users/admin/builder/spi-builder-workspace/.dependencies/checkouts/SwiftSCAD/Sources/SwiftSCAD/Values/Bezier/BezierPath+Visualization.swift /Users/admin/builder/spi-builder-workspace/.dependencies/checkouts/SwiftSCAD/Sources/SwiftSCAD/Values/Bezier/BezierPath.Curve.swift /Users/admin/builder/spi-builder-workspace/.dependencies/checkouts/SwiftSCAD/Sources/SwiftSCAD/Values/Bezier/BezierPath.swift /Users/admin/builder/spi-builder-workspace/.dependencies/checkouts/SwiftSCAD/Sources/SwiftSCAD/Values/Bezier/Path\ Builder/BezierPath.Builder.swift /Users/admin/builder/spi-builder-workspace/.dependencies/checkouts/SwiftSCAD/Sources/SwiftSCAD/Values/Bezier/Path\ Builder/ComponentFunctions.swift /Users/admin/builder/spi-builder-workspace/.dependencies/checkouts/SwiftSCAD/Sources/SwiftSCAD/Values/Bezier/Path\ Builder/PathBuilderValue.swift /Users/admin/builder/spi-builder-workspace/.dependencies/checkouts/SwiftSCAD/Sources/SwiftSCAD/Values/Bezier/Path\ Builder/PathBuilderVector.swift /Users/admin/builder/spi-builder-workspace/.dependencies/checkouts/SwiftSCAD/Sources/SwiftSCAD/Values/Boundary/Boundary+Shapes.swift /Users/admin/builder/spi-builder-workspace/.dependencies/checkouts/SwiftSCAD/Sources/SwiftSCAD/Values/Boundary/Boundary+Visualization.swift (in target 'SwiftSCAD' from project 'SwiftSCAD')
SwiftCompile normal armv7k /Users/admin/builder/spi-builder-workspace/.dependencies/checkouts/SwiftSCAD/Sources/SwiftSCAD/Values/Angle/Angle+Operators.swift (in target 'SwiftSCAD' from project 'SwiftSCAD')
cd /Users/admin/builder/spi-builder-workspace/.swiftpm/xcode
SwiftCompile normal armv7k /Users/admin/builder/spi-builder-workspace/.dependencies/checkouts/SwiftSCAD/Sources/SwiftSCAD/Values/Angle/Angle+Trigonometry.swift (in target 'SwiftSCAD' from project 'SwiftSCAD')
cd /Users/admin/builder/spi-builder-workspace/.swiftpm/xcode
SwiftCompile normal armv7k /Users/admin/builder/spi-builder-workspace/.dependencies/checkouts/SwiftSCAD/Sources/SwiftSCAD/Values/Angle/Angle.swift (in target 'SwiftSCAD' from project 'SwiftSCAD')
cd /Users/admin/builder/spi-builder-workspace/.swiftpm/xcode
SwiftCompile normal armv7k /Users/admin/builder/spi-builder-workspace/.dependencies/checkouts/SwiftSCAD/Sources/SwiftSCAD/Values/Axis/Axes.swift (in target 'SwiftSCAD' from project 'SwiftSCAD')
cd /Users/admin/builder/spi-builder-workspace/.swiftpm/xcode
SwiftCompile normal armv7k /Users/admin/builder/spi-builder-workspace/.dependencies/checkouts/SwiftSCAD/Sources/SwiftSCAD/Values/Axis/Axis.swift (in target 'SwiftSCAD' from project 'SwiftSCAD')
cd /Users/admin/builder/spi-builder-workspace/.swiftpm/xcode
SwiftCompile normal armv7k /Users/admin/builder/spi-builder-workspace/.dependencies/checkouts/SwiftSCAD/Sources/SwiftSCAD/Values/Axis/AxisDirection.swift (in target 'SwiftSCAD' from project 'SwiftSCAD')
cd /Users/admin/builder/spi-builder-workspace/.swiftpm/xcode
SwiftCompile normal armv7k /Users/admin/builder/spi-builder-workspace/.dependencies/checkouts/SwiftSCAD/Sources/SwiftSCAD/Values/Bezier/BezierPath+Adding.swift (in target 'SwiftSCAD' from project 'SwiftSCAD')
cd /Users/admin/builder/spi-builder-workspace/.swiftpm/xcode
SwiftCompile normal armv7k /Users/admin/builder/spi-builder-workspace/.dependencies/checkouts/SwiftSCAD/Sources/SwiftSCAD/Values/Bezier/BezierPath+Operations.swift (in target 'SwiftSCAD' from project 'SwiftSCAD')
cd /Users/admin/builder/spi-builder-workspace/.swiftpm/xcode
SwiftCompile normal armv7k /Users/admin/builder/spi-builder-workspace/.dependencies/checkouts/SwiftSCAD/Sources/SwiftSCAD/Values/Bezier/BezierPath+Visualization.swift (in target 'SwiftSCAD' from project 'SwiftSCAD')
cd /Users/admin/builder/spi-builder-workspace/.swiftpm/xcode
SwiftCompile normal armv7k /Users/admin/builder/spi-builder-workspace/.dependencies/checkouts/SwiftSCAD/Sources/SwiftSCAD/Values/Bezier/BezierPath.Curve.swift (in target 'SwiftSCAD' from project 'SwiftSCAD')
cd /Users/admin/builder/spi-builder-workspace/.swiftpm/xcode
SwiftCompile normal armv7k /Users/admin/builder/spi-builder-workspace/.dependencies/checkouts/SwiftSCAD/Sources/SwiftSCAD/Values/Bezier/BezierPath.swift (in target 'SwiftSCAD' from project 'SwiftSCAD')
cd /Users/admin/builder/spi-builder-workspace/.swiftpm/xcode
SwiftCompile normal armv7k /Users/admin/builder/spi-builder-workspace/.dependencies/checkouts/SwiftSCAD/Sources/SwiftSCAD/Values/Bezier/Path\ Builder/BezierPath.Builder.swift (in target 'SwiftSCAD' from project 'SwiftSCAD')
cd /Users/admin/builder/spi-builder-workspace/.swiftpm/xcode
SwiftCompile normal armv7k /Users/admin/builder/spi-builder-workspace/.dependencies/checkouts/SwiftSCAD/Sources/SwiftSCAD/Values/Bezier/Path\ Builder/ComponentFunctions.swift (in target 'SwiftSCAD' from project 'SwiftSCAD')
cd /Users/admin/builder/spi-builder-workspace/.swiftpm/xcode
SwiftCompile normal armv7k /Users/admin/builder/spi-builder-workspace/.dependencies/checkouts/SwiftSCAD/Sources/SwiftSCAD/Values/Bezier/Path\ Builder/PathBuilderValue.swift (in target 'SwiftSCAD' from project 'SwiftSCAD')
cd /Users/admin/builder/spi-builder-workspace/.swiftpm/xcode
SwiftCompile normal armv7k /Users/admin/builder/spi-builder-workspace/.dependencies/checkouts/SwiftSCAD/Sources/SwiftSCAD/Values/Bezier/Path\ Builder/PathBuilderVector.swift (in target 'SwiftSCAD' from project 'SwiftSCAD')
cd /Users/admin/builder/spi-builder-workspace/.swiftpm/xcode
SwiftCompile normal armv7k /Users/admin/builder/spi-builder-workspace/.dependencies/checkouts/SwiftSCAD/Sources/SwiftSCAD/Values/Boundary/Boundary+Shapes.swift (in target 'SwiftSCAD' from project 'SwiftSCAD')
cd /Users/admin/builder/spi-builder-workspace/.swiftpm/xcode
SwiftCompile normal armv7k /Users/admin/builder/spi-builder-workspace/.dependencies/checkouts/SwiftSCAD/Sources/SwiftSCAD/Values/Boundary/Boundary+Visualization.swift (in target 'SwiftSCAD' from project 'SwiftSCAD')
cd /Users/admin/builder/spi-builder-workspace/.swiftpm/xcode
SwiftCompile normal arm64 Compiling\ Offset.swift,\ Rounding.swift,\ Projection.swift,\ Replace.swift,\ RoundedBoxCornerMask.swift,\ RoundedRectangleMask.swift,\ RoundingBoxCorners.swift,\ RoundingRectangleCorners.swift,\ SetVariables.swift,\ Stack.swift,\ UseFacets.swift,\ Within.swift,\ Operators.swift,\ CodeFragment+Export.swift,\ OpenSCADExport+FixSTL.swift,\ OpenSCADExport+POSIX.swift,\ OpenSCADExport+Windows.swift /Users/admin/builder/spi-builder-workspace/.dependencies/checkouts/SwiftSCAD/Sources/SwiftSCAD/Operations/Offsetting/Offset.swift /Users/admin/builder/spi-builder-workspace/.dependencies/checkouts/SwiftSCAD/Sources/SwiftSCAD/Operations/Offsetting/Rounding.swift /Users/admin/builder/spi-builder-workspace/.dependencies/checkouts/SwiftSCAD/Sources/SwiftSCAD/Operations/Projection.swift /Users/admin/builder/spi-builder-workspace/.dependencies/checkouts/SwiftSCAD/Sources/SwiftSCAD/Operations/Replace.swift /Users/admin/builder/spi-builder-workspace/.dependencies/checkouts/SwiftSCAD/Sources/SwiftSCAD/Operations/Rounding/Masks/RoundedBoxCornerMask.swift /Users/admin/builder/spi-builder-workspace/.dependencies/checkouts/SwiftSCAD/Sources/SwiftSCAD/Operations/Rounding/Masks/RoundedRectangleMask.swift /Users/admin/builder/spi-builder-workspace/.dependencies/checkouts/SwiftSCAD/Sources/SwiftSCAD/Operations/Rounding/RoundingBoxCorners.swift /Users/admin/builder/spi-builder-workspace/.dependencies/checkouts/SwiftSCAD/Sources/SwiftSCAD/Operations/Rounding/RoundingRectangleCorners.swift /Users/admin/builder/spi-builder-workspace/.dependencies/checkouts/SwiftSCAD/Sources/SwiftSCAD/Operations/SetVariables.swift /Users/admin/builder/spi-builder-workspace/.dependencies/checkouts/SwiftSCAD/Sources/SwiftSCAD/Operations/Stack.swift /Users/admin/builder/spi-builder-workspace/.dependencies/checkouts/SwiftSCAD/Sources/SwiftSCAD/Operations/UseFacets.swift /Users/admin/builder/spi-builder-workspace/.dependencies/checkouts/SwiftSCAD/Sources/SwiftSCAD/Operations/Within.swift /Users/admin/builder/spi-builder-workspace/.dependencies/checkouts/SwiftSCAD/Sources/SwiftSCAD/Operators.swift /Users/admin/builder/spi-builder-workspace/.dependencies/checkouts/SwiftSCAD/Sources/SwiftSCAD/Output/CodeFragment+Export.swift /Users/admin/builder/spi-builder-workspace/.dependencies/checkouts/SwiftSCAD/Sources/SwiftSCAD/Output/OpenSCADExport/OpenSCADExport+FixSTL.swift /Users/admin/builder/spi-builder-workspace/.dependencies/checkouts/SwiftSCAD/Sources/SwiftSCAD/Output/OpenSCADExport/OpenSCADExport+POSIX.swift /Users/admin/builder/spi-builder-workspace/.dependencies/checkouts/SwiftSCAD/Sources/SwiftSCAD/Output/OpenSCADExport/OpenSCADExport+Windows.swift (in target 'SwiftSCAD' from project 'SwiftSCAD')
Failed frontend command:
/Applications/Xcode-16.3.0.app/Contents/Developer/Toolchains/XcodeDefault.xctoolchain/usr/bin/swift-frontend -frontend -c -filelist /Users/admin/builder/spi-builder-workspace/.derivedData/Build/Intermediates.noindex/SwiftSCAD.build/Debug-watchos/SwiftSCAD.build/Objects-normal/arm64/sources-2 -primary-file /Users/admin/builder/spi-builder-workspace/.dependencies/checkouts/SwiftSCAD/Sources/SwiftSCAD/Operations/Offsetting/Offset.swift -primary-file /Users/admin/builder/spi-builder-workspace/.dependencies/checkouts/SwiftSCAD/Sources/SwiftSCAD/Operations/Offsetting/Rounding.swift -primary-file /Users/admin/builder/spi-builder-workspace/.dependencies/checkouts/SwiftSCAD/Sources/SwiftSCAD/Operations/Projection.swift -primary-file /Users/admin/builder/spi-builder-workspace/.dependencies/checkouts/SwiftSCAD/Sources/SwiftSCAD/Operations/Replace.swift -primary-file /Users/admin/builder/spi-builder-workspace/.dependencies/checkouts/SwiftSCAD/Sources/SwiftSCAD/Operations/Rounding/Masks/RoundedBoxCornerMask.swift -primary-file /Users/admin/builder/spi-builder-workspace/.dependencies/checkouts/SwiftSCAD/Sources/SwiftSCAD/Operations/Rounding/Masks/RoundedRectangleMask.swift -primary-file /Users/admin/builder/spi-builder-workspace/.dependencies/checkouts/SwiftSCAD/Sources/SwiftSCAD/Operations/Rounding/RoundingBoxCorners.swift -primary-file /Users/admin/builder/spi-builder-workspace/.dependencies/checkouts/SwiftSCAD/Sources/SwiftSCAD/Operations/Rounding/RoundingRectangleCorners.swift -primary-file /Users/admin/builder/spi-builder-workspace/.dependencies/checkouts/SwiftSCAD/Sources/SwiftSCAD/Operations/SetVariables.swift -primary-file /Users/admin/builder/spi-builder-workspace/.dependencies/checkouts/SwiftSCAD/Sources/SwiftSCAD/Operations/Stack.swift -primary-file /Users/admin/builder/spi-builder-workspace/.dependencies/checkouts/SwiftSCAD/Sources/SwiftSCAD/Operations/UseFacets.swift -primary-file /Users/admin/builder/spi-builder-workspace/.dependencies/checkouts/SwiftSCAD/Sources/SwiftSCAD/Operations/Within.swift -primary-file /Users/admin/builder/spi-builder-workspace/.dependencies/checkouts/SwiftSCAD/Sources/SwiftSCAD/Operators.swift -primary-file /Users/admin/builder/spi-builder-workspace/.dependencies/checkouts/SwiftSCAD/Sources/SwiftSCAD/Output/CodeFragment+Export.swift -primary-file /Users/admin/builder/spi-builder-workspace/.dependencies/checkouts/SwiftSCAD/Sources/SwiftSCAD/Output/OpenSCADExport/OpenSCADExport+FixSTL.swift -primary-file /Users/admin/builder/spi-builder-workspace/.dependencies/checkouts/SwiftSCAD/Sources/SwiftSCAD/Output/OpenSCADExport/OpenSCADExport+POSIX.swift -primary-file /Users/admin/builder/spi-builder-workspace/.dependencies/checkouts/SwiftSCAD/Sources/SwiftSCAD/Output/OpenSCADExport/OpenSCADExport+Windows.swift -supplementary-output-file-map /Users/admin/builder/spi-builder-workspace/.derivedData/Build/Intermediates.noindex/SwiftSCAD.build/Debug-watchos/SwiftSCAD.build/Objects-normal/arm64/supplementaryOutputs-265 -target arm64-apple-watchos5.0 -Xllvm -aarch64-use-tbi -enable-objc-interop -sdk /Applications/Xcode-16.3.0.app/Contents/Developer/Platforms/WatchOS.platform/Developer/SDKs/WatchOS11.4.sdk -I /Users/admin/builder/spi-builder-workspace/.derivedData/Build/Products/Debug-watchos -I /Applications/Xcode-16.3.0.app/Contents/Developer/Platforms/WatchOS.platform/Developer/usr/lib -F /Users/admin/builder/spi-builder-workspace/.derivedData/Build/Products/Debug-watchos/PackageFrameworks -F /Users/admin/builder/spi-builder-workspace/.derivedData/Build/Products/Debug-watchos/PackageFrameworks -F /Users/admin/builder/spi-builder-workspace/.derivedData/Build/Products/Debug-watchos/PackageFrameworks -F /Users/admin/builder/spi-builder-workspace/.derivedData/Build/Products/Debug-watchos/PackageFrameworks -F /Users/admin/builder/spi-builder-workspace/.derivedData/Build/Products/Debug-watchos/PackageFrameworks -F /Users/admin/builder/spi-builder-workspace/.derivedData/Build/Products/Debug-watchos/PackageFrameworks -F /Users/admin/builder/spi-builder-workspace/.derivedData/Build/Products/Debug-watchos/PackageFrameworks -F /Users/admin/builder/spi-builder-workspace/.derivedData/Build/Products/Debug-watchos/PackageFrameworks -F /Users/admin/builder/spi-builder-workspace/.derivedData/Build/Products/Debug-watchos/PackageFrameworks -F /Users/admin/builder/spi-builder-workspace/.derivedData/Build/Products/Debug-watchos -F /Applications/Xcode-16.3.0.app/Contents/Developer/Platforms/WatchOS.platform/Developer/Library/Frameworks -F /Applications/Xcode-16.3.0.app/Contents/Developer/Platforms/WatchOS.platform/Developer/SDKs/WatchOS11.4.sdk/Developer/Library/Frameworks -no-color-diagnostics -enable-testing -g -debug-info-format\=dwarf -dwarf-version\=4 -module-cache-path /Users/admin/builder/spi-builder-workspace/.derivedData/ModuleCache.noindex -suppress-warnings -swift-version 6 -enforce-exclusivity\=checked -Onone -D SWIFT_PACKAGE -D DEBUG -D Xcode -serialize-debugging-options -const-gather-protocols-file /Users/admin/builder/spi-builder-workspace/.derivedData/Build/Intermediates.noindex/SwiftSCAD.build/Debug-watchos/SwiftSCAD.build/Objects-normal/arm64/SwiftSCAD_const_extract_protocols.json -enable-experimental-feature DebugDescriptionMacro -empty-abi-descriptor -plugin-path /Applications/Xcode-16.3.0.app/Contents/Developer/Toolchains/XcodeDefault.xctoolchain/usr/lib/swift/host/plugins/testing -user-module-version 0.9.0 -validate-clang-modules-once -clang-build-session-file /Users/admin/builder/spi-builder-workspace/.derivedData/ModuleCache.noindex/Session.modulevalidation -Xcc -working-directory -Xcc /Users/admin/builder/spi-builder-workspace/.swiftpm/xcode -resource-dir /Applications/Xcode-16.3.0.app/Contents/Developer/Toolchains/XcodeDefault.xctoolchain/usr/lib/swift -enable-anonymous-context-mangled-names -file-compilation-dir /Users/admin/builder/spi-builder-workspace/.swiftpm/xcode -Xcc -ivfsstatcache -Xcc /Users/admin/builder/spi-builder-workspace/.derivedData/SDKStatCaches.noindex/watchos11.4-22T246-43efb940ff07ba2497b70ec94253f576.sdkstatcache -Xcc -I/Users/admin/builder/spi-builder-workspace/.derivedData/Build/Intermediates.noindex/SwiftSCAD.build/Debug-watchos/SwiftSCAD.build/swift-overrides.hmap -Xcc -I/Users/admin/builder/spi-builder-workspace/.derivedData/Build/Products/Debug-watchos/include -Xcc -I/Users/admin/builder/spi-builder-workspace/.derivedData/Build/Intermediates.noindex/SwiftSCAD.build/Debug-watchos/SwiftSCAD.build/DerivedSources-normal/arm64 -Xcc -I/Users/admin/builder/spi-builder-workspace/.derivedData/Build/Intermediates.noindex/SwiftSCAD.build/Debug-watchos/SwiftSCAD.build/DerivedSources/arm64 -Xcc -I/Users/admin/builder/spi-builder-workspace/.derivedData/Build/Intermediates.noindex/SwiftSCAD.build/Debug-watchos/SwiftSCAD.build/DerivedSources -Xcc -DSWIFT_PACKAGE -Xcc -DDEBUG\=1 -module-name SwiftSCAD -package-name swiftscad -frontend-parseable-output -disable-clang-spi -target-sdk-version 11.4 -target-sdk-name watchos11.4 -external-plugin-path /Applications/Xcode-16.3.0.app/Contents/Developer/Platforms/WatchOS.platform/Developer/usr/lib/swift/host/plugins\#/Applications/Xcode-16.3.0.app/Contents/Developer/Platforms/WatchOS.platform/Developer/usr/bin/swift-plugin-server -external-plugin-path /Applications/Xcode-16.3.0.app/Contents/Developer/Platforms/WatchOS.platform/Developer/usr/local/lib/swift/host/plugins\#/Applications/Xcode-16.3.0.app/Contents/Developer/Platforms/WatchOS.platform/Developer/usr/bin/swift-plugin-server -in-process-plugin-server-path /Applications/Xcode-16.3.0.app/Contents/Developer/Toolchains/XcodeDefault.xctoolchain/usr/lib/swift/host/libSwiftInProcPluginServer.dylib -plugin-path /Applications/Xcode-16.3.0.app/Contents/Developer/Toolchains/XcodeDefault.xctoolchain/usr/lib/swift/host/plugins -plugin-path /Applications/Xcode-16.3.0.app/Contents/Developer/Toolchains/XcodeDefault.xctoolchain/usr/local/lib/swift/host/plugins -o /Users/admin/builder/spi-builder-workspace/.derivedData/Build/Intermediates.noindex/SwiftSCAD.build/Debug-watchos/SwiftSCAD.build/Objects-normal/arm64/Offset.o -o /Users/admin/builder/spi-builder-workspace/.derivedData/Build/Intermediates.noindex/SwiftSCAD.build/Debug-watchos/SwiftSCAD.build/Objects-normal/arm64/Rounding.o -o /Users/admin/builder/spi-builder-workspace/.derivedData/Build/Intermediates.noindex/SwiftSCAD.build/Debug-watchos/SwiftSCAD.build/Objects-normal/arm64/Projection.o -o /Users/admin/builder/spi-builder-workspace/.derivedData/Build/Intermediates.noindex/SwiftSCAD.build/Debug-watchos/SwiftSCAD.build/Objects-normal/arm64/Replace.o -o /Users/admin/builder/spi-builder-workspace/.derivedData/Build/Intermediates.noindex/SwiftSCAD.build/Debug-watchos/SwiftSCAD.build/Objects-normal/arm64/RoundedBoxCornerMask.o -o /Users/admin/builder/spi-builder-workspace/.derivedData/Build/Intermediates.noindex/SwiftSCAD.build/Debug-watchos/SwiftSCAD.build/Objects-normal/arm64/RoundedRectangleMask.o -o /Users/admin/builder/spi-builder-workspace/.derivedData/Build/Intermediates.noindex/SwiftSCAD.build/Debug-watchos/SwiftSCAD.build/Objects-normal/arm64/RoundingBoxCorners.o -o /Users/admin/builder/spi-builder-workspace/.derivedData/Build/Intermediates.noindex/SwiftSCAD.build/Debug-watchos/SwiftSCAD.build/Objects-normal/arm64/RoundingRectangleCorners.o -o /Users/admin/builder/spi-builder-workspace/.derivedData/Build/Intermediates.noindex/SwiftSCAD.build/Debug-watchos/SwiftSCAD.build/Objects-normal/arm64/SetVariables.o -o /Users/admin/builder/spi-builder-workspace/.derivedData/Build/Intermediates.noindex/SwiftSCAD.build/Debug-watchos/SwiftSCAD.build/Objects-normal/arm64/Stack.o -o /Users/admin/builder/spi-builder-workspace/.derivedData/Build/Intermediates.noindex/SwiftSCAD.build/Debug-watchos/SwiftSCAD.build/Objects-normal/arm64/UseFacets.o -o /Users/admin/builder/spi-builder-workspace/.derivedData/Build/Intermediates.noindex/SwiftSCAD.build/Debug-watchos/SwiftSCAD.build/Objects-normal/arm64/Within.o -o /Users/admin/builder/spi-builder-workspace/.derivedData/Build/Intermediates.noindex/SwiftSCAD.build/Debug-watchos/SwiftSCAD.build/Objects-normal/arm64/Operators.o -o /Users/admin/builder/spi-builder-workspace/.derivedData/Build/Intermediates.noindex/SwiftSCAD.build/Debug-watchos/SwiftSCAD.build/Objects-normal/arm64/CodeFragment+Export.o -o /Users/admin/builder/spi-builder-workspace/.derivedData/Build/Intermediates.noindex/SwiftSCAD.build/Debug-watchos/SwiftSCAD.build/Objects-normal/arm64/OpenSCADExport+FixSTL.o -o /Users/admin/builder/spi-builder-workspace/.derivedData/Build/Intermediates.noindex/SwiftSCAD.build/Debug-watchos/SwiftSCAD.build/Objects-normal/arm64/OpenSCADExport+POSIX.o -o /Users/admin/builder/spi-builder-workspace/.derivedData/Build/Intermediates.noindex/SwiftSCAD.build/Debug-watchos/SwiftSCAD.build/Objects-normal/arm64/OpenSCADExport+Windows.o -index-unit-output-path /SwiftSCAD.build/Debug-watchos/SwiftSCAD.build/Objects-normal/arm64/Offset.o -index-unit-output-path /SwiftSCAD.build/Debug-watchos/SwiftSCAD.build/Objects-normal/arm64/Rounding.o -index-unit-output-path /SwiftSCAD.build/Debug-watchos/SwiftSCAD.build/Objects-normal/arm64/Projection.o -index-unit-output-path /SwiftSCAD.build/Debug-watchos/SwiftSCAD.build/Objects-normal/arm64/Replace.o -index-unit-output-path /SwiftSCAD.build/Debug-watchos/SwiftSCAD.build/Objects-normal/arm64/RoundedBoxCornerMask.o -index-unit-output-path /SwiftSCAD.build/Debug-watchos/SwiftSCAD.build/Objects-normal/arm64/RoundedRectangleMask.o -index-unit-output-path /SwiftSCAD.build/Debug-watchos/SwiftSCAD.build/Objects-normal/arm64/RoundingBoxCorners.o -index-unit-output-path /SwiftSCAD.build/Debug-watchos/SwiftSCAD.build/Objects-normal/arm64/RoundingRectangleCorners.o -index-unit-output-path /SwiftSCAD.build/Debug-watchos/SwiftSCAD.build/Objects-normal/arm64/SetVariables.o -index-unit-output-path /SwiftSCAD.build/Debug-watchos/SwiftSCAD.build/Objects-normal/arm64/Stack.o -index-unit-output-path /SwiftSCAD.build/Debug-watchos/SwiftSCAD.build/Objects-normal/arm64/UseFacets.o -index-unit-output-path /SwiftSCAD.build/Debug-watchos/SwiftSCAD.build/Objects-normal/arm64/Within.o -index-unit-output-path /SwiftSCAD.build/Debug-watchos/SwiftSCAD.build/Objects-normal/arm64/Operators.o -index-unit-output-path /SwiftSCAD.build/Debug-watchos/SwiftSCAD.build/Objects-normal/arm64/CodeFragment+Export.o -index-unit-output-path /SwiftSCAD.build/Debug-watchos/SwiftSCAD.build/Objects-normal/arm64/OpenSCADExport+FixSTL.o -index-unit-output-path /SwiftSCAD.build/Debug-watchos/SwiftSCAD.build/Objects-normal/arm64/OpenSCADExport+POSIX.o -index-unit-output-path /SwiftSCAD.build/Debug-watchos/SwiftSCAD.build/Objects-normal/arm64/OpenSCADExport+Windows.o -index-store-path /Users/admin/builder/spi-builder-workspace/.derivedData/Index.noindex/DataStore -index-system-modules
SwiftCompile normal arm64 /Users/admin/builder/spi-builder-workspace/.dependencies/checkouts/SwiftSCAD/Sources/SwiftSCAD/Operations/Offsetting/Offset.swift (in target 'SwiftSCAD' from project 'SwiftSCAD')
cd /Users/admin/builder/spi-builder-workspace/.swiftpm/xcode
SwiftCompile normal arm64 /Users/admin/builder/spi-builder-workspace/.dependencies/checkouts/SwiftSCAD/Sources/SwiftSCAD/Operations/Offsetting/Rounding.swift (in target 'SwiftSCAD' from project 'SwiftSCAD')
cd /Users/admin/builder/spi-builder-workspace/.swiftpm/xcode
SwiftCompile normal arm64 /Users/admin/builder/spi-builder-workspace/.dependencies/checkouts/SwiftSCAD/Sources/SwiftSCAD/Operations/Projection.swift (in target 'SwiftSCAD' from project 'SwiftSCAD')
cd /Users/admin/builder/spi-builder-workspace/.swiftpm/xcode
SwiftCompile normal arm64 /Users/admin/builder/spi-builder-workspace/.dependencies/checkouts/SwiftSCAD/Sources/SwiftSCAD/Operations/Replace.swift (in target 'SwiftSCAD' from project 'SwiftSCAD')
cd /Users/admin/builder/spi-builder-workspace/.swiftpm/xcode
SwiftCompile normal arm64 /Users/admin/builder/spi-builder-workspace/.dependencies/checkouts/SwiftSCAD/Sources/SwiftSCAD/Operations/Rounding/Masks/RoundedBoxCornerMask.swift (in target 'SwiftSCAD' from project 'SwiftSCAD')
cd /Users/admin/builder/spi-builder-workspace/.swiftpm/xcode
SwiftCompile normal arm64 /Users/admin/builder/spi-builder-workspace/.dependencies/checkouts/SwiftSCAD/Sources/SwiftSCAD/Operations/Rounding/Masks/RoundedRectangleMask.swift (in target 'SwiftSCAD' from project 'SwiftSCAD')
cd /Users/admin/builder/spi-builder-workspace/.swiftpm/xcode
SwiftCompile normal arm64 /Users/admin/builder/spi-builder-workspace/.dependencies/checkouts/SwiftSCAD/Sources/SwiftSCAD/Operations/Rounding/RoundingBoxCorners.swift (in target 'SwiftSCAD' from project 'SwiftSCAD')
cd /Users/admin/builder/spi-builder-workspace/.swiftpm/xcode
SwiftCompile normal arm64 /Users/admin/builder/spi-builder-workspace/.dependencies/checkouts/SwiftSCAD/Sources/SwiftSCAD/Operations/Rounding/RoundingRectangleCorners.swift (in target 'SwiftSCAD' from project 'SwiftSCAD')
cd /Users/admin/builder/spi-builder-workspace/.swiftpm/xcode
SwiftCompile normal arm64 /Users/admin/builder/spi-builder-workspace/.dependencies/checkouts/SwiftSCAD/Sources/SwiftSCAD/Operations/SetVariables.swift (in target 'SwiftSCAD' from project 'SwiftSCAD')
cd /Users/admin/builder/spi-builder-workspace/.swiftpm/xcode
SwiftCompile normal arm64 /Users/admin/builder/spi-builder-workspace/.dependencies/checkouts/SwiftSCAD/Sources/SwiftSCAD/Operations/Stack.swift (in target 'SwiftSCAD' from project 'SwiftSCAD')
cd /Users/admin/builder/spi-builder-workspace/.swiftpm/xcode
SwiftCompile normal arm64 /Users/admin/builder/spi-builder-workspace/.dependencies/checkouts/SwiftSCAD/Sources/SwiftSCAD/Operations/UseFacets.swift (in target 'SwiftSCAD' from project 'SwiftSCAD')
cd /Users/admin/builder/spi-builder-workspace/.swiftpm/xcode
SwiftCompile normal arm64 /Users/admin/builder/spi-builder-workspace/.dependencies/checkouts/SwiftSCAD/Sources/SwiftSCAD/Operations/Within.swift (in target 'SwiftSCAD' from project 'SwiftSCAD')
cd /Users/admin/builder/spi-builder-workspace/.swiftpm/xcode
SwiftCompile normal arm64 /Users/admin/builder/spi-builder-workspace/.dependencies/checkouts/SwiftSCAD/Sources/SwiftSCAD/Operators.swift (in target 'SwiftSCAD' from project 'SwiftSCAD')
cd /Users/admin/builder/spi-builder-workspace/.swiftpm/xcode
SwiftCompile normal arm64 /Users/admin/builder/spi-builder-workspace/.dependencies/checkouts/SwiftSCAD/Sources/SwiftSCAD/Output/CodeFragment+Export.swift (in target 'SwiftSCAD' from project 'SwiftSCAD')
cd /Users/admin/builder/spi-builder-workspace/.swiftpm/xcode
SwiftCompile normal arm64 /Users/admin/builder/spi-builder-workspace/.dependencies/checkouts/SwiftSCAD/Sources/SwiftSCAD/Output/OpenSCADExport/OpenSCADExport+FixSTL.swift (in target 'SwiftSCAD' from project 'SwiftSCAD')
cd /Users/admin/builder/spi-builder-workspace/.swiftpm/xcode
SwiftCompile normal arm64 /Users/admin/builder/spi-builder-workspace/.dependencies/checkouts/SwiftSCAD/Sources/SwiftSCAD/Output/OpenSCADExport/OpenSCADExport+POSIX.swift (in target 'SwiftSCAD' from project 'SwiftSCAD')
cd /Users/admin/builder/spi-builder-workspace/.swiftpm/xcode
/Users/admin/builder/spi-builder-workspace/.dependencies/checkouts/SwiftSCAD/Sources/SwiftSCAD/Output/OpenSCADExport/OpenSCADExport+POSIX.swift:11:13: error: 'init(filePath:directoryHint:relativeTo:)' is only available in watchOS 9.0 or newer
URL(filePath: String($0), directoryHint: .isDirectory).appending(component: "openscad")
^
/Users/admin/builder/spi-builder-workspace/.dependencies/checkouts/SwiftSCAD/Sources/SwiftSCAD/Output/OpenSCADExport/OpenSCADExport+POSIX.swift:11:13: note: add 'if #available' version check
URL(filePath: String($0), directoryHint: .isDirectory).appending(component: "openscad")
^
/Users/admin/builder/spi-builder-workspace/.dependencies/checkouts/SwiftSCAD/Sources/SwiftSCAD/Output/OpenSCADExport/OpenSCADExport+POSIX.swift:7:17: note: add @available attribute to enclosing static method
static func findExecutableAutomatically() -> URL? {
^
/Users/admin/builder/spi-builder-workspace/.dependencies/checkouts/SwiftSCAD/Sources/SwiftSCAD/Output/OpenSCADExport/OpenSCADExport+POSIX.swift:6:10: note: add @available attribute to enclosing extension
internal extension OpenSCADExport {
^
/Users/admin/builder/spi-builder-workspace/.dependencies/checkouts/SwiftSCAD/Sources/SwiftSCAD/Output/OpenSCADExport/OpenSCADExport+POSIX.swift:11:68: error: 'appending(component:directoryHint:)' is only available in watchOS 9.0 or newer
URL(filePath: String($0), directoryHint: .isDirectory).appending(component: "openscad")
^
/Users/admin/builder/spi-builder-workspace/.dependencies/checkouts/SwiftSCAD/Sources/SwiftSCAD/Output/OpenSCADExport/OpenSCADExport+POSIX.swift:11:68: note: add 'if #available' version check
URL(filePath: String($0), directoryHint: .isDirectory).appending(component: "openscad")
^
/Users/admin/builder/spi-builder-workspace/.dependencies/checkouts/SwiftSCAD/Sources/SwiftSCAD/Output/OpenSCADExport/OpenSCADExport+POSIX.swift:7:17: note: add @available attribute to enclosing static method
static func findExecutableAutomatically() -> URL? {
^
/Users/admin/builder/spi-builder-workspace/.dependencies/checkouts/SwiftSCAD/Sources/SwiftSCAD/Output/OpenSCADExport/OpenSCADExport+POSIX.swift:6:10: note: add @available attribute to enclosing extension
internal extension OpenSCADExport {
^
/Users/admin/builder/spi-builder-workspace/.dependencies/checkouts/SwiftSCAD/Sources/SwiftSCAD/Output/OpenSCADExport/OpenSCADExport+POSIX.swift:15:78: error: 'path(percentEncoded:)' is only available in watchOS 9.0 or newer
return possibleExecutables.first { fileManager.fileExists(atPath: $0.path()) }
^
/Users/admin/builder/spi-builder-workspace/.dependencies/checkouts/SwiftSCAD/Sources/SwiftSCAD/Output/OpenSCADExport/OpenSCADExport+POSIX.swift:15:78: note: add 'if #available' version check
return possibleExecutables.first { fileManager.fileExists(atPath: $0.path()) }
^
/Users/admin/builder/spi-builder-workspace/.dependencies/checkouts/SwiftSCAD/Sources/SwiftSCAD/Output/OpenSCADExport/OpenSCADExport+POSIX.swift:7:17: note: add @available attribute to enclosing static method
static func findExecutableAutomatically() -> URL? {
^
/Users/admin/builder/spi-builder-workspace/.dependencies/checkouts/SwiftSCAD/Sources/SwiftSCAD/Output/OpenSCADExport/OpenSCADExport+POSIX.swift:6:10: note: add @available attribute to enclosing extension
internal extension OpenSCADExport {
^
SwiftCompile normal arm64 /Users/admin/builder/spi-builder-workspace/.dependencies/checkouts/SwiftSCAD/Sources/SwiftSCAD/Output/OpenSCADExport/OpenSCADExport+Windows.swift (in target 'SwiftSCAD' from project 'SwiftSCAD')
cd /Users/admin/builder/spi-builder-workspace/.swiftpm/xcode
SwiftDriverJobDiscovery normal armv7k Compiling _HashNode+Structural isEqualSet.swift, _HashNode+Structural isSubset.swift, _HashNode+Structural mapValues.swift, _HashNode+Structural merge.swift, _HashNode+Structural subtracting.swift, _HashNode+Structural symmetricDifference.swift, _HashNode+Structural union.swift, _HashNode+Subtree Insertions.swift, _HashNode+Subtree Modify.swift (in target 'HashTreeCollections' from project 'swift-collections')
SwiftCompile normal armv7k Compiling\ ArrayBuilder.swift,\ Compatibility.swift,\ Concurrency.swift,\ Colored.swift,\ ForceRender.swift,\ Prefix.swift,\ VisualizeAxes.swift,\ Environment.swift,\ EnvironmentContext.swift,\ EnvironmentModifier.swift,\ EnvironmentValues.swift,\ ReadEnvironment.swift,\ Environment+Color.swift,\ Environment+Transform.swift,\ Facets.swift,\ NaturalUpDirection.swift,\ Operation.swift,\ PreviewConvexity.swift /Users/admin/builder/spi-builder-workspace/.dependencies/checkouts/SwiftSCAD/Sources/SwiftSCAD/ArrayBuilder.swift /Users/admin/builder/spi-builder-workspace/.dependencies/checkouts/SwiftSCAD/Sources/SwiftSCAD/Compatibility.swift /Users/admin/builder/spi-builder-workspace/.dependencies/checkouts/SwiftSCAD/Sources/SwiftSCAD/Concurrency.swift /Users/admin/builder/spi-builder-workspace/.dependencies/checkouts/SwiftSCAD/Sources/SwiftSCAD/Development/Colored.swift /Users/admin/builder/spi-builder-workspace/.dependencies/checkouts/SwiftSCAD/Sources/SwiftSCAD/Development/ForceRender.swift /Users/admin/builder/spi-builder-workspace/.dependencies/checkouts/SwiftSCAD/Sources/SwiftSCAD/Development/Prefix.swift /Users/admin/builder/spi-builder-workspace/.dependencies/checkouts/SwiftSCAD/Sources/SwiftSCAD/Development/VisualizeAxes.swift /Users/admin/builder/spi-builder-workspace/.dependencies/checkouts/SwiftSCAD/Sources/SwiftSCAD/Environment/Environment.swift /Users/admin/builder/spi-builder-workspace/.dependencies/checkouts/SwiftSCAD/Sources/SwiftSCAD/Environment/EnvironmentContext.swift /Users/admin/builder/spi-builder-workspace/.dependencies/checkouts/SwiftSCAD/Sources/SwiftSCAD/Environment/EnvironmentModifier.swift /Users/admin/builder/spi-builder-workspace/.dependencies/checkouts/SwiftSCAD/Sources/SwiftSCAD/Environment/EnvironmentValues.swift /Users/admin/builder/spi-builder-workspace/.dependencies/checkouts/SwiftSCAD/Sources/SwiftSCAD/Environment/ReadEnvironment.swift /Users/admin/builder/spi-builder-workspace/.dependencies/checkouts/SwiftSCAD/Sources/SwiftSCAD/Environment/Values/Environment+Color.swift /Users/admin/builder/spi-builder-workspace/.dependencies/checkouts/SwiftSCAD/Sources/SwiftSCAD/Environment/Values/Environment+Transform.swift /Users/admin/builder/spi-builder-workspace/.dependencies/checkouts/SwiftSCAD/Sources/SwiftSCAD/Environment/Values/Facets.swift /Users/admin/builder/spi-builder-workspace/.dependencies/checkouts/SwiftSCAD/Sources/SwiftSCAD/Environment/Values/NaturalUpDirection.swift /Users/admin/builder/spi-builder-workspace/.dependencies/checkouts/SwiftSCAD/Sources/SwiftSCAD/Environment/Values/Operation.swift /Users/admin/builder/spi-builder-workspace/.dependencies/checkouts/SwiftSCAD/Sources/SwiftSCAD/Environment/Values/PreviewConvexity.swift (in target 'SwiftSCAD' from project 'SwiftSCAD')
SwiftCompile normal armv7k /Users/admin/builder/spi-builder-workspace/.dependencies/checkouts/SwiftSCAD/Sources/SwiftSCAD/ArrayBuilder.swift (in target 'SwiftSCAD' from project 'SwiftSCAD')
cd /Users/admin/builder/spi-builder-workspace/.swiftpm/xcode
SwiftCompile normal armv7k /Users/admin/builder/spi-builder-workspace/.dependencies/checkouts/SwiftSCAD/Sources/SwiftSCAD/Compatibility.swift (in target 'SwiftSCAD' from project 'SwiftSCAD')
cd /Users/admin/builder/spi-builder-workspace/.swiftpm/xcode
SwiftCompile normal armv7k /Users/admin/builder/spi-builder-workspace/.dependencies/checkouts/SwiftSCAD/Sources/SwiftSCAD/Concurrency.swift (in target 'SwiftSCAD' from project 'SwiftSCAD')
cd /Users/admin/builder/spi-builder-workspace/.swiftpm/xcode
SwiftCompile normal armv7k /Users/admin/builder/spi-builder-workspace/.dependencies/checkouts/SwiftSCAD/Sources/SwiftSCAD/Development/Colored.swift (in target 'SwiftSCAD' from project 'SwiftSCAD')
cd /Users/admin/builder/spi-builder-workspace/.swiftpm/xcode
SwiftCompile normal armv7k /Users/admin/builder/spi-builder-workspace/.dependencies/checkouts/SwiftSCAD/Sources/SwiftSCAD/Development/ForceRender.swift (in target 'SwiftSCAD' from project 'SwiftSCAD')
cd /Users/admin/builder/spi-builder-workspace/.swiftpm/xcode
SwiftCompile normal armv7k /Users/admin/builder/spi-builder-workspace/.dependencies/checkouts/SwiftSCAD/Sources/SwiftSCAD/Development/Prefix.swift (in target 'SwiftSCAD' from project 'SwiftSCAD')
cd /Users/admin/builder/spi-builder-workspace/.swiftpm/xcode
SwiftCompile normal armv7k /Users/admin/builder/spi-builder-workspace/.dependencies/checkouts/SwiftSCAD/Sources/SwiftSCAD/Development/VisualizeAxes.swift (in target 'SwiftSCAD' from project 'SwiftSCAD')
cd /Users/admin/builder/spi-builder-workspace/.swiftpm/xcode
SwiftCompile normal armv7k /Users/admin/builder/spi-builder-workspace/.dependencies/checkouts/SwiftSCAD/Sources/SwiftSCAD/Environment/Environment.swift (in target 'SwiftSCAD' from project 'SwiftSCAD')
cd /Users/admin/builder/spi-builder-workspace/.swiftpm/xcode
SwiftCompile normal armv7k /Users/admin/builder/spi-builder-workspace/.dependencies/checkouts/SwiftSCAD/Sources/SwiftSCAD/Environment/EnvironmentContext.swift (in target 'SwiftSCAD' from project 'SwiftSCAD')
cd /Users/admin/builder/spi-builder-workspace/.swiftpm/xcode
SwiftCompile normal armv7k /Users/admin/builder/spi-builder-workspace/.dependencies/checkouts/SwiftSCAD/Sources/SwiftSCAD/Environment/EnvironmentModifier.swift (in target 'SwiftSCAD' from project 'SwiftSCAD')
cd /Users/admin/builder/spi-builder-workspace/.swiftpm/xcode
SwiftCompile normal armv7k /Users/admin/builder/spi-builder-workspace/.dependencies/checkouts/SwiftSCAD/Sources/SwiftSCAD/Environment/EnvironmentValues.swift (in target 'SwiftSCAD' from project 'SwiftSCAD')
cd /Users/admin/builder/spi-builder-workspace/.swiftpm/xcode
SwiftCompile normal armv7k /Users/admin/builder/spi-builder-workspace/.dependencies/checkouts/SwiftSCAD/Sources/SwiftSCAD/Environment/ReadEnvironment.swift (in target 'SwiftSCAD' from project 'SwiftSCAD')
cd /Users/admin/builder/spi-builder-workspace/.swiftpm/xcode
SwiftCompile normal armv7k /Users/admin/builder/spi-builder-workspace/.dependencies/checkouts/SwiftSCAD/Sources/SwiftSCAD/Environment/Values/Environment+Color.swift (in target 'SwiftSCAD' from project 'SwiftSCAD')
cd /Users/admin/builder/spi-builder-workspace/.swiftpm/xcode
SwiftCompile normal armv7k /Users/admin/builder/spi-builder-workspace/.dependencies/checkouts/SwiftSCAD/Sources/SwiftSCAD/Environment/Values/Environment+Transform.swift (in target 'SwiftSCAD' from project 'SwiftSCAD')
cd /Users/admin/builder/spi-builder-workspace/.swiftpm/xcode
SwiftCompile normal armv7k /Users/admin/builder/spi-builder-workspace/.dependencies/checkouts/SwiftSCAD/Sources/SwiftSCAD/Environment/Values/Facets.swift (in target 'SwiftSCAD' from project 'SwiftSCAD')
cd /Users/admin/builder/spi-builder-workspace/.swiftpm/xcode
SwiftCompile normal armv7k /Users/admin/builder/spi-builder-workspace/.dependencies/checkouts/SwiftSCAD/Sources/SwiftSCAD/Environment/Values/NaturalUpDirection.swift (in target 'SwiftSCAD' from project 'SwiftSCAD')
cd /Users/admin/builder/spi-builder-workspace/.swiftpm/xcode
SwiftCompile normal armv7k /Users/admin/builder/spi-builder-workspace/.dependencies/checkouts/SwiftSCAD/Sources/SwiftSCAD/Environment/Values/Operation.swift (in target 'SwiftSCAD' from project 'SwiftSCAD')
cd /Users/admin/builder/spi-builder-workspace/.swiftpm/xcode
SwiftCompile normal armv7k /Users/admin/builder/spi-builder-workspace/.dependencies/checkouts/SwiftSCAD/Sources/SwiftSCAD/Environment/Values/PreviewConvexity.swift (in target 'SwiftSCAD' from project 'SwiftSCAD')
cd /Users/admin/builder/spi-builder-workspace/.swiftpm/xcode
SwiftDriverJobDiscovery normal arm64 Compiling ArrayBuilder.swift, Compatibility.swift, Concurrency.swift, Colored.swift, ForceRender.swift, Prefix.swift, VisualizeAxes.swift, Environment.swift, EnvironmentContext.swift, EnvironmentModifier.swift, EnvironmentValues.swift, ReadEnvironment.swift, Environment+Color.swift, Environment+Transform.swift, Facets.swift, NaturalUpDirection.swift, Operation.swift, PreviewConvexity.swift (in target 'SwiftSCAD' from project 'SwiftSCAD')
SwiftCompile normal armv7k Compiling\ RepeatAlong.swift,\ RepeatAround.swift,\ Symmetry.swift,\ ApplyBoxEdgeProfile.swift,\ ApplyEdgeProfile.swift,\ ExtrudePolygon.swift,\ ExtrudeWithEdgeProfiles.swift,\ ExtrudedAlong.swift,\ ExtrudedHull.swift,\ LinearExtrude.swift,\ LinearExtrudeScaling.swift,\ RotateExtrude.swift,\ ConvexHull.swift,\ Fill.swift,\ Import.swift,\ Name.swift,\ MinkowskiSum.swift /Users/admin/builder/spi-builder-workspace/.dependencies/checkouts/SwiftSCAD/Sources/SwiftSCAD/Operations/Duplication/RepeatAlong.swift /Users/admin/builder/spi-builder-workspace/.dependencies/checkouts/SwiftSCAD/Sources/SwiftSCAD/Operations/Duplication/RepeatAround.swift /Users/admin/builder/spi-builder-workspace/.dependencies/checkouts/SwiftSCAD/Sources/SwiftSCAD/Operations/Duplication/Symmetry.swift /Users/admin/builder/spi-builder-workspace/.dependencies/checkouts/SwiftSCAD/Sources/SwiftSCAD/Operations/Edge\ Profile\ Application/ApplyBoxEdgeProfile.swift /Users/admin/builder/spi-builder-workspace/.dependencies/checkouts/SwiftSCAD/Sources/SwiftSCAD/Operations/Edge\ Profile\ Application/ApplyEdgeProfile.swift /Users/admin/builder/spi-builder-workspace/.dependencies/checkouts/SwiftSCAD/Sources/SwiftSCAD/Operations/Extrude/ExtrudePolygon.swift /Users/admin/builder/spi-builder-workspace/.dependencies/checkouts/SwiftSCAD/Sources/SwiftSCAD/Operations/Extrude/ExtrudeWithEdgeProfiles.swift /Users/admin/builder/spi-builder-workspace/.dependencies/checkouts/SwiftSCAD/Sources/SwiftSCAD/Operations/Extrude/ExtrudedAlong.swift /Users/admin/builder/spi-builder-workspace/.dependencies/checkouts/SwiftSCAD/Sources/SwiftSCAD/Operations/Extrude/ExtrudedHull.swift /Users/admin/builder/spi-builder-workspace/.dependencies/checkouts/SwiftSCAD/Sources/SwiftSCAD/Operations/Extrude/LinearExtrude.swift /Users/admin/builder/spi-builder-workspace/.dependencies/checkouts/SwiftSCAD/Sources/SwiftSCAD/Operations/Extrude/LinearExtrudeScaling.swift /Users/admin/builder/spi-builder-workspace/.dependencies/checkouts/SwiftSCAD/Sources/SwiftSCAD/Operations/Extrude/RotateExtrude.swift /Users/admin/builder/spi-builder-workspace/.dependencies/checkouts/SwiftSCAD/Sources/SwiftSCAD/Operations/Filling/ConvexHull.swift /Users/admin/builder/spi-builder-workspace/.dependencies/checkouts/SwiftSCAD/Sources/SwiftSCAD/Operations/Filling/Fill.swift /Users/admin/builder/spi-builder-workspace/.dependencies/checkouts/SwiftSCAD/Sources/SwiftSCAD/Operations/Import.swift /Users/admin/builder/spi-builder-workspace/.dependencies/checkouts/SwiftSCAD/Sources/SwiftSCAD/Operations/Name.swift /Users/admin/builder/spi-builder-workspace/.dependencies/checkouts/SwiftSCAD/Sources/SwiftSCAD/Operations/Offsetting/MinkowskiSum.swift (in target 'SwiftSCAD' from project 'SwiftSCAD')
SwiftCompile normal armv7k /Users/admin/builder/spi-builder-workspace/.dependencies/checkouts/SwiftSCAD/Sources/SwiftSCAD/Operations/Duplication/RepeatAlong.swift (in target 'SwiftSCAD' from project 'SwiftSCAD')
cd /Users/admin/builder/spi-builder-workspace/.swiftpm/xcode
SwiftCompile normal armv7k /Users/admin/builder/spi-builder-workspace/.dependencies/checkouts/SwiftSCAD/Sources/SwiftSCAD/Operations/Duplication/RepeatAround.swift (in target 'SwiftSCAD' from project 'SwiftSCAD')
cd /Users/admin/builder/spi-builder-workspace/.swiftpm/xcode
SwiftCompile normal armv7k /Users/admin/builder/spi-builder-workspace/.dependencies/checkouts/SwiftSCAD/Sources/SwiftSCAD/Operations/Duplication/Symmetry.swift (in target 'SwiftSCAD' from project 'SwiftSCAD')
cd /Users/admin/builder/spi-builder-workspace/.swiftpm/xcode
SwiftCompile normal armv7k /Users/admin/builder/spi-builder-workspace/.dependencies/checkouts/SwiftSCAD/Sources/SwiftSCAD/Operations/Edge\ Profile\ Application/ApplyBoxEdgeProfile.swift (in target 'SwiftSCAD' from project 'SwiftSCAD')
cd /Users/admin/builder/spi-builder-workspace/.swiftpm/xcode
SwiftCompile normal armv7k /Users/admin/builder/spi-builder-workspace/.dependencies/checkouts/SwiftSCAD/Sources/SwiftSCAD/Operations/Edge\ Profile\ Application/ApplyEdgeProfile.swift (in target 'SwiftSCAD' from project 'SwiftSCAD')
cd /Users/admin/builder/spi-builder-workspace/.swiftpm/xcode
SwiftCompile normal armv7k /Users/admin/builder/spi-builder-workspace/.dependencies/checkouts/SwiftSCAD/Sources/SwiftSCAD/Operations/Extrude/ExtrudePolygon.swift (in target 'SwiftSCAD' from project 'SwiftSCAD')
cd /Users/admin/builder/spi-builder-workspace/.swiftpm/xcode
SwiftCompile normal armv7k /Users/admin/builder/spi-builder-workspace/.dependencies/checkouts/SwiftSCAD/Sources/SwiftSCAD/Operations/Extrude/ExtrudeWithEdgeProfiles.swift (in target 'SwiftSCAD' from project 'SwiftSCAD')
cd /Users/admin/builder/spi-builder-workspace/.swiftpm/xcode
SwiftCompile normal armv7k /Users/admin/builder/spi-builder-workspace/.dependencies/checkouts/SwiftSCAD/Sources/SwiftSCAD/Operations/Extrude/ExtrudedAlong.swift (in target 'SwiftSCAD' from project 'SwiftSCAD')
cd /Users/admin/builder/spi-builder-workspace/.swiftpm/xcode
SwiftCompile normal armv7k /Users/admin/builder/spi-builder-workspace/.dependencies/checkouts/SwiftSCAD/Sources/SwiftSCAD/Operations/Extrude/ExtrudedHull.swift (in target 'SwiftSCAD' from project 'SwiftSCAD')
cd /Users/admin/builder/spi-builder-workspace/.swiftpm/xcode
SwiftCompile normal armv7k /Users/admin/builder/spi-builder-workspace/.dependencies/checkouts/SwiftSCAD/Sources/SwiftSCAD/Operations/Extrude/LinearExtrude.swift (in target 'SwiftSCAD' from project 'SwiftSCAD')
cd /Users/admin/builder/spi-builder-workspace/.swiftpm/xcode
SwiftCompile normal armv7k /Users/admin/builder/spi-builder-workspace/.dependencies/checkouts/SwiftSCAD/Sources/SwiftSCAD/Operations/Extrude/LinearExtrudeScaling.swift (in target 'SwiftSCAD' from project 'SwiftSCAD')
cd /Users/admin/builder/spi-builder-workspace/.swiftpm/xcode
SwiftCompile normal armv7k /Users/admin/builder/spi-builder-workspace/.dependencies/checkouts/SwiftSCAD/Sources/SwiftSCAD/Operations/Extrude/RotateExtrude.swift (in target 'SwiftSCAD' from project 'SwiftSCAD')
cd /Users/admin/builder/spi-builder-workspace/.swiftpm/xcode
SwiftCompile normal armv7k /Users/admin/builder/spi-builder-workspace/.dependencies/checkouts/SwiftSCAD/Sources/SwiftSCAD/Operations/Filling/ConvexHull.swift (in target 'SwiftSCAD' from project 'SwiftSCAD')
cd /Users/admin/builder/spi-builder-workspace/.swiftpm/xcode
SwiftCompile normal armv7k /Users/admin/builder/spi-builder-workspace/.dependencies/checkouts/SwiftSCAD/Sources/SwiftSCAD/Operations/Filling/Fill.swift (in target 'SwiftSCAD' from project 'SwiftSCAD')
cd /Users/admin/builder/spi-builder-workspace/.swiftpm/xcode
SwiftCompile normal armv7k /Users/admin/builder/spi-builder-workspace/.dependencies/checkouts/SwiftSCAD/Sources/SwiftSCAD/Operations/Import.swift (in target 'SwiftSCAD' from project 'SwiftSCAD')
cd /Users/admin/builder/spi-builder-workspace/.swiftpm/xcode
SwiftCompile normal armv7k /Users/admin/builder/spi-builder-workspace/.dependencies/checkouts/SwiftSCAD/Sources/SwiftSCAD/Operations/Name.swift (in target 'SwiftSCAD' from project 'SwiftSCAD')
cd /Users/admin/builder/spi-builder-workspace/.swiftpm/xcode
SwiftCompile normal armv7k /Users/admin/builder/spi-builder-workspace/.dependencies/checkouts/SwiftSCAD/Sources/SwiftSCAD/Operations/Offsetting/MinkowskiSum.swift (in target 'SwiftSCAD' from project 'SwiftSCAD')
cd /Users/admin/builder/spi-builder-workspace/.swiftpm/xcode
SwiftDriverJobDiscovery normal arm64_32 Emitting module for SwiftSCAD (in target 'SwiftSCAD' from project 'SwiftSCAD')
SwiftDriver\ Compilation\ Requirements SwiftSCAD normal arm64_32 com.apple.xcode.tools.swift.compiler (in target 'SwiftSCAD' from project 'SwiftSCAD')
cd /Users/admin/builder/spi-builder-workspace/.swiftpm/xcode
builtin-Swift-Compilation-Requirements -- /Applications/Xcode-16.3.0.app/Contents/Developer/Toolchains/XcodeDefault.xctoolchain/usr/bin/swiftc -module-name SwiftSCAD -Onone -enforce-exclusivity\=checked @/Users/admin/builder/spi-builder-workspace/.derivedData/Build/Intermediates.noindex/SwiftSCAD.build/Debug-watchos/SwiftSCAD.build/Objects-normal/arm64_32/SwiftSCAD.SwiftFileList -DSWIFT_PACKAGE -DDEBUG -DXcode -plugin-path /Applications/Xcode-16.3.0.app/Contents/Developer/Toolchains/XcodeDefault.xctoolchain/usr/lib/swift/host/plugins/testing -enable-experimental-feature DebugDescriptionMacro -sdk /Applications/Xcode-16.3.0.app/Contents/Developer/Platforms/WatchOS.platform/Developer/SDKs/WatchOS11.4.sdk -target arm64_32-apple-watchos5.0 -g -module-cache-path /Users/admin/builder/spi-builder-workspace/.derivedData/ModuleCache.noindex -Xfrontend -serialize-debugging-options -enable-testing -suppress-warnings -index-store-path /Users/admin/builder/spi-builder-workspace/.derivedData/Index.noindex/DataStore -swift-version 6 -I /Users/admin/builder/spi-builder-workspace/.derivedData/Build/Products/Debug-watchos -I /Applications/Xcode-16.3.0.app/Contents/Developer/Platforms/WatchOS.platform/Developer/usr/lib -F /Users/admin/builder/spi-builder-workspace/.derivedData/Build/Products/Debug-watchos/PackageFrameworks -F /Users/admin/builder/spi-builder-workspace/.derivedData/Build/Products/Debug-watchos/PackageFrameworks -F /Users/admin/builder/spi-builder-workspace/.derivedData/Build/Products/Debug-watchos/PackageFrameworks -F /Users/admin/builder/spi-builder-workspace/.derivedData/Build/Products/Debug-watchos/PackageFrameworks -F /Users/admin/builder/spi-builder-workspace/.derivedData/Build/Products/Debug-watchos/PackageFrameworks -F /Users/admin/builder/spi-builder-workspace/.derivedData/Build/Products/Debug-watchos/PackageFrameworks -F /Users/admin/builder/spi-builder-workspace/.derivedData/Build/Products/Debug-watchos/PackageFrameworks -F /Users/admin/builder/spi-builder-workspace/.derivedData/Build/Products/Debug-watchos/PackageFrameworks -F /Users/admin/builder/spi-builder-workspace/.derivedData/Build/Products/Debug-watchos/PackageFrameworks -F /Users/admin/builder/spi-builder-workspace/.derivedData/Build/Products/Debug-watchos -F /Applications/Xcode-16.3.0.app/Contents/Developer/Platforms/WatchOS.platform/Developer/Library/Frameworks -F /Applications/Xcode-16.3.0.app/Contents/Developer/Platforms/WatchOS.platform/Developer/SDKs/WatchOS11.4.sdk/Developer/Library/Frameworks -c -j10 -enable-batch-mode -incremental -Xcc -ivfsstatcache -Xcc /Users/admin/builder/spi-builder-workspace/.derivedData/SDKStatCaches.noindex/watchos11.4-22T246-43efb940ff07ba2497b70ec94253f576.sdkstatcache -output-file-map /Users/admin/builder/spi-builder-workspace/.derivedData/Build/Intermediates.noindex/SwiftSCAD.build/Debug-watchos/SwiftSCAD.build/Objects-normal/arm64_32/SwiftSCAD-OutputFileMap.json -use-frontend-parseable-output -save-temps -no-color-diagnostics -serialize-diagnostics -emit-dependencies -emit-module -emit-module-path /Users/admin/builder/spi-builder-workspace/.derivedData/Build/Intermediates.noindex/SwiftSCAD.build/Debug-watchos/SwiftSCAD.build/Objects-normal/arm64_32/SwiftSCAD.swiftmodule -user-module-version 0.9.0 -validate-clang-modules-once -clang-build-session-file /Users/admin/builder/spi-builder-workspace/.derivedData/ModuleCache.noindex/Session.modulevalidation -package-name swiftscad -Xcc -I/Users/admin/builder/spi-builder-workspace/.derivedData/Build/Intermediates.noindex/SwiftSCAD.build/Debug-watchos/SwiftSCAD.build/swift-overrides.hmap -emit-const-values -Xfrontend -const-gather-protocols-file -Xfrontend /Users/admin/builder/spi-builder-workspace/.derivedData/Build/Intermediates.noindex/SwiftSCAD.build/Debug-watchos/SwiftSCAD.build/Objects-normal/arm64_32/SwiftSCAD_const_extract_protocols.json -Xcc -I/Users/admin/builder/spi-builder-workspace/.derivedData/Build/Products/Debug-watchos/include -Xcc -I/Users/admin/builder/spi-builder-workspace/.derivedData/Build/Intermediates.noindex/SwiftSCAD.build/Debug-watchos/SwiftSCAD.build/DerivedSources-normal/arm64_32 -Xcc -I/Users/admin/builder/spi-builder-workspace/.derivedData/Build/Intermediates.noindex/SwiftSCAD.build/Debug-watchos/SwiftSCAD.build/DerivedSources/arm64_32 -Xcc -I/Users/admin/builder/spi-builder-workspace/.derivedData/Build/Intermediates.noindex/SwiftSCAD.build/Debug-watchos/SwiftSCAD.build/DerivedSources -Xcc -DSWIFT_PACKAGE -Xcc -DDEBUG\=1 -emit-objc-header -emit-objc-header-path /Users/admin/builder/spi-builder-workspace/.derivedData/Build/Intermediates.noindex/SwiftSCAD.build/Debug-watchos/SwiftSCAD.build/Objects-normal/arm64_32/SwiftSCAD-Swift.h -working-directory /Users/admin/builder/spi-builder-workspace/.swiftpm/xcode -experimental-emit-module-separately -disable-cmo
SwiftDriverJobDiscovery normal arm64 Compiling ResultModifier.swift, ResultReader.swift, Logging.swift, Aligned.swift, Adding.swift, AddingExclusive.swift, Difference.swift, Intersection.swift, Union.swift, Measure.swift, OffsetBounds.swift, Resize2D.swift, Resize3D.swift, SetBounds.swift, SetBoundsSize.swift, Clone.swift, Distribute.swift (in target 'SwiftSCAD' from project 'SwiftSCAD')
SwiftCompile normal arm64_32 Compiling\ AffineTransform2D+Modification.swift,\ AffineTransform2D.swift,\ AffineTransform3D+Creation.swift,\ AffineTransform3D+Modification.swift,\ AffineTransform3D.swift,\ Rotation3D.swift,\ AffineTransform.swift,\ BasicMatrix3x3.swift,\ BasicMatrix4x4.swift,\ Matrix.swift,\ DimensionalValues.swift,\ Vector.swift,\ Vector2D+Operators.swift,\ Vector2D.swift,\ Vector3D+Directions.swift,\ Vector3D+Operators.swift,\ Vector3D.swift /Users/admin/builder/spi-builder-workspace/.dependencies/checkouts/SwiftSCAD/Sources/SwiftSCAD/Values/Transforms/2D/AffineTransform2D+Modification.swift /Users/admin/builder/spi-builder-workspace/.dependencies/checkouts/SwiftSCAD/Sources/SwiftSCAD/Values/Transforms/2D/AffineTransform2D.swift /Users/admin/builder/spi-builder-workspace/.dependencies/checkouts/SwiftSCAD/Sources/SwiftSCAD/Values/Transforms/3D/AffineTransform3D+Creation.swift /Users/admin/builder/spi-builder-workspace/.dependencies/checkouts/SwiftSCAD/Sources/SwiftSCAD/Values/Transforms/3D/AffineTransform3D+Modification.swift /Users/admin/builder/spi-builder-workspace/.dependencies/checkouts/SwiftSCAD/Sources/SwiftSCAD/Values/Transforms/3D/AffineTransform3D.swift /Users/admin/builder/spi-builder-workspace/.dependencies/checkouts/SwiftSCAD/Sources/SwiftSCAD/Values/Transforms/3D/Rotation3D.swift /Users/admin/builder/spi-builder-workspace/.dependencies/checkouts/SwiftSCAD/Sources/SwiftSCAD/Values/Transforms/AffineTransform.swift /Users/admin/builder/spi-builder-workspace/.dependencies/checkouts/SwiftSCAD/Sources/SwiftSCAD/Values/Transforms/Matrix/BasicMatrix3x3.swift /Users/admin/builder/spi-builder-workspace/.dependencies/checkouts/SwiftSCAD/Sources/SwiftSCAD/Values/Transforms/Matrix/BasicMatrix4x4.swift /Users/admin/builder/spi-builder-workspace/.dependencies/checkouts/SwiftSCAD/Sources/SwiftSCAD/Values/Transforms/Matrix/Matrix.swift /Users/admin/builder/spi-builder-workspace/.dependencies/checkouts/SwiftSCAD/Sources/SwiftSCAD/Values/Vectors/DimensionalValues.swift /Users/admin/builder/spi-builder-workspace/.dependencies/checkouts/SwiftSCAD/Sources/SwiftSCAD/Values/Vectors/Vector.swift /Users/admin/builder/spi-builder-workspace/.dependencies/checkouts/SwiftSCAD/Sources/SwiftSCAD/Values/Vectors/Vector2D+Operators.swift /Users/admin/builder/spi-builder-workspace/.dependencies/checkouts/SwiftSCAD/Sources/SwiftSCAD/Values/Vectors/Vector2D.swift /Users/admin/builder/spi-builder-workspace/.dependencies/checkouts/SwiftSCAD/Sources/SwiftSCAD/Values/Vectors/Vector3D+Directions.swift /Users/admin/builder/spi-builder-workspace/.dependencies/checkouts/SwiftSCAD/Sources/SwiftSCAD/Values/Vectors/Vector3D+Operators.swift /Users/admin/builder/spi-builder-workspace/.dependencies/checkouts/SwiftSCAD/Sources/SwiftSCAD/Values/Vectors/Vector3D.swift (in target 'SwiftSCAD' from project 'SwiftSCAD')
SwiftCompile normal arm64_32 /Users/admin/builder/spi-builder-workspace/.dependencies/checkouts/SwiftSCAD/Sources/SwiftSCAD/Values/Transforms/2D/AffineTransform2D+Modification.swift (in target 'SwiftSCAD' from project 'SwiftSCAD')
cd /Users/admin/builder/spi-builder-workspace/.swiftpm/xcode
SwiftCompile normal arm64_32 /Users/admin/builder/spi-builder-workspace/.dependencies/checkouts/SwiftSCAD/Sources/SwiftSCAD/Values/Transforms/2D/AffineTransform2D.swift (in target 'SwiftSCAD' from project 'SwiftSCAD')
cd /Users/admin/builder/spi-builder-workspace/.swiftpm/xcode
SwiftCompile normal arm64_32 /Users/admin/builder/spi-builder-workspace/.dependencies/checkouts/SwiftSCAD/Sources/SwiftSCAD/Values/Transforms/3D/AffineTransform3D+Creation.swift (in target 'SwiftSCAD' from project 'SwiftSCAD')
cd /Users/admin/builder/spi-builder-workspace/.swiftpm/xcode
SwiftCompile normal arm64_32 /Users/admin/builder/spi-builder-workspace/.dependencies/checkouts/SwiftSCAD/Sources/SwiftSCAD/Values/Transforms/3D/AffineTransform3D+Modification.swift (in target 'SwiftSCAD' from project 'SwiftSCAD')
cd /Users/admin/builder/spi-builder-workspace/.swiftpm/xcode
SwiftCompile normal arm64_32 /Users/admin/builder/spi-builder-workspace/.dependencies/checkouts/SwiftSCAD/Sources/SwiftSCAD/Values/Transforms/3D/AffineTransform3D.swift (in target 'SwiftSCAD' from project 'SwiftSCAD')
cd /Users/admin/builder/spi-builder-workspace/.swiftpm/xcode
SwiftCompile normal arm64_32 /Users/admin/builder/spi-builder-workspace/.dependencies/checkouts/SwiftSCAD/Sources/SwiftSCAD/Values/Transforms/3D/Rotation3D.swift (in target 'SwiftSCAD' from project 'SwiftSCAD')
cd /Users/admin/builder/spi-builder-workspace/.swiftpm/xcode
SwiftCompile normal arm64_32 /Users/admin/builder/spi-builder-workspace/.dependencies/checkouts/SwiftSCAD/Sources/SwiftSCAD/Values/Transforms/AffineTransform.swift (in target 'SwiftSCAD' from project 'SwiftSCAD')
cd /Users/admin/builder/spi-builder-workspace/.swiftpm/xcode
SwiftCompile normal arm64_32 /Users/admin/builder/spi-builder-workspace/.dependencies/checkouts/SwiftSCAD/Sources/SwiftSCAD/Values/Transforms/Matrix/BasicMatrix3x3.swift (in target 'SwiftSCAD' from project 'SwiftSCAD')
cd /Users/admin/builder/spi-builder-workspace/.swiftpm/xcode
SwiftCompile normal arm64_32 /Users/admin/builder/spi-builder-workspace/.dependencies/checkouts/SwiftSCAD/Sources/SwiftSCAD/Values/Transforms/Matrix/BasicMatrix4x4.swift (in target 'SwiftSCAD' from project 'SwiftSCAD')
cd /Users/admin/builder/spi-builder-workspace/.swiftpm/xcode
SwiftCompile normal arm64_32 /Users/admin/builder/spi-builder-workspace/.dependencies/checkouts/SwiftSCAD/Sources/SwiftSCAD/Values/Transforms/Matrix/Matrix.swift (in target 'SwiftSCAD' from project 'SwiftSCAD')
cd /Users/admin/builder/spi-builder-workspace/.swiftpm/xcode
SwiftCompile normal arm64_32 /Users/admin/builder/spi-builder-workspace/.dependencies/checkouts/SwiftSCAD/Sources/SwiftSCAD/Values/Vectors/DimensionalValues.swift (in target 'SwiftSCAD' from project 'SwiftSCAD')
cd /Users/admin/builder/spi-builder-workspace/.swiftpm/xcode
SwiftCompile normal arm64_32 /Users/admin/builder/spi-builder-workspace/.dependencies/checkouts/SwiftSCAD/Sources/SwiftSCAD/Values/Vectors/Vector.swift (in target 'SwiftSCAD' from project 'SwiftSCAD')
cd /Users/admin/builder/spi-builder-workspace/.swiftpm/xcode
SwiftCompile normal arm64_32 /Users/admin/builder/spi-builder-workspace/.dependencies/checkouts/SwiftSCAD/Sources/SwiftSCAD/Values/Vectors/Vector2D+Operators.swift (in target 'SwiftSCAD' from project 'SwiftSCAD')
cd /Users/admin/builder/spi-builder-workspace/.swiftpm/xcode
SwiftCompile normal arm64_32 /Users/admin/builder/spi-builder-workspace/.dependencies/checkouts/SwiftSCAD/Sources/SwiftSCAD/Values/Vectors/Vector2D.swift (in target 'SwiftSCAD' from project 'SwiftSCAD')
cd /Users/admin/builder/spi-builder-workspace/.swiftpm/xcode
SwiftCompile normal arm64_32 /Users/admin/builder/spi-builder-workspace/.dependencies/checkouts/SwiftSCAD/Sources/SwiftSCAD/Values/Vectors/Vector3D+Directions.swift (in target 'SwiftSCAD' from project 'SwiftSCAD')
cd /Users/admin/builder/spi-builder-workspace/.swiftpm/xcode
SwiftCompile normal arm64_32 /Users/admin/builder/spi-builder-workspace/.dependencies/checkouts/SwiftSCAD/Sources/SwiftSCAD/Values/Vectors/Vector3D+Operators.swift (in target 'SwiftSCAD' from project 'SwiftSCAD')
cd /Users/admin/builder/spi-builder-workspace/.swiftpm/xcode
SwiftCompile normal arm64_32 /Users/admin/builder/spi-builder-workspace/.dependencies/checkouts/SwiftSCAD/Sources/SwiftSCAD/Values/Vectors/Vector3D.swift (in target 'SwiftSCAD' from project 'SwiftSCAD')
cd /Users/admin/builder/spi-builder-workspace/.swiftpm/xcode
Copy /Users/admin/builder/spi-builder-workspace/.derivedData/Build/Products/Debug-watchos/SwiftSCAD.swiftmodule/arm64_32-apple-watchos.abi.json /Users/admin/builder/spi-builder-workspace/.derivedData/Build/Intermediates.noindex/SwiftSCAD.build/Debug-watchos/SwiftSCAD.build/Objects-normal/arm64_32/SwiftSCAD.abi.json (in target 'SwiftSCAD' from project 'SwiftSCAD')
cd /Users/admin/builder/spi-builder-workspace/.dependencies/checkouts/SwiftSCAD
builtin-copy -exclude .DS_Store -exclude CVS -exclude .svn -exclude .git -exclude .hg -resolve-src-symlinks -rename /Users/admin/builder/spi-builder-workspace/.derivedData/Build/Intermediates.noindex/SwiftSCAD.build/Debug-watchos/SwiftSCAD.build/Objects-normal/arm64_32/SwiftSCAD.abi.json /Users/admin/builder/spi-builder-workspace/.derivedData/Build/Products/Debug-watchos/SwiftSCAD.swiftmodule/arm64_32-apple-watchos.abi.json
SwiftDriverJobDiscovery normal arm64 Compiling Text.swift, TextModifiers.swift, Box.swift, Cylinder+Angles.swift, Cylinder.swift, Polyhedron.swift, Sphere.swift, Torus.swift, Tube.swift, Rotate.swift, RotateAround.swift, Scale.swift, Transform.swift, Translate.swift, AxisAlignment.swift, GeometryAlignment+Presets.swift, GeometryAlignment.swift (in target 'SwiftSCAD' from project 'SwiftSCAD')
SwiftCompile normal arm64_32 Compiling\ Tolerance.swift,\ Extensions.swift,\ AnchorList.swift,\ Anchors+Public.swift,\ Geometry+Anchors.swift,\ Array+Geometry.swift,\ CodeFragment.swift,\ GeometryName.swift,\ GeometryProxy.swift,\ Output.swift,\ CombinedGeometry.swift,\ ExtrusionGeometry.swift,\ Geometry.swift,\ LeafGeometry.swift,\ Shape.swift,\ TransformedGeometry.swift,\ WrappedGeometry.swift,\ ResultElement.swift /Users/admin/builder/spi-builder-workspace/.dependencies/checkouts/SwiftSCAD/Sources/SwiftSCAD/Environment/Values/Tolerance.swift /Users/admin/builder/spi-builder-workspace/.dependencies/checkouts/SwiftSCAD/Sources/SwiftSCAD/Extensions.swift /Users/admin/builder/spi-builder-workspace/.dependencies/checkouts/SwiftSCAD/Sources/SwiftSCAD/Geometry/Anchors/AnchorList.swift /Users/admin/builder/spi-builder-workspace/.dependencies/checkouts/SwiftSCAD/Sources/SwiftSCAD/Geometry/Anchors/Anchors+Public.swift /Users/admin/builder/spi-builder-workspace/.dependencies/checkouts/SwiftSCAD/Sources/SwiftSCAD/Geometry/Anchors/Geometry+Anchors.swift /Users/admin/builder/spi-builder-workspace/.dependencies/checkouts/SwiftSCAD/Sources/SwiftSCAD/Geometry/Array+Geometry.swift /Users/admin/builder/spi-builder-workspace/.dependencies/checkouts/SwiftSCAD/Sources/SwiftSCAD/Geometry/Output/CodeFragment.swift /Users/admin/builder/spi-builder-workspace/.dependencies/checkouts/SwiftSCAD/Sources/SwiftSCAD/Geometry/Output/GeometryName.swift /Users/admin/builder/spi-builder-workspace/.dependencies/checkouts/SwiftSCAD/Sources/SwiftSCAD/Geometry/Output/GeometryProxy.swift /Users/admin/builder/spi-builder-workspace/.dependencies/checkouts/SwiftSCAD/Sources/SwiftSCAD/Geometry/Output/Output.swift /Users/admin/builder/spi-builder-workspace/.dependencies/checkouts/SwiftSCAD/Sources/SwiftSCAD/Geometry/Protocols/CombinedGeometry.swift /Users/admin/builder/spi-builder-workspace/.dependencies/checkouts/SwiftSCAD/Sources/SwiftSCAD/Geometry/Protocols/ExtrusionGeometry.swift /Users/admin/builder/spi-builder-workspace/.dependencies/checkouts/SwiftSCAD/Sources/SwiftSCAD/Geometry/Protocols/Geometry.swift /Users/admin/builder/spi-builder-workspace/.dependencies/checkouts/SwiftSCAD/Sources/SwiftSCAD/Geometry/Protocols/LeafGeometry.swift /Users/admin/builder/spi-builder-workspace/.dependencies/checkouts/SwiftSCAD/Sources/SwiftSCAD/Geometry/Protocols/Shape.swift /Users/admin/builder/spi-builder-workspace/.dependencies/checkouts/SwiftSCAD/Sources/SwiftSCAD/Geometry/Protocols/TransformedGeometry.swift /Users/admin/builder/spi-builder-workspace/.dependencies/checkouts/SwiftSCAD/Sources/SwiftSCAD/Geometry/Protocols/WrappedGeometry.swift /Users/admin/builder/spi-builder-workspace/.dependencies/checkouts/SwiftSCAD/Sources/SwiftSCAD/Geometry/ResultElement/ResultElement.swift (in target 'SwiftSCAD' from project 'SwiftSCAD')
Command SwiftCompile failed with a nonzero exit code
** BUILD FAILED **
The following build commands failed:
SwiftCompile normal arm64 Compiling\ Offset.swift,\ Rounding.swift,\ Projection.swift,\ Replace.swift,\ RoundedBoxCornerMask.swift,\ RoundedRectangleMask.swift,\ RoundingBoxCorners.swift,\ RoundingRectangleCorners.swift,\ SetVariables.swift,\ Stack.swift,\ UseFacets.swift,\ Within.swift,\ Operators.swift,\ CodeFragment+Export.swift,\ OpenSCADExport+FixSTL.swift,\ OpenSCADExport+POSIX.swift,\ OpenSCADExport+Windows.swift /Users/admin/builder/spi-builder-workspace/.dependencies/checkouts/SwiftSCAD/Sources/SwiftSCAD/Operations/Offsetting/Offset.swift /Users/admin/builder/spi-builder-workspace/.dependencies/checkouts/SwiftSCAD/Sources/SwiftSCAD/Operations/Offsetting/Rounding.swift /Users/admin/builder/spi-builder-workspace/.dependencies/checkouts/SwiftSCAD/Sources/SwiftSCAD/Operations/Projection.swift /Users/admin/builder/spi-builder-workspace/.dependencies/checkouts/SwiftSCAD/Sources/SwiftSCAD/Operations/Replace.swift /Users/admin/builder/spi-builder-workspace/.dependencies/checkouts/SwiftSCAD/Sources/SwiftSCAD/Operations/Rounding/Masks/RoundedBoxCornerMask.swift /Users/admin/builder/spi-builder-workspace/.dependencies/checkouts/SwiftSCAD/Sources/SwiftSCAD/Operations/Rounding/Masks/RoundedRectangleMask.swift /Users/admin/builder/spi-builder-workspace/.dependencies/checkouts/SwiftSCAD/Sources/SwiftSCAD/Operations/Rounding/RoundingBoxCorners.swift /Users/admin/builder/spi-builder-workspace/.dependencies/checkouts/SwiftSCAD/Sources/SwiftSCAD/Operations/Rounding/RoundingRectangleCorners.swift /Users/admin/builder/spi-builder-workspace/.dependencies/checkouts/SwiftSCAD/Sources/SwiftSCAD/Operations/SetVariables.swift /Users/admin/builder/spi-builder-workspace/.dependencies/checkouts/SwiftSCAD/Sources/SwiftSCAD/Operations/Stack.swift /Users/admin/builder/spi-builder-workspace/.dependencies/checkouts/SwiftSCAD/Sources/SwiftSCAD/Operations/UseFacets.swift /Users/admin/builder/spi-builder-workspace/.dependencies/checkouts/SwiftSCAD/Sources/SwiftSCAD/Operations/Within.swift /Users/admin/builder/spi-builder-workspace/.dependencies/checkouts/SwiftSCAD/Sources/SwiftSCAD/Operators.swift /Users/admin/builder/spi-builder-workspace/.dependencies/checkouts/SwiftSCAD/Sources/SwiftSCAD/Output/CodeFragment+Export.swift /Users/admin/builder/spi-builder-workspace/.dependencies/checkouts/SwiftSCAD/Sources/SwiftSCAD/Output/OpenSCADExport/OpenSCADExport+FixSTL.swift /Users/admin/builder/spi-builder-workspace/.dependencies/checkouts/SwiftSCAD/Sources/SwiftSCAD/Output/OpenSCADExport/OpenSCADExport+POSIX.swift /Users/admin/builder/spi-builder-workspace/.dependencies/checkouts/SwiftSCAD/Sources/SwiftSCAD/Output/OpenSCADExport/OpenSCADExport+Windows.swift (in target 'SwiftSCAD' from project 'SwiftSCAD')
SwiftCompile normal arm64 /Users/admin/builder/spi-builder-workspace/.dependencies/checkouts/SwiftSCAD/Sources/SwiftSCAD/Output/OpenSCADExport/OpenSCADExport+POSIX.swift (in target 'SwiftSCAD' from project 'SwiftSCAD')
SwiftCompile normal arm64_32 Compiling\ Tolerance.swift,\ Extensions.swift,\ AnchorList.swift,\ Anchors+Public.swift,\ Geometry+Anchors.swift,\ Array+Geometry.swift,\ CodeFragment.swift,\ GeometryName.swift,\ GeometryProxy.swift,\ Output.swift,\ CombinedGeometry.swift,\ ExtrusionGeometry.swift,\ Geometry.swift,\ LeafGeometry.swift,\ Shape.swift,\ TransformedGeometry.swift,\ WrappedGeometry.swift,\ ResultElement.swift /Users/admin/builder/spi-builder-workspace/.dependencies/checkouts/SwiftSCAD/Sources/SwiftSCAD/Environment/Values/Tolerance.swift /Users/admin/builder/spi-builder-workspace/.dependencies/checkouts/SwiftSCAD/Sources/SwiftSCAD/Extensions.swift /Users/admin/builder/spi-builder-workspace/.dependencies/checkouts/SwiftSCAD/Sources/SwiftSCAD/Geometry/Anchors/AnchorList.swift /Users/admin/builder/spi-builder-workspace/.dependencies/checkouts/SwiftSCAD/Sources/SwiftSCAD/Geometry/Anchors/Anchors+Public.swift /Users/admin/builder/spi-builder-workspace/.dependencies/checkouts/SwiftSCAD/Sources/SwiftSCAD/Geometry/Anchors/Geometry+Anchors.swift /Users/admin/builder/spi-builder-workspace/.dependencies/checkouts/SwiftSCAD/Sources/SwiftSCAD/Geometry/Array+Geometry.swift /Users/admin/builder/spi-builder-workspace/.dependencies/checkouts/SwiftSCAD/Sources/SwiftSCAD/Geometry/Output/CodeFragment.swift /Users/admin/builder/spi-builder-workspace/.dependencies/checkouts/SwiftSCAD/Sources/SwiftSCAD/Geometry/Output/GeometryName.swift /Users/admin/builder/spi-builder-workspace/.dependencies/checkouts/SwiftSCAD/Sources/SwiftSCAD/Geometry/Output/GeometryProxy.swift /Users/admin/builder/spi-builder-workspace/.dependencies/checkouts/SwiftSCAD/Sources/SwiftSCAD/Geometry/Output/Output.swift /Users/admin/builder/spi-builder-workspace/.dependencies/checkouts/SwiftSCAD/Sources/SwiftSCAD/Geometry/Protocols/CombinedGeometry.swift /Users/admin/builder/spi-builder-workspace/.dependencies/checkouts/SwiftSCAD/Sources/SwiftSCAD/Geometry/Protocols/ExtrusionGeometry.swift /Users/admin/builder/spi-builder-workspace/.dependencies/checkouts/SwiftSCAD/Sources/SwiftSCAD/Geometry/Protocols/Geometry.swift /Users/admin/builder/spi-builder-workspace/.dependencies/checkouts/SwiftSCAD/Sources/SwiftSCAD/Geometry/Protocols/LeafGeometry.swift /Users/admin/builder/spi-builder-workspace/.dependencies/checkouts/SwiftSCAD/Sources/SwiftSCAD/Geometry/Protocols/Shape.swift /Users/admin/builder/spi-builder-workspace/.dependencies/checkouts/SwiftSCAD/Sources/SwiftSCAD/Geometry/Protocols/TransformedGeometry.swift /Users/admin/builder/spi-builder-workspace/.dependencies/checkouts/SwiftSCAD/Sources/SwiftSCAD/Geometry/Protocols/WrappedGeometry.swift /Users/admin/builder/spi-builder-workspace/.dependencies/checkouts/SwiftSCAD/Sources/SwiftSCAD/Geometry/ResultElement/ResultElement.swift (in target 'SwiftSCAD' from project 'SwiftSCAD')
Building workspace spi-builder-workspace with scheme Helical-Package
(4 failures)
BUILD FAILURE 6.1 watchOS