Build Information
Failed to build swift-package-api-diff, reference main (d9947b
), with Swift 6.1 for iOS using Xcode 16.3 on 26 Apr 2025 22:46:51 UTC.
Build Command
env DEVELOPER_DIR=/Applications/Xcode-16.3.0.app xcrun xcodebuild -IDEClonedSourcePackagesDirPathOverride=$PWD/.dependencies -skipMacroValidation -skipPackagePluginValidation -derivedDataPath $PWD/.derivedData build -scheme swift-package-api-diff -destination generic/platform=iOS
Build Log
RegisterExecutionPolicyException /Users/admin/builder/spi-builder-workspace/.derivedData/Build/Products/Debug-iphoneos/llbuildCore.o (in target 'llbuildCore' from project 'llbuild')
cd /Users/admin/builder/spi-builder-workspace/.dependencies/checkouts/swift-llbuild
builtin-RegisterExecutionPolicyException /Users/admin/builder/spi-builder-workspace/.derivedData/Build/Products/Debug-iphoneos/llbuildCore.o
Ld /Users/admin/builder/spi-builder-workspace/.derivedData/Build/Products/Debug-iphoneos/llbuildBuildSystem.o normal (in target 'llbuildBuildSystem' from project 'llbuild')
cd /Users/admin/builder/spi-builder-workspace/.dependencies/checkouts/swift-llbuild
/Applications/Xcode-16.3.0.app/Contents/Developer/Toolchains/XcodeDefault.xctoolchain/usr/bin/clang++ -Xlinker -reproducible -target arm64-apple-ios12.0 -r -isysroot /Applications/Xcode-16.3.0.app/Contents/Developer/Platforms/iPhoneOS.platform/Developer/SDKs/iPhoneOS18.4.sdk -O0 -w -L/Users/admin/builder/spi-builder-workspace/.derivedData/Build/Intermediates.noindex/EagerLinkingTBDs/Debug-iphoneos -L/Users/admin/builder/spi-builder-workspace/.derivedData/Build/Products/Debug-iphoneos -L/Applications/Xcode-16.3.0.app/Contents/Developer/Platforms/iPhoneOS.platform/Developer/usr/lib -F/Users/admin/builder/spi-builder-workspace/.derivedData/Build/Intermediates.noindex/EagerLinkingTBDs/Debug-iphoneos -F/Users/admin/builder/spi-builder-workspace/.derivedData/Build/Products/Debug-iphoneos/PackageFrameworks -F/Users/admin/builder/spi-builder-workspace/.derivedData/Build/Products/Debug-iphoneos/PackageFrameworks -F/Users/admin/builder/spi-builder-workspace/.derivedData/Build/Products/Debug-iphoneos/PackageFrameworks -F/Users/admin/builder/spi-builder-workspace/.derivedData/Build/Products/Debug-iphoneos/PackageFrameworks -F/Users/admin/builder/spi-builder-workspace/.derivedData/Build/Products/Debug-iphoneos -iframework /Applications/Xcode-16.3.0.app/Contents/Developer/Platforms/iPhoneOS.platform/Developer/Library/Frameworks -iframework /Applications/Xcode-16.3.0.app/Contents/Developer/Platforms/iPhoneOS.platform/Developer/SDKs/iPhoneOS18.4.sdk/Developer/Library/Frameworks -filelist /Users/admin/builder/spi-builder-workspace/.derivedData/Build/Intermediates.noindex/llbuild.build/Debug-iphoneos/llbuildBuildSystem.build/Objects-normal/arm64/llbuildBuildSystem.LinkFileList -nostdlib -Xlinker -object_path_lto -Xlinker /Users/admin/builder/spi-builder-workspace/.derivedData/Build/Intermediates.noindex/llbuild.build/Debug-iphoneos/llbuildBuildSystem.build/Objects-normal/arm64/llbuildBuildSystem_lto.o -rdynamic -Xlinker -no_deduplicate -Xlinker -debug_variant -Xlinker -dependency_info -Xlinker /Users/admin/builder/spi-builder-workspace/.derivedData/Build/Intermediates.noindex/llbuild.build/Debug-iphoneos/llbuildBuildSystem.build/Objects-normal/arm64/llbuildBuildSystem_dependency_info.dat -o /Users/admin/builder/spi-builder-workspace/.derivedData/Build/Products/Debug-iphoneos/llbuildBuildSystem.o
RegisterExecutionPolicyException /Users/admin/builder/spi-builder-workspace/.derivedData/Build/Products/Debug-iphoneos/llbuildBuildSystem.o (in target 'llbuildBuildSystem' from project 'llbuild')
cd /Users/admin/builder/spi-builder-workspace/.dependencies/checkouts/swift-llbuild
builtin-RegisterExecutionPolicyException /Users/admin/builder/spi-builder-workspace/.derivedData/Build/Products/Debug-iphoneos/llbuildBuildSystem.o
SwiftEmitModule normal arm64 Emitting\ module\ for\ TSCLibc (in target 'TSCLibc' from project 'swift-tools-support-core')
SwiftCompile normal arm64 /Users/admin/builder/spi-builder-workspace/.dependencies/checkouts/swift-tools-support-core/Sources/TSCLibc/libc.swift (in target 'TSCLibc' from project 'swift-tools-support-core')
cd /Users/admin/builder/spi-builder-workspace/.swiftpm/xcode
SwiftCompile normal arm64 Compiling\ libc.swift /Users/admin/builder/spi-builder-workspace/.dependencies/checkouts/swift-tools-support-core/Sources/TSCLibc/libc.swift (in target 'TSCLibc' from project 'swift-tools-support-core')
SwiftCompile normal arm64 /Users/admin/builder/spi-builder-workspace/.dependencies/checkouts/swift-tools-support-core/Sources/TSCLibc/libc.swift (in target 'TSCLibc' from project 'swift-tools-support-core')
cd /Users/admin/builder/spi-builder-workspace/.swiftpm/xcode
Ld /Users/admin/builder/spi-builder-workspace/.derivedData/Build/Products/Debug-iphoneos/libllbuild.o normal (in target 'libllbuild' from project 'llbuild')
cd /Users/admin/builder/spi-builder-workspace/.dependencies/checkouts/swift-llbuild
/Applications/Xcode-16.3.0.app/Contents/Developer/Toolchains/XcodeDefault.xctoolchain/usr/bin/clang++ -Xlinker -reproducible -target arm64-apple-ios12.0 -r -isysroot /Applications/Xcode-16.3.0.app/Contents/Developer/Platforms/iPhoneOS.platform/Developer/SDKs/iPhoneOS18.4.sdk -O0 -w -L/Users/admin/builder/spi-builder-workspace/.derivedData/Build/Intermediates.noindex/EagerLinkingTBDs/Debug-iphoneos -L/Users/admin/builder/spi-builder-workspace/.derivedData/Build/Products/Debug-iphoneos -L/Applications/Xcode-16.3.0.app/Contents/Developer/Platforms/iPhoneOS.platform/Developer/usr/lib -F/Users/admin/builder/spi-builder-workspace/.derivedData/Build/Intermediates.noindex/EagerLinkingTBDs/Debug-iphoneos -F/Users/admin/builder/spi-builder-workspace/.derivedData/Build/Products/Debug-iphoneos/PackageFrameworks -F/Users/admin/builder/spi-builder-workspace/.derivedData/Build/Products/Debug-iphoneos/PackageFrameworks -F/Users/admin/builder/spi-builder-workspace/.derivedData/Build/Products/Debug-iphoneos/PackageFrameworks -F/Users/admin/builder/spi-builder-workspace/.derivedData/Build/Products/Debug-iphoneos/PackageFrameworks -F/Users/admin/builder/spi-builder-workspace/.derivedData/Build/Products/Debug-iphoneos/PackageFrameworks -F/Users/admin/builder/spi-builder-workspace/.derivedData/Build/Products/Debug-iphoneos -iframework /Applications/Xcode-16.3.0.app/Contents/Developer/Platforms/iPhoneOS.platform/Developer/Library/Frameworks -iframework /Applications/Xcode-16.3.0.app/Contents/Developer/Platforms/iPhoneOS.platform/Developer/SDKs/iPhoneOS18.4.sdk/Developer/Library/Frameworks -filelist /Users/admin/builder/spi-builder-workspace/.derivedData/Build/Intermediates.noindex/llbuild.build/Debug-iphoneos/libllbuild.build/Objects-normal/arm64/libllbuild.LinkFileList -nostdlib -Xlinker -object_path_lto -Xlinker /Users/admin/builder/spi-builder-workspace/.derivedData/Build/Intermediates.noindex/llbuild.build/Debug-iphoneos/libllbuild.build/Objects-normal/arm64/libllbuild_lto.o -rdynamic -Xlinker -no_deduplicate -Xlinker -debug_variant -Xlinker -dependency_info -Xlinker /Users/admin/builder/spi-builder-workspace/.derivedData/Build/Intermediates.noindex/llbuild.build/Debug-iphoneos/libllbuild.build/Objects-normal/arm64/libllbuild_dependency_info.dat -o /Users/admin/builder/spi-builder-workspace/.derivedData/Build/Products/Debug-iphoneos/libllbuild.o
RegisterExecutionPolicyException /Users/admin/builder/spi-builder-workspace/.derivedData/Build/Products/Debug-iphoneos/libllbuild.o (in target 'libllbuild' from project 'llbuild')
cd /Users/admin/builder/spi-builder-workspace/.dependencies/checkouts/swift-llbuild
builtin-RegisterExecutionPolicyException /Users/admin/builder/spi-builder-workspace/.derivedData/Build/Products/Debug-iphoneos/libllbuild.o
SwiftCompile normal arm64 Compiling\ Files.swift /Users/admin/builder/spi-builder-workspace/.dependencies/checkouts/Files/Sources/Files.swift (in target 'Files' from project 'Files')
SwiftCompile normal arm64 /Users/admin/builder/spi-builder-workspace/.dependencies/checkouts/Files/Sources/Files.swift (in target 'Files' from project 'Files')
cd /Users/admin/builder/spi-builder-workspace/.swiftpm/xcode
SwiftEmitModule normal arm64 Emitting\ module\ for\ Files (in target 'Files' from project 'Files')
SwiftCompile normal arm64 /Users/admin/builder/spi-builder-workspace/.dependencies/checkouts/Files/Sources/Files.swift (in target 'Files' from project 'Files')
cd /Users/admin/builder/spi-builder-workspace/.swiftpm/xcode
SwiftDriverJobDiscovery normal arm64 Emitting module for TSCLibc (in target 'TSCLibc' from project 'swift-tools-support-core')
SwiftDriver\ Compilation\ Requirements TSCLibc normal arm64 com.apple.xcode.tools.swift.compiler (in target 'TSCLibc' from project 'swift-tools-support-core')
cd /Users/admin/builder/spi-builder-workspace/.swiftpm/xcode
builtin-Swift-Compilation-Requirements -- /Applications/Xcode-16.3.0.app/Contents/Developer/Toolchains/XcodeDefault.xctoolchain/usr/bin/swiftc -module-name TSCLibc -Onone -enforce-exclusivity\=checked @/Users/admin/builder/spi-builder-workspace/.derivedData/Build/Intermediates.noindex/swift-tools-support-core.build/Debug-iphoneos/TSCLibc.build/Objects-normal/arm64/TSCLibc.SwiftFileList -DSWIFT_PACKAGE -DDEBUG -DXcode -plugin-path /Applications/Xcode-16.3.0.app/Contents/Developer/Toolchains/XcodeDefault.xctoolchain/usr/lib/swift/host/plugins/testing -enable-experimental-feature DebugDescriptionMacro -sdk /Applications/Xcode-16.3.0.app/Contents/Developer/Platforms/iPhoneOS.platform/Developer/SDKs/iPhoneOS18.4.sdk -target arm64-apple-ios12.0 -g -module-cache-path /Users/admin/builder/spi-builder-workspace/.derivedData/ModuleCache.noindex -Xfrontend -serialize-debugging-options -profile-coverage-mapping -profile-generate -enable-testing -suppress-warnings -index-store-path /Users/admin/builder/spi-builder-workspace/.derivedData/Index.noindex/DataStore -swift-version 5 -I /Users/admin/builder/spi-builder-workspace/.derivedData/Build/Products/Debug-iphoneos -I /Applications/Xcode-16.3.0.app/Contents/Developer/Platforms/iPhoneOS.platform/Developer/usr/lib -F /Users/admin/builder/spi-builder-workspace/.derivedData/Build/Products/Debug-iphoneos -F /Applications/Xcode-16.3.0.app/Contents/Developer/Platforms/iPhoneOS.platform/Developer/Library/Frameworks -F /Applications/Xcode-16.3.0.app/Contents/Developer/Platforms/iPhoneOS.platform/Developer/SDKs/iPhoneOS18.4.sdk/Developer/Library/Frameworks -parse-as-library -c -j10 -enable-batch-mode -incremental -Xcc -ivfsstatcache -Xcc /Users/admin/builder/spi-builder-workspace/.derivedData/SDKStatCaches.noindex/iphoneos18.4-22E235-339d34bc69d7fc736c3220795c36f340.sdkstatcache -output-file-map /Users/admin/builder/spi-builder-workspace/.derivedData/Build/Intermediates.noindex/swift-tools-support-core.build/Debug-iphoneos/TSCLibc.build/Objects-normal/arm64/TSCLibc-OutputFileMap.json -use-frontend-parseable-output -save-temps -no-color-diagnostics -serialize-diagnostics -emit-dependencies -emit-module -emit-module-path /Users/admin/builder/spi-builder-workspace/.derivedData/Build/Intermediates.noindex/swift-tools-support-core.build/Debug-iphoneos/TSCLibc.build/Objects-normal/arm64/TSCLibc.swiftmodule -validate-clang-modules-once -clang-build-session-file /Users/admin/builder/spi-builder-workspace/.derivedData/ModuleCache.noindex/Session.modulevalidation -Xcc -I/Users/admin/builder/spi-builder-workspace/.derivedData/Build/Intermediates.noindex/swift-tools-support-core.build/Debug-iphoneos/TSCLibc.build/swift-overrides.hmap -emit-const-values -Xfrontend -const-gather-protocols-file -Xfrontend /Users/admin/builder/spi-builder-workspace/.derivedData/Build/Intermediates.noindex/swift-tools-support-core.build/Debug-iphoneos/TSCLibc.build/Objects-normal/arm64/TSCLibc_const_extract_protocols.json -Xcc -I/Users/admin/builder/spi-builder-workspace/.derivedData/Build/Products/Debug-iphoneos/include -Xcc -I/Users/admin/builder/spi-builder-workspace/.derivedData/Build/Intermediates.noindex/swift-tools-support-core.build/Debug-iphoneos/TSCLibc.build/DerivedSources-normal/arm64 -Xcc -I/Users/admin/builder/spi-builder-workspace/.derivedData/Build/Intermediates.noindex/swift-tools-support-core.build/Debug-iphoneos/TSCLibc.build/DerivedSources/arm64 -Xcc -I/Users/admin/builder/spi-builder-workspace/.derivedData/Build/Intermediates.noindex/swift-tools-support-core.build/Debug-iphoneos/TSCLibc.build/DerivedSources -Xcc -DSWIFT_PACKAGE -Xcc -DDEBUG\=1 -emit-objc-header -emit-objc-header-path /Users/admin/builder/spi-builder-workspace/.derivedData/Build/Intermediates.noindex/swift-tools-support-core.build/Debug-iphoneos/TSCLibc.build/Objects-normal/arm64/TSCLibc-Swift.h -working-directory /Users/admin/builder/spi-builder-workspace/.swiftpm/xcode -experimental-emit-module-separately -disable-cmo
Copy /Users/admin/builder/spi-builder-workspace/.derivedData/Build/Products/Debug-iphoneos/TSCLibc.swiftmodule/arm64-apple-ios.abi.json /Users/admin/builder/spi-builder-workspace/.derivedData/Build/Intermediates.noindex/swift-tools-support-core.build/Debug-iphoneos/TSCLibc.build/Objects-normal/arm64/TSCLibc.abi.json (in target 'TSCLibc' from project 'swift-tools-support-core')
cd /Users/admin/builder/spi-builder-workspace/.dependencies/checkouts/swift-tools-support-core
builtin-copy -exclude .DS_Store -exclude CVS -exclude .svn -exclude .git -exclude .hg -resolve-src-symlinks -rename /Users/admin/builder/spi-builder-workspace/.derivedData/Build/Intermediates.noindex/swift-tools-support-core.build/Debug-iphoneos/TSCLibc.build/Objects-normal/arm64/TSCLibc.abi.json /Users/admin/builder/spi-builder-workspace/.derivedData/Build/Products/Debug-iphoneos/TSCLibc.swiftmodule/arm64-apple-ios.abi.json
SwiftDriverJobDiscovery normal arm64 Compiling libc.swift (in target 'TSCLibc' from project 'swift-tools-support-core')
SwiftDriver\ Compilation TSCLibc normal arm64 com.apple.xcode.tools.swift.compiler (in target 'TSCLibc' from project 'swift-tools-support-core')
cd /Users/admin/builder/spi-builder-workspace/.swiftpm/xcode
builtin-Swift-Compilation -- /Applications/Xcode-16.3.0.app/Contents/Developer/Toolchains/XcodeDefault.xctoolchain/usr/bin/swiftc -module-name TSCLibc -Onone -enforce-exclusivity\=checked @/Users/admin/builder/spi-builder-workspace/.derivedData/Build/Intermediates.noindex/swift-tools-support-core.build/Debug-iphoneos/TSCLibc.build/Objects-normal/arm64/TSCLibc.SwiftFileList -DSWIFT_PACKAGE -DDEBUG -DXcode -plugin-path /Applications/Xcode-16.3.0.app/Contents/Developer/Toolchains/XcodeDefault.xctoolchain/usr/lib/swift/host/plugins/testing -enable-experimental-feature DebugDescriptionMacro -sdk /Applications/Xcode-16.3.0.app/Contents/Developer/Platforms/iPhoneOS.platform/Developer/SDKs/iPhoneOS18.4.sdk -target arm64-apple-ios12.0 -g -module-cache-path /Users/admin/builder/spi-builder-workspace/.derivedData/ModuleCache.noindex -Xfrontend -serialize-debugging-options -profile-coverage-mapping -profile-generate -enable-testing -suppress-warnings -index-store-path /Users/admin/builder/spi-builder-workspace/.derivedData/Index.noindex/DataStore -swift-version 5 -I /Users/admin/builder/spi-builder-workspace/.derivedData/Build/Products/Debug-iphoneos -I /Applications/Xcode-16.3.0.app/Contents/Developer/Platforms/iPhoneOS.platform/Developer/usr/lib -F /Users/admin/builder/spi-builder-workspace/.derivedData/Build/Products/Debug-iphoneos -F /Applications/Xcode-16.3.0.app/Contents/Developer/Platforms/iPhoneOS.platform/Developer/Library/Frameworks -F /Applications/Xcode-16.3.0.app/Contents/Developer/Platforms/iPhoneOS.platform/Developer/SDKs/iPhoneOS18.4.sdk/Developer/Library/Frameworks -parse-as-library -c -j10 -enable-batch-mode -incremental -Xcc -ivfsstatcache -Xcc /Users/admin/builder/spi-builder-workspace/.derivedData/SDKStatCaches.noindex/iphoneos18.4-22E235-339d34bc69d7fc736c3220795c36f340.sdkstatcache -output-file-map /Users/admin/builder/spi-builder-workspace/.derivedData/Build/Intermediates.noindex/swift-tools-support-core.build/Debug-iphoneos/TSCLibc.build/Objects-normal/arm64/TSCLibc-OutputFileMap.json -use-frontend-parseable-output -save-temps -no-color-diagnostics -serialize-diagnostics -emit-dependencies -emit-module -emit-module-path /Users/admin/builder/spi-builder-workspace/.derivedData/Build/Intermediates.noindex/swift-tools-support-core.build/Debug-iphoneos/TSCLibc.build/Objects-normal/arm64/TSCLibc.swiftmodule -validate-clang-modules-once -clang-build-session-file /Users/admin/builder/spi-builder-workspace/.derivedData/ModuleCache.noindex/Session.modulevalidation -Xcc -I/Users/admin/builder/spi-builder-workspace/.derivedData/Build/Intermediates.noindex/swift-tools-support-core.build/Debug-iphoneos/TSCLibc.build/swift-overrides.hmap -emit-const-values -Xfrontend -const-gather-protocols-file -Xfrontend /Users/admin/builder/spi-builder-workspace/.derivedData/Build/Intermediates.noindex/swift-tools-support-core.build/Debug-iphoneos/TSCLibc.build/Objects-normal/arm64/TSCLibc_const_extract_protocols.json -Xcc -I/Users/admin/builder/spi-builder-workspace/.derivedData/Build/Products/Debug-iphoneos/include -Xcc -I/Users/admin/builder/spi-builder-workspace/.derivedData/Build/Intermediates.noindex/swift-tools-support-core.build/Debug-iphoneos/TSCLibc.build/DerivedSources-normal/arm64 -Xcc -I/Users/admin/builder/spi-builder-workspace/.derivedData/Build/Intermediates.noindex/swift-tools-support-core.build/Debug-iphoneos/TSCLibc.build/DerivedSources/arm64 -Xcc -I/Users/admin/builder/spi-builder-workspace/.derivedData/Build/Intermediates.noindex/swift-tools-support-core.build/Debug-iphoneos/TSCLibc.build/DerivedSources -Xcc -DSWIFT_PACKAGE -Xcc -DDEBUG\=1 -emit-objc-header -emit-objc-header-path /Users/admin/builder/spi-builder-workspace/.derivedData/Build/Intermediates.noindex/swift-tools-support-core.build/Debug-iphoneos/TSCLibc.build/Objects-normal/arm64/TSCLibc-Swift.h -working-directory /Users/admin/builder/spi-builder-workspace/.swiftpm/xcode -experimental-emit-module-separately -disable-cmo
SwiftDriver TSCBasic normal arm64 com.apple.xcode.tools.swift.compiler (in target 'TSCBasic' from project 'swift-tools-support-core')
cd /Users/admin/builder/spi-builder-workspace/.swiftpm/xcode
builtin-SwiftDriver -- /Applications/Xcode-16.3.0.app/Contents/Developer/Toolchains/XcodeDefault.xctoolchain/usr/bin/swiftc -module-name TSCBasic -Onone -enforce-exclusivity\=checked @/Users/admin/builder/spi-builder-workspace/.derivedData/Build/Intermediates.noindex/swift-tools-support-core.build/Debug-iphoneos/TSCBasic.build/Objects-normal/arm64/TSCBasic.SwiftFileList -DSWIFT_PACKAGE -DDEBUG -DXcode -plugin-path /Applications/Xcode-16.3.0.app/Contents/Developer/Toolchains/XcodeDefault.xctoolchain/usr/lib/swift/host/plugins/testing -enable-experimental-feature DebugDescriptionMacro -sdk /Applications/Xcode-16.3.0.app/Contents/Developer/Platforms/iPhoneOS.platform/Developer/SDKs/iPhoneOS18.4.sdk -target arm64-apple-ios12.0 -g -module-cache-path /Users/admin/builder/spi-builder-workspace/.derivedData/ModuleCache.noindex -Xfrontend -serialize-debugging-options -profile-coverage-mapping -profile-generate -enable-testing -suppress-warnings -index-store-path /Users/admin/builder/spi-builder-workspace/.derivedData/Index.noindex/DataStore -swift-version 5 -I /Users/admin/builder/spi-builder-workspace/.derivedData/Build/Products/Debug-iphoneos -I /Applications/Xcode-16.3.0.app/Contents/Developer/Platforms/iPhoneOS.platform/Developer/usr/lib -F /Users/admin/builder/spi-builder-workspace/.derivedData/Build/Products/Debug-iphoneos/PackageFrameworks -F /Users/admin/builder/spi-builder-workspace/.derivedData/Build/Products/Debug-iphoneos/PackageFrameworks -F /Users/admin/builder/spi-builder-workspace/.derivedData/Build/Products/Debug-iphoneos -F /Applications/Xcode-16.3.0.app/Contents/Developer/Platforms/iPhoneOS.platform/Developer/Library/Frameworks -F /Applications/Xcode-16.3.0.app/Contents/Developer/Platforms/iPhoneOS.platform/Developer/SDKs/iPhoneOS18.4.sdk/Developer/Library/Frameworks -c -j10 -enable-batch-mode -incremental -Xcc -ivfsstatcache -Xcc /Users/admin/builder/spi-builder-workspace/.derivedData/SDKStatCaches.noindex/iphoneos18.4-22E235-339d34bc69d7fc736c3220795c36f340.sdkstatcache -output-file-map /Users/admin/builder/spi-builder-workspace/.derivedData/Build/Intermediates.noindex/swift-tools-support-core.build/Debug-iphoneos/TSCBasic.build/Objects-normal/arm64/TSCBasic-OutputFileMap.json -use-frontend-parseable-output -save-temps -no-color-diagnostics -serialize-diagnostics -emit-dependencies -emit-module -emit-module-path /Users/admin/builder/spi-builder-workspace/.derivedData/Build/Intermediates.noindex/swift-tools-support-core.build/Debug-iphoneos/TSCBasic.build/Objects-normal/arm64/TSCBasic.swiftmodule -validate-clang-modules-once -clang-build-session-file /Users/admin/builder/spi-builder-workspace/.derivedData/ModuleCache.noindex/Session.modulevalidation -Xcc -I/Users/admin/builder/spi-builder-workspace/.derivedData/Build/Intermediates.noindex/swift-tools-support-core.build/Debug-iphoneos/TSCBasic.build/swift-overrides.hmap -emit-const-values -Xfrontend -const-gather-protocols-file -Xfrontend /Users/admin/builder/spi-builder-workspace/.derivedData/Build/Intermediates.noindex/swift-tools-support-core.build/Debug-iphoneos/TSCBasic.build/Objects-normal/arm64/TSCBasic_const_extract_protocols.json -Xcc -I/Users/admin/builder/spi-builder-workspace/.dependencies/checkouts/swift-tools-support-core/Sources/TSCclibc/include -Xcc -I/Users/admin/builder/spi-builder-workspace/.derivedData/Build/Products/Debug-iphoneos/include -Xcc -I/Users/admin/builder/spi-builder-workspace/.derivedData/Build/Intermediates.noindex/swift-tools-support-core.build/Debug-iphoneos/TSCBasic.build/DerivedSources-normal/arm64 -Xcc -I/Users/admin/builder/spi-builder-workspace/.derivedData/Build/Intermediates.noindex/swift-tools-support-core.build/Debug-iphoneos/TSCBasic.build/DerivedSources/arm64 -Xcc -I/Users/admin/builder/spi-builder-workspace/.derivedData/Build/Intermediates.noindex/swift-tools-support-core.build/Debug-iphoneos/TSCBasic.build/DerivedSources -Xcc -DSWIFT_PACKAGE -Xcc -DDEBUG\=1 -emit-objc-header -emit-objc-header-path /Users/admin/builder/spi-builder-workspace/.derivedData/Build/Intermediates.noindex/swift-tools-support-core.build/Debug-iphoneos/TSCBasic.build/Objects-normal/arm64/TSCBasic-Swift.h -working-directory /Users/admin/builder/spi-builder-workspace/.swiftpm/xcode -experimental-emit-module-separately -disable-cmo
SwiftCompile normal arm64 Compiling\ BuildDBBindings.swift /Users/admin/builder/spi-builder-workspace/.dependencies/checkouts/swift-llbuild/products/llbuildSwift/BuildDBBindings.swift (in target 'llbuildSwift' from project 'llbuild')
SwiftCompile normal arm64 /Users/admin/builder/spi-builder-workspace/.dependencies/checkouts/swift-llbuild/products/llbuildSwift/BuildDBBindings.swift (in target 'llbuildSwift' from project 'llbuild')
cd /Users/admin/builder/spi-builder-workspace/.swiftpm/xcode
SwiftCompile normal arm64 Compiling\ BuildSystemBindings.swift /Users/admin/builder/spi-builder-workspace/.dependencies/checkouts/swift-llbuild/products/llbuildSwift/BuildSystemBindings.swift (in target 'llbuildSwift' from project 'llbuild')
SwiftCompile normal arm64 /Users/admin/builder/spi-builder-workspace/.dependencies/checkouts/swift-llbuild/products/llbuildSwift/BuildSystemBindings.swift (in target 'llbuildSwift' from project 'llbuild')
cd /Users/admin/builder/spi-builder-workspace/.swiftpm/xcode
SwiftEmitModule normal arm64 Emitting\ module\ for\ llbuildSwift (in target 'llbuildSwift' from project 'llbuild')
EmitSwiftModule normal arm64 (in target 'llbuildSwift' from project 'llbuild')
cd /Users/admin/builder/spi-builder-workspace/.swiftpm/xcode
SwiftCompile normal arm64 Compiling\ BuildValue.swift /Users/admin/builder/spi-builder-workspace/.dependencies/checkouts/swift-llbuild/products/llbuildSwift/BuildValue.swift (in target 'llbuildSwift' from project 'llbuild')
SwiftCompile normal arm64 /Users/admin/builder/spi-builder-workspace/.dependencies/checkouts/swift-llbuild/products/llbuildSwift/BuildValue.swift (in target 'llbuildSwift' from project 'llbuild')
cd /Users/admin/builder/spi-builder-workspace/.swiftpm/xcode
SwiftCompile normal arm64 Compiling\ Internals.swift /Users/admin/builder/spi-builder-workspace/.dependencies/checkouts/swift-llbuild/products/llbuildSwift/Internals.swift (in target 'llbuildSwift' from project 'llbuild')
SwiftCompile normal arm64 /Users/admin/builder/spi-builder-workspace/.dependencies/checkouts/swift-llbuild/products/llbuildSwift/Internals.swift (in target 'llbuildSwift' from project 'llbuild')
cd /Users/admin/builder/spi-builder-workspace/.swiftpm/xcode
SwiftCompile normal arm64 Compiling\ BuildKey.swift /Users/admin/builder/spi-builder-workspace/.dependencies/checkouts/swift-llbuild/products/llbuildSwift/BuildKey.swift (in target 'llbuildSwift' from project 'llbuild')
SwiftCompile normal arm64 /Users/admin/builder/spi-builder-workspace/.dependencies/checkouts/swift-llbuild/products/llbuildSwift/BuildKey.swift (in target 'llbuildSwift' from project 'llbuild')
cd /Users/admin/builder/spi-builder-workspace/.swiftpm/xcode
SwiftDriverJobDiscovery normal arm64 Emitting module for Files (in target 'Files' from project 'Files')
SwiftCompile normal arm64 Compiling\ CoreBindings.swift /Users/admin/builder/spi-builder-workspace/.dependencies/checkouts/swift-llbuild/products/llbuildSwift/CoreBindings.swift (in target 'llbuildSwift' from project 'llbuild')
SwiftCompile normal arm64 /Users/admin/builder/spi-builder-workspace/.dependencies/checkouts/swift-llbuild/products/llbuildSwift/CoreBindings.swift (in target 'llbuildSwift' from project 'llbuild')
cd /Users/admin/builder/spi-builder-workspace/.swiftpm/xcode
SwiftEmitModule normal arm64 Emitting\ module\ for\ Yams (in target 'Yams' from project 'Yams')
EmitSwiftModule normal arm64 (in target 'Yams' from project 'Yams')
cd /Users/admin/builder/spi-builder-workspace/.swiftpm/xcode
SwiftDriver\ Compilation\ Requirements Files normal arm64 com.apple.xcode.tools.swift.compiler (in target 'Files' from project 'Files')
cd /Users/admin/builder/spi-builder-workspace/.swiftpm/xcode
builtin-Swift-Compilation-Requirements -- /Applications/Xcode-16.3.0.app/Contents/Developer/Toolchains/XcodeDefault.xctoolchain/usr/bin/swiftc -module-name Files -Onone -enforce-exclusivity\=checked @/Users/admin/builder/spi-builder-workspace/.derivedData/Build/Intermediates.noindex/Files.build/Debug-iphoneos/Files.build/Objects-normal/arm64/Files.SwiftFileList -DSWIFT_PACKAGE -DDEBUG -DXcode -plugin-path /Applications/Xcode-16.3.0.app/Contents/Developer/Toolchains/XcodeDefault.xctoolchain/usr/lib/swift/host/plugins/testing -enable-experimental-feature DebugDescriptionMacro -sdk /Applications/Xcode-16.3.0.app/Contents/Developer/Platforms/iPhoneOS.platform/Developer/SDKs/iPhoneOS18.4.sdk -target arm64-apple-ios12.0 -g -module-cache-path /Users/admin/builder/spi-builder-workspace/.derivedData/ModuleCache.noindex -Xfrontend -serialize-debugging-options -profile-coverage-mapping -profile-generate -enable-testing -suppress-warnings -index-store-path /Users/admin/builder/spi-builder-workspace/.derivedData/Index.noindex/DataStore -swift-version 5 -I /Users/admin/builder/spi-builder-workspace/.derivedData/Build/Products/Debug-iphoneos -I /Applications/Xcode-16.3.0.app/Contents/Developer/Platforms/iPhoneOS.platform/Developer/usr/lib -F /Users/admin/builder/spi-builder-workspace/.derivedData/Build/Products/Debug-iphoneos -F /Applications/Xcode-16.3.0.app/Contents/Developer/Platforms/iPhoneOS.platform/Developer/Library/Frameworks -F /Applications/Xcode-16.3.0.app/Contents/Developer/Platforms/iPhoneOS.platform/Developer/SDKs/iPhoneOS18.4.sdk/Developer/Library/Frameworks -parse-as-library -c -j10 -enable-batch-mode -incremental -Xcc -ivfsstatcache -Xcc /Users/admin/builder/spi-builder-workspace/.derivedData/SDKStatCaches.noindex/iphoneos18.4-22E235-339d34bc69d7fc736c3220795c36f340.sdkstatcache -output-file-map /Users/admin/builder/spi-builder-workspace/.derivedData/Build/Intermediates.noindex/Files.build/Debug-iphoneos/Files.build/Objects-normal/arm64/Files-OutputFileMap.json -use-frontend-parseable-output -save-temps -no-color-diagnostics -serialize-diagnostics -emit-dependencies -emit-module -emit-module-path /Users/admin/builder/spi-builder-workspace/.derivedData/Build/Intermediates.noindex/Files.build/Debug-iphoneos/Files.build/Objects-normal/arm64/Files.swiftmodule -validate-clang-modules-once -clang-build-session-file /Users/admin/builder/spi-builder-workspace/.derivedData/ModuleCache.noindex/Session.modulevalidation -Xcc -I/Users/admin/builder/spi-builder-workspace/.derivedData/Build/Intermediates.noindex/Files.build/Debug-iphoneos/Files.build/swift-overrides.hmap -emit-const-values -Xfrontend -const-gather-protocols-file -Xfrontend /Users/admin/builder/spi-builder-workspace/.derivedData/Build/Intermediates.noindex/Files.build/Debug-iphoneos/Files.build/Objects-normal/arm64/Files_const_extract_protocols.json -Xcc -I/Users/admin/builder/spi-builder-workspace/.derivedData/Build/Products/Debug-iphoneos/include -Xcc -I/Users/admin/builder/spi-builder-workspace/.derivedData/Build/Intermediates.noindex/Files.build/Debug-iphoneos/Files.build/DerivedSources-normal/arm64 -Xcc -I/Users/admin/builder/spi-builder-workspace/.derivedData/Build/Intermediates.noindex/Files.build/Debug-iphoneos/Files.build/DerivedSources/arm64 -Xcc -I/Users/admin/builder/spi-builder-workspace/.derivedData/Build/Intermediates.noindex/Files.build/Debug-iphoneos/Files.build/DerivedSources -Xcc -DSWIFT_PACKAGE -Xcc -DDEBUG\=1 -emit-objc-header -emit-objc-header-path /Users/admin/builder/spi-builder-workspace/.derivedData/Build/Intermediates.noindex/Files.build/Debug-iphoneos/Files.build/Objects-normal/arm64/Files-Swift.h -working-directory /Users/admin/builder/spi-builder-workspace/.swiftpm/xcode -experimental-emit-module-separately -disable-cmo
SwiftEmitModule normal arm64 Emitting\ module\ for\ ArgumentParser (in target 'ArgumentParser' from project 'swift-argument-parser')
EmitSwiftModule normal arm64 (in target 'ArgumentParser' from project 'swift-argument-parser')
cd /Users/admin/builder/spi-builder-workspace/.swiftpm/xcode
SwiftEmitModule normal arm64 Emitting\ module\ for\ TSCBasic (in target 'TSCBasic' from project 'swift-tools-support-core')
EmitSwiftModule normal arm64 (in target 'TSCBasic' from project 'swift-tools-support-core')
cd /Users/admin/builder/spi-builder-workspace/.swiftpm/xcode
SwiftDriverJobDiscovery normal arm64 Compiling BuildSystemBindings.swift (in target 'llbuildSwift' from project 'llbuild')
Copy /Users/admin/builder/spi-builder-workspace/.derivedData/Build/Products/Debug-iphoneos/Files.swiftmodule/arm64-apple-ios.abi.json /Users/admin/builder/spi-builder-workspace/.derivedData/Build/Intermediates.noindex/Files.build/Debug-iphoneos/Files.build/Objects-normal/arm64/Files.abi.json (in target 'Files' from project 'Files')
cd /Users/admin/builder/spi-builder-workspace/.dependencies/checkouts/Files
builtin-copy -exclude .DS_Store -exclude CVS -exclude .svn -exclude .git -exclude .hg -resolve-src-symlinks -rename /Users/admin/builder/spi-builder-workspace/.derivedData/Build/Intermediates.noindex/Files.build/Debug-iphoneos/Files.build/Objects-normal/arm64/Files.abi.json /Users/admin/builder/spi-builder-workspace/.derivedData/Build/Products/Debug-iphoneos/Files.swiftmodule/arm64-apple-ios.abi.json
SwiftDriverJobDiscovery normal arm64 Compiling Internals.swift (in target 'llbuildSwift' from project 'llbuild')
SwiftCompile normal arm64 Compiling\ Node.swift,\ Parser.swift /Users/admin/builder/spi-builder-workspace/.dependencies/checkouts/Yams/Sources/Yams/Node.swift /Users/admin/builder/spi-builder-workspace/.dependencies/checkouts/Yams/Sources/Yams/Parser.swift (in target 'Yams' from project 'Yams')
SwiftCompile normal arm64 /Users/admin/builder/spi-builder-workspace/.dependencies/checkouts/Yams/Sources/Yams/Node.swift (in target 'Yams' from project 'Yams')
cd /Users/admin/builder/spi-builder-workspace/.swiftpm/xcode
SwiftCompile normal arm64 /Users/admin/builder/spi-builder-workspace/.dependencies/checkouts/Yams/Sources/Yams/Parser.swift (in target 'Yams' from project 'Yams')
cd /Users/admin/builder/spi-builder-workspace/.swiftpm/xcode
SwiftCompile normal arm64 Compiling\ Emitter.swift,\ Encoder.swift /Users/admin/builder/spi-builder-workspace/.dependencies/checkouts/Yams/Sources/Yams/Emitter.swift /Users/admin/builder/spi-builder-workspace/.dependencies/checkouts/Yams/Sources/Yams/Encoder.swift (in target 'Yams' from project 'Yams')
SwiftCompile normal arm64 /Users/admin/builder/spi-builder-workspace/.dependencies/checkouts/Yams/Sources/Yams/Emitter.swift (in target 'Yams' from project 'Yams')
cd /Users/admin/builder/spi-builder-workspace/.swiftpm/xcode
SwiftCompile normal arm64 /Users/admin/builder/spi-builder-workspace/.dependencies/checkouts/Yams/Sources/Yams/Encoder.swift (in target 'Yams' from project 'Yams')
cd /Users/admin/builder/spi-builder-workspace/.swiftpm/xcode
SwiftDriverJobDiscovery normal arm64 Emitting module for llbuildSwift (in target 'llbuildSwift' from project 'llbuild')
SwiftDriver\ Compilation\ Requirements llbuildSwift normal arm64 com.apple.xcode.tools.swift.compiler (in target 'llbuildSwift' from project 'llbuild')
cd /Users/admin/builder/spi-builder-workspace/.swiftpm/xcode
builtin-Swift-Compilation-Requirements -- /Applications/Xcode-16.3.0.app/Contents/Developer/Toolchains/XcodeDefault.xctoolchain/usr/bin/swiftc -module-name llbuildSwift -Onone -enforce-exclusivity\=checked @/Users/admin/builder/spi-builder-workspace/.derivedData/Build/Intermediates.noindex/llbuild.build/Debug-iphoneos/llbuildSwift.build/Objects-normal/arm64/llbuildSwift.SwiftFileList -DSWIFT_PACKAGE -DDEBUG -Xcc -fmodule-map-file\=/Users/admin/builder/spi-builder-workspace/.derivedData/Build/Intermediates.noindex/GeneratedModuleMaps-iphoneos/llbuildBuildSystem.modulemap -Xcc -fmodule-map-file\=/Users/admin/builder/spi-builder-workspace/.derivedData/Build/Intermediates.noindex/GeneratedModuleMaps-iphoneos/llbuildCore.modulemap -Xcc -fmodule-map-file\=/Users/admin/builder/spi-builder-workspace/.derivedData/Build/Intermediates.noindex/GeneratedModuleMaps-iphoneos/llbuildBasic.modulemap -Xcc -fmodule-map-file\=/Users/admin/builder/spi-builder-workspace/.derivedData/Build/Intermediates.noindex/GeneratedModuleMaps-iphoneos/llvmSupport.modulemap -Xcc -fmodule-map-file\=/Users/admin/builder/spi-builder-workspace/.derivedData/Build/Intermediates.noindex/GeneratedModuleMaps-iphoneos/llvmDemangle.modulemap -DXcode -plugin-path /Applications/Xcode-16.3.0.app/Contents/Developer/Toolchains/XcodeDefault.xctoolchain/usr/lib/swift/host/plugins/testing -enable-experimental-feature DebugDescriptionMacro -sdk /Applications/Xcode-16.3.0.app/Contents/Developer/Platforms/iPhoneOS.platform/Developer/SDKs/iPhoneOS18.4.sdk -target arm64-apple-ios12.0 -g -module-cache-path /Users/admin/builder/spi-builder-workspace/.derivedData/ModuleCache.noindex -Xfrontend -serialize-debugging-options -profile-coverage-mapping -profile-generate -enable-testing -suppress-warnings -index-store-path /Users/admin/builder/spi-builder-workspace/.derivedData/Index.noindex/DataStore -swift-version 5 -I /Users/admin/builder/spi-builder-workspace/.derivedData/Build/Products/Debug-iphoneos -I /Applications/Xcode-16.3.0.app/Contents/Developer/Platforms/iPhoneOS.platform/Developer/usr/lib -F /Users/admin/builder/spi-builder-workspace/.derivedData/Build/Products/Debug-iphoneos/PackageFrameworks -F /Users/admin/builder/spi-builder-workspace/.derivedData/Build/Products/Debug-iphoneos/PackageFrameworks -F /Users/admin/builder/spi-builder-workspace/.derivedData/Build/Products/Debug-iphoneos/PackageFrameworks -F /Users/admin/builder/spi-builder-workspace/.derivedData/Build/Products/Debug-iphoneos/PackageFrameworks -F /Users/admin/builder/spi-builder-workspace/.derivedData/Build/Products/Debug-iphoneos/PackageFrameworks -F /Users/admin/builder/spi-builder-workspace/.derivedData/Build/Products/Debug-iphoneos/PackageFrameworks -F /Users/admin/builder/spi-builder-workspace/.derivedData/Build/Products/Debug-iphoneos -F /Applications/Xcode-16.3.0.app/Contents/Developer/Platforms/iPhoneOS.platform/Developer/Library/Frameworks -F /Applications/Xcode-16.3.0.app/Contents/Developer/Platforms/iPhoneOS.platform/Developer/SDKs/iPhoneOS18.4.sdk/Developer/Library/Frameworks -c -j10 -enable-batch-mode -incremental -Xcc -ivfsstatcache -Xcc /Users/admin/builder/spi-builder-workspace/.derivedData/SDKStatCaches.noindex/iphoneos18.4-22E235-339d34bc69d7fc736c3220795c36f340.sdkstatcache -output-file-map /Users/admin/builder/spi-builder-workspace/.derivedData/Build/Intermediates.noindex/llbuild.build/Debug-iphoneos/llbuildSwift.build/Objects-normal/arm64/llbuildSwift-OutputFileMap.json -use-frontend-parseable-output -save-temps -no-color-diagnostics -serialize-diagnostics -emit-dependencies -emit-module -emit-module-path /Users/admin/builder/spi-builder-workspace/.derivedData/Build/Intermediates.noindex/llbuild.build/Debug-iphoneos/llbuildSwift.build/Objects-normal/arm64/llbuildSwift.swiftmodule -validate-clang-modules-once -clang-build-session-file /Users/admin/builder/spi-builder-workspace/.derivedData/ModuleCache.noindex/Session.modulevalidation -Xcc -I/Users/admin/builder/spi-builder-workspace/.derivedData/Build/Intermediates.noindex/llbuild.build/Debug-iphoneos/llbuildSwift.build/swift-overrides.hmap -emit-const-values -Xfrontend -const-gather-protocols-file -Xfrontend /Users/admin/builder/spi-builder-workspace/.derivedData/Build/Intermediates.noindex/llbuild.build/Debug-iphoneos/llbuildSwift.build/Objects-normal/arm64/llbuildSwift_const_extract_protocols.json -Xcc -I/Users/admin/builder/spi-builder-workspace/.dependencies/checkouts/swift-llbuild/products/libllbuild/include -Xcc -I/Users/admin/builder/spi-builder-workspace/.dependencies/checkouts/swift-llbuild/lib/BuildSystem/include -Xcc -I/Users/admin/builder/spi-builder-workspace/.dependencies/checkouts/swift-llbuild/lib/Core/include -Xcc -I/Users/admin/builder/spi-builder-workspace/.dependencies/checkouts/swift-llbuild/lib/Basic/include -Xcc -I/Users/admin/builder/spi-builder-workspace/.dependencies/checkouts/swift-llbuild/lib/llvm/Support/include -Xcc -I/Users/admin/builder/spi-builder-workspace/.dependencies/checkouts/swift-llbuild/lib/llvm/Demangle/include -Xcc -I/Users/admin/builder/spi-builder-workspace/.derivedData/Build/Products/Debug-iphoneos/include -Xcc -I/Users/admin/builder/spi-builder-workspace/.derivedData/Build/Intermediates.noindex/llbuild.build/Debug-iphoneos/llbuildSwift.build/DerivedSources-normal/arm64 -Xcc -I/Users/admin/builder/spi-builder-workspace/.derivedData/Build/Intermediates.noindex/llbuild.build/Debug-iphoneos/llbuildSwift.build/DerivedSources/arm64 -Xcc -I/Users/admin/builder/spi-builder-workspace/.derivedData/Build/Intermediates.noindex/llbuild.build/Debug-iphoneos/llbuildSwift.build/DerivedSources -Xcc -DSWIFT_PACKAGE -Xcc -DDEBUG\=1 -emit-objc-header -emit-objc-header-path /Users/admin/builder/spi-builder-workspace/.derivedData/Build/Intermediates.noindex/llbuild.build/Debug-iphoneos/llbuildSwift.build/Objects-normal/arm64/llbuildSwift-Swift.h -working-directory /Users/admin/builder/spi-builder-workspace/.swiftpm/xcode -experimental-emit-module-separately -disable-cmo
SwiftDriverJobDiscovery normal arm64 Compiling BuildValue.swift (in target 'llbuildSwift' from project 'llbuild')
SwiftCompile normal arm64 Compiling\ String+Yams.swift /Users/admin/builder/spi-builder-workspace/.dependencies/checkouts/Yams/Sources/Yams/String+Yams.swift (in target 'Yams' from project 'Yams')
SwiftCompile normal arm64 /Users/admin/builder/spi-builder-workspace/.dependencies/checkouts/Yams/Sources/Yams/String+Yams.swift (in target 'Yams' from project 'Yams')
cd /Users/admin/builder/spi-builder-workspace/.swiftpm/xcode
Copy /Users/admin/builder/spi-builder-workspace/.derivedData/Build/Products/Debug-iphoneos/llbuildSwift.swiftmodule/arm64-apple-ios.abi.json /Users/admin/builder/spi-builder-workspace/.derivedData/Build/Intermediates.noindex/llbuild.build/Debug-iphoneos/llbuildSwift.build/Objects-normal/arm64/llbuildSwift.abi.json (in target 'llbuildSwift' from project 'llbuild')
cd /Users/admin/builder/spi-builder-workspace/.dependencies/checkouts/swift-llbuild
builtin-copy -exclude .DS_Store -exclude CVS -exclude .svn -exclude .git -exclude .hg -resolve-src-symlinks -rename /Users/admin/builder/spi-builder-workspace/.derivedData/Build/Intermediates.noindex/llbuild.build/Debug-iphoneos/llbuildSwift.build/Objects-normal/arm64/llbuildSwift.abi.json /Users/admin/builder/spi-builder-workspace/.derivedData/Build/Products/Debug-iphoneos/llbuildSwift.swiftmodule/arm64-apple-ios.abi.json
SwiftDriverJobDiscovery normal arm64 Compiling BuildKey.swift (in target 'llbuildSwift' from project 'llbuild')
SwiftCompile normal arm64 Compiling\ Tag.swift /Users/admin/builder/spi-builder-workspace/.dependencies/checkouts/Yams/Sources/Yams/Tag.swift (in target 'Yams' from project 'Yams')
SwiftCompile normal arm64 /Users/admin/builder/spi-builder-workspace/.dependencies/checkouts/Yams/Sources/Yams/Tag.swift (in target 'Yams' from project 'Yams')
cd /Users/admin/builder/spi-builder-workspace/.swiftpm/xcode
SwiftCompile normal arm64 Compiling\ Constructor.swift,\ Decoder.swift /Users/admin/builder/spi-builder-workspace/.dependencies/checkouts/Yams/Sources/Yams/Constructor.swift /Users/admin/builder/spi-builder-workspace/.dependencies/checkouts/Yams/Sources/Yams/Decoder.swift (in target 'Yams' from project 'Yams')
SwiftCompile normal arm64 /Users/admin/builder/spi-builder-workspace/.dependencies/checkouts/Yams/Sources/Yams/Constructor.swift (in target 'Yams' from project 'Yams')
cd /Users/admin/builder/spi-builder-workspace/.swiftpm/xcode
SwiftCompile normal arm64 /Users/admin/builder/spi-builder-workspace/.dependencies/checkouts/Yams/Sources/Yams/Decoder.swift (in target 'Yams' from project 'Yams')
cd /Users/admin/builder/spi-builder-workspace/.swiftpm/xcode
SwiftDriverJobDiscovery normal arm64 Compiling CoreBindings.swift (in target 'llbuildSwift' from project 'llbuild')
SwiftCompile normal arm64 Compiling\ Node.Scalar.swift,\ Node.Sequence.swift /Users/admin/builder/spi-builder-workspace/.dependencies/checkouts/Yams/Sources/Yams/Node.Scalar.swift /Users/admin/builder/spi-builder-workspace/.dependencies/checkouts/Yams/Sources/Yams/Node.Sequence.swift (in target 'Yams' from project 'Yams')
SwiftCompile normal arm64 /Users/admin/builder/spi-builder-workspace/.dependencies/checkouts/Yams/Sources/Yams/Node.Scalar.swift (in target 'Yams' from project 'Yams')
cd /Users/admin/builder/spi-builder-workspace/.swiftpm/xcode
SwiftCompile normal arm64 /Users/admin/builder/spi-builder-workspace/.dependencies/checkouts/Yams/Sources/Yams/Node.Sequence.swift (in target 'Yams' from project 'Yams')
cd /Users/admin/builder/spi-builder-workspace/.swiftpm/xcode
SwiftDriverJobDiscovery normal arm64 Compiling Files.swift (in target 'Files' from project 'Files')
SwiftCompile normal arm64 Compiling\ Representer.swift /Users/admin/builder/spi-builder-workspace/.dependencies/checkouts/Yams/Sources/Yams/Representer.swift (in target 'Yams' from project 'Yams')
SwiftCompile normal arm64 /Users/admin/builder/spi-builder-workspace/.dependencies/checkouts/Yams/Sources/Yams/Representer.swift (in target 'Yams' from project 'Yams')
cd /Users/admin/builder/spi-builder-workspace/.swiftpm/xcode
SwiftDriverJobDiscovery normal arm64 Compiling BuildDBBindings.swift (in target 'llbuildSwift' from project 'llbuild')
SwiftDriver\ Compilation llbuildSwift normal arm64 com.apple.xcode.tools.swift.compiler (in target 'llbuildSwift' from project 'llbuild')
cd /Users/admin/builder/spi-builder-workspace/.swiftpm/xcode
builtin-Swift-Compilation -- /Applications/Xcode-16.3.0.app/Contents/Developer/Toolchains/XcodeDefault.xctoolchain/usr/bin/swiftc -module-name llbuildSwift -Onone -enforce-exclusivity\=checked @/Users/admin/builder/spi-builder-workspace/.derivedData/Build/Intermediates.noindex/llbuild.build/Debug-iphoneos/llbuildSwift.build/Objects-normal/arm64/llbuildSwift.SwiftFileList -DSWIFT_PACKAGE -DDEBUG -Xcc -fmodule-map-file\=/Users/admin/builder/spi-builder-workspace/.derivedData/Build/Intermediates.noindex/GeneratedModuleMaps-iphoneos/llbuildBuildSystem.modulemap -Xcc -fmodule-map-file\=/Users/admin/builder/spi-builder-workspace/.derivedData/Build/Intermediates.noindex/GeneratedModuleMaps-iphoneos/llbuildCore.modulemap -Xcc -fmodule-map-file\=/Users/admin/builder/spi-builder-workspace/.derivedData/Build/Intermediates.noindex/GeneratedModuleMaps-iphoneos/llbuildBasic.modulemap -Xcc -fmodule-map-file\=/Users/admin/builder/spi-builder-workspace/.derivedData/Build/Intermediates.noindex/GeneratedModuleMaps-iphoneos/llvmSupport.modulemap -Xcc -fmodule-map-file\=/Users/admin/builder/spi-builder-workspace/.derivedData/Build/Intermediates.noindex/GeneratedModuleMaps-iphoneos/llvmDemangle.modulemap -DXcode -plugin-path /Applications/Xcode-16.3.0.app/Contents/Developer/Toolchains/XcodeDefault.xctoolchain/usr/lib/swift/host/plugins/testing -enable-experimental-feature DebugDescriptionMacro -sdk /Applications/Xcode-16.3.0.app/Contents/Developer/Platforms/iPhoneOS.platform/Developer/SDKs/iPhoneOS18.4.sdk -target arm64-apple-ios12.0 -g -module-cache-path /Users/admin/builder/spi-builder-workspace/.derivedData/ModuleCache.noindex -Xfrontend -serialize-debugging-options -profile-coverage-mapping -profile-generate -enable-testing -suppress-warnings -index-store-path /Users/admin/builder/spi-builder-workspace/.derivedData/Index.noindex/DataStore -swift-version 5 -I /Users/admin/builder/spi-builder-workspace/.derivedData/Build/Products/Debug-iphoneos -I /Applications/Xcode-16.3.0.app/Contents/Developer/Platforms/iPhoneOS.platform/Developer/usr/lib -F /Users/admin/builder/spi-builder-workspace/.derivedData/Build/Products/Debug-iphoneos/PackageFrameworks -F /Users/admin/builder/spi-builder-workspace/.derivedData/Build/Products/Debug-iphoneos/PackageFrameworks -F /Users/admin/builder/spi-builder-workspace/.derivedData/Build/Products/Debug-iphoneos/PackageFrameworks -F /Users/admin/builder/spi-builder-workspace/.derivedData/Build/Products/Debug-iphoneos/PackageFrameworks -F /Users/admin/builder/spi-builder-workspace/.derivedData/Build/Products/Debug-iphoneos/PackageFrameworks -F /Users/admin/builder/spi-builder-workspace/.derivedData/Build/Products/Debug-iphoneos/PackageFrameworks -F /Users/admin/builder/spi-builder-workspace/.derivedData/Build/Products/Debug-iphoneos -F /Applications/Xcode-16.3.0.app/Contents/Developer/Platforms/iPhoneOS.platform/Developer/Library/Frameworks -F /Applications/Xcode-16.3.0.app/Contents/Developer/Platforms/iPhoneOS.platform/Developer/SDKs/iPhoneOS18.4.sdk/Developer/Library/Frameworks -c -j10 -enable-batch-mode -incremental -Xcc -ivfsstatcache -Xcc /Users/admin/builder/spi-builder-workspace/.derivedData/SDKStatCaches.noindex/iphoneos18.4-22E235-339d34bc69d7fc736c3220795c36f340.sdkstatcache -output-file-map /Users/admin/builder/spi-builder-workspace/.derivedData/Build/Intermediates.noindex/llbuild.build/Debug-iphoneos/llbuildSwift.build/Objects-normal/arm64/llbuildSwift-OutputFileMap.json -use-frontend-parseable-output -save-temps -no-color-diagnostics -serialize-diagnostics -emit-dependencies -emit-module -emit-module-path /Users/admin/builder/spi-builder-workspace/.derivedData/Build/Intermediates.noindex/llbuild.build/Debug-iphoneos/llbuildSwift.build/Objects-normal/arm64/llbuildSwift.swiftmodule -validate-clang-modules-once -clang-build-session-file /Users/admin/builder/spi-builder-workspace/.derivedData/ModuleCache.noindex/Session.modulevalidation -Xcc -I/Users/admin/builder/spi-builder-workspace/.derivedData/Build/Intermediates.noindex/llbuild.build/Debug-iphoneos/llbuildSwift.build/swift-overrides.hmap -emit-const-values -Xfrontend -const-gather-protocols-file -Xfrontend /Users/admin/builder/spi-builder-workspace/.derivedData/Build/Intermediates.noindex/llbuild.build/Debug-iphoneos/llbuildSwift.build/Objects-normal/arm64/llbuildSwift_const_extract_protocols.json -Xcc -I/Users/admin/builder/spi-builder-workspace/.dependencies/checkouts/swift-llbuild/products/libllbuild/include -Xcc -I/Users/admin/builder/spi-builder-workspace/.dependencies/checkouts/swift-llbuild/lib/BuildSystem/include -Xcc -I/Users/admin/builder/spi-builder-workspace/.dependencies/checkouts/swift-llbuild/lib/Core/include -Xcc -I/Users/admin/builder/spi-builder-workspace/.dependencies/checkouts/swift-llbuild/lib/Basic/include -Xcc -I/Users/admin/builder/spi-builder-workspace/.dependencies/checkouts/swift-llbuild/lib/llvm/Support/include -Xcc -I/Users/admin/builder/spi-builder-workspace/.dependencies/checkouts/swift-llbuild/lib/llvm/Demangle/include -Xcc -I/Users/admin/builder/spi-builder-workspace/.derivedData/Build/Products/Debug-iphoneos/include -Xcc -I/Users/admin/builder/spi-builder-workspace/.derivedData/Build/Intermediates.noindex/llbuild.build/Debug-iphoneos/llbuildSwift.build/DerivedSources-normal/arm64 -Xcc -I/Users/admin/builder/spi-builder-workspace/.derivedData/Build/Intermediates.noindex/llbuild.build/Debug-iphoneos/llbuildSwift.build/DerivedSources/arm64 -Xcc -I/Users/admin/builder/spi-builder-workspace/.derivedData/Build/Intermediates.noindex/llbuild.build/Debug-iphoneos/llbuildSwift.build/DerivedSources -Xcc -DSWIFT_PACKAGE -Xcc -DDEBUG\=1 -emit-objc-header -emit-objc-header-path /Users/admin/builder/spi-builder-workspace/.derivedData/Build/Intermediates.noindex/llbuild.build/Debug-iphoneos/llbuildSwift.build/Objects-normal/arm64/llbuildSwift-Swift.h -working-directory /Users/admin/builder/spi-builder-workspace/.swiftpm/xcode -experimental-emit-module-separately -disable-cmo
SwiftDriverJobDiscovery normal arm64 Emitting module for ArgumentParser (in target 'ArgumentParser' from project 'swift-argument-parser')
SwiftDriver\ Compilation\ Requirements ArgumentParser normal arm64 com.apple.xcode.tools.swift.compiler (in target 'ArgumentParser' from project 'swift-argument-parser')
cd /Users/admin/builder/spi-builder-workspace/.swiftpm/xcode
builtin-Swift-Compilation-Requirements -- /Applications/Xcode-16.3.0.app/Contents/Developer/Toolchains/XcodeDefault.xctoolchain/usr/bin/swiftc -module-name ArgumentParser -Onone -enforce-exclusivity\=checked @/Users/admin/builder/spi-builder-workspace/.derivedData/Build/Intermediates.noindex/swift-argument-parser.build/Debug-iphoneos/ArgumentParser.build/Objects-normal/arm64/ArgumentParser.SwiftFileList -DSWIFT_PACKAGE -DDEBUG -DXcode -plugin-path /Applications/Xcode-16.3.0.app/Contents/Developer/Toolchains/XcodeDefault.xctoolchain/usr/lib/swift/host/plugins/testing -enable-experimental-feature DebugDescriptionMacro -sdk /Applications/Xcode-16.3.0.app/Contents/Developer/Platforms/iPhoneOS.platform/Developer/SDKs/iPhoneOS18.4.sdk -target arm64-apple-ios12.0 -g -module-cache-path /Users/admin/builder/spi-builder-workspace/.derivedData/ModuleCache.noindex -Xfrontend -serialize-debugging-options -profile-coverage-mapping -profile-generate -enable-testing -suppress-warnings -index-store-path /Users/admin/builder/spi-builder-workspace/.derivedData/Index.noindex/DataStore -swift-version 5 -I /Users/admin/builder/spi-builder-workspace/.derivedData/Build/Products/Debug-iphoneos -I /Applications/Xcode-16.3.0.app/Contents/Developer/Platforms/iPhoneOS.platform/Developer/usr/lib -F /Users/admin/builder/spi-builder-workspace/.derivedData/Build/Products/Debug-iphoneos -F /Applications/Xcode-16.3.0.app/Contents/Developer/Platforms/iPhoneOS.platform/Developer/Library/Frameworks -F /Applications/Xcode-16.3.0.app/Contents/Developer/Platforms/iPhoneOS.platform/Developer/SDKs/iPhoneOS18.4.sdk/Developer/Library/Frameworks -c -j10 -enable-batch-mode -incremental -Xcc -ivfsstatcache -Xcc /Users/admin/builder/spi-builder-workspace/.derivedData/SDKStatCaches.noindex/iphoneos18.4-22E235-339d34bc69d7fc736c3220795c36f340.sdkstatcache -output-file-map /Users/admin/builder/spi-builder-workspace/.derivedData/Build/Intermediates.noindex/swift-argument-parser.build/Debug-iphoneos/ArgumentParser.build/Objects-normal/arm64/ArgumentParser-OutputFileMap.json -use-frontend-parseable-output -save-temps -no-color-diagnostics -serialize-diagnostics -emit-dependencies -emit-module -emit-module-path /Users/admin/builder/spi-builder-workspace/.derivedData/Build/Intermediates.noindex/swift-argument-parser.build/Debug-iphoneos/ArgumentParser.build/Objects-normal/arm64/ArgumentParser.swiftmodule -validate-clang-modules-once -clang-build-session-file /Users/admin/builder/spi-builder-workspace/.derivedData/ModuleCache.noindex/Session.modulevalidation -Xcc -I/Users/admin/builder/spi-builder-workspace/.derivedData/Build/Intermediates.noindex/swift-argument-parser.build/Debug-iphoneos/ArgumentParser.build/swift-overrides.hmap -emit-const-values -Xfrontend -const-gather-protocols-file -Xfrontend /Users/admin/builder/spi-builder-workspace/.derivedData/Build/Intermediates.noindex/swift-argument-parser.build/Debug-iphoneos/ArgumentParser.build/Objects-normal/arm64/ArgumentParser_const_extract_protocols.json -Xcc -I/Users/admin/builder/spi-builder-workspace/.derivedData/Build/Products/Debug-iphoneos/include -Xcc -I/Users/admin/builder/spi-builder-workspace/.derivedData/Build/Intermediates.noindex/swift-argument-parser.build/Debug-iphoneos/ArgumentParser.build/DerivedSources-normal/arm64 -Xcc -I/Users/admin/builder/spi-builder-workspace/.derivedData/Build/Intermediates.noindex/swift-argument-parser.build/Debug-iphoneos/ArgumentParser.build/DerivedSources/arm64 -Xcc -I/Users/admin/builder/spi-builder-workspace/.derivedData/Build/Intermediates.noindex/swift-argument-parser.build/Debug-iphoneos/ArgumentParser.build/DerivedSources -Xcc -DSWIFT_PACKAGE -Xcc -DDEBUG\=1 -emit-objc-header -emit-objc-header-path /Users/admin/builder/spi-builder-workspace/.derivedData/Build/Intermediates.noindex/swift-argument-parser.build/Debug-iphoneos/ArgumentParser.build/Objects-normal/arm64/ArgumentParser-Swift.h -working-directory /Users/admin/builder/spi-builder-workspace/.swiftpm/xcode -experimental-emit-module-separately -disable-cmo
SwiftCompile normal arm64 Compiling\ Resolver.swift /Users/admin/builder/spi-builder-workspace/.dependencies/checkouts/Yams/Sources/Yams/Resolver.swift (in target 'Yams' from project 'Yams')
SwiftCompile normal arm64 /Users/admin/builder/spi-builder-workspace/.dependencies/checkouts/Yams/Sources/Yams/Resolver.swift (in target 'Yams' from project 'Yams')
cd /Users/admin/builder/spi-builder-workspace/.swiftpm/xcode
Copy /Users/admin/builder/spi-builder-workspace/.derivedData/Build/Products/Debug-iphoneos/ArgumentParser.swiftmodule/arm64-apple-ios.abi.json /Users/admin/builder/spi-builder-workspace/.derivedData/Build/Intermediates.noindex/swift-argument-parser.build/Debug-iphoneos/ArgumentParser.build/Objects-normal/arm64/ArgumentParser.abi.json (in target 'ArgumentParser' from project 'swift-argument-parser')
cd /Users/admin/builder/spi-builder-workspace/.dependencies/checkouts/swift-argument-parser
builtin-copy -exclude .DS_Store -exclude CVS -exclude .svn -exclude .git -exclude .hg -resolve-src-symlinks -rename /Users/admin/builder/spi-builder-workspace/.derivedData/Build/Intermediates.noindex/swift-argument-parser.build/Debug-iphoneos/ArgumentParser.build/Objects-normal/arm64/ArgumentParser.abi.json /Users/admin/builder/spi-builder-workspace/.derivedData/Build/Products/Debug-iphoneos/ArgumentParser.swiftmodule/arm64-apple-ios.abi.json
SwiftDriverJobDiscovery normal arm64 Compiling String+Yams.swift (in target 'Yams' from project 'Yams')
SwiftCompile normal arm64 Compiling\ YamlError.swift /Users/admin/builder/spi-builder-workspace/.dependencies/checkouts/Yams/Sources/Yams/YamlError.swift (in target 'Yams' from project 'Yams')
SwiftCompile normal arm64 /Users/admin/builder/spi-builder-workspace/.dependencies/checkouts/Yams/Sources/Yams/YamlError.swift (in target 'Yams' from project 'Yams')
cd /Users/admin/builder/spi-builder-workspace/.swiftpm/xcode
Copy /Users/admin/builder/spi-builder-workspace/.derivedData/Build/Products/Debug-iphoneos/ArgumentParser.swiftmodule/arm64-apple-ios.swiftmodule /Users/admin/builder/spi-builder-workspace/.derivedData/Build/Intermediates.noindex/swift-argument-parser.build/Debug-iphoneos/ArgumentParser.build/Objects-normal/arm64/ArgumentParser.swiftmodule (in target 'ArgumentParser' from project 'swift-argument-parser')
cd /Users/admin/builder/spi-builder-workspace/.dependencies/checkouts/swift-argument-parser
builtin-copy -exclude .DS_Store -exclude CVS -exclude .svn -exclude .git -exclude .hg -resolve-src-symlinks -rename /Users/admin/builder/spi-builder-workspace/.derivedData/Build/Intermediates.noindex/swift-argument-parser.build/Debug-iphoneos/ArgumentParser.build/Objects-normal/arm64/ArgumentParser.swiftmodule /Users/admin/builder/spi-builder-workspace/.derivedData/Build/Products/Debug-iphoneos/ArgumentParser.swiftmodule/arm64-apple-ios.swiftmodule
SwiftDriverJobDiscovery normal arm64 Compiling Tag.swift (in target 'Yams' from project 'Yams')
SwiftCompile normal arm64 Compiling\ Mark.swift,\ Node.Mapping.swift /Users/admin/builder/spi-builder-workspace/.dependencies/checkouts/Yams/Sources/Yams/Mark.swift /Users/admin/builder/spi-builder-workspace/.dependencies/checkouts/Yams/Sources/Yams/Node.Mapping.swift (in target 'Yams' from project 'Yams')
SwiftCompile normal arm64 /Users/admin/builder/spi-builder-workspace/.dependencies/checkouts/Yams/Sources/Yams/Mark.swift (in target 'Yams' from project 'Yams')
cd /Users/admin/builder/spi-builder-workspace/.swiftpm/xcode
SwiftCompile normal arm64 /Users/admin/builder/spi-builder-workspace/.dependencies/checkouts/Yams/Sources/Yams/Node.Mapping.swift (in target 'Yams' from project 'Yams')
cd /Users/admin/builder/spi-builder-workspace/.swiftpm/xcode
SwiftCompile normal arm64 Compiling\ Await.swift,\ Base64URL.swift,\ ByteString.swift,\ CStringArray.swift,\ CacheableSequence.swift /Users/admin/builder/spi-builder-workspace/.dependencies/checkouts/swift-tools-support-core/Sources/TSCBasic/Await.swift /Users/admin/builder/spi-builder-workspace/.dependencies/checkouts/swift-tools-support-core/Sources/TSCBasic/Base64URL.swift /Users/admin/builder/spi-builder-workspace/.dependencies/checkouts/swift-tools-support-core/Sources/TSCBasic/ByteString.swift /Users/admin/builder/spi-builder-workspace/.dependencies/checkouts/swift-tools-support-core/Sources/TSCBasic/CStringArray.swift /Users/admin/builder/spi-builder-workspace/.dependencies/checkouts/swift-tools-support-core/Sources/TSCBasic/CacheableSequence.swift (in target 'TSCBasic' from project 'swift-tools-support-core')
SwiftCompile normal arm64 /Users/admin/builder/spi-builder-workspace/.dependencies/checkouts/swift-tools-support-core/Sources/TSCBasic/Await.swift (in target 'TSCBasic' from project 'swift-tools-support-core')
cd /Users/admin/builder/spi-builder-workspace/.swiftpm/xcode
SwiftCompile normal arm64 /Users/admin/builder/spi-builder-workspace/.dependencies/checkouts/swift-tools-support-core/Sources/TSCBasic/Base64URL.swift (in target 'TSCBasic' from project 'swift-tools-support-core')
cd /Users/admin/builder/spi-builder-workspace/.swiftpm/xcode
SwiftCompile normal arm64 /Users/admin/builder/spi-builder-workspace/.dependencies/checkouts/swift-tools-support-core/Sources/TSCBasic/ByteString.swift (in target 'TSCBasic' from project 'swift-tools-support-core')
cd /Users/admin/builder/spi-builder-workspace/.swiftpm/xcode
SwiftCompile normal arm64 /Users/admin/builder/spi-builder-workspace/.dependencies/checkouts/swift-tools-support-core/Sources/TSCBasic/CStringArray.swift (in target 'TSCBasic' from project 'swift-tools-support-core')
cd /Users/admin/builder/spi-builder-workspace/.swiftpm/xcode
SwiftCompile normal arm64 /Users/admin/builder/spi-builder-workspace/.dependencies/checkouts/swift-tools-support-core/Sources/TSCBasic/CacheableSequence.swift (in target 'TSCBasic' from project 'swift-tools-support-core')
cd /Users/admin/builder/spi-builder-workspace/.swiftpm/xcode
SwiftDriverJobDiscovery normal arm64 Emitting module for Yams (in target 'Yams' from project 'Yams')
SwiftDriver\ Compilation\ Requirements Yams normal arm64 com.apple.xcode.tools.swift.compiler (in target 'Yams' from project 'Yams')
cd /Users/admin/builder/spi-builder-workspace/.swiftpm/xcode
builtin-Swift-Compilation-Requirements -- /Applications/Xcode-16.3.0.app/Contents/Developer/Toolchains/XcodeDefault.xctoolchain/usr/bin/swiftc -module-name Yams -Onone -enforce-exclusivity\=checked @/Users/admin/builder/spi-builder-workspace/.derivedData/Build/Intermediates.noindex/Yams.build/Debug-iphoneos/Yams.build/Objects-normal/arm64/Yams.SwiftFileList -DSWIFT_PACKAGE -DDEBUG -DXcode -plugin-path /Applications/Xcode-16.3.0.app/Contents/Developer/Toolchains/XcodeDefault.xctoolchain/usr/lib/swift/host/plugins/testing -enable-experimental-feature DebugDescriptionMacro -sdk /Applications/Xcode-16.3.0.app/Contents/Developer/Platforms/iPhoneOS.platform/Developer/SDKs/iPhoneOS18.4.sdk -target arm64-apple-ios12.0 -g -module-cache-path /Users/admin/builder/spi-builder-workspace/.derivedData/ModuleCache.noindex -Xfrontend -serialize-debugging-options -profile-coverage-mapping -profile-generate -enable-testing -suppress-warnings -index-store-path /Users/admin/builder/spi-builder-workspace/.derivedData/Index.noindex/DataStore -swift-version 5 -I /Users/admin/builder/spi-builder-workspace/.derivedData/Build/Products/Debug-iphoneos -I /Applications/Xcode-16.3.0.app/Contents/Developer/Platforms/iPhoneOS.platform/Developer/usr/lib -F /Users/admin/builder/spi-builder-workspace/.derivedData/Build/Products/Debug-iphoneos/PackageFrameworks -F /Users/admin/builder/spi-builder-workspace/.derivedData/Build/Products/Debug-iphoneos -F /Applications/Xcode-16.3.0.app/Contents/Developer/Platforms/iPhoneOS.platform/Developer/Library/Frameworks -F /Applications/Xcode-16.3.0.app/Contents/Developer/Platforms/iPhoneOS.platform/Developer/SDKs/iPhoneOS18.4.sdk/Developer/Library/Frameworks -c -j10 -enable-batch-mode -incremental -Xcc -ivfsstatcache -Xcc /Users/admin/builder/spi-builder-workspace/.derivedData/SDKStatCaches.noindex/iphoneos18.4-22E235-339d34bc69d7fc736c3220795c36f340.sdkstatcache -output-file-map /Users/admin/builder/spi-builder-workspace/.derivedData/Build/Intermediates.noindex/Yams.build/Debug-iphoneos/Yams.build/Objects-normal/arm64/Yams-OutputFileMap.json -use-frontend-parseable-output -save-temps -no-color-diagnostics -serialize-diagnostics -emit-dependencies -emit-module -emit-module-path /Users/admin/builder/spi-builder-workspace/.derivedData/Build/Intermediates.noindex/Yams.build/Debug-iphoneos/Yams.build/Objects-normal/arm64/Yams.swiftmodule -validate-clang-modules-once -clang-build-session-file /Users/admin/builder/spi-builder-workspace/.derivedData/ModuleCache.noindex/Session.modulevalidation -Xcc -I/Users/admin/builder/spi-builder-workspace/.derivedData/Build/Intermediates.noindex/Yams.build/Debug-iphoneos/Yams.build/swift-overrides.hmap -emit-const-values -Xfrontend -const-gather-protocols-file -Xfrontend /Users/admin/builder/spi-builder-workspace/.derivedData/Build/Intermediates.noindex/Yams.build/Debug-iphoneos/Yams.build/Objects-normal/arm64/Yams_const_extract_protocols.json -Xcc -I/Users/admin/builder/spi-builder-workspace/.dependencies/checkouts/Yams/Sources/CYaml/include -Xcc -I/Users/admin/builder/spi-builder-workspace/.derivedData/Build/Products/Debug-iphoneos/include -Xcc -I/Users/admin/builder/spi-builder-workspace/.derivedData/Build/Intermediates.noindex/Yams.build/Debug-iphoneos/Yams.build/DerivedSources-normal/arm64 -Xcc -I/Users/admin/builder/spi-builder-workspace/.derivedData/Build/Intermediates.noindex/Yams.build/Debug-iphoneos/Yams.build/DerivedSources/arm64 -Xcc -I/Users/admin/builder/spi-builder-workspace/.derivedData/Build/Intermediates.noindex/Yams.build/Debug-iphoneos/Yams.build/DerivedSources -Xcc -DSWIFT_PACKAGE -Xcc -DDEBUG\=1 -emit-objc-header -emit-objc-header-path /Users/admin/builder/spi-builder-workspace/.derivedData/Build/Intermediates.noindex/Yams.build/Debug-iphoneos/Yams.build/Objects-normal/arm64/Yams-Swift.h -working-directory /Users/admin/builder/spi-builder-workspace/.swiftpm/xcode -experimental-emit-module-separately -disable-cmo
SwiftDriverJobDiscovery normal arm64 Emitting module for TSCBasic (in target 'TSCBasic' from project 'swift-tools-support-core')
SwiftDriver\ Compilation\ Requirements TSCBasic normal arm64 com.apple.xcode.tools.swift.compiler (in target 'TSCBasic' from project 'swift-tools-support-core')
cd /Users/admin/builder/spi-builder-workspace/.swiftpm/xcode
builtin-Swift-Compilation-Requirements -- /Applications/Xcode-16.3.0.app/Contents/Developer/Toolchains/XcodeDefault.xctoolchain/usr/bin/swiftc -module-name TSCBasic -Onone -enforce-exclusivity\=checked @/Users/admin/builder/spi-builder-workspace/.derivedData/Build/Intermediates.noindex/swift-tools-support-core.build/Debug-iphoneos/TSCBasic.build/Objects-normal/arm64/TSCBasic.SwiftFileList -DSWIFT_PACKAGE -DDEBUG -DXcode -plugin-path /Applications/Xcode-16.3.0.app/Contents/Developer/Toolchains/XcodeDefault.xctoolchain/usr/lib/swift/host/plugins/testing -enable-experimental-feature DebugDescriptionMacro -sdk /Applications/Xcode-16.3.0.app/Contents/Developer/Platforms/iPhoneOS.platform/Developer/SDKs/iPhoneOS18.4.sdk -target arm64-apple-ios12.0 -g -module-cache-path /Users/admin/builder/spi-builder-workspace/.derivedData/ModuleCache.noindex -Xfrontend -serialize-debugging-options -profile-coverage-mapping -profile-generate -enable-testing -suppress-warnings -index-store-path /Users/admin/builder/spi-builder-workspace/.derivedData/Index.noindex/DataStore -swift-version 5 -I /Users/admin/builder/spi-builder-workspace/.derivedData/Build/Products/Debug-iphoneos -I /Applications/Xcode-16.3.0.app/Contents/Developer/Platforms/iPhoneOS.platform/Developer/usr/lib -F /Users/admin/builder/spi-builder-workspace/.derivedData/Build/Products/Debug-iphoneos/PackageFrameworks -F /Users/admin/builder/spi-builder-workspace/.derivedData/Build/Products/Debug-iphoneos/PackageFrameworks -F /Users/admin/builder/spi-builder-workspace/.derivedData/Build/Products/Debug-iphoneos -F /Applications/Xcode-16.3.0.app/Contents/Developer/Platforms/iPhoneOS.platform/Developer/Library/Frameworks -F /Applications/Xcode-16.3.0.app/Contents/Developer/Platforms/iPhoneOS.platform/Developer/SDKs/iPhoneOS18.4.sdk/Developer/Library/Frameworks -c -j10 -enable-batch-mode -incremental -Xcc -ivfsstatcache -Xcc /Users/admin/builder/spi-builder-workspace/.derivedData/SDKStatCaches.noindex/iphoneos18.4-22E235-339d34bc69d7fc736c3220795c36f340.sdkstatcache -output-file-map /Users/admin/builder/spi-builder-workspace/.derivedData/Build/Intermediates.noindex/swift-tools-support-core.build/Debug-iphoneos/TSCBasic.build/Objects-normal/arm64/TSCBasic-OutputFileMap.json -use-frontend-parseable-output -save-temps -no-color-diagnostics -serialize-diagnostics -emit-dependencies -emit-module -emit-module-path /Users/admin/builder/spi-builder-workspace/.derivedData/Build/Intermediates.noindex/swift-tools-support-core.build/Debug-iphoneos/TSCBasic.build/Objects-normal/arm64/TSCBasic.swiftmodule -validate-clang-modules-once -clang-build-session-file /Users/admin/builder/spi-builder-workspace/.derivedData/ModuleCache.noindex/Session.modulevalidation -Xcc -I/Users/admin/builder/spi-builder-workspace/.derivedData/Build/Intermediates.noindex/swift-tools-support-core.build/Debug-iphoneos/TSCBasic.build/swift-overrides.hmap -emit-const-values -Xfrontend -const-gather-protocols-file -Xfrontend /Users/admin/builder/spi-builder-workspace/.derivedData/Build/Intermediates.noindex/swift-tools-support-core.build/Debug-iphoneos/TSCBasic.build/Objects-normal/arm64/TSCBasic_const_extract_protocols.json -Xcc -I/Users/admin/builder/spi-builder-workspace/.dependencies/checkouts/swift-tools-support-core/Sources/TSCclibc/include -Xcc -I/Users/admin/builder/spi-builder-workspace/.derivedData/Build/Products/Debug-iphoneos/include -Xcc -I/Users/admin/builder/spi-builder-workspace/.derivedData/Build/Intermediates.noindex/swift-tools-support-core.build/Debug-iphoneos/TSCBasic.build/DerivedSources-normal/arm64 -Xcc -I/Users/admin/builder/spi-builder-workspace/.derivedData/Build/Intermediates.noindex/swift-tools-support-core.build/Debug-iphoneos/TSCBasic.build/DerivedSources/arm64 -Xcc -I/Users/admin/builder/spi-builder-workspace/.derivedData/Build/Intermediates.noindex/swift-tools-support-core.build/Debug-iphoneos/TSCBasic.build/DerivedSources -Xcc -DSWIFT_PACKAGE -Xcc -DDEBUG\=1 -emit-objc-header -emit-objc-header-path /Users/admin/builder/spi-builder-workspace/.derivedData/Build/Intermediates.noindex/swift-tools-support-core.build/Debug-iphoneos/TSCBasic.build/Objects-normal/arm64/TSCBasic-Swift.h -working-directory /Users/admin/builder/spi-builder-workspace/.swiftpm/xcode -experimental-emit-module-separately -disable-cmo
Copy /Users/admin/builder/spi-builder-workspace/.derivedData/Build/Products/Debug-iphoneos/Yams.swiftmodule/arm64-apple-ios.abi.json /Users/admin/builder/spi-builder-workspace/.derivedData/Build/Intermediates.noindex/Yams.build/Debug-iphoneos/Yams.build/Objects-normal/arm64/Yams.abi.json (in target 'Yams' from project 'Yams')
cd /Users/admin/builder/spi-builder-workspace/.dependencies/checkouts/Yams
builtin-copy -exclude .DS_Store -exclude CVS -exclude .svn -exclude .git -exclude .hg -resolve-src-symlinks -rename /Users/admin/builder/spi-builder-workspace/.derivedData/Build/Intermediates.noindex/Yams.build/Debug-iphoneos/Yams.build/Objects-normal/arm64/Yams.abi.json /Users/admin/builder/spi-builder-workspace/.derivedData/Build/Products/Debug-iphoneos/Yams.swiftmodule/arm64-apple-ios.abi.json
Copy /Users/admin/builder/spi-builder-workspace/.derivedData/Build/Products/Debug-iphoneos/TSCBasic.swiftmodule/arm64-apple-ios.swiftmodule /Users/admin/builder/spi-builder-workspace/.derivedData/Build/Intermediates.noindex/swift-tools-support-core.build/Debug-iphoneos/TSCBasic.build/Objects-normal/arm64/TSCBasic.swiftmodule (in target 'TSCBasic' from project 'swift-tools-support-core')
cd /Users/admin/builder/spi-builder-workspace/.dependencies/checkouts/swift-tools-support-core
builtin-copy -exclude .DS_Store -exclude CVS -exclude .svn -exclude .git -exclude .hg -resolve-src-symlinks -rename /Users/admin/builder/spi-builder-workspace/.derivedData/Build/Intermediates.noindex/swift-tools-support-core.build/Debug-iphoneos/TSCBasic.build/Objects-normal/arm64/TSCBasic.swiftmodule /Users/admin/builder/spi-builder-workspace/.derivedData/Build/Products/Debug-iphoneos/TSCBasic.swiftmodule/arm64-apple-ios.swiftmodule
Copy /Users/admin/builder/spi-builder-workspace/.derivedData/Build/Products/Debug-iphoneos/Yams.swiftmodule/arm64-apple-ios.swiftmodule /Users/admin/builder/spi-builder-workspace/.derivedData/Build/Intermediates.noindex/Yams.build/Debug-iphoneos/Yams.build/Objects-normal/arm64/Yams.swiftmodule (in target 'Yams' from project 'Yams')
cd /Users/admin/builder/spi-builder-workspace/.dependencies/checkouts/Yams
builtin-copy -exclude .DS_Store -exclude CVS -exclude .svn -exclude .git -exclude .hg -resolve-src-symlinks -rename /Users/admin/builder/spi-builder-workspace/.derivedData/Build/Intermediates.noindex/Yams.build/Debug-iphoneos/Yams.build/Objects-normal/arm64/Yams.swiftmodule /Users/admin/builder/spi-builder-workspace/.derivedData/Build/Products/Debug-iphoneos/Yams.swiftmodule/arm64-apple-ios.swiftmodule
Copy /Users/admin/builder/spi-builder-workspace/.derivedData/Build/Products/Debug-iphoneos/TSCBasic.swiftmodule/arm64-apple-ios.abi.json /Users/admin/builder/spi-builder-workspace/.derivedData/Build/Intermediates.noindex/swift-tools-support-core.build/Debug-iphoneos/TSCBasic.build/Objects-normal/arm64/TSCBasic.abi.json (in target 'TSCBasic' from project 'swift-tools-support-core')
cd /Users/admin/builder/spi-builder-workspace/.dependencies/checkouts/swift-tools-support-core
builtin-copy -exclude .DS_Store -exclude CVS -exclude .svn -exclude .git -exclude .hg -resolve-src-symlinks -rename /Users/admin/builder/spi-builder-workspace/.derivedData/Build/Intermediates.noindex/swift-tools-support-core.build/Debug-iphoneos/TSCBasic.build/Objects-normal/arm64/TSCBasic.abi.json /Users/admin/builder/spi-builder-workspace/.derivedData/Build/Products/Debug-iphoneos/TSCBasic.swiftmodule/arm64-apple-ios.abi.json
SwiftCompile normal arm64 Compiling\ Closable.swift,\ CodableResult.swift,\ CollectionAlgorithms.swift,\ CollectionExtensions.swift,\ Condition.swift /Users/admin/builder/spi-builder-workspace/.dependencies/checkouts/swift-tools-support-core/Sources/TSCBasic/Closable.swift /Users/admin/builder/spi-builder-workspace/.dependencies/checkouts/swift-tools-support-core/Sources/TSCBasic/CodableResult.swift /Users/admin/builder/spi-builder-workspace/.dependencies/checkouts/swift-tools-support-core/Sources/TSCBasic/CollectionAlgorithms.swift /Users/admin/builder/spi-builder-workspace/.dependencies/checkouts/swift-tools-support-core/Sources/TSCBasic/CollectionExtensions.swift /Users/admin/builder/spi-builder-workspace/.dependencies/checkouts/swift-tools-support-core/Sources/TSCBasic/Condition.swift (in target 'TSCBasic' from project 'swift-tools-support-core')
SwiftCompile normal arm64 /Users/admin/builder/spi-builder-workspace/.dependencies/checkouts/swift-tools-support-core/Sources/TSCBasic/Closable.swift (in target 'TSCBasic' from project 'swift-tools-support-core')
cd /Users/admin/builder/spi-builder-workspace/.swiftpm/xcode
SwiftCompile normal arm64 /Users/admin/builder/spi-builder-workspace/.dependencies/checkouts/swift-tools-support-core/Sources/TSCBasic/CodableResult.swift (in target 'TSCBasic' from project 'swift-tools-support-core')
cd /Users/admin/builder/spi-builder-workspace/.swiftpm/xcode
SwiftCompile normal arm64 /Users/admin/builder/spi-builder-workspace/.dependencies/checkouts/swift-tools-support-core/Sources/TSCBasic/CollectionAlgorithms.swift (in target 'TSCBasic' from project 'swift-tools-support-core')
cd /Users/admin/builder/spi-builder-workspace/.swiftpm/xcode
SwiftCompile normal arm64 /Users/admin/builder/spi-builder-workspace/.dependencies/checkouts/swift-tools-support-core/Sources/TSCBasic/CollectionExtensions.swift (in target 'TSCBasic' from project 'swift-tools-support-core')
cd /Users/admin/builder/spi-builder-workspace/.swiftpm/xcode
SwiftCompile normal arm64 /Users/admin/builder/spi-builder-workspace/.dependencies/checkouts/swift-tools-support-core/Sources/TSCBasic/Condition.swift (in target 'TSCBasic' from project 'swift-tools-support-core')
cd /Users/admin/builder/spi-builder-workspace/.swiftpm/xcode
SwiftCompile normal arm64 Compiling\ JSONMapper.swift,\ KeyedPair.swift,\ LazyCache.swift,\ Lock.swift /Users/admin/builder/spi-builder-workspace/.dependencies/checkouts/swift-tools-support-core/Sources/TSCBasic/JSONMapper.swift /Users/admin/builder/spi-builder-workspace/.dependencies/checkouts/swift-tools-support-core/Sources/TSCBasic/KeyedPair.swift /Users/admin/builder/spi-builder-workspace/.dependencies/checkouts/swift-tools-support-core/Sources/TSCBasic/LazyCache.swift /Users/admin/builder/spi-builder-workspace/.dependencies/checkouts/swift-tools-support-core/Sources/TSCBasic/Lock.swift (in target 'TSCBasic' from project 'swift-tools-support-core')
SwiftCompile normal arm64 /Users/admin/builder/spi-builder-workspace/.dependencies/checkouts/swift-tools-support-core/Sources/TSCBasic/JSONMapper.swift (in target 'TSCBasic' from project 'swift-tools-support-core')
cd /Users/admin/builder/spi-builder-workspace/.swiftpm/xcode
SwiftCompile normal arm64 /Users/admin/builder/spi-builder-workspace/.dependencies/checkouts/swift-tools-support-core/Sources/TSCBasic/KeyedPair.swift (in target 'TSCBasic' from project 'swift-tools-support-core')
cd /Users/admin/builder/spi-builder-workspace/.swiftpm/xcode
SwiftCompile normal arm64 /Users/admin/builder/spi-builder-workspace/.dependencies/checkouts/swift-tools-support-core/Sources/TSCBasic/LazyCache.swift (in target 'TSCBasic' from project 'swift-tools-support-core')
cd /Users/admin/builder/spi-builder-workspace/.swiftpm/xcode
SwiftCompile normal arm64 /Users/admin/builder/spi-builder-workspace/.dependencies/checkouts/swift-tools-support-core/Sources/TSCBasic/Lock.swift (in target 'TSCBasic' from project 'swift-tools-support-core')
cd /Users/admin/builder/spi-builder-workspace/.swiftpm/xcode
SwiftDriverJobDiscovery normal arm64 Compiling Node.Scalar.swift, Node.Sequence.swift (in target 'Yams' from project 'Yams')
SwiftDriver TSCUtility normal arm64 com.apple.xcode.tools.swift.compiler (in target 'TSCUtility' from project 'swift-tools-support-core')
cd /Users/admin/builder/spi-builder-workspace/.swiftpm/xcode
builtin-SwiftDriver -- /Applications/Xcode-16.3.0.app/Contents/Developer/Toolchains/XcodeDefault.xctoolchain/usr/bin/swiftc -module-name TSCUtility -Onone -enforce-exclusivity\=checked @/Users/admin/builder/spi-builder-workspace/.derivedData/Build/Intermediates.noindex/swift-tools-support-core.build/Debug-iphoneos/TSCUtility.build/Objects-normal/arm64/TSCUtility.SwiftFileList -DSWIFT_PACKAGE -DDEBUG -DXcode -plugin-path /Applications/Xcode-16.3.0.app/Contents/Developer/Toolchains/XcodeDefault.xctoolchain/usr/lib/swift/host/plugins/testing -enable-experimental-feature DebugDescriptionMacro -sdk /Applications/Xcode-16.3.0.app/Contents/Developer/Platforms/iPhoneOS.platform/Developer/SDKs/iPhoneOS18.4.sdk -target arm64-apple-ios12.0 -g -module-cache-path /Users/admin/builder/spi-builder-workspace/.derivedData/ModuleCache.noindex -Xfrontend -serialize-debugging-options -profile-coverage-mapping -profile-generate -enable-testing -suppress-warnings -index-store-path /Users/admin/builder/spi-builder-workspace/.derivedData/Index.noindex/DataStore -swift-version 5 -I /Users/admin/builder/spi-builder-workspace/.derivedData/Build/Products/Debug-iphoneos -I /Applications/Xcode-16.3.0.app/Contents/Developer/Platforms/iPhoneOS.platform/Developer/usr/lib -F /Users/admin/builder/spi-builder-workspace/.derivedData/Build/Products/Debug-iphoneos/PackageFrameworks -F /Users/admin/builder/spi-builder-workspace/.derivedData/Build/Products/Debug-iphoneos/PackageFrameworks -F /Users/admin/builder/spi-builder-workspace/.derivedData/Build/Products/Debug-iphoneos/PackageFrameworks -F /Users/admin/builder/spi-builder-workspace/.derivedData/Build/Products/Debug-iphoneos -F /Applications/Xcode-16.3.0.app/Contents/Developer/Platforms/iPhoneOS.platform/Developer/Library/Frameworks -F /Applications/Xcode-16.3.0.app/Contents/Developer/Platforms/iPhoneOS.platform/Developer/SDKs/iPhoneOS18.4.sdk/Developer/Library/Frameworks -c -j10 -enable-batch-mode -incremental -Xcc -ivfsstatcache -Xcc /Users/admin/builder/spi-builder-workspace/.derivedData/SDKStatCaches.noindex/iphoneos18.4-22E235-339d34bc69d7fc736c3220795c36f340.sdkstatcache -output-file-map /Users/admin/builder/spi-builder-workspace/.derivedData/Build/Intermediates.noindex/swift-tools-support-core.build/Debug-iphoneos/TSCUtility.build/Objects-normal/arm64/TSCUtility-OutputFileMap.json -use-frontend-parseable-output -save-temps -no-color-diagnostics -serialize-diagnostics -emit-dependencies -emit-module -emit-module-path /Users/admin/builder/spi-builder-workspace/.derivedData/Build/Intermediates.noindex/swift-tools-support-core.build/Debug-iphoneos/TSCUtility.build/Objects-normal/arm64/TSCUtility.swiftmodule -validate-clang-modules-once -clang-build-session-file /Users/admin/builder/spi-builder-workspace/.derivedData/ModuleCache.noindex/Session.modulevalidation -Xcc -I/Users/admin/builder/spi-builder-workspace/.derivedData/Build/Intermediates.noindex/swift-tools-support-core.build/Debug-iphoneos/TSCUtility.build/swift-overrides.hmap -emit-const-values -Xfrontend -const-gather-protocols-file -Xfrontend /Users/admin/builder/spi-builder-workspace/.derivedData/Build/Intermediates.noindex/swift-tools-support-core.build/Debug-iphoneos/TSCUtility.build/Objects-normal/arm64/TSCUtility_const_extract_protocols.json -Xcc -I/Users/admin/builder/spi-builder-workspace/.dependencies/checkouts/swift-tools-support-core/Sources/TSCclibc/include -Xcc -I/Users/admin/builder/spi-builder-workspace/.derivedData/Build/Products/Debug-iphoneos/include -Xcc -I/Users/admin/builder/spi-builder-workspace/.derivedData/Build/Intermediates.noindex/swift-tools-support-core.build/Debug-iphoneos/TSCUtility.build/DerivedSources-normal/arm64 -Xcc -I/Users/admin/builder/spi-builder-workspace/.derivedData/Build/Intermediates.noindex/swift-tools-support-core.build/Debug-iphoneos/TSCUtility.build/DerivedSources/arm64 -Xcc -I/Users/admin/builder/spi-builder-workspace/.derivedData/Build/Intermediates.noindex/swift-tools-support-core.build/Debug-iphoneos/TSCUtility.build/DerivedSources -Xcc -DSWIFT_PACKAGE -Xcc -DDEBUG\=1 -emit-objc-header -emit-objc-header-path /Users/admin/builder/spi-builder-workspace/.derivedData/Build/Intermediates.noindex/swift-tools-support-core.build/Debug-iphoneos/TSCUtility.build/Objects-normal/arm64/TSCUtility-Swift.h -working-directory /Users/admin/builder/spi-builder-workspace/.swiftpm/xcode -experimental-emit-module-separately -disable-cmo
SwiftDriverJobDiscovery normal arm64 Compiling Representer.swift (in target 'Yams' from project 'Yams')
SwiftCompile normal arm64 Compiling\ ProcessSet.swift,\ RegEx.swift,\ Result.swift,\ SortedArray.swift /Users/admin/builder/spi-builder-workspace/.dependencies/checkouts/swift-tools-support-core/Sources/TSCBasic/ProcessSet.swift /Users/admin/builder/spi-builder-workspace/.dependencies/checkouts/swift-tools-support-core/Sources/TSCBasic/RegEx.swift /Users/admin/builder/spi-builder-workspace/.dependencies/checkouts/swift-tools-support-core/Sources/TSCBasic/Result.swift /Users/admin/builder/spi-builder-workspace/.dependencies/checkouts/swift-tools-support-core/Sources/TSCBasic/SortedArray.swift (in target 'TSCBasic' from project 'swift-tools-support-core')
SwiftCompile normal arm64 /Users/admin/builder/spi-builder-workspace/.dependencies/checkouts/swift-tools-support-core/Sources/TSCBasic/ProcessSet.swift (in target 'TSCBasic' from project 'swift-tools-support-core')
cd /Users/admin/builder/spi-builder-workspace/.swiftpm/xcode
SwiftCompile normal arm64 /Users/admin/builder/spi-builder-workspace/.dependencies/checkouts/swift-tools-support-core/Sources/TSCBasic/RegEx.swift (in target 'TSCBasic' from project 'swift-tools-support-core')
cd /Users/admin/builder/spi-builder-workspace/.swiftpm/xcode
SwiftCompile normal arm64 /Users/admin/builder/spi-builder-workspace/.dependencies/checkouts/swift-tools-support-core/Sources/TSCBasic/Result.swift (in target 'TSCBasic' from project 'swift-tools-support-core')
cd /Users/admin/builder/spi-builder-workspace/.swiftpm/xcode
SwiftCompile normal arm64 /Users/admin/builder/spi-builder-workspace/.dependencies/checkouts/swift-tools-support-core/Sources/TSCBasic/SortedArray.swift (in target 'TSCBasic' from project 'swift-tools-support-core')
cd /Users/admin/builder/spi-builder-workspace/.swiftpm/xcode
SwiftDriverJobDiscovery normal arm64 Compiling Node.swift, Parser.swift (in target 'Yams' from project 'Yams')
SwiftCompile normal arm64 Compiling\ Thread.swift,\ Tuple.swift,\ WritableByteStream.swift,\ misc.swift /Users/admin/builder/spi-builder-workspace/.dependencies/checkouts/swift-tools-support-core/Sources/TSCBasic/Thread.swift /Users/admin/builder/spi-builder-workspace/.dependencies/checkouts/swift-tools-support-core/Sources/TSCBasic/Tuple.swift /Users/admin/builder/spi-builder-workspace/.dependencies/checkouts/swift-tools-support-core/Sources/TSCBasic/WritableByteStream.swift /Users/admin/builder/spi-builder-workspace/.dependencies/checkouts/swift-tools-support-core/Sources/TSCBasic/misc.swift (in target 'TSCBasic' from project 'swift-tools-support-core')
SwiftCompile normal arm64 /Users/admin/builder/spi-builder-workspace/.dependencies/checkouts/swift-tools-support-core/Sources/TSCBasic/Thread.swift (in target 'TSCBasic' from project 'swift-tools-support-core')
cd /Users/admin/builder/spi-builder-workspace/.swiftpm/xcode
SwiftCompile normal arm64 /Users/admin/builder/spi-builder-workspace/.dependencies/checkouts/swift-tools-support-core/Sources/TSCBasic/Tuple.swift (in target 'TSCBasic' from project 'swift-tools-support-core')
cd /Users/admin/builder/spi-builder-workspace/.swiftpm/xcode
SwiftCompile normal arm64 /Users/admin/builder/spi-builder-workspace/.dependencies/checkouts/swift-tools-support-core/Sources/TSCBasic/WritableByteStream.swift (in target 'TSCBasic' from project 'swift-tools-support-core')
cd /Users/admin/builder/spi-builder-workspace/.swiftpm/xcode
SwiftCompile normal arm64 /Users/admin/builder/spi-builder-workspace/.dependencies/checkouts/swift-tools-support-core/Sources/TSCBasic/misc.swift (in target 'TSCBasic' from project 'swift-tools-support-core')
cd /Users/admin/builder/spi-builder-workspace/.swiftpm/xcode
SwiftDriverJobDiscovery normal arm64 Compiling Resolver.swift (in target 'Yams' from project 'Yams')
SwiftCompile normal arm64 Compiling\ OSLog.swift,\ ObjectIdentifierProtocol.swift,\ OrderedDictionary.swift,\ OrderedSet.swift /Users/admin/builder/spi-builder-workspace/.dependencies/checkouts/swift-tools-support-core/Sources/TSCBasic/OSLog.swift /Users/admin/builder/spi-builder-workspace/.dependencies/checkouts/swift-tools-support-core/Sources/TSCBasic/ObjectIdentifierProtocol.swift /Users/admin/builder/spi-builder-workspace/.dependencies/checkouts/swift-tools-support-core/Sources/TSCBasic/OrderedDictionary.swift /Users/admin/builder/spi-builder-workspace/.dependencies/checkouts/swift-tools-support-core/Sources/TSCBasic/OrderedSet.swift (in target 'TSCBasic' from project 'swift-tools-support-core')
SwiftCompile normal arm64 /Users/admin/builder/spi-builder-workspace/.dependencies/checkouts/swift-tools-support-core/Sources/TSCBasic/OSLog.swift (in target 'TSCBasic' from project 'swift-tools-support-core')
cd /Users/admin/builder/spi-builder-workspace/.swiftpm/xcode
SwiftCompile normal arm64 /Users/admin/builder/spi-builder-workspace/.dependencies/checkouts/swift-tools-support-core/Sources/TSCBasic/ObjectIdentifierProtocol.swift (in target 'TSCBasic' from project 'swift-tools-support-core')
cd /Users/admin/builder/spi-builder-workspace/.swiftpm/xcode
SwiftCompile normal arm64 /Users/admin/builder/spi-builder-workspace/.dependencies/checkouts/swift-tools-support-core/Sources/TSCBasic/OrderedDictionary.swift (in target 'TSCBasic' from project 'swift-tools-support-core')
cd /Users/admin/builder/spi-builder-workspace/.swiftpm/xcode
SwiftCompile normal arm64 /Users/admin/builder/spi-builder-workspace/.dependencies/checkouts/swift-tools-support-core/Sources/TSCBasic/OrderedSet.swift (in target 'TSCBasic' from project 'swift-tools-support-core')
cd /Users/admin/builder/spi-builder-workspace/.swiftpm/xcode
SwiftDriverJobDiscovery normal arm64 Compiling YamlError.swift (in target 'Yams' from project 'Yams')
SwiftCompile normal arm64 Compiling\ DeltaAlgorithm.swift,\ DiagnosticsEngine.swift,\ DictionaryExtensions.swift,\ DictionaryLiteralExtensions.swift,\ EditDistance.swift /Users/admin/builder/spi-builder-workspace/.dependencies/checkouts/swift-tools-support-core/Sources/TSCBasic/DeltaAlgorithm.swift /Users/admin/builder/spi-builder-workspace/.dependencies/checkouts/swift-tools-support-core/Sources/TSCBasic/DiagnosticsEngine.swift /Users/admin/builder/spi-builder-workspace/.dependencies/checkouts/swift-tools-support-core/Sources/TSCBasic/DictionaryExtensions.swift /Users/admin/builder/spi-builder-workspace/.dependencies/checkouts/swift-tools-support-core/Sources/TSCBasic/DictionaryLiteralExtensions.swift /Users/admin/builder/spi-builder-workspace/.dependencies/checkouts/swift-tools-support-core/Sources/TSCBasic/EditDistance.swift (in target 'TSCBasic' from project 'swift-tools-support-core')
SwiftCompile normal arm64 /Users/admin/builder/spi-builder-workspace/.dependencies/checkouts/swift-tools-support-core/Sources/TSCBasic/DeltaAlgorithm.swift (in target 'TSCBasic' from project 'swift-tools-support-core')
cd /Users/admin/builder/spi-builder-workspace/.swiftpm/xcode
SwiftCompile normal arm64 /Users/admin/builder/spi-builder-workspace/.dependencies/checkouts/swift-tools-support-core/Sources/TSCBasic/DiagnosticsEngine.swift (in target 'TSCBasic' from project 'swift-tools-support-core')
cd /Users/admin/builder/spi-builder-workspace/.swiftpm/xcode
SwiftCompile normal arm64 /Users/admin/builder/spi-builder-workspace/.dependencies/checkouts/swift-tools-support-core/Sources/TSCBasic/DictionaryExtensions.swift (in target 'TSCBasic' from project 'swift-tools-support-core')
cd /Users/admin/builder/spi-builder-workspace/.swiftpm/xcode
SwiftCompile normal arm64 /Users/admin/builder/spi-builder-workspace/.dependencies/checkouts/swift-tools-support-core/Sources/TSCBasic/DictionaryLiteralExtensions.swift (in target 'TSCBasic' from project 'swift-tools-support-core')
cd /Users/admin/builder/spi-builder-workspace/.swiftpm/xcode
SwiftCompile normal arm64 /Users/admin/builder/spi-builder-workspace/.dependencies/checkouts/swift-tools-support-core/Sources/TSCBasic/EditDistance.swift (in target 'TSCBasic' from project 'swift-tools-support-core')
cd /Users/admin/builder/spi-builder-workspace/.swiftpm/xcode
SwiftEmitModule normal arm64 Emitting\ module\ for\ TSCUtility (in target 'TSCUtility' from project 'swift-tools-support-core')
EmitSwiftModule normal arm64 (in target 'TSCUtility' from project 'swift-tools-support-core')
cd /Users/admin/builder/spi-builder-workspace/.swiftpm/xcode
SwiftDriverJobDiscovery normal arm64 Compiling Emitter.swift, Encoder.swift (in target 'Yams' from project 'Yams')
SwiftCompile normal arm64 Compiling\ Archiver.swift,\ ArgumentParser.swift,\ ArgumentParserShellCompletion.swift,\ Array+Extensions.swift /Users/admin/builder/spi-builder-workspace/.dependencies/checkouts/swift-tools-support-core/Sources/TSCUtility/Archiver.swift /Users/admin/builder/spi-builder-workspace/.dependencies/checkouts/swift-tools-support-core/Sources/TSCUtility/ArgumentParser.swift /Users/admin/builder/spi-builder-workspace/.dependencies/checkouts/swift-tools-support-core/Sources/TSCUtility/ArgumentParserShellCompletion.swift /Users/admin/builder/spi-builder-workspace/.dependencies/checkouts/swift-tools-support-core/Sources/TSCUtility/Array+Extensions.swift (in target 'TSCUtility' from project 'swift-tools-support-core')
SwiftCompile normal arm64 /Users/admin/builder/spi-builder-workspace/.dependencies/checkouts/swift-tools-support-core/Sources/TSCUtility/Archiver.swift (in target 'TSCUtility' from project 'swift-tools-support-core')
cd /Users/admin/builder/spi-builder-workspace/.swiftpm/xcode
SwiftCompile normal arm64 /Users/admin/builder/spi-builder-workspace/.dependencies/checkouts/swift-tools-support-core/Sources/TSCUtility/ArgumentParser.swift (in target 'TSCUtility' from project 'swift-tools-support-core')
cd /Users/admin/builder/spi-builder-workspace/.swiftpm/xcode
SwiftCompile normal arm64 /Users/admin/builder/spi-builder-workspace/.dependencies/checkouts/swift-tools-support-core/Sources/TSCUtility/ArgumentParserShellCompletion.swift (in target 'TSCUtility' from project 'swift-tools-support-core')
cd /Users/admin/builder/spi-builder-workspace/.swiftpm/xcode
SwiftCompile normal arm64 /Users/admin/builder/spi-builder-workspace/.dependencies/checkouts/swift-tools-support-core/Sources/TSCUtility/Array+Extensions.swift (in target 'TSCUtility' from project 'swift-tools-support-core')
cd /Users/admin/builder/spi-builder-workspace/.swiftpm/xcode
SwiftDriverJobDiscovery normal arm64 Compiling Mark.swift, Node.Mapping.swift (in target 'Yams' from project 'Yams')
SwiftCompile normal arm64 Compiling\ Context.swift,\ Diagnostics.swift,\ Downloader.swift,\ FSWatch.swift /Users/admin/builder/spi-builder-workspace/.dependencies/checkouts/swift-tools-support-core/Sources/TSCUtility/Context.swift /Users/admin/builder/spi-builder-workspace/.dependencies/checkouts/swift-tools-support-core/Sources/TSCUtility/Diagnostics.swift /Users/admin/builder/spi-builder-workspace/.dependencies/checkouts/swift-tools-support-core/Sources/TSCUtility/Downloader.swift /Users/admin/builder/spi-builder-workspace/.dependencies/checkouts/swift-tools-support-core/Sources/TSCUtility/FSWatch.swift (in target 'TSCUtility' from project 'swift-tools-support-core')
SwiftCompile normal arm64 /Users/admin/builder/spi-builder-workspace/.dependencies/checkouts/swift-tools-support-core/Sources/TSCUtility/Context.swift (in target 'TSCUtility' from project 'swift-tools-support-core')
cd /Users/admin/builder/spi-builder-workspace/.swiftpm/xcode
SwiftCompile normal arm64 /Users/admin/builder/spi-builder-workspace/.dependencies/checkouts/swift-tools-support-core/Sources/TSCUtility/Diagnostics.swift (in target 'TSCUtility' from project 'swift-tools-support-core')
cd /Users/admin/builder/spi-builder-workspace/.swiftpm/xcode
SwiftCompile normal arm64 /Users/admin/builder/spi-builder-workspace/.dependencies/checkouts/swift-tools-support-core/Sources/TSCUtility/Downloader.swift (in target 'TSCUtility' from project 'swift-tools-support-core')
cd /Users/admin/builder/spi-builder-workspace/.swiftpm/xcode
SwiftCompile normal arm64 /Users/admin/builder/spi-builder-workspace/.dependencies/checkouts/swift-tools-support-core/Sources/TSCUtility/FSWatch.swift (in target 'TSCUtility' from project 'swift-tools-support-core')
cd /Users/admin/builder/spi-builder-workspace/.swiftpm/xcode
SwiftDriverJobDiscovery normal arm64 Compiling Closable.swift, CodableResult.swift, CollectionAlgorithms.swift, CollectionExtensions.swift, Condition.swift (in target 'TSCBasic' from project 'swift-tools-support-core')
SwiftCompile normal arm64 Compiling\ InterruptHandler.swift,\ JSONMessageStreamingParser.swift,\ Netrc.swift,\ OSLog.swift /Users/admin/builder/spi-builder-workspace/.dependencies/checkouts/swift-tools-support-core/Sources/TSCUtility/InterruptHandler.swift /Users/admin/builder/spi-builder-workspace/.dependencies/checkouts/swift-tools-support-core/Sources/TSCUtility/JSONMessageStreamingParser.swift /Users/admin/builder/spi-builder-workspace/.dependencies/checkouts/swift-tools-support-core/Sources/TSCUtility/Netrc.swift /Users/admin/builder/spi-builder-workspace/.dependencies/checkouts/swift-tools-support-core/Sources/TSCUtility/OSLog.swift (in target 'TSCUtility' from project 'swift-tools-support-core')
SwiftCompile normal arm64 /Users/admin/builder/spi-builder-workspace/.dependencies/checkouts/swift-tools-support-core/Sources/TSCUtility/InterruptHandler.swift (in target 'TSCUtility' from project 'swift-tools-support-core')
cd /Users/admin/builder/spi-builder-workspace/.swiftpm/xcode
SwiftCompile normal arm64 /Users/admin/builder/spi-builder-workspace/.dependencies/checkouts/swift-tools-support-core/Sources/TSCUtility/JSONMessageStreamingParser.swift (in target 'TSCUtility' from project 'swift-tools-support-core')
cd /Users/admin/builder/spi-builder-workspace/.swiftpm/xcode
SwiftCompile normal arm64 /Users/admin/builder/spi-builder-workspace/.dependencies/checkouts/swift-tools-support-core/Sources/TSCUtility/Netrc.swift (in target 'TSCUtility' from project 'swift-tools-support-core')
cd /Users/admin/builder/spi-builder-workspace/.swiftpm/xcode
SwiftCompile normal arm64 /Users/admin/builder/spi-builder-workspace/.dependencies/checkouts/swift-tools-support-core/Sources/TSCUtility/OSLog.swift (in target 'TSCUtility' from project 'swift-tools-support-core')
cd /Users/admin/builder/spi-builder-workspace/.swiftpm/xcode
SwiftDriverJobDiscovery normal arm64 Compiling JSONMapper.swift, KeyedPair.swift, LazyCache.swift, Lock.swift (in target 'TSCBasic' from project 'swift-tools-support-core')
SwiftCompile normal arm64 Compiling\ OrderedZip.swift,\ PersistenceCache.swift,\ PkgConfig.swift,\ Platform.swift /Users/admin/builder/spi-builder-workspace/.dependencies/checkouts/swift-tools-support-core/Sources/TSCUtility/OrderedZip.swift /Users/admin/builder/spi-builder-workspace/.dependencies/checkouts/swift-tools-support-core/Sources/TSCUtility/PersistenceCache.swift /Users/admin/builder/spi-builder-workspace/.dependencies/checkouts/swift-tools-support-core/Sources/TSCUtility/PkgConfig.swift /Users/admin/builder/spi-builder-workspace/.dependencies/checkouts/swift-tools-support-core/Sources/TSCUtility/Platform.swift (in target 'TSCUtility' from project 'swift-tools-support-core')
SwiftCompile normal arm64 /Users/admin/builder/spi-builder-workspace/.dependencies/checkouts/swift-tools-support-core/Sources/TSCUtility/OrderedZip.swift (in target 'TSCUtility' from project 'swift-tools-support-core')
cd /Users/admin/builder/spi-builder-workspace/.swiftpm/xcode
SwiftCompile normal arm64 /Users/admin/builder/spi-builder-workspace/.dependencies/checkouts/swift-tools-support-core/Sources/TSCUtility/PersistenceCache.swift (in target 'TSCUtility' from project 'swift-tools-support-core')
cd /Users/admin/builder/spi-builder-workspace/.swiftpm/xcode
SwiftCompile normal arm64 /Users/admin/builder/spi-builder-workspace/.dependencies/checkouts/swift-tools-support-core/Sources/TSCUtility/PkgConfig.swift (in target 'TSCUtility' from project 'swift-tools-support-core')
cd /Users/admin/builder/spi-builder-workspace/.swiftpm/xcode
SwiftCompile normal arm64 /Users/admin/builder/spi-builder-workspace/.dependencies/checkouts/swift-tools-support-core/Sources/TSCUtility/Platform.swift (in target 'TSCUtility' from project 'swift-tools-support-core')
cd /Users/admin/builder/spi-builder-workspace/.swiftpm/xcode
SwiftDriverJobDiscovery normal arm64 Compiling Await.swift, Base64URL.swift, ByteString.swift, CStringArray.swift, CacheableSequence.swift (in target 'TSCBasic' from project 'swift-tools-support-core')
SwiftCompile normal arm64 Compiling\ SimplePersistence.swift,\ StringExtensions.swift,\ StringMangling.swift,\ Tracing.swift /Users/admin/builder/spi-builder-workspace/.dependencies/checkouts/swift-tools-support-core/Sources/TSCUtility/SimplePersistence.swift /Users/admin/builder/spi-builder-workspace/.dependencies/checkouts/swift-tools-support-core/Sources/TSCUtility/StringExtensions.swift /Users/admin/builder/spi-builder-workspace/.dependencies/checkouts/swift-tools-support-core/Sources/TSCUtility/StringMangling.swift /Users/admin/builder/spi-builder-workspace/.dependencies/checkouts/swift-tools-support-core/Sources/TSCUtility/Tracing.swift (in target 'TSCUtility' from project 'swift-tools-support-core')
SwiftCompile normal arm64 /Users/admin/builder/spi-builder-workspace/.dependencies/checkouts/swift-tools-support-core/Sources/TSCUtility/SimplePersistence.swift (in target 'TSCUtility' from project 'swift-tools-support-core')
cd /Users/admin/builder/spi-builder-workspace/.swiftpm/xcode
SwiftCompile normal arm64 /Users/admin/builder/spi-builder-workspace/.dependencies/checkouts/swift-tools-support-core/Sources/TSCUtility/StringExtensions.swift (in target 'TSCUtility' from project 'swift-tools-support-core')
cd /Users/admin/builder/spi-builder-workspace/.swiftpm/xcode
SwiftCompile normal arm64 /Users/admin/builder/spi-builder-workspace/.dependencies/checkouts/swift-tools-support-core/Sources/TSCUtility/StringMangling.swift (in target 'TSCUtility' from project 'swift-tools-support-core')
cd /Users/admin/builder/spi-builder-workspace/.swiftpm/xcode
SwiftCompile normal arm64 /Users/admin/builder/spi-builder-workspace/.dependencies/checkouts/swift-tools-support-core/Sources/TSCUtility/Tracing.swift (in target 'TSCUtility' from project 'swift-tools-support-core')
cd /Users/admin/builder/spi-builder-workspace/.swiftpm/xcode
SwiftDriverJobDiscovery normal arm64 Compiling Constructor.swift, Decoder.swift (in target 'Yams' from project 'Yams')
SwiftDriver\ Compilation Yams normal arm64 com.apple.xcode.tools.swift.compiler (in target 'Yams' from project 'Yams')
cd /Users/admin/builder/spi-builder-workspace/.swiftpm/xcode
builtin-Swift-Compilation -- /Applications/Xcode-16.3.0.app/Contents/Developer/Toolchains/XcodeDefault.xctoolchain/usr/bin/swiftc -module-name Yams -Onone -enforce-exclusivity\=checked @/Users/admin/builder/spi-builder-workspace/.derivedData/Build/Intermediates.noindex/Yams.build/Debug-iphoneos/Yams.build/Objects-normal/arm64/Yams.SwiftFileList -DSWIFT_PACKAGE -DDEBUG -DXcode -plugin-path /Applications/Xcode-16.3.0.app/Contents/Developer/Toolchains/XcodeDefault.xctoolchain/usr/lib/swift/host/plugins/testing -enable-experimental-feature DebugDescriptionMacro -sdk /Applications/Xcode-16.3.0.app/Contents/Developer/Platforms/iPhoneOS.platform/Developer/SDKs/iPhoneOS18.4.sdk -target arm64-apple-ios12.0 -g -module-cache-path /Users/admin/builder/spi-builder-workspace/.derivedData/ModuleCache.noindex -Xfrontend -serialize-debugging-options -profile-coverage-mapping -profile-generate -enable-testing -suppress-warnings -index-store-path /Users/admin/builder/spi-builder-workspace/.derivedData/Index.noindex/DataStore -swift-version 5 -I /Users/admin/builder/spi-builder-workspace/.derivedData/Build/Products/Debug-iphoneos -I /Applications/Xcode-16.3.0.app/Contents/Developer/Platforms/iPhoneOS.platform/Developer/usr/lib -F /Users/admin/builder/spi-builder-workspace/.derivedData/Build/Products/Debug-iphoneos/PackageFrameworks -F /Users/admin/builder/spi-builder-workspace/.derivedData/Build/Products/Debug-iphoneos -F /Applications/Xcode-16.3.0.app/Contents/Developer/Platforms/iPhoneOS.platform/Developer/Library/Frameworks -F /Applications/Xcode-16.3.0.app/Contents/Developer/Platforms/iPhoneOS.platform/Developer/SDKs/iPhoneOS18.4.sdk/Developer/Library/Frameworks -c -j10 -enable-batch-mode -incremental -Xcc -ivfsstatcache -Xcc /Users/admin/builder/spi-builder-workspace/.derivedData/SDKStatCaches.noindex/iphoneos18.4-22E235-339d34bc69d7fc736c3220795c36f340.sdkstatcache -output-file-map /Users/admin/builder/spi-builder-workspace/.derivedData/Build/Intermediates.noindex/Yams.build/Debug-iphoneos/Yams.build/Objects-normal/arm64/Yams-OutputFileMap.json -use-frontend-parseable-output -save-temps -no-color-diagnostics -serialize-diagnostics -emit-dependencies -emit-module -emit-module-path /Users/admin/builder/spi-builder-workspace/.derivedData/Build/Intermediates.noindex/Yams.build/Debug-iphoneos/Yams.build/Objects-normal/arm64/Yams.swiftmodule -validate-clang-modules-once -clang-build-session-file /Users/admin/builder/spi-builder-workspace/.derivedData/ModuleCache.noindex/Session.modulevalidation -Xcc -I/Users/admin/builder/spi-builder-workspace/.derivedData/Build/Intermediates.noindex/Yams.build/Debug-iphoneos/Yams.build/swift-overrides.hmap -emit-const-values -Xfrontend -const-gather-protocols-file -Xfrontend /Users/admin/builder/spi-builder-workspace/.derivedData/Build/Intermediates.noindex/Yams.build/Debug-iphoneos/Yams.build/Objects-normal/arm64/Yams_const_extract_protocols.json -Xcc -I/Users/admin/builder/spi-builder-workspace/.dependencies/checkouts/Yams/Sources/CYaml/include -Xcc -I/Users/admin/builder/spi-builder-workspace/.derivedData/Build/Products/Debug-iphoneos/include -Xcc -I/Users/admin/builder/spi-builder-workspace/.derivedData/Build/Intermediates.noindex/Yams.build/Debug-iphoneos/Yams.build/DerivedSources-normal/arm64 -Xcc -I/Users/admin/builder/spi-builder-workspace/.derivedData/Build/Intermediates.noindex/Yams.build/Debug-iphoneos/Yams.build/DerivedSources/arm64 -Xcc -I/Users/admin/builder/spi-builder-workspace/.derivedData/Build/Intermediates.noindex/Yams.build/Debug-iphoneos/Yams.build/DerivedSources -Xcc -DSWIFT_PACKAGE -Xcc -DDEBUG\=1 -emit-objc-header -emit-objc-header-path /Users/admin/builder/spi-builder-workspace/.derivedData/Build/Intermediates.noindex/Yams.build/Debug-iphoneos/Yams.build/Objects-normal/arm64/Yams-Swift.h -working-directory /Users/admin/builder/spi-builder-workspace/.swiftpm/xcode -experimental-emit-module-separately -disable-cmo
SwiftDriverJobDiscovery normal arm64 Compiling OSLog.swift, ObjectIdentifierProtocol.swift, OrderedDictionary.swift, OrderedSet.swift (in target 'TSCBasic' from project 'swift-tools-support-core')
SwiftCompile normal arm64 Compiling\ Triple.swift,\ URL.swift,\ Verbosity.swift,\ Version.swift /Users/admin/builder/spi-builder-workspace/.dependencies/checkouts/swift-tools-support-core/Sources/TSCUtility/Triple.swift /Users/admin/builder/spi-builder-workspace/.dependencies/checkouts/swift-tools-support-core/Sources/TSCUtility/URL.swift /Users/admin/builder/spi-builder-workspace/.dependencies/checkouts/swift-tools-support-core/Sources/TSCUtility/Verbosity.swift /Users/admin/builder/spi-builder-workspace/.dependencies/checkouts/swift-tools-support-core/Sources/TSCUtility/Version.swift (in target 'TSCUtility' from project 'swift-tools-support-core')
SwiftCompile normal arm64 /Users/admin/builder/spi-builder-workspace/.dependencies/checkouts/swift-tools-support-core/Sources/TSCUtility/Triple.swift (in target 'TSCUtility' from project 'swift-tools-support-core')
cd /Users/admin/builder/spi-builder-workspace/.swiftpm/xcode
SwiftCompile normal arm64 /Users/admin/builder/spi-builder-workspace/.dependencies/checkouts/swift-tools-support-core/Sources/TSCUtility/URL.swift (in target 'TSCUtility' from project 'swift-tools-support-core')
cd /Users/admin/builder/spi-builder-workspace/.swiftpm/xcode
SwiftCompile normal arm64 /Users/admin/builder/spi-builder-workspace/.dependencies/checkouts/swift-tools-support-core/Sources/TSCUtility/Verbosity.swift (in target 'TSCUtility' from project 'swift-tools-support-core')
cd /Users/admin/builder/spi-builder-workspace/.swiftpm/xcode
SwiftCompile normal arm64 /Users/admin/builder/spi-builder-workspace/.dependencies/checkouts/swift-tools-support-core/Sources/TSCUtility/Version.swift (in target 'TSCUtility' from project 'swift-tools-support-core')
cd /Users/admin/builder/spi-builder-workspace/.swiftpm/xcode
SwiftCompile normal arm64 Compiling\ FloatingPointExtensions.swift,\ Git.swift,\ Hex.swift,\ IndexStore.swift /Users/admin/builder/spi-builder-workspace/.dependencies/checkouts/swift-tools-support-core/Sources/TSCUtility/FloatingPointExtensions.swift /Users/admin/builder/spi-builder-workspace/.dependencies/checkouts/swift-tools-support-core/Sources/TSCUtility/Git.swift /Users/admin/builder/spi-builder-workspace/.dependencies/checkouts/swift-tools-support-core/Sources/TSCUtility/Hex.swift /Users/admin/builder/spi-builder-workspace/.dependencies/checkouts/swift-tools-support-core/Sources/TSCUtility/IndexStore.swift (in target 'TSCUtility' from project 'swift-tools-support-core')
SwiftCompile normal arm64 /Users/admin/builder/spi-builder-workspace/.dependencies/checkouts/swift-tools-support-core/Sources/TSCUtility/FloatingPointExtensions.swift (in target 'TSCUtility' from project 'swift-tools-support-core')
cd /Users/admin/builder/spi-builder-workspace/.swiftpm/xcode
SwiftCompile normal arm64 /Users/admin/builder/spi-builder-workspace/.dependencies/checkouts/swift-tools-support-core/Sources/TSCUtility/Git.swift (in target 'TSCUtility' from project 'swift-tools-support-core')
cd /Users/admin/builder/spi-builder-workspace/.swiftpm/xcode
SwiftCompile normal arm64 /Users/admin/builder/spi-builder-workspace/.dependencies/checkouts/swift-tools-support-core/Sources/TSCUtility/Hex.swift (in target 'TSCUtility' from project 'swift-tools-support-core')
cd /Users/admin/builder/spi-builder-workspace/.swiftpm/xcode
SwiftCompile normal arm64 /Users/admin/builder/spi-builder-workspace/.dependencies/checkouts/swift-tools-support-core/Sources/TSCUtility/IndexStore.swift (in target 'TSCUtility' from project 'swift-tools-support-core')
cd /Users/admin/builder/spi-builder-workspace/.swiftpm/xcode
SwiftDriverJobDiscovery normal arm64 Compiling ProcessSet.swift, RegEx.swift, Result.swift, SortedArray.swift (in target 'TSCBasic' from project 'swift-tools-support-core')
SwiftCompile normal arm64 Compiling\ PolymorphicCodable.swift,\ ProgressAnimation.swift,\ SQLite.swift,\ SerializedDiagnostics.swift /Users/admin/builder/spi-builder-workspace/.dependencies/checkouts/swift-tools-support-core/Sources/TSCUtility/PolymorphicCodable.swift /Users/admin/builder/spi-builder-workspace/.dependencies/checkouts/swift-tools-support-core/Sources/TSCUtility/ProgressAnimation.swift /Users/admin/builder/spi-builder-workspace/.dependencies/checkouts/swift-tools-support-core/Sources/TSCUtility/SQLite.swift /Users/admin/builder/spi-builder-workspace/.dependencies/checkouts/swift-tools-support-core/Sources/TSCUtility/SerializedDiagnostics.swift (in target 'TSCUtility' from project 'swift-tools-support-core')
SwiftCompile normal arm64 /Users/admin/builder/spi-builder-workspace/.dependencies/checkouts/swift-tools-support-core/Sources/TSCUtility/PolymorphicCodable.swift (in target 'TSCUtility' from project 'swift-tools-support-core')
cd /Users/admin/builder/spi-builder-workspace/.swiftpm/xcode
SwiftCompile normal arm64 /Users/admin/builder/spi-builder-workspace/.dependencies/checkouts/swift-tools-support-core/Sources/TSCUtility/ProgressAnimation.swift (in target 'TSCUtility' from project 'swift-tools-support-core')
cd /Users/admin/builder/spi-builder-workspace/.swiftpm/xcode
SwiftCompile normal arm64 /Users/admin/builder/spi-builder-workspace/.dependencies/checkouts/swift-tools-support-core/Sources/TSCUtility/SQLite.swift (in target 'TSCUtility' from project 'swift-tools-support-core')
cd /Users/admin/builder/spi-builder-workspace/.swiftpm/xcode
SwiftCompile normal arm64 /Users/admin/builder/spi-builder-workspace/.dependencies/checkouts/swift-tools-support-core/Sources/TSCUtility/SerializedDiagnostics.swift (in target 'TSCUtility' from project 'swift-tools-support-core')
cd /Users/admin/builder/spi-builder-workspace/.swiftpm/xcode
SwiftDriverJobDiscovery normal arm64 Compiling DeltaAlgorithm.swift, DiagnosticsEngine.swift, DictionaryExtensions.swift, DictionaryLiteralExtensions.swift, EditDistance.swift (in target 'TSCBasic' from project 'swift-tools-support-core')
SwiftCompile normal arm64 Compiling\ Versioning.swift,\ dlopen.swift,\ misc.swift /Users/admin/builder/spi-builder-workspace/.dependencies/checkouts/swift-tools-support-core/Sources/TSCUtility/Versioning.swift /Users/admin/builder/spi-builder-workspace/.dependencies/checkouts/swift-tools-support-core/Sources/TSCUtility/dlopen.swift /Users/admin/builder/spi-builder-workspace/.dependencies/checkouts/swift-tools-support-core/Sources/TSCUtility/misc.swift (in target 'TSCUtility' from project 'swift-tools-support-core')
SwiftCompile normal arm64 /Users/admin/builder/spi-builder-workspace/.dependencies/checkouts/swift-tools-support-core/Sources/TSCUtility/Versioning.swift (in target 'TSCUtility' from project 'swift-tools-support-core')
cd /Users/admin/builder/spi-builder-workspace/.swiftpm/xcode
SwiftCompile normal arm64 /Users/admin/builder/spi-builder-workspace/.dependencies/checkouts/swift-tools-support-core/Sources/TSCUtility/dlopen.swift (in target 'TSCUtility' from project 'swift-tools-support-core')
cd /Users/admin/builder/spi-builder-workspace/.swiftpm/xcode
SwiftCompile normal arm64 /Users/admin/builder/spi-builder-workspace/.dependencies/checkouts/swift-tools-support-core/Sources/TSCUtility/misc.swift (in target 'TSCUtility' from project 'swift-tools-support-core')
cd /Users/admin/builder/spi-builder-workspace/.swiftpm/xcode
SwiftDriverJobDiscovery normal arm64 Compiling InterruptHandler.swift, JSONMessageStreamingParser.swift, Netrc.swift, OSLog.swift (in target 'TSCUtility' from project 'swift-tools-support-core')
SwiftCompile normal arm64 Compiling\ Bits.swift,\ Bitstream.swift,\ BuildFlags.swift,\ CollectionExtensions.swift /Users/admin/builder/spi-builder-workspace/.dependencies/checkouts/swift-tools-support-core/Sources/TSCUtility/Bits.swift /Users/admin/builder/spi-builder-workspace/.dependencies/checkouts/swift-tools-support-core/Sources/TSCUtility/Bitstream.swift /Users/admin/builder/spi-builder-workspace/.dependencies/checkouts/swift-tools-support-core/Sources/TSCUtility/BuildFlags.swift /Users/admin/builder/spi-builder-workspace/.dependencies/checkouts/swift-tools-support-core/Sources/TSCUtility/CollectionExtensions.swift (in target 'TSCUtility' from project 'swift-tools-support-core')
SwiftCompile normal arm64 /Users/admin/builder/spi-builder-workspace/.dependencies/checkouts/swift-tools-support-core/Sources/TSCUtility/Bits.swift (in target 'TSCUtility' from project 'swift-tools-support-core')
cd /Users/admin/builder/spi-builder-workspace/.swiftpm/xcode
SwiftCompile normal arm64 /Users/admin/builder/spi-builder-workspace/.dependencies/checkouts/swift-tools-support-core/Sources/TSCUtility/Bitstream.swift (in target 'TSCUtility' from project 'swift-tools-support-core')
cd /Users/admin/builder/spi-builder-workspace/.swiftpm/xcode
SwiftCompile normal arm64 /Users/admin/builder/spi-builder-workspace/.dependencies/checkouts/swift-tools-support-core/Sources/TSCUtility/BuildFlags.swift (in target 'TSCUtility' from project 'swift-tools-support-core')
cd /Users/admin/builder/spi-builder-workspace/.swiftpm/xcode
SwiftCompile normal arm64 /Users/admin/builder/spi-builder-workspace/.dependencies/checkouts/swift-tools-support-core/Sources/TSCUtility/CollectionExtensions.swift (in target 'TSCUtility' from project 'swift-tools-support-core')
cd /Users/admin/builder/spi-builder-workspace/.swiftpm/xcode
SwiftDriverJobDiscovery normal arm64 Compiling Context.swift, Diagnostics.swift, Downloader.swift, FSWatch.swift (in target 'TSCUtility' from project 'swift-tools-support-core')
SwiftCompile normal arm64 Compiling\ StringConversions.swift,\ SynchronizedQueue.swift,\ TemporaryFile.swift,\ TerminalController.swift /Users/admin/builder/spi-builder-workspace/.dependencies/checkouts/swift-tools-support-core/Sources/TSCBasic/StringConversions.swift /Users/admin/builder/spi-builder-workspace/.dependencies/checkouts/swift-tools-support-core/Sources/TSCBasic/SynchronizedQueue.swift /Users/admin/builder/spi-builder-workspace/.dependencies/checkouts/swift-tools-support-core/Sources/TSCBasic/TemporaryFile.swift /Users/admin/builder/spi-builder-workspace/.dependencies/checkouts/swift-tools-support-core/Sources/TSCBasic/TerminalController.swift (in target 'TSCBasic' from project 'swift-tools-support-core')
SwiftCompile normal arm64 /Users/admin/builder/spi-builder-workspace/.dependencies/checkouts/swift-tools-support-core/Sources/TSCBasic/StringConversions.swift (in target 'TSCBasic' from project 'swift-tools-support-core')
cd /Users/admin/builder/spi-builder-workspace/.swiftpm/xcode
SwiftCompile normal arm64 /Users/admin/builder/spi-builder-workspace/.dependencies/checkouts/swift-tools-support-core/Sources/TSCBasic/SynchronizedQueue.swift (in target 'TSCBasic' from project 'swift-tools-support-core')
cd /Users/admin/builder/spi-builder-workspace/.swiftpm/xcode
SwiftCompile normal arm64 /Users/admin/builder/spi-builder-workspace/.dependencies/checkouts/swift-tools-support-core/Sources/TSCBasic/TemporaryFile.swift (in target 'TSCBasic' from project 'swift-tools-support-core')
cd /Users/admin/builder/spi-builder-workspace/.swiftpm/xcode
SwiftCompile normal arm64 /Users/admin/builder/spi-builder-workspace/.dependencies/checkouts/swift-tools-support-core/Sources/TSCBasic/TerminalController.swift (in target 'TSCBasic' from project 'swift-tools-support-core')
cd /Users/admin/builder/spi-builder-workspace/.swiftpm/xcode
SwiftDriverJobDiscovery normal arm64 Emitting module for TSCUtility (in target 'TSCUtility' from project 'swift-tools-support-core')
SwiftDriver\ Compilation\ Requirements TSCUtility normal arm64 com.apple.xcode.tools.swift.compiler (in target 'TSCUtility' from project 'swift-tools-support-core')
cd /Users/admin/builder/spi-builder-workspace/.swiftpm/xcode
builtin-Swift-Compilation-Requirements -- /Applications/Xcode-16.3.0.app/Contents/Developer/Toolchains/XcodeDefault.xctoolchain/usr/bin/swiftc -module-name TSCUtility -Onone -enforce-exclusivity\=checked @/Users/admin/builder/spi-builder-workspace/.derivedData/Build/Intermediates.noindex/swift-tools-support-core.build/Debug-iphoneos/TSCUtility.build/Objects-normal/arm64/TSCUtility.SwiftFileList -DSWIFT_PACKAGE -DDEBUG -DXcode -plugin-path /Applications/Xcode-16.3.0.app/Contents/Developer/Toolchains/XcodeDefault.xctoolchain/usr/lib/swift/host/plugins/testing -enable-experimental-feature DebugDescriptionMacro -sdk /Applications/Xcode-16.3.0.app/Contents/Developer/Platforms/iPhoneOS.platform/Developer/SDKs/iPhoneOS18.4.sdk -target arm64-apple-ios12.0 -g -module-cache-path /Users/admin/builder/spi-builder-workspace/.derivedData/ModuleCache.noindex -Xfrontend -serialize-debugging-options -profile-coverage-mapping -profile-generate -enable-testing -suppress-warnings -index-store-path /Users/admin/builder/spi-builder-workspace/.derivedData/Index.noindex/DataStore -swift-version 5 -I /Users/admin/builder/spi-builder-workspace/.derivedData/Build/Products/Debug-iphoneos -I /Applications/Xcode-16.3.0.app/Contents/Developer/Platforms/iPhoneOS.platform/Developer/usr/lib -F /Users/admin/builder/spi-builder-workspace/.derivedData/Build/Products/Debug-iphoneos/PackageFrameworks -F /Users/admin/builder/spi-builder-workspace/.derivedData/Build/Products/Debug-iphoneos/PackageFrameworks -F /Users/admin/builder/spi-builder-workspace/.derivedData/Build/Products/Debug-iphoneos/PackageFrameworks -F /Users/admin/builder/spi-builder-workspace/.derivedData/Build/Products/Debug-iphoneos -F /Applications/Xcode-16.3.0.app/Contents/Developer/Platforms/iPhoneOS.platform/Developer/Library/Frameworks -F /Applications/Xcode-16.3.0.app/Contents/Developer/Platforms/iPhoneOS.platform/Developer/SDKs/iPhoneOS18.4.sdk/Developer/Library/Frameworks -c -j10 -enable-batch-mode -incremental -Xcc -ivfsstatcache -Xcc /Users/admin/builder/spi-builder-workspace/.derivedData/SDKStatCaches.noindex/iphoneos18.4-22E235-339d34bc69d7fc736c3220795c36f340.sdkstatcache -output-file-map /Users/admin/builder/spi-builder-workspace/.derivedData/Build/Intermediates.noindex/swift-tools-support-core.build/Debug-iphoneos/TSCUtility.build/Objects-normal/arm64/TSCUtility-OutputFileMap.json -use-frontend-parseable-output -save-temps -no-color-diagnostics -serialize-diagnostics -emit-dependencies -emit-module -emit-module-path /Users/admin/builder/spi-builder-workspace/.derivedData/Build/Intermediates.noindex/swift-tools-support-core.build/Debug-iphoneos/TSCUtility.build/Objects-normal/arm64/TSCUtility.swiftmodule -validate-clang-modules-once -clang-build-session-file /Users/admin/builder/spi-builder-workspace/.derivedData/ModuleCache.noindex/Session.modulevalidation -Xcc -I/Users/admin/builder/spi-builder-workspace/.derivedData/Build/Intermediates.noindex/swift-tools-support-core.build/Debug-iphoneos/TSCUtility.build/swift-overrides.hmap -emit-const-values -Xfrontend -const-gather-protocols-file -Xfrontend /Users/admin/builder/spi-builder-workspace/.derivedData/Build/Intermediates.noindex/swift-tools-support-core.build/Debug-iphoneos/TSCUtility.build/Objects-normal/arm64/TSCUtility_const_extract_protocols.json -Xcc -I/Users/admin/builder/spi-builder-workspace/.dependencies/checkouts/swift-tools-support-core/Sources/TSCclibc/include -Xcc -I/Users/admin/builder/spi-builder-workspace/.derivedData/Build/Products/Debug-iphoneos/include -Xcc -I/Users/admin/builder/spi-builder-workspace/.derivedData/Build/Intermediates.noindex/swift-tools-support-core.build/Debug-iphoneos/TSCUtility.build/DerivedSources-normal/arm64 -Xcc -I/Users/admin/builder/spi-builder-workspace/.derivedData/Build/Intermediates.noindex/swift-tools-support-core.build/Debug-iphoneos/TSCUtility.build/DerivedSources/arm64 -Xcc -I/Users/admin/builder/spi-builder-workspace/.derivedData/Build/Intermediates.noindex/swift-tools-support-core.build/Debug-iphoneos/TSCUtility.build/DerivedSources -Xcc -DSWIFT_PACKAGE -Xcc -DDEBUG\=1 -emit-objc-header -emit-objc-header-path /Users/admin/builder/spi-builder-workspace/.derivedData/Build/Intermediates.noindex/swift-tools-support-core.build/Debug-iphoneos/TSCUtility.build/Objects-normal/arm64/TSCUtility-Swift.h -working-directory /Users/admin/builder/spi-builder-workspace/.swiftpm/xcode -experimental-emit-module-separately -disable-cmo
SwiftDriverJobDiscovery normal arm64 Compiling Thread.swift, Tuple.swift, WritableByteStream.swift, misc.swift (in target 'TSCBasic' from project 'swift-tools-support-core')
SwiftCompile normal arm64 Compiling\ FileInfo.swift,\ FileSystem.swift,\ GraphAlgorithms.swift,\ HashAlgorithms.swift,\ JSON.swift /Users/admin/builder/spi-builder-workspace/.dependencies/checkouts/swift-tools-support-core/Sources/TSCBasic/FileInfo.swift /Users/admin/builder/spi-builder-workspace/.dependencies/checkouts/swift-tools-support-core/Sources/TSCBasic/FileSystem.swift /Users/admin/builder/spi-builder-workspace/.dependencies/checkouts/swift-tools-support-core/Sources/TSCBasic/GraphAlgorithms.swift /Users/admin/builder/spi-builder-workspace/.dependencies/checkouts/swift-tools-support-core/Sources/TSCBasic/HashAlgorithms.swift /Users/admin/builder/spi-builder-workspace/.dependencies/checkouts/swift-tools-support-core/Sources/TSCBasic/JSON.swift (in target 'TSCBasic' from project 'swift-tools-support-core')
SwiftCompile normal arm64 /Users/admin/builder/spi-builder-workspace/.dependencies/checkouts/swift-tools-support-core/Sources/TSCBasic/FileInfo.swift (in target 'TSCBasic' from project 'swift-tools-support-core')
cd /Users/admin/builder/spi-builder-workspace/.swiftpm/xcode
SwiftCompile normal arm64 /Users/admin/builder/spi-builder-workspace/.dependencies/checkouts/swift-tools-support-core/Sources/TSCBasic/FileSystem.swift (in target 'TSCBasic' from project 'swift-tools-support-core')
cd /Users/admin/builder/spi-builder-workspace/.swiftpm/xcode
SwiftCompile normal arm64 /Users/admin/builder/spi-builder-workspace/.dependencies/checkouts/swift-tools-support-core/Sources/TSCBasic/GraphAlgorithms.swift (in target 'TSCBasic' from project 'swift-tools-support-core')
cd /Users/admin/builder/spi-builder-workspace/.swiftpm/xcode
SwiftCompile normal arm64 /Users/admin/builder/spi-builder-workspace/.dependencies/checkouts/swift-tools-support-core/Sources/TSCBasic/HashAlgorithms.swift (in target 'TSCBasic' from project 'swift-tools-support-core')
cd /Users/admin/builder/spi-builder-workspace/.swiftpm/xcode
SwiftCompile normal arm64 /Users/admin/builder/spi-builder-workspace/.dependencies/checkouts/swift-tools-support-core/Sources/TSCBasic/JSON.swift (in target 'TSCBasic' from project 'swift-tools-support-core')
cd /Users/admin/builder/spi-builder-workspace/.swiftpm/xcode
SwiftCompile normal arm64 Compiling\ Path.swift,\ PathShims.swift,\ Process.swift,\ ProcessEnv.swift /Users/admin/builder/spi-builder-workspace/.dependencies/checkouts/swift-tools-support-core/Sources/TSCBasic/Path.swift /Users/admin/builder/spi-builder-workspace/.dependencies/checkouts/swift-tools-support-core/Sources/TSCBasic/PathShims.swift /Users/admin/builder/spi-builder-workspace/.dependencies/checkouts/swift-tools-support-core/Sources/TSCBasic/Process.swift /Users/admin/builder/spi-builder-workspace/.dependencies/checkouts/swift-tools-support-core/Sources/TSCBasic/ProcessEnv.swift (in target 'TSCBasic' from project 'swift-tools-support-core')
SwiftCompile normal arm64 /Users/admin/builder/spi-builder-workspace/.dependencies/checkouts/swift-tools-support-core/Sources/TSCBasic/Path.swift (in target 'TSCBasic' from project 'swift-tools-support-core')
cd /Users/admin/builder/spi-builder-workspace/.swiftpm/xcode
SwiftCompile normal arm64 /Users/admin/builder/spi-builder-workspace/.dependencies/checkouts/swift-tools-support-core/Sources/TSCBasic/PathShims.swift (in target 'TSCBasic' from project 'swift-tools-support-core')
cd /Users/admin/builder/spi-builder-workspace/.swiftpm/xcode
SwiftCompile normal arm64 /Users/admin/builder/spi-builder-workspace/.dependencies/checkouts/swift-tools-support-core/Sources/TSCBasic/Process.swift (in target 'TSCBasic' from project 'swift-tools-support-core')
cd /Users/admin/builder/spi-builder-workspace/.swiftpm/xcode
SwiftCompile normal arm64 /Users/admin/builder/spi-builder-workspace/.dependencies/checkouts/swift-tools-support-core/Sources/TSCBasic/ProcessEnv.swift (in target 'TSCBasic' from project 'swift-tools-support-core')
cd /Users/admin/builder/spi-builder-workspace/.swiftpm/xcode
SwiftDriverJobDiscovery normal arm64 Compiling OrderedZip.swift, PersistenceCache.swift, PkgConfig.swift, Platform.swift (in target 'TSCUtility' from project 'swift-tools-support-core')
Copy /Users/admin/builder/spi-builder-workspace/.derivedData/Build/Products/Debug-iphoneos/TSCUtility.swiftmodule/arm64-apple-ios.swiftmodule /Users/admin/builder/spi-builder-workspace/.derivedData/Build/Intermediates.noindex/swift-tools-support-core.build/Debug-iphoneos/TSCUtility.build/Objects-normal/arm64/TSCUtility.swiftmodule (in target 'TSCUtility' from project 'swift-tools-support-core')
cd /Users/admin/builder/spi-builder-workspace/.dependencies/checkouts/swift-tools-support-core
builtin-copy -exclude .DS_Store -exclude CVS -exclude .svn -exclude .git -exclude .hg -resolve-src-symlinks -rename /Users/admin/builder/spi-builder-workspace/.derivedData/Build/Intermediates.noindex/swift-tools-support-core.build/Debug-iphoneos/TSCUtility.build/Objects-normal/arm64/TSCUtility.swiftmodule /Users/admin/builder/spi-builder-workspace/.derivedData/Build/Products/Debug-iphoneos/TSCUtility.swiftmodule/arm64-apple-ios.swiftmodule
SwiftDriverJobDiscovery normal arm64 Compiling Versioning.swift, dlopen.swift, misc.swift (in target 'TSCUtility' from project 'swift-tools-support-core')
Copy /Users/admin/builder/spi-builder-workspace/.derivedData/Build/Products/Debug-iphoneos/TSCUtility.swiftmodule/arm64-apple-ios.abi.json /Users/admin/builder/spi-builder-workspace/.derivedData/Build/Intermediates.noindex/swift-tools-support-core.build/Debug-iphoneos/TSCUtility.build/Objects-normal/arm64/TSCUtility.abi.json (in target 'TSCUtility' from project 'swift-tools-support-core')
cd /Users/admin/builder/spi-builder-workspace/.dependencies/checkouts/swift-tools-support-core
builtin-copy -exclude .DS_Store -exclude CVS -exclude .svn -exclude .git -exclude .hg -resolve-src-symlinks -rename /Users/admin/builder/spi-builder-workspace/.derivedData/Build/Intermediates.noindex/swift-tools-support-core.build/Debug-iphoneos/TSCUtility.build/Objects-normal/arm64/TSCUtility.abi.json /Users/admin/builder/spi-builder-workspace/.derivedData/Build/Products/Debug-iphoneos/TSCUtility.swiftmodule/arm64-apple-ios.abi.json
SwiftDriver\ Compilation Files normal arm64 com.apple.xcode.tools.swift.compiler (in target 'Files' from project 'Files')
cd /Users/admin/builder/spi-builder-workspace/.swiftpm/xcode
builtin-Swift-Compilation -- /Applications/Xcode-16.3.0.app/Contents/Developer/Toolchains/XcodeDefault.xctoolchain/usr/bin/swiftc -module-name Files -Onone -enforce-exclusivity\=checked @/Users/admin/builder/spi-builder-workspace/.derivedData/Build/Intermediates.noindex/Files.build/Debug-iphoneos/Files.build/Objects-normal/arm64/Files.SwiftFileList -DSWIFT_PACKAGE -DDEBUG -DXcode -plugin-path /Applications/Xcode-16.3.0.app/Contents/Developer/Toolchains/XcodeDefault.xctoolchain/usr/lib/swift/host/plugins/testing -enable-experimental-feature DebugDescriptionMacro -sdk /Applications/Xcode-16.3.0.app/Contents/Developer/Platforms/iPhoneOS.platform/Developer/SDKs/iPhoneOS18.4.sdk -target arm64-apple-ios12.0 -g -module-cache-path /Users/admin/builder/spi-builder-workspace/.derivedData/ModuleCache.noindex -Xfrontend -serialize-debugging-options -profile-coverage-mapping -profile-generate -enable-testing -suppress-warnings -index-store-path /Users/admin/builder/spi-builder-workspace/.derivedData/Index.noindex/DataStore -swift-version 5 -I /Users/admin/builder/spi-builder-workspace/.derivedData/Build/Products/Debug-iphoneos -I /Applications/Xcode-16.3.0.app/Contents/Developer/Platforms/iPhoneOS.platform/Developer/usr/lib -F /Users/admin/builder/spi-builder-workspace/.derivedData/Build/Products/Debug-iphoneos -F /Applications/Xcode-16.3.0.app/Contents/Developer/Platforms/iPhoneOS.platform/Developer/Library/Frameworks -F /Applications/Xcode-16.3.0.app/Contents/Developer/Platforms/iPhoneOS.platform/Developer/SDKs/iPhoneOS18.4.sdk/Developer/Library/Frameworks -parse-as-library -c -j10 -enable-batch-mode -incremental -Xcc -ivfsstatcache -Xcc /Users/admin/builder/spi-builder-workspace/.derivedData/SDKStatCaches.noindex/iphoneos18.4-22E235-339d34bc69d7fc736c3220795c36f340.sdkstatcache -output-file-map /Users/admin/builder/spi-builder-workspace/.derivedData/Build/Intermediates.noindex/Files.build/Debug-iphoneos/Files.build/Objects-normal/arm64/Files-OutputFileMap.json -use-frontend-parseable-output -save-temps -no-color-diagnostics -serialize-diagnostics -emit-dependencies -emit-module -emit-module-path /Users/admin/builder/spi-builder-workspace/.derivedData/Build/Intermediates.noindex/Files.build/Debug-iphoneos/Files.build/Objects-normal/arm64/Files.swiftmodule -validate-clang-modules-once -clang-build-session-file /Users/admin/builder/spi-builder-workspace/.derivedData/ModuleCache.noindex/Session.modulevalidation -Xcc -I/Users/admin/builder/spi-builder-workspace/.derivedData/Build/Intermediates.noindex/Files.build/Debug-iphoneos/Files.build/swift-overrides.hmap -emit-const-values -Xfrontend -const-gather-protocols-file -Xfrontend /Users/admin/builder/spi-builder-workspace/.derivedData/Build/Intermediates.noindex/Files.build/Debug-iphoneos/Files.build/Objects-normal/arm64/Files_const_extract_protocols.json -Xcc -I/Users/admin/builder/spi-builder-workspace/.derivedData/Build/Products/Debug-iphoneos/include -Xcc -I/Users/admin/builder/spi-builder-workspace/.derivedData/Build/Intermediates.noindex/Files.build/Debug-iphoneos/Files.build/DerivedSources-normal/arm64 -Xcc -I/Users/admin/builder/spi-builder-workspace/.derivedData/Build/Intermediates.noindex/Files.build/Debug-iphoneos/Files.build/DerivedSources/arm64 -Xcc -I/Users/admin/builder/spi-builder-workspace/.derivedData/Build/Intermediates.noindex/Files.build/Debug-iphoneos/Files.build/DerivedSources -Xcc -DSWIFT_PACKAGE -Xcc -DDEBUG\=1 -emit-objc-header -emit-objc-header-path /Users/admin/builder/spi-builder-workspace/.derivedData/Build/Intermediates.noindex/Files.build/Debug-iphoneos/Files.build/Objects-normal/arm64/Files-Swift.h -working-directory /Users/admin/builder/spi-builder-workspace/.swiftpm/xcode -experimental-emit-module-separately -disable-cmo
SwiftCompile normal arm64 Compiling\ Flag.swift,\ NameSpecification.swift,\ Option.swift,\ OptionGroup.swift /Users/admin/builder/spi-builder-workspace/.dependencies/checkouts/swift-argument-parser/Sources/ArgumentParser/Parsable\ Properties/Flag.swift /Users/admin/builder/spi-builder-workspace/.dependencies/checkouts/swift-argument-parser/Sources/ArgumentParser/Parsable\ Properties/NameSpecification.swift /Users/admin/builder/spi-builder-workspace/.dependencies/checkouts/swift-argument-parser/Sources/ArgumentParser/Parsable\ Properties/Option.swift /Users/admin/builder/spi-builder-workspace/.dependencies/checkouts/swift-argument-parser/Sources/ArgumentParser/Parsable\ Properties/OptionGroup.swift (in target 'ArgumentParser' from project 'swift-argument-parser')
SwiftCompile normal arm64 /Users/admin/builder/spi-builder-workspace/.dependencies/checkouts/swift-argument-parser/Sources/ArgumentParser/Parsable\ Properties/Flag.swift (in target 'ArgumentParser' from project 'swift-argument-parser')
cd /Users/admin/builder/spi-builder-workspace/.swiftpm/xcode
SwiftCompile normal arm64 /Users/admin/builder/spi-builder-workspace/.dependencies/checkouts/swift-argument-parser/Sources/ArgumentParser/Parsable\ Properties/NameSpecification.swift (in target 'ArgumentParser' from project 'swift-argument-parser')
cd /Users/admin/builder/spi-builder-workspace/.swiftpm/xcode
SwiftCompile normal arm64 /Users/admin/builder/spi-builder-workspace/.dependencies/checkouts/swift-argument-parser/Sources/ArgumentParser/Parsable\ Properties/Option.swift (in target 'ArgumentParser' from project 'swift-argument-parser')
cd /Users/admin/builder/spi-builder-workspace/.swiftpm/xcode
SwiftCompile normal arm64 /Users/admin/builder/spi-builder-workspace/.dependencies/checkouts/swift-argument-parser/Sources/ArgumentParser/Parsable\ Properties/OptionGroup.swift (in target 'ArgumentParser' from project 'swift-argument-parser')
cd /Users/admin/builder/spi-builder-workspace/.swiftpm/xcode
SwiftDriver SwiftOptions normal arm64 com.apple.xcode.tools.swift.compiler (in target 'SwiftOptions' from project 'swift-driver')
cd /Users/admin/builder/spi-builder-workspace/.swiftpm/xcode
builtin-SwiftDriver -- /Applications/Xcode-16.3.0.app/Contents/Developer/Toolchains/XcodeDefault.xctoolchain/usr/bin/swiftc -module-name SwiftOptions -Onone -enforce-exclusivity\=checked @/Users/admin/builder/spi-builder-workspace/.derivedData/Build/Intermediates.noindex/swift-driver.build/Debug-iphoneos/SwiftOptions.build/Objects-normal/arm64/SwiftOptions.SwiftFileList -DSWIFT_PACKAGE -DDEBUG -DXcode -plugin-path /Applications/Xcode-16.3.0.app/Contents/Developer/Toolchains/XcodeDefault.xctoolchain/usr/lib/swift/host/plugins/testing -enable-experimental-feature DebugDescriptionMacro -sdk /Applications/Xcode-16.3.0.app/Contents/Developer/Platforms/iPhoneOS.platform/Developer/SDKs/iPhoneOS18.4.sdk -target arm64-apple-ios12.0 -g -module-cache-path /Users/admin/builder/spi-builder-workspace/.derivedData/ModuleCache.noindex -Xfrontend -serialize-debugging-options -profile-coverage-mapping -profile-generate -enable-testing -suppress-warnings -index-store-path /Users/admin/builder/spi-builder-workspace/.derivedData/Index.noindex/DataStore -swift-version 5 -I /Users/admin/builder/spi-builder-workspace/.derivedData/Build/Products/Debug-iphoneos -I /Applications/Xcode-16.3.0.app/Contents/Developer/Platforms/iPhoneOS.platform/Developer/usr/lib -F /Users/admin/builder/spi-builder-workspace/.derivedData/Build/Products/Debug-iphoneos/PackageFrameworks -F /Users/admin/builder/spi-builder-workspace/.derivedData/Build/Products/Debug-iphoneos/PackageFrameworks -F /Users/admin/builder/spi-builder-workspace/.derivedData/Build/Products/Debug-iphoneos/PackageFrameworks -F /Users/admin/builder/spi-builder-workspace/.derivedData/Build/Products/Debug-iphoneos/PackageFrameworks -F /Users/admin/builder/spi-builder-workspace/.derivedData/Build/Products/Debug-iphoneos -F /Applications/Xcode-16.3.0.app/Contents/Developer/Platforms/iPhoneOS.platform/Developer/Library/Frameworks -F /Applications/Xcode-16.3.0.app/Contents/Developer/Platforms/iPhoneOS.platform/Developer/SDKs/iPhoneOS18.4.sdk/Developer/Library/Frameworks -c -j10 -enable-batch-mode -incremental -Xcc -ivfsstatcache -Xcc /Users/admin/builder/spi-builder-workspace/.derivedData/SDKStatCaches.noindex/iphoneos18.4-22E235-339d34bc69d7fc736c3220795c36f340.sdkstatcache -output-file-map /Users/admin/builder/spi-builder-workspace/.derivedData/Build/Intermediates.noindex/swift-driver.build/Debug-iphoneos/SwiftOptions.build/Objects-normal/arm64/SwiftOptions-OutputFileMap.json -use-frontend-parseable-output -save-temps -no-color-diagnostics -serialize-diagnostics -emit-dependencies -emit-module -emit-module-path /Users/admin/builder/spi-builder-workspace/.derivedData/Build/Intermediates.noindex/swift-driver.build/Debug-iphoneos/SwiftOptions.build/Objects-normal/arm64/SwiftOptions.swiftmodule -validate-clang-modules-once -clang-build-session-file /Users/admin/builder/spi-builder-workspace/.derivedData/ModuleCache.noindex/Session.modulevalidation -Xcc -I/Users/admin/builder/spi-builder-workspace/.derivedData/Build/Intermediates.noindex/swift-driver.build/Debug-iphoneos/SwiftOptions.build/swift-overrides.hmap -emit-const-values -Xfrontend -const-gather-protocols-file -Xfrontend /Users/admin/builder/spi-builder-workspace/.derivedData/Build/Intermediates.noindex/swift-driver.build/Debug-iphoneos/SwiftOptions.build/Objects-normal/arm64/SwiftOptions_const_extract_protocols.json -Xcc -I/Users/admin/builder/spi-builder-workspace/.dependencies/checkouts/swift-tools-support-core/Sources/TSCclibc/include -Xcc -I/Users/admin/builder/spi-builder-workspace/.derivedData/Build/Products/Debug-iphoneos/include -Xcc -I/Users/admin/builder/spi-builder-workspace/.derivedData/Build/Intermediates.noindex/swift-driver.build/Debug-iphoneos/SwiftOptions.build/DerivedSources-normal/arm64 -Xcc -I/Users/admin/builder/spi-builder-workspace/.derivedData/Build/Intermediates.noindex/swift-driver.build/Debug-iphoneos/SwiftOptions.build/DerivedSources/arm64 -Xcc -I/Users/admin/builder/spi-builder-workspace/.derivedData/Build/Intermediates.noindex/swift-driver.build/Debug-iphoneos/SwiftOptions.build/DerivedSources -Xcc -DSWIFT_PACKAGE -Xcc -DDEBUG\=1 -emit-objc-header -emit-objc-header-path /Users/admin/builder/spi-builder-workspace/.derivedData/Build/Intermediates.noindex/swift-driver.build/Debug-iphoneos/SwiftOptions.build/Objects-normal/arm64/SwiftOptions-Swift.h -working-directory /Users/admin/builder/spi-builder-workspace/.swiftpm/xcode -experimental-emit-module-separately -disable-cmo
SwiftDriverJobDiscovery normal arm64 Compiling FloatingPointExtensions.swift, Git.swift, Hex.swift, IndexStore.swift (in target 'TSCUtility' from project 'swift-tools-support-core')
SwiftDriver Basics normal arm64 com.apple.xcode.tools.swift.compiler (in target 'Basics' from project 'SwiftPM')
cd /Users/admin/builder/spi-builder-workspace/.swiftpm/xcode
builtin-SwiftDriver -- /Applications/Xcode-16.3.0.app/Contents/Developer/Toolchains/XcodeDefault.xctoolchain/usr/bin/swiftc -module-name Basics -Onone -enforce-exclusivity\=checked @/Users/admin/builder/spi-builder-workspace/.derivedData/Build/Intermediates.noindex/SwiftPM.build/Debug-iphoneos/Basics.build/Objects-normal/arm64/Basics.SwiftFileList -DSWIFT_PACKAGE -DDEBUG -DXcode -plugin-path /Applications/Xcode-16.3.0.app/Contents/Developer/Toolchains/XcodeDefault.xctoolchain/usr/lib/swift/host/plugins/testing -enable-experimental-feature DebugDescriptionMacro -sdk /Applications/Xcode-16.3.0.app/Contents/Developer/Platforms/iPhoneOS.platform/Developer/SDKs/iPhoneOS18.4.sdk -target arm64-apple-ios12.0 -g -module-cache-path /Users/admin/builder/spi-builder-workspace/.derivedData/ModuleCache.noindex -Xfrontend -serialize-debugging-options -profile-coverage-mapping -profile-generate -enable-testing -suppress-warnings -index-store-path /Users/admin/builder/spi-builder-workspace/.derivedData/Index.noindex/DataStore -swift-version 5 -I /Users/admin/builder/spi-builder-workspace/.derivedData/Build/Products/Debug-iphoneos -I /Applications/Xcode-16.3.0.app/Contents/Developer/Platforms/iPhoneOS.platform/Developer/usr/lib -F /Users/admin/builder/spi-builder-workspace/.derivedData/Build/Products/Debug-iphoneos/PackageFrameworks -F /Users/admin/builder/spi-builder-workspace/.derivedData/Build/Products/Debug-iphoneos/PackageFrameworks -F /Users/admin/builder/spi-builder-workspace/.derivedData/Build/Products/Debug-iphoneos/PackageFrameworks -F /Users/admin/builder/spi-builder-workspace/.derivedData/Build/Products/Debug-iphoneos/PackageFrameworks -F /Users/admin/builder/spi-builder-workspace/.derivedData/Build/Products/Debug-iphoneos -F /Applications/Xcode-16.3.0.app/Contents/Developer/Platforms/iPhoneOS.platform/Developer/Library/Frameworks -F /Applications/Xcode-16.3.0.app/Contents/Developer/Platforms/iPhoneOS.platform/Developer/SDKs/iPhoneOS18.4.sdk/Developer/Library/Frameworks -c -j10 -enable-batch-mode -incremental -Xcc -ivfsstatcache -Xcc /Users/admin/builder/spi-builder-workspace/.derivedData/SDKStatCaches.noindex/iphoneos18.4-22E235-339d34bc69d7fc736c3220795c36f340.sdkstatcache -output-file-map /Users/admin/builder/spi-builder-workspace/.derivedData/Build/Intermediates.noindex/SwiftPM.build/Debug-iphoneos/Basics.build/Objects-normal/arm64/Basics-OutputFileMap.json -use-frontend-parseable-output -save-temps -no-color-diagnostics -serialize-diagnostics -emit-dependencies -emit-module -emit-module-path /Users/admin/builder/spi-builder-workspace/.derivedData/Build/Intermediates.noindex/SwiftPM.build/Debug-iphoneos/Basics.build/Objects-normal/arm64/Basics.swiftmodule -validate-clang-modules-once -clang-build-session-file /Users/admin/builder/spi-builder-workspace/.derivedData/ModuleCache.noindex/Session.modulevalidation -Xcc -I/Users/admin/builder/spi-builder-workspace/.derivedData/Build/Intermediates.noindex/SwiftPM.build/Debug-iphoneos/Basics.build/swift-overrides.hmap -emit-const-values -Xfrontend -const-gather-protocols-file -Xfrontend /Users/admin/builder/spi-builder-workspace/.derivedData/Build/Intermediates.noindex/SwiftPM.build/Debug-iphoneos/Basics.build/Objects-normal/arm64/Basics_const_extract_protocols.json -Xcc -I/Users/admin/builder/spi-builder-workspace/.dependencies/checkouts/swift-tools-support-core/Sources/TSCclibc/include -Xcc -I/Users/admin/builder/spi-builder-workspace/.derivedData/Build/Products/Debug-iphoneos/include -Xcc -I/Users/admin/builder/spi-builder-workspace/.derivedData/Build/Intermediates.noindex/SwiftPM.build/Debug-iphoneos/Basics.build/DerivedSources-normal/arm64 -Xcc -I/Users/admin/builder/spi-builder-workspace/.derivedData/Build/Intermediates.noindex/SwiftPM.build/Debug-iphoneos/Basics.build/DerivedSources/arm64 -Xcc -I/Users/admin/builder/spi-builder-workspace/.derivedData/Build/Intermediates.noindex/SwiftPM.build/Debug-iphoneos/Basics.build/DerivedSources -Xcc -DSWIFT_PACKAGE -Xcc -DDEBUG\=1 -emit-objc-header -emit-objc-header-path /Users/admin/builder/spi-builder-workspace/.derivedData/Build/Intermediates.noindex/SwiftPM.build/Debug-iphoneos/Basics.build/Objects-normal/arm64/Basics-Swift.h -working-directory /Users/admin/builder/spi-builder-workspace/.swiftpm/xcode -experimental-emit-module-separately -disable-cmo
SwiftEmitModule normal arm64 Emitting\ module\ for\ SwiftOptions (in target 'SwiftOptions' from project 'swift-driver')
EmitSwiftModule normal arm64 (in target 'SwiftOptions' from project 'swift-driver')
cd /Users/admin/builder/spi-builder-workspace/.swiftpm/xcode
SwiftDriverJobDiscovery normal arm64 Compiling Archiver.swift, ArgumentParser.swift, ArgumentParserShellCompletion.swift, Array+Extensions.swift (in target 'TSCUtility' from project 'swift-tools-support-core')
SwiftCompile normal arm64 Compiling\ OptionParsing.swift /Users/admin/builder/spi-builder-workspace/.dependencies/checkouts/swift-driver/Sources/SwiftOptions/OptionParsing.swift (in target 'SwiftOptions' from project 'swift-driver')
SwiftCompile normal arm64 /Users/admin/builder/spi-builder-workspace/.dependencies/checkouts/swift-driver/Sources/SwiftOptions/OptionParsing.swift (in target 'SwiftOptions' from project 'swift-driver')
cd /Users/admin/builder/spi-builder-workspace/.swiftpm/xcode
SwiftEmitModule normal arm64 Emitting\ module\ for\ Basics (in target 'Basics' from project 'SwiftPM')
EmitSwiftModule normal arm64 (in target 'Basics' from project 'SwiftPM')
cd /Users/admin/builder/spi-builder-workspace/.swiftpm/xcode
SwiftDriverJobDiscovery normal arm64 Compiling SimplePersistence.swift, StringExtensions.swift, StringMangling.swift, Tracing.swift (in target 'TSCUtility' from project 'swift-tools-support-core')
SwiftCompile normal arm64 Compiling\ PrefixTrie.swift /Users/admin/builder/spi-builder-workspace/.dependencies/checkouts/swift-driver/Sources/SwiftOptions/PrefixTrie.swift (in target 'SwiftOptions' from project 'swift-driver')
SwiftCompile normal arm64 /Users/admin/builder/spi-builder-workspace/.dependencies/checkouts/swift-driver/Sources/SwiftOptions/PrefixTrie.swift (in target 'SwiftOptions' from project 'swift-driver')
cd /Users/admin/builder/spi-builder-workspace/.swiftpm/xcode
SwiftDriverJobDiscovery normal arm64 Compiling StringConversions.swift, SynchronizedQueue.swift, TemporaryFile.swift, TerminalController.swift (in target 'TSCBasic' from project 'swift-tools-support-core')
SwiftCompile normal arm64 Compiling\ OptionTable.swift /Users/admin/builder/spi-builder-workspace/.dependencies/checkouts/swift-driver/Sources/SwiftOptions/OptionTable.swift (in target 'SwiftOptions' from project 'swift-driver')
SwiftCompile normal arm64 /Users/admin/builder/spi-builder-workspace/.dependencies/checkouts/swift-driver/Sources/SwiftOptions/OptionTable.swift (in target 'SwiftOptions' from project 'swift-driver')
cd /Users/admin/builder/spi-builder-workspace/.swiftpm/xcode
SwiftDriverJobDiscovery normal arm64 Compiling PolymorphicCodable.swift, ProgressAnimation.swift, SQLite.swift, SerializedDiagnostics.swift (in target 'TSCUtility' from project 'swift-tools-support-core')
SwiftCompile normal arm64 Compiling\ ExtraOptions.swift /Users/admin/builder/spi-builder-workspace/.dependencies/checkouts/swift-driver/Sources/SwiftOptions/ExtraOptions.swift (in target 'SwiftOptions' from project 'swift-driver')
SwiftCompile normal arm64 /Users/admin/builder/spi-builder-workspace/.dependencies/checkouts/swift-driver/Sources/SwiftOptions/ExtraOptions.swift (in target 'SwiftOptions' from project 'swift-driver')
cd /Users/admin/builder/spi-builder-workspace/.swiftpm/xcode
SwiftDriverJobDiscovery normal arm64 Emitting module for Basics (in target 'Basics' from project 'SwiftPM')
SwiftDriver\ Compilation\ Requirements Basics normal arm64 com.apple.xcode.tools.swift.compiler (in target 'Basics' from project 'SwiftPM')
cd /Users/admin/builder/spi-builder-workspace/.swiftpm/xcode
builtin-Swift-Compilation-Requirements -- /Applications/Xcode-16.3.0.app/Contents/Developer/Toolchains/XcodeDefault.xctoolchain/usr/bin/swiftc -module-name Basics -Onone -enforce-exclusivity\=checked @/Users/admin/builder/spi-builder-workspace/.derivedData/Build/Intermediates.noindex/SwiftPM.build/Debug-iphoneos/Basics.build/Objects-normal/arm64/Basics.SwiftFileList -DSWIFT_PACKAGE -DDEBUG -DXcode -plugin-path /Applications/Xcode-16.3.0.app/Contents/Developer/Toolchains/XcodeDefault.xctoolchain/usr/lib/swift/host/plugins/testing -enable-experimental-feature DebugDescriptionMacro -sdk /Applications/Xcode-16.3.0.app/Contents/Developer/Platforms/iPhoneOS.platform/Developer/SDKs/iPhoneOS18.4.sdk -target arm64-apple-ios12.0 -g -module-cache-path /Users/admin/builder/spi-builder-workspace/.derivedData/ModuleCache.noindex -Xfrontend -serialize-debugging-options -profile-coverage-mapping -profile-generate -enable-testing -suppress-warnings -index-store-path /Users/admin/builder/spi-builder-workspace/.derivedData/Index.noindex/DataStore -swift-version 5 -I /Users/admin/builder/spi-builder-workspace/.derivedData/Build/Products/Debug-iphoneos -I /Applications/Xcode-16.3.0.app/Contents/Developer/Platforms/iPhoneOS.platform/Developer/usr/lib -F /Users/admin/builder/spi-builder-workspace/.derivedData/Build/Products/Debug-iphoneos/PackageFrameworks -F /Users/admin/builder/spi-builder-workspace/.derivedData/Build/Products/Debug-iphoneos/PackageFrameworks -F /Users/admin/builder/spi-builder-workspace/.derivedData/Build/Products/Debug-iphoneos/PackageFrameworks -F /Users/admin/builder/spi-builder-workspace/.derivedData/Build/Products/Debug-iphoneos/PackageFrameworks -F /Users/admin/builder/spi-builder-workspace/.derivedData/Build/Products/Debug-iphoneos -F /Applications/Xcode-16.3.0.app/Contents/Developer/Platforms/iPhoneOS.platform/Developer/Library/Frameworks -F /Applications/Xcode-16.3.0.app/Contents/Developer/Platforms/iPhoneOS.platform/Developer/SDKs/iPhoneOS18.4.sdk/Developer/Library/Frameworks -c -j10 -enable-batch-mode -incremental -Xcc -ivfsstatcache -Xcc /Users/admin/builder/spi-builder-workspace/.derivedData/SDKStatCaches.noindex/iphoneos18.4-22E235-339d34bc69d7fc736c3220795c36f340.sdkstatcache -output-file-map /Users/admin/builder/spi-builder-workspace/.derivedData/Build/Intermediates.noindex/SwiftPM.build/Debug-iphoneos/Basics.build/Objects-normal/arm64/Basics-OutputFileMap.json -use-frontend-parseable-output -save-temps -no-color-diagnostics -serialize-diagnostics -emit-dependencies -emit-module -emit-module-path /Users/admin/builder/spi-builder-workspace/.derivedData/Build/Intermediates.noindex/SwiftPM.build/Debug-iphoneos/Basics.build/Objects-normal/arm64/Basics.swiftmodule -validate-clang-modules-once -clang-build-session-file /Users/admin/builder/spi-builder-workspace/.derivedData/ModuleCache.noindex/Session.modulevalidation -Xcc -I/Users/admin/builder/spi-builder-workspace/.derivedData/Build/Intermediates.noindex/SwiftPM.build/Debug-iphoneos/Basics.build/swift-overrides.hmap -emit-const-values -Xfrontend -const-gather-protocols-file -Xfrontend /Users/admin/builder/spi-builder-workspace/.derivedData/Build/Intermediates.noindex/SwiftPM.build/Debug-iphoneos/Basics.build/Objects-normal/arm64/Basics_const_extract_protocols.json -Xcc -I/Users/admin/builder/spi-builder-workspace/.dependencies/checkouts/swift-tools-support-core/Sources/TSCclibc/include -Xcc -I/Users/admin/builder/spi-builder-workspace/.derivedData/Build/Products/Debug-iphoneos/include -Xcc -I/Users/admin/builder/spi-builder-workspace/.derivedData/Build/Intermediates.noindex/SwiftPM.build/Debug-iphoneos/Basics.build/DerivedSources-normal/arm64 -Xcc -I/Users/admin/builder/spi-builder-workspace/.derivedData/Build/Intermediates.noindex/SwiftPM.build/Debug-iphoneos/Basics.build/DerivedSources/arm64 -Xcc -I/Users/admin/builder/spi-builder-workspace/.derivedData/Build/Intermediates.noindex/SwiftPM.build/Debug-iphoneos/Basics.build/DerivedSources -Xcc -DSWIFT_PACKAGE -Xcc -DDEBUG\=1 -emit-objc-header -emit-objc-header-path /Users/admin/builder/spi-builder-workspace/.derivedData/Build/Intermediates.noindex/SwiftPM.build/Debug-iphoneos/Basics.build/Objects-normal/arm64/Basics-Swift.h -working-directory /Users/admin/builder/spi-builder-workspace/.swiftpm/xcode -experimental-emit-module-separately -disable-cmo
SwiftDriverJobDiscovery normal arm64 Compiling Bits.swift, Bitstream.swift, BuildFlags.swift, CollectionExtensions.swift (in target 'TSCUtility' from project 'swift-tools-support-core')
SwiftCompile normal arm64 Compiling\ DriverKind.swift /Users/admin/builder/spi-builder-workspace/.dependencies/checkouts/swift-driver/Sources/SwiftOptions/DriverKind.swift (in target 'SwiftOptions' from project 'swift-driver')
SwiftCompile normal arm64 /Users/admin/builder/spi-builder-workspace/.dependencies/checkouts/swift-driver/Sources/SwiftOptions/DriverKind.swift (in target 'SwiftOptions' from project 'swift-driver')
cd /Users/admin/builder/spi-builder-workspace/.swiftpm/xcode
Copy /Users/admin/builder/spi-builder-workspace/.derivedData/Build/Products/Debug-iphoneos/Basics.swiftmodule/arm64-apple-ios.abi.json /Users/admin/builder/spi-builder-workspace/.derivedData/Build/Intermediates.noindex/SwiftPM.build/Debug-iphoneos/Basics.build/Objects-normal/arm64/Basics.abi.json (in target 'Basics' from project 'SwiftPM')
cd /Users/admin/builder/spi-builder-workspace/.dependencies/checkouts/swift-package-manager
builtin-copy -exclude .DS_Store -exclude CVS -exclude .svn -exclude .git -exclude .hg -resolve-src-symlinks -rename /Users/admin/builder/spi-builder-workspace/.derivedData/Build/Intermediates.noindex/SwiftPM.build/Debug-iphoneos/Basics.build/Objects-normal/arm64/Basics.abi.json /Users/admin/builder/spi-builder-workspace/.derivedData/Build/Products/Debug-iphoneos/Basics.swiftmodule/arm64-apple-ios.abi.json
SwiftDriverJobDiscovery normal arm64 Compiling OptionParsing.swift (in target 'SwiftOptions' from project 'swift-driver')
SwiftCompile normal arm64 Compiling\ Options.swift /Users/admin/builder/spi-builder-workspace/.dependencies/checkouts/swift-driver/Sources/SwiftOptions/Options.swift (in target 'SwiftOptions' from project 'swift-driver')
SwiftCompile normal arm64 /Users/admin/builder/spi-builder-workspace/.dependencies/checkouts/swift-driver/Sources/SwiftOptions/Options.swift (in target 'SwiftOptions' from project 'swift-driver')
cd /Users/admin/builder/spi-builder-workspace/.swiftpm/xcode
SwiftCompile normal arm64 Compiling\ Option.swift /Users/admin/builder/spi-builder-workspace/.dependencies/checkouts/swift-driver/Sources/SwiftOptions/Option.swift (in target 'SwiftOptions' from project 'swift-driver')
SwiftCompile normal arm64 /Users/admin/builder/spi-builder-workspace/.dependencies/checkouts/swift-driver/Sources/SwiftOptions/Option.swift (in target 'SwiftOptions' from project 'swift-driver')
cd /Users/admin/builder/spi-builder-workspace/.swiftpm/xcode
SwiftDriverJobDiscovery normal arm64 Compiling Triple.swift, URL.swift, Verbosity.swift, Version.swift (in target 'TSCUtility' from project 'swift-tools-support-core')
SwiftDriverJobDiscovery normal arm64 Compiling OptionTable.swift (in target 'SwiftOptions' from project 'swift-driver')
SwiftDriver\ Compilation TSCUtility normal arm64 com.apple.xcode.tools.swift.compiler (in target 'TSCUtility' from project 'swift-tools-support-core')
cd /Users/admin/builder/spi-builder-workspace/.swiftpm/xcode
builtin-Swift-Compilation -- /Applications/Xcode-16.3.0.app/Contents/Developer/Toolchains/XcodeDefault.xctoolchain/usr/bin/swiftc -module-name TSCUtility -Onone -enforce-exclusivity\=checked @/Users/admin/builder/spi-builder-workspace/.derivedData/Build/Intermediates.noindex/swift-tools-support-core.build/Debug-iphoneos/TSCUtility.build/Objects-normal/arm64/TSCUtility.SwiftFileList -DSWIFT_PACKAGE -DDEBUG -DXcode -plugin-path /Applications/Xcode-16.3.0.app/Contents/Developer/Toolchains/XcodeDefault.xctoolchain/usr/lib/swift/host/plugins/testing -enable-experimental-feature DebugDescriptionMacro -sdk /Applications/Xcode-16.3.0.app/Contents/Developer/Platforms/iPhoneOS.platform/Developer/SDKs/iPhoneOS18.4.sdk -target arm64-apple-ios12.0 -g -module-cache-path /Users/admin/builder/spi-builder-workspace/.derivedData/ModuleCache.noindex -Xfrontend -serialize-debugging-options -profile-coverage-mapping -profile-generate -enable-testing -suppress-warnings -index-store-path /Users/admin/builder/spi-builder-workspace/.derivedData/Index.noindex/DataStore -swift-version 5 -I /Users/admin/builder/spi-builder-workspace/.derivedData/Build/Products/Debug-iphoneos -I /Applications/Xcode-16.3.0.app/Contents/Developer/Platforms/iPhoneOS.platform/Developer/usr/lib -F /Users/admin/builder/spi-builder-workspace/.derivedData/Build/Products/Debug-iphoneos/PackageFrameworks -F /Users/admin/builder/spi-builder-workspace/.derivedData/Build/Products/Debug-iphoneos/PackageFrameworks -F /Users/admin/builder/spi-builder-workspace/.derivedData/Build/Products/Debug-iphoneos/PackageFrameworks -F /Users/admin/builder/spi-builder-workspace/.derivedData/Build/Products/Debug-iphoneos -F /Applications/Xcode-16.3.0.app/Contents/Developer/Platforms/iPhoneOS.platform/Developer/Library/Frameworks -F /Applications/Xcode-16.3.0.app/Contents/Developer/Platforms/iPhoneOS.platform/Developer/SDKs/iPhoneOS18.4.sdk/Developer/Library/Frameworks -c -j10 -enable-batch-mode -incremental -Xcc -ivfsstatcache -Xcc /Users/admin/builder/spi-builder-workspace/.derivedData/SDKStatCaches.noindex/iphoneos18.4-22E235-339d34bc69d7fc736c3220795c36f340.sdkstatcache -output-file-map /Users/admin/builder/spi-builder-workspace/.derivedData/Build/Intermediates.noindex/swift-tools-support-core.build/Debug-iphoneos/TSCUtility.build/Objects-normal/arm64/TSCUtility-OutputFileMap.json -use-frontend-parseable-output -save-temps -no-color-diagnostics -serialize-diagnostics -emit-dependencies -emit-module -emit-module-path /Users/admin/builder/spi-builder-workspace/.derivedData/Build/Intermediates.noindex/swift-tools-support-core.build/Debug-iphoneos/TSCUtility.build/Objects-normal/arm64/TSCUtility.swiftmodule -validate-clang-modules-once -clang-build-session-file /Users/admin/builder/spi-builder-workspace/.derivedData/ModuleCache.noindex/Session.modulevalidation -Xcc -I/Users/admin/builder/spi-builder-workspace/.derivedData/Build/Intermediates.noindex/swift-tools-support-core.build/Debug-iphoneos/TSCUtility.build/swift-overrides.hmap -emit-const-values -Xfrontend -const-gather-protocols-file -Xfrontend /Users/admin/builder/spi-builder-workspace/.derivedData/Build/Intermediates.noindex/swift-tools-support-core.build/Debug-iphoneos/TSCUtility.build/Objects-normal/arm64/TSCUtility_const_extract_protocols.json -Xcc -I/Users/admin/builder/spi-builder-workspace/.dependencies/checkouts/swift-tools-support-core/Sources/TSCclibc/include -Xcc -I/Users/admin/builder/spi-builder-workspace/.derivedData/Build/Products/Debug-iphoneos/include -Xcc -I/Users/admin/builder/spi-builder-workspace/.derivedData/Build/Intermediates.noindex/swift-tools-support-core.build/Debug-iphoneos/TSCUtility.build/DerivedSources-normal/arm64 -Xcc -I/Users/admin/builder/spi-builder-workspace/.derivedData/Build/Intermediates.noindex/swift-tools-support-core.build/Debug-iphoneos/TSCUtility.build/DerivedSources/arm64 -Xcc -I/Users/admin/builder/spi-builder-workspace/.derivedData/Build/Intermediates.noindex/swift-tools-support-core.build/Debug-iphoneos/TSCUtility.build/DerivedSources -Xcc -DSWIFT_PACKAGE -Xcc -DDEBUG\=1 -emit-objc-header -emit-objc-header-path /Users/admin/builder/spi-builder-workspace/.derivedData/Build/Intermediates.noindex/swift-tools-support-core.build/Debug-iphoneos/TSCUtility.build/Objects-normal/arm64/TSCUtility-Swift.h -working-directory /Users/admin/builder/spi-builder-workspace/.swiftpm/xcode -experimental-emit-module-separately -disable-cmo
SwiftCompile normal arm64 Compiling\ ParsedOptions.swift /Users/admin/builder/spi-builder-workspace/.dependencies/checkouts/swift-driver/Sources/SwiftOptions/ParsedOptions.swift (in target 'SwiftOptions' from project 'swift-driver')
SwiftCompile normal arm64 /Users/admin/builder/spi-builder-workspace/.dependencies/checkouts/swift-driver/Sources/SwiftOptions/ParsedOptions.swift (in target 'SwiftOptions' from project 'swift-driver')
cd /Users/admin/builder/spi-builder-workspace/.swiftpm/xcode
SwiftCompile normal arm64 Compiling\ FileSystem+Extensions.swift /Users/admin/builder/spi-builder-workspace/.dependencies/checkouts/swift-package-manager/Sources/Basics/FileSystem+Extensions.swift (in target 'Basics' from project 'SwiftPM')
SwiftCompile normal arm64 /Users/admin/builder/spi-builder-workspace/.dependencies/checkouts/swift-package-manager/Sources/Basics/FileSystem+Extensions.swift (in target 'Basics' from project 'SwiftPM')
cd /Users/admin/builder/spi-builder-workspace/.swiftpm/xcode
SwiftDriverJobDiscovery normal arm64 Compiling PrefixTrie.swift (in target 'SwiftOptions' from project 'swift-driver')
SwiftCompile normal arm64 Compiling\ HTTPClient.swift /Users/admin/builder/spi-builder-workspace/.dependencies/checkouts/swift-package-manager/Sources/Basics/HTTPClient.swift (in target 'Basics' from project 'SwiftPM')
SwiftCompile normal arm64 /Users/admin/builder/spi-builder-workspace/.dependencies/checkouts/swift-package-manager/Sources/Basics/HTTPClient.swift (in target 'Basics' from project 'SwiftPM')
cd /Users/admin/builder/spi-builder-workspace/.swiftpm/xcode
SwiftDriverJobDiscovery normal arm64 Compiling ExtraOptions.swift (in target 'SwiftOptions' from project 'swift-driver')
SwiftCompile normal arm64 Compiling\ ByteString+Extensions.swift /Users/admin/builder/spi-builder-workspace/.dependencies/checkouts/swift-package-manager/Sources/Basics/ByteString+Extensions.swift (in target 'Basics' from project 'SwiftPM')
Failed frontend command:
/Applications/Xcode-16.3.0.app/Contents/Developer/Toolchains/XcodeDefault.xctoolchain/usr/bin/swift-frontend -frontend -c -primary-file /Users/admin/builder/spi-builder-workspace/.dependencies/checkouts/swift-package-manager/Sources/Basics/ByteString+Extensions.swift /Users/admin/builder/spi-builder-workspace/.dependencies/checkouts/swift-package-manager/Sources/Basics/ConcurrencyHelpers.swift /Users/admin/builder/spi-builder-workspace/.dependencies/checkouts/swift-package-manager/Sources/Basics/Dictionary+Extensions.swift /Users/admin/builder/spi-builder-workspace/.dependencies/checkouts/swift-package-manager/Sources/Basics/DispatchTimeInterval+Extensions.swift /Users/admin/builder/spi-builder-workspace/.dependencies/checkouts/swift-package-manager/Sources/Basics/Errors.swift /Users/admin/builder/spi-builder-workspace/.dependencies/checkouts/swift-package-manager/Sources/Basics/FileSystem+Extensions.swift /Users/admin/builder/spi-builder-workspace/.dependencies/checkouts/swift-package-manager/Sources/Basics/HTPClient+URLSession.swift /Users/admin/builder/spi-builder-workspace/.dependencies/checkouts/swift-package-manager/Sources/Basics/HTTPClient.swift /Users/admin/builder/spi-builder-workspace/.dependencies/checkouts/swift-package-manager/Sources/Basics/JSON+Extensions.swift -emit-dependencies-path /Users/admin/builder/spi-builder-workspace/.derivedData/Build/Intermediates.noindex/SwiftPM.build/Debug-iphoneos/Basics.build/Objects-normal/arm64/ByteString+Extensions.d -emit-const-values-path /Users/admin/builder/spi-builder-workspace/.derivedData/Build/Intermediates.noindex/SwiftPM.build/Debug-iphoneos/Basics.build/Objects-normal/arm64/ByteString+Extensions.swiftconstvalues -emit-reference-dependencies-path /Users/admin/builder/spi-builder-workspace/.derivedData/Build/Intermediates.noindex/SwiftPM.build/Debug-iphoneos/Basics.build/Objects-normal/arm64/ByteString+Extensions.swiftdeps -serialize-diagnostics-path /Users/admin/builder/spi-builder-workspace/.derivedData/Build/Intermediates.noindex/SwiftPM.build/Debug-iphoneos/Basics.build/Objects-normal/arm64/ByteString+Extensions.dia -target arm64-apple-ios12.0 -Xllvm -aarch64-use-tbi -enable-objc-interop -sdk /Applications/Xcode-16.3.0.app/Contents/Developer/Platforms/iPhoneOS.platform/Developer/SDKs/iPhoneOS18.4.sdk -I /Users/admin/builder/spi-builder-workspace/.derivedData/Build/Products/Debug-iphoneos -I /Applications/Xcode-16.3.0.app/Contents/Developer/Platforms/iPhoneOS.platform/Developer/usr/lib -F /Users/admin/builder/spi-builder-workspace/.derivedData/Build/Products/Debug-iphoneos/PackageFrameworks -F /Users/admin/builder/spi-builder-workspace/.derivedData/Build/Products/Debug-iphoneos/PackageFrameworks -F /Users/admin/builder/spi-builder-workspace/.derivedData/Build/Products/Debug-iphoneos/PackageFrameworks -F /Users/admin/builder/spi-builder-workspace/.derivedData/Build/Products/Debug-iphoneos/PackageFrameworks -F /Users/admin/builder/spi-builder-workspace/.derivedData/Build/Products/Debug-iphoneos -F /Applications/Xcode-16.3.0.app/Contents/Developer/Platforms/iPhoneOS.platform/Developer/Library/Frameworks -F /Applications/Xcode-16.3.0.app/Contents/Developer/Platforms/iPhoneOS.platform/Developer/SDKs/iPhoneOS18.4.sdk/Developer/Library/Frameworks -no-color-diagnostics -enable-testing -g -debug-info-format\=dwarf -dwarf-version\=4 -module-cache-path /Users/admin/builder/spi-builder-workspace/.derivedData/ModuleCache.noindex -suppress-warnings -profile-generate -profile-coverage-mapping -swift-version 5 -enforce-exclusivity\=checked -Onone -D SWIFT_PACKAGE -D DEBUG -D Xcode -serialize-debugging-options -const-gather-protocols-file /Users/admin/builder/spi-builder-workspace/.derivedData/Build/Intermediates.noindex/SwiftPM.build/Debug-iphoneos/Basics.build/Objects-normal/arm64/Basics_const_extract_protocols.json -enable-experimental-feature DebugDescriptionMacro -empty-abi-descriptor -plugin-path /Applications/Xcode-16.3.0.app/Contents/Developer/Toolchains/XcodeDefault.xctoolchain/usr/lib/swift/host/plugins/testing -validate-clang-modules-once -clang-build-session-file /Users/admin/builder/spi-builder-workspace/.derivedData/ModuleCache.noindex/Session.modulevalidation -Xcc -working-directory -Xcc /Users/admin/builder/spi-builder-workspace/.swiftpm/xcode -resource-dir /Applications/Xcode-16.3.0.app/Contents/Developer/Toolchains/XcodeDefault.xctoolchain/usr/lib/swift -enable-anonymous-context-mangled-names -file-compilation-dir /Users/admin/builder/spi-builder-workspace/.swiftpm/xcode -Xcc -ivfsstatcache -Xcc /Users/admin/builder/spi-builder-workspace/.derivedData/SDKStatCaches.noindex/iphoneos18.4-22E235-339d34bc69d7fc736c3220795c36f340.sdkstatcache -Xcc -I/Users/admin/builder/spi-builder-workspace/.derivedData/Build/Intermediates.noindex/SwiftPM.build/Debug-iphoneos/Basics.build/swift-overrides.hmap -Xcc -I/Users/admin/builder/spi-builder-workspace/.dependencies/checkouts/swift-tools-support-core/Sources/TSCclibc/include -Xcc -I/Users/admin/builder/spi-builder-workspace/.derivedData/Build/Products/Debug-iphoneos/include -Xcc -I/Users/admin/builder/spi-builder-workspace/.derivedData/Build/Intermediates.noindex/SwiftPM.build/Debug-iphoneos/Basics.build/DerivedSources-normal/arm64 -Xcc -I/Users/admin/builder/spi-builder-workspace/.derivedData/Build/Intermediates.noindex/SwiftPM.build/Debug-iphoneos/Basics.build/DerivedSources/arm64 -Xcc -I/Users/admin/builder/spi-builder-workspace/.derivedData/Build/Intermediates.noindex/SwiftPM.build/Debug-iphoneos/Basics.build/DerivedSources -Xcc -DSWIFT_PACKAGE -Xcc -DDEBUG\=1 -module-name Basics -frontend-parseable-output -disable-clang-spi -target-sdk-version 18.4 -target-sdk-name iphoneos18.4 -external-plugin-path /Applications/Xcode-16.3.0.app/Contents/Developer/Platforms/iPhoneOS.platform/Developer/usr/lib/swift/host/plugins\#/Applications/Xcode-16.3.0.app/Contents/Developer/Platforms/iPhoneOS.platform/Developer/usr/bin/swift-plugin-server -external-plugin-path /Applications/Xcode-16.3.0.app/Contents/Developer/Platforms/iPhoneOS.platform/Developer/usr/local/lib/swift/host/plugins\#/Applications/Xcode-16.3.0.app/Contents/Developer/Platforms/iPhoneOS.platform/Developer/usr/bin/swift-plugin-server -in-process-plugin-server-path /Applications/Xcode-16.3.0.app/Contents/Developer/Toolchains/XcodeDefault.xctoolchain/usr/lib/swift/host/libSwiftInProcPluginServer.dylib -plugin-path /Applications/Xcode-16.3.0.app/Contents/Developer/Toolchains/XcodeDefault.xctoolchain/usr/lib/swift/host/plugins -plugin-path /Applications/Xcode-16.3.0.app/Contents/Developer/Toolchains/XcodeDefault.xctoolchain/usr/local/lib/swift/host/plugins -o /Users/admin/builder/spi-builder-workspace/.derivedData/Build/Intermediates.noindex/SwiftPM.build/Debug-iphoneos/Basics.build/Objects-normal/arm64/ByteString+Extensions.o -index-unit-output-path /SwiftPM.build/Debug-iphoneos/Basics.build/Objects-normal/arm64/ByteString+Extensions.o -index-store-path /Users/admin/builder/spi-builder-workspace/.derivedData/Index.noindex/DataStore -index-system-modules
SwiftCompile normal arm64 /Users/admin/builder/spi-builder-workspace/.dependencies/checkouts/swift-package-manager/Sources/Basics/ByteString+Extensions.swift (in target 'Basics' from project 'SwiftPM')
cd /Users/admin/builder/spi-builder-workspace/.swiftpm/xcode
/Users/admin/builder/spi-builder-workspace/.dependencies/checkouts/swift-package-manager/Sources/Basics/ByteString+Extensions.swift:21:20: error: 'CryptoKitSHA256' is only available in iOS 13 or newer
return CryptoKitSHA256().hash(self).hexadecimalRepresentation
^
/Users/admin/builder/spi-builder-workspace/.dependencies/checkouts/swift-package-manager/Sources/Basics/ByteString+Extensions.swift:21:20: note: add 'if #available' version check
return CryptoKitSHA256().hash(self).hexadecimalRepresentation
^
/Users/admin/builder/spi-builder-workspace/.dependencies/checkouts/swift-package-manager/Sources/Basics/ByteString+Extensions.swift:18:16: note: add @available attribute to enclosing property
public var sha256Checksum: String {
^
/Users/admin/builder/spi-builder-workspace/.dependencies/checkouts/swift-package-manager/Sources/Basics/ByteString+Extensions.swift:11:1: note: add @available attribute to enclosing extension
extension ByteString {
^
SwiftDriverJobDiscovery normal arm64 Compiling Flag.swift, NameSpecification.swift, Option.swift, OptionGroup.swift (in target 'ArgumentParser' from project 'swift-argument-parser')
SwiftDriver SourceControl normal arm64 com.apple.xcode.tools.swift.compiler (in target 'SourceControl' from project 'SwiftPM')
cd /Users/admin/builder/spi-builder-workspace/.swiftpm/xcode
builtin-SwiftDriver -- /Applications/Xcode-16.3.0.app/Contents/Developer/Toolchains/XcodeDefault.xctoolchain/usr/bin/swiftc -module-name SourceControl -Onone -enforce-exclusivity\=checked @/Users/admin/builder/spi-builder-workspace/.derivedData/Build/Intermediates.noindex/SwiftPM.build/Debug-iphoneos/SourceControl.build/Objects-normal/arm64/SourceControl.SwiftFileList -DSWIFT_PACKAGE -DDEBUG -DXcode -plugin-path /Applications/Xcode-16.3.0.app/Contents/Developer/Toolchains/XcodeDefault.xctoolchain/usr/lib/swift/host/plugins/testing -enable-experimental-feature DebugDescriptionMacro -sdk /Applications/Xcode-16.3.0.app/Contents/Developer/Platforms/iPhoneOS.platform/Developer/SDKs/iPhoneOS18.4.sdk -target arm64-apple-ios12.0 -g -module-cache-path /Users/admin/builder/spi-builder-workspace/.derivedData/ModuleCache.noindex -Xfrontend -serialize-debugging-options -profile-coverage-mapping -profile-generate -enable-testing -suppress-warnings -index-store-path /Users/admin/builder/spi-builder-workspace/.derivedData/Index.noindex/DataStore -swift-version 5 -I /Users/admin/builder/spi-builder-workspace/.derivedData/Build/Products/Debug-iphoneos -I /Applications/Xcode-16.3.0.app/Contents/Developer/Platforms/iPhoneOS.platform/Developer/usr/lib -F /Users/admin/builder/spi-builder-workspace/.derivedData/Build/Products/Debug-iphoneos/PackageFrameworks -F /Users/admin/builder/spi-builder-workspace/.derivedData/Build/Products/Debug-iphoneos/PackageFrameworks -F /Users/admin/builder/spi-builder-workspace/.derivedData/Build/Products/Debug-iphoneos/PackageFrameworks -F /Users/admin/builder/spi-builder-workspace/.derivedData/Build/Products/Debug-iphoneos/PackageFrameworks -F /Users/admin/builder/spi-builder-workspace/.derivedData/Build/Products/Debug-iphoneos/PackageFrameworks -F /Users/admin/builder/spi-builder-workspace/.derivedData/Build/Products/Debug-iphoneos -F /Applications/Xcode-16.3.0.app/Contents/Developer/Platforms/iPhoneOS.platform/Developer/Library/Frameworks -F /Applications/Xcode-16.3.0.app/Contents/Developer/Platforms/iPhoneOS.platform/Developer/SDKs/iPhoneOS18.4.sdk/Developer/Library/Frameworks -c -j10 -enable-batch-mode -incremental -Xcc -ivfsstatcache -Xcc /Users/admin/builder/spi-builder-workspace/.derivedData/SDKStatCaches.noindex/iphoneos18.4-22E235-339d34bc69d7fc736c3220795c36f340.sdkstatcache -output-file-map /Users/admin/builder/spi-builder-workspace/.derivedData/Build/Intermediates.noindex/SwiftPM.build/Debug-iphoneos/SourceControl.build/Objects-normal/arm64/SourceControl-OutputFileMap.json -use-frontend-parseable-output -save-temps -no-color-diagnostics -serialize-diagnostics -emit-dependencies -emit-module -emit-module-path /Users/admin/builder/spi-builder-workspace/.derivedData/Build/Intermediates.noindex/SwiftPM.build/Debug-iphoneos/SourceControl.build/Objects-normal/arm64/SourceControl.swiftmodule -validate-clang-modules-once -clang-build-session-file /Users/admin/builder/spi-builder-workspace/.derivedData/ModuleCache.noindex/Session.modulevalidation -Xcc -I/Users/admin/builder/spi-builder-workspace/.derivedData/Build/Intermediates.noindex/SwiftPM.build/Debug-iphoneos/SourceControl.build/swift-overrides.hmap -emit-const-values -Xfrontend -const-gather-protocols-file -Xfrontend /Users/admin/builder/spi-builder-workspace/.derivedData/Build/Intermediates.noindex/SwiftPM.build/Debug-iphoneos/SourceControl.build/Objects-normal/arm64/SourceControl_const_extract_protocols.json -Xcc -I/Users/admin/builder/spi-builder-workspace/.dependencies/checkouts/swift-tools-support-core/Sources/TSCclibc/include -Xcc -I/Users/admin/builder/spi-builder-workspace/.derivedData/Build/Products/Debug-iphoneos/include -Xcc -I/Users/admin/builder/spi-builder-workspace/.derivedData/Build/Intermediates.noindex/SwiftPM.build/Debug-iphoneos/SourceControl.build/DerivedSources-normal/arm64 -Xcc -I/Users/admin/builder/spi-builder-workspace/.derivedData/Build/Intermediates.noindex/SwiftPM.build/Debug-iphoneos/SourceControl.build/DerivedSources/arm64 -Xcc -I/Users/admin/builder/spi-builder-workspace/.derivedData/Build/Intermediates.noindex/SwiftPM.build/Debug-iphoneos/SourceControl.build/DerivedSources -Xcc -DSWIFT_PACKAGE -Xcc -DDEBUG\=1 -emit-objc-header -emit-objc-header-path /Users/admin/builder/spi-builder-workspace/.derivedData/Build/Intermediates.noindex/SwiftPM.build/Debug-iphoneos/SourceControl.build/Objects-normal/arm64/SourceControl-Swift.h -working-directory /Users/admin/builder/spi-builder-workspace/.swiftpm/xcode -experimental-emit-module-separately -disable-cmo
SwiftDriverJobDiscovery normal arm64 Compiling DriverKind.swift (in target 'SwiftOptions' from project 'swift-driver')
SwiftDriver SPMLLBuild normal arm64 com.apple.xcode.tools.swift.compiler (in target 'SPMLLBuild' from project 'SwiftPM')
cd /Users/admin/builder/spi-builder-workspace/.swiftpm/xcode
builtin-SwiftDriver -- /Applications/Xcode-16.3.0.app/Contents/Developer/Toolchains/XcodeDefault.xctoolchain/usr/bin/swiftc -module-name SPMLLBuild -Onone -enforce-exclusivity\=checked @/Users/admin/builder/spi-builder-workspace/.derivedData/Build/Intermediates.noindex/SwiftPM.build/Debug-iphoneos/SPMLLBuild.build/Objects-normal/arm64/SPMLLBuild.SwiftFileList -DSWIFT_PACKAGE -DDEBUG -Xcc -fmodule-map-file\=/Users/admin/builder/spi-builder-workspace/.derivedData/Build/Intermediates.noindex/GeneratedModuleMaps-iphoneos/llbuildBuildSystem.modulemap -Xcc -fmodule-map-file\=/Users/admin/builder/spi-builder-workspace/.derivedData/Build/Intermediates.noindex/GeneratedModuleMaps-iphoneos/llbuildCore.modulemap -Xcc -fmodule-map-file\=/Users/admin/builder/spi-builder-workspace/.derivedData/Build/Intermediates.noindex/GeneratedModuleMaps-iphoneos/llbuildBasic.modulemap -Xcc -fmodule-map-file\=/Users/admin/builder/spi-builder-workspace/.derivedData/Build/Intermediates.noindex/GeneratedModuleMaps-iphoneos/llvmSupport.modulemap -Xcc -fmodule-map-file\=/Users/admin/builder/spi-builder-workspace/.derivedData/Build/Intermediates.noindex/GeneratedModuleMaps-iphoneos/llvmDemangle.modulemap -DXcode -plugin-path /Applications/Xcode-16.3.0.app/Contents/Developer/Toolchains/XcodeDefault.xctoolchain/usr/lib/swift/host/plugins/testing -enable-experimental-feature DebugDescriptionMacro -sdk /Applications/Xcode-16.3.0.app/Contents/Developer/Platforms/iPhoneOS.platform/Developer/SDKs/iPhoneOS18.4.sdk -target arm64-apple-ios12.0 -g -module-cache-path /Users/admin/builder/spi-builder-workspace/.derivedData/ModuleCache.noindex -Xfrontend -serialize-debugging-options -profile-coverage-mapping -profile-generate -enable-testing -suppress-warnings -index-store-path /Users/admin/builder/spi-builder-workspace/.derivedData/Index.noindex/DataStore -swift-version 5 -I /Users/admin/builder/spi-builder-workspace/.derivedData/Build/Products/Debug-iphoneos -I /Applications/Xcode-16.3.0.app/Contents/Developer/Platforms/iPhoneOS.platform/Developer/usr/lib -F /Users/admin/builder/spi-builder-workspace/.derivedData/Build/Products/Debug-iphoneos/PackageFrameworks -F /Users/admin/builder/spi-builder-workspace/.derivedData/Build/Products/Debug-iphoneos/PackageFrameworks -F /Users/admin/builder/spi-builder-workspace/.derivedData/Build/Products/Debug-iphoneos/PackageFrameworks -F /Users/admin/builder/spi-builder-workspace/.derivedData/Build/Products/Debug-iphoneos/PackageFrameworks -F /Users/admin/builder/spi-builder-workspace/.derivedData/Build/Products/Debug-iphoneos/PackageFrameworks -F /Users/admin/builder/spi-builder-workspace/.derivedData/Build/Products/Debug-iphoneos/PackageFrameworks -F /Users/admin/builder/spi-builder-workspace/.derivedData/Build/Products/Debug-iphoneos/PackageFrameworks -F /Users/admin/builder/spi-builder-workspace/.derivedData/Build/Products/Debug-iphoneos/PackageFrameworks -F /Users/admin/builder/spi-builder-workspace/.derivedData/Build/Products/Debug-iphoneos/PackageFrameworks -F /Users/admin/builder/spi-builder-workspace/.derivedData/Build/Products/Debug-iphoneos/PackageFrameworks -F /Users/admin/builder/spi-builder-workspace/.derivedData/Build/Products/Debug-iphoneos/PackageFrameworks -F /Users/admin/builder/spi-builder-workspace/.derivedData/Build/Products/Debug-iphoneos/PackageFrameworks -F /Users/admin/builder/spi-builder-workspace/.derivedData/Build/Products/Debug-iphoneos -F /Applications/Xcode-16.3.0.app/Contents/Developer/Platforms/iPhoneOS.platform/Developer/Library/Frameworks -F /Applications/Xcode-16.3.0.app/Contents/Developer/Platforms/iPhoneOS.platform/Developer/SDKs/iPhoneOS18.4.sdk/Developer/Library/Frameworks -parse-as-library -c -j10 -enable-batch-mode -incremental -Xcc -ivfsstatcache -Xcc /Users/admin/builder/spi-builder-workspace/.derivedData/SDKStatCaches.noindex/iphoneos18.4-22E235-339d34bc69d7fc736c3220795c36f340.sdkstatcache -output-file-map /Users/admin/builder/spi-builder-workspace/.derivedData/Build/Intermediates.noindex/SwiftPM.build/Debug-iphoneos/SPMLLBuild.build/Objects-normal/arm64/SPMLLBuild-OutputFileMap.json -use-frontend-parseable-output -save-temps -no-color-diagnostics -serialize-diagnostics -emit-dependencies -emit-module -emit-module-path /Users/admin/builder/spi-builder-workspace/.derivedData/Build/Intermediates.noindex/SwiftPM.build/Debug-iphoneos/SPMLLBuild.build/Objects-normal/arm64/SPMLLBuild.swiftmodule -validate-clang-modules-once -clang-build-session-file /Users/admin/builder/spi-builder-workspace/.derivedData/ModuleCache.noindex/Session.modulevalidation -Xcc -I/Users/admin/builder/spi-builder-workspace/.derivedData/Build/Intermediates.noindex/SwiftPM.build/Debug-iphoneos/SPMLLBuild.build/swift-overrides.hmap -emit-const-values -Xfrontend -const-gather-protocols-file -Xfrontend /Users/admin/builder/spi-builder-workspace/.derivedData/Build/Intermediates.noindex/SwiftPM.build/Debug-iphoneos/SPMLLBuild.build/Objects-normal/arm64/SPMLLBuild_const_extract_protocols.json -Xcc -I/Users/admin/builder/spi-builder-workspace/.dependencies/checkouts/swift-tools-support-core/Sources/TSCclibc/include -Xcc -I/Users/admin/builder/spi-builder-workspace/.dependencies/checkouts/swift-llbuild/products/libllbuild/include -Xcc -I/Users/admin/builder/spi-builder-workspace/.dependencies/checkouts/swift-llbuild/lib/BuildSystem/include -Xcc -I/Users/admin/builder/spi-builder-workspace/.dependencies/checkouts/swift-llbuild/lib/Core/include -Xcc -I/Users/admin/builder/spi-builder-workspace/.dependencies/checkouts/swift-llbuild/lib/Basic/include -Xcc -I/Users/admin/builder/spi-builder-workspace/.dependencies/checkouts/swift-llbuild/lib/llvm/Support/include -Xcc -I/Users/admin/builder/spi-builder-workspace/.dependencies/checkouts/swift-llbuild/lib/llvm/Demangle/include -Xcc -I/Users/admin/builder/spi-builder-workspace/.derivedData/Build/Products/Debug-iphoneos/include -Xcc -I/Users/admin/builder/spi-builder-workspace/.derivedData/Build/Intermediates.noindex/SwiftPM.build/Debug-iphoneos/SPMLLBuild.build/DerivedSources-normal/arm64 -Xcc -I/Users/admin/builder/spi-builder-workspace/.derivedData/Build/Intermediates.noindex/SwiftPM.build/Debug-iphoneos/SPMLLBuild.build/DerivedSources/arm64 -Xcc -I/Users/admin/builder/spi-builder-workspace/.derivedData/Build/Intermediates.noindex/SwiftPM.build/Debug-iphoneos/SPMLLBuild.build/DerivedSources -Xcc -DSWIFT_PACKAGE -Xcc -DDEBUG\=1 -emit-objc-header -emit-objc-header-path /Users/admin/builder/spi-builder-workspace/.derivedData/Build/Intermediates.noindex/SwiftPM.build/Debug-iphoneos/SPMLLBuild.build/Objects-normal/arm64/SPMLLBuild-Swift.h -working-directory /Users/admin/builder/spi-builder-workspace/.swiftpm/xcode -experimental-emit-module-separately -disable-cmo
SwiftEmitModule normal arm64 Emitting\ module\ for\ SourceControl (in target 'SourceControl' from project 'SwiftPM')
EmitSwiftModule normal arm64 (in target 'SourceControl' from project 'SwiftPM')
cd /Users/admin/builder/spi-builder-workspace/.swiftpm/xcode
SwiftEmitModule normal arm64 Emitting\ module\ for\ SPMLLBuild (in target 'SPMLLBuild' from project 'SwiftPM')
SwiftDriverJobDiscovery normal arm64 Compiling Option.swift (in target 'SwiftOptions' from project 'swift-driver')
SwiftDriver PackageModel normal arm64 com.apple.xcode.tools.swift.compiler (in target 'PackageModel' from project 'SwiftPM')
cd /Users/admin/builder/spi-builder-workspace/.swiftpm/xcode
builtin-SwiftDriver -- /Applications/Xcode-16.3.0.app/Contents/Developer/Toolchains/XcodeDefault.xctoolchain/usr/bin/swiftc -module-name PackageModel -Onone -enforce-exclusivity\=checked @/Users/admin/builder/spi-builder-workspace/.derivedData/Build/Intermediates.noindex/SwiftPM.build/Debug-iphoneos/PackageModel.build/Objects-normal/arm64/PackageModel.SwiftFileList -DSWIFT_PACKAGE -DDEBUG -DXcode -plugin-path /Applications/Xcode-16.3.0.app/Contents/Developer/Toolchains/XcodeDefault.xctoolchain/usr/lib/swift/host/plugins/testing -enable-experimental-feature DebugDescriptionMacro -sdk /Applications/Xcode-16.3.0.app/Contents/Developer/Platforms/iPhoneOS.platform/Developer/SDKs/iPhoneOS18.4.sdk -target arm64-apple-ios12.0 -g -module-cache-path /Users/admin/builder/spi-builder-workspace/.derivedData/ModuleCache.noindex -Xfrontend -serialize-debugging-options -profile-coverage-mapping -profile-generate -enable-testing -suppress-warnings -index-store-path /Users/admin/builder/spi-builder-workspace/.derivedData/Index.noindex/DataStore -swift-version 5 -I /Users/admin/builder/spi-builder-workspace/.derivedData/Build/Products/Debug-iphoneos -I /Applications/Xcode-16.3.0.app/Contents/Developer/Platforms/iPhoneOS.platform/Developer/usr/lib -F /Users/admin/builder/spi-builder-workspace/.derivedData/Build/Products/Debug-iphoneos/PackageFrameworks -F /Users/admin/builder/spi-builder-workspace/.derivedData/Build/Products/Debug-iphoneos/PackageFrameworks -F /Users/admin/builder/spi-builder-workspace/.derivedData/Build/Products/Debug-iphoneos/PackageFrameworks -F /Users/admin/builder/spi-builder-workspace/.derivedData/Build/Products/Debug-iphoneos/PackageFrameworks -F /Users/admin/builder/spi-builder-workspace/.derivedData/Build/Products/Debug-iphoneos/PackageFrameworks -F /Users/admin/builder/spi-builder-workspace/.derivedData/Build/Products/Debug-iphoneos -F /Applications/Xcode-16.3.0.app/Contents/Developer/Platforms/iPhoneOS.platform/Developer/Library/Frameworks -F /Applications/Xcode-16.3.0.app/Contents/Developer/Platforms/iPhoneOS.platform/Developer/SDKs/iPhoneOS18.4.sdk/Developer/Library/Frameworks -c -j10 -enable-batch-mode -incremental -Xcc -ivfsstatcache -Xcc /Users/admin/builder/spi-builder-workspace/.derivedData/SDKStatCaches.noindex/iphoneos18.4-22E235-339d34bc69d7fc736c3220795c36f340.sdkstatcache -output-file-map /Users/admin/builder/spi-builder-workspace/.derivedData/Build/Intermediates.noindex/SwiftPM.build/Debug-iphoneos/PackageModel.build/Objects-normal/arm64/PackageModel-OutputFileMap.json -use-frontend-parseable-output -save-temps -no-color-diagnostics -serialize-diagnostics -emit-dependencies -emit-module -emit-module-path /Users/admin/builder/spi-builder-workspace/.derivedData/Build/Intermediates.noindex/SwiftPM.build/Debug-iphoneos/PackageModel.build/Objects-normal/arm64/PackageModel.swiftmodule -validate-clang-modules-once -clang-build-session-file /Users/admin/builder/spi-builder-workspace/.derivedData/ModuleCache.noindex/Session.modulevalidation -Xcc -I/Users/admin/builder/spi-builder-workspace/.derivedData/Build/Intermediates.noindex/SwiftPM.build/Debug-iphoneos/PackageModel.build/swift-overrides.hmap -emit-const-values -Xfrontend -const-gather-protocols-file -Xfrontend /Users/admin/builder/spi-builder-workspace/.derivedData/Build/Intermediates.noindex/SwiftPM.build/Debug-iphoneos/PackageModel.build/Objects-normal/arm64/PackageModel_const_extract_protocols.json -Xcc -I/Users/admin/builder/spi-builder-workspace/.dependencies/checkouts/swift-tools-support-core/Sources/TSCclibc/include -Xcc -I/Users/admin/builder/spi-builder-workspace/.derivedData/Build/Products/Debug-iphoneos/include -Xcc -I/Users/admin/builder/spi-builder-workspace/.derivedData/Build/Intermediates.noindex/SwiftPM.build/Debug-iphoneos/PackageModel.build/DerivedSources-normal/arm64 -Xcc -I/Users/admin/builder/spi-builder-workspace/.derivedData/Build/Intermediates.noindex/SwiftPM.build/Debug-iphoneos/PackageModel.build/DerivedSources/arm64 -Xcc -I/Users/admin/builder/spi-builder-workspace/.derivedData/Build/Intermediates.noindex/SwiftPM.build/Debug-iphoneos/PackageModel.build/DerivedSources -Xcc -DSWIFT_PACKAGE -Xcc -DDEBUG\=1 -emit-objc-header -emit-objc-header-path /Users/admin/builder/spi-builder-workspace/.derivedData/Build/Intermediates.noindex/SwiftPM.build/Debug-iphoneos/PackageModel.build/Objects-normal/arm64/PackageModel-Swift.h -working-directory /Users/admin/builder/spi-builder-workspace/.swiftpm/xcode -experimental-emit-module-separately -disable-cmo
SwiftDriverJobDiscovery normal arm64 Emitting module for SwiftOptions (in target 'SwiftOptions' from project 'swift-driver')
SwiftDriver\ Compilation\ Requirements SwiftOptions normal arm64 com.apple.xcode.tools.swift.compiler (in target 'SwiftOptions' from project 'swift-driver')
cd /Users/admin/builder/spi-builder-workspace/.swiftpm/xcode
builtin-Swift-Compilation-Requirements -- /Applications/Xcode-16.3.0.app/Contents/Developer/Toolchains/XcodeDefault.xctoolchain/usr/bin/swiftc -module-name SwiftOptions -Onone -enforce-exclusivity\=checked @/Users/admin/builder/spi-builder-workspace/.derivedData/Build/Intermediates.noindex/swift-driver.build/Debug-iphoneos/SwiftOptions.build/Objects-normal/arm64/SwiftOptions.SwiftFileList -DSWIFT_PACKAGE -DDEBUG -DXcode -plugin-path /Applications/Xcode-16.3.0.app/Contents/Developer/Toolchains/XcodeDefault.xctoolchain/usr/lib/swift/host/plugins/testing -enable-experimental-feature DebugDescriptionMacro -sdk /Applications/Xcode-16.3.0.app/Contents/Developer/Platforms/iPhoneOS.platform/Developer/SDKs/iPhoneOS18.4.sdk -target arm64-apple-ios12.0 -g -module-cache-path /Users/admin/builder/spi-builder-workspace/.derivedData/ModuleCache.noindex -Xfrontend -serialize-debugging-options -profile-coverage-mapping -profile-generate -enable-testing -suppress-warnings -index-store-path /Users/admin/builder/spi-builder-workspace/.derivedData/Index.noindex/DataStore -swift-version 5 -I /Users/admin/builder/spi-builder-workspace/.derivedData/Build/Products/Debug-iphoneos -I /Applications/Xcode-16.3.0.app/Contents/Developer/Platforms/iPhoneOS.platform/Developer/usr/lib -F /Users/admin/builder/spi-builder-workspace/.derivedData/Build/Products/Debug-iphoneos/PackageFrameworks -F /Users/admin/builder/spi-builder-workspace/.derivedData/Build/Products/Debug-iphoneos/PackageFrameworks -F /Users/admin/builder/spi-builder-workspace/.derivedData/Build/Products/Debug-iphoneos/PackageFrameworks -F /Users/admin/builder/spi-builder-workspace/.derivedData/Build/Products/Debug-iphoneos/PackageFrameworks -F /Users/admin/builder/spi-builder-workspace/.derivedData/Build/Products/Debug-iphoneos -F /Applications/Xcode-16.3.0.app/Contents/Developer/Platforms/iPhoneOS.platform/Developer/Library/Frameworks -F /Applications/Xcode-16.3.0.app/Contents/Developer/Platforms/iPhoneOS.platform/Developer/SDKs/iPhoneOS18.4.sdk/Developer/Library/Frameworks -c -j10 -enable-batch-mode -incremental -Xcc -ivfsstatcache -Xcc /Users/admin/builder/spi-builder-workspace/.derivedData/SDKStatCaches.noindex/iphoneos18.4-22E235-339d34bc69d7fc736c3220795c36f340.sdkstatcache -output-file-map /Users/admin/builder/spi-builder-workspace/.derivedData/Build/Intermediates.noindex/swift-driver.build/Debug-iphoneos/SwiftOptions.build/Objects-normal/arm64/SwiftOptions-OutputFileMap.json -use-frontend-parseable-output -save-temps -no-color-diagnostics -serialize-diagnostics -emit-dependencies -emit-module -emit-module-path /Users/admin/builder/spi-builder-workspace/.derivedData/Build/Intermediates.noindex/swift-driver.build/Debug-iphoneos/SwiftOptions.build/Objects-normal/arm64/SwiftOptions.swiftmodule -validate-clang-modules-once -clang-build-session-file /Users/admin/builder/spi-builder-workspace/.derivedData/ModuleCache.noindex/Session.modulevalidation -Xcc -I/Users/admin/builder/spi-builder-workspace/.derivedData/Build/Intermediates.noindex/swift-driver.build/Debug-iphoneos/SwiftOptions.build/swift-overrides.hmap -emit-const-values -Xfrontend -const-gather-protocols-file -Xfrontend /Users/admin/builder/spi-builder-workspace/.derivedData/Build/Intermediates.noindex/swift-driver.build/Debug-iphoneos/SwiftOptions.build/Objects-normal/arm64/SwiftOptions_const_extract_protocols.json -Xcc -I/Users/admin/builder/spi-builder-workspace/.dependencies/checkouts/swift-tools-support-core/Sources/TSCclibc/include -Xcc -I/Users/admin/builder/spi-builder-workspace/.derivedData/Build/Products/Debug-iphoneos/include -Xcc -I/Users/admin/builder/spi-builder-workspace/.derivedData/Build/Intermediates.noindex/swift-driver.build/Debug-iphoneos/SwiftOptions.build/DerivedSources-normal/arm64 -Xcc -I/Users/admin/builder/spi-builder-workspace/.derivedData/Build/Intermediates.noindex/swift-driver.build/Debug-iphoneos/SwiftOptions.build/DerivedSources/arm64 -Xcc -I/Users/admin/builder/spi-builder-workspace/.derivedData/Build/Intermediates.noindex/swift-driver.build/Debug-iphoneos/SwiftOptions.build/DerivedSources -Xcc -DSWIFT_PACKAGE -Xcc -DDEBUG\=1 -emit-objc-header -emit-objc-header-path /Users/admin/builder/spi-builder-workspace/.derivedData/Build/Intermediates.noindex/swift-driver.build/Debug-iphoneos/SwiftOptions.build/Objects-normal/arm64/SwiftOptions-Swift.h -working-directory /Users/admin/builder/spi-builder-workspace/.swiftpm/xcode -experimental-emit-module-separately -disable-cmo
SwiftEmitModule normal arm64 Emitting\ module\ for\ PackageModel (in target 'PackageModel' from project 'SwiftPM')
Copy /Users/admin/builder/spi-builder-workspace/.derivedData/Build/Products/Debug-iphoneos/SwiftOptions.swiftmodule/arm64-apple-ios.abi.json /Users/admin/builder/spi-builder-workspace/.derivedData/Build/Intermediates.noindex/swift-driver.build/Debug-iphoneos/SwiftOptions.build/Objects-normal/arm64/SwiftOptions.abi.json (in target 'SwiftOptions' from project 'swift-driver')
cd /Users/admin/builder/spi-builder-workspace/.dependencies/checkouts/swift-driver
builtin-copy -exclude .DS_Store -exclude CVS -exclude .svn -exclude .git -exclude .hg -resolve-src-symlinks -rename /Users/admin/builder/spi-builder-workspace/.derivedData/Build/Intermediates.noindex/swift-driver.build/Debug-iphoneos/SwiftOptions.build/Objects-normal/arm64/SwiftOptions.abi.json /Users/admin/builder/spi-builder-workspace/.derivedData/Build/Products/Debug-iphoneos/SwiftOptions.swiftmodule/arm64-apple-ios.abi.json
SwiftDriverJobDiscovery normal arm64 Compiling FileSystem+Extensions.swift (in target 'Basics' from project 'SwiftPM')
SwiftDriver LLBuildManifest normal arm64 com.apple.xcode.tools.swift.compiler (in target 'LLBuildManifest' from project 'SwiftPM')
cd /Users/admin/builder/spi-builder-workspace/.swiftpm/xcode
builtin-SwiftDriver -- /Applications/Xcode-16.3.0.app/Contents/Developer/Toolchains/XcodeDefault.xctoolchain/usr/bin/swiftc -module-name LLBuildManifest -Onone -enforce-exclusivity\=checked @/Users/admin/builder/spi-builder-workspace/.derivedData/Build/Intermediates.noindex/SwiftPM.build/Debug-iphoneos/LLBuildManifest.build/Objects-normal/arm64/LLBuildManifest.SwiftFileList -DSWIFT_PACKAGE -DDEBUG -DXcode -plugin-path /Applications/Xcode-16.3.0.app/Contents/Developer/Toolchains/XcodeDefault.xctoolchain/usr/lib/swift/host/plugins/testing -enable-experimental-feature DebugDescriptionMacro -sdk /Applications/Xcode-16.3.0.app/Contents/Developer/Platforms/iPhoneOS.platform/Developer/SDKs/iPhoneOS18.4.sdk -target arm64-apple-ios12.0 -g -module-cache-path /Users/admin/builder/spi-builder-workspace/.derivedData/ModuleCache.noindex -Xfrontend -serialize-debugging-options -profile-coverage-mapping -profile-generate -enable-testing -suppress-warnings -index-store-path /Users/admin/builder/spi-builder-workspace/.derivedData/Index.noindex/DataStore -swift-version 5 -I /Users/admin/builder/spi-builder-workspace/.derivedData/Build/Products/Debug-iphoneos -I /Applications/Xcode-16.3.0.app/Contents/Developer/Platforms/iPhoneOS.platform/Developer/usr/lib -F /Users/admin/builder/spi-builder-workspace/.derivedData/Build/Products/Debug-iphoneos/PackageFrameworks -F /Users/admin/builder/spi-builder-workspace/.derivedData/Build/Products/Debug-iphoneos/PackageFrameworks -F /Users/admin/builder/spi-builder-workspace/.derivedData/Build/Products/Debug-iphoneos/PackageFrameworks -F /Users/admin/builder/spi-builder-workspace/.derivedData/Build/Products/Debug-iphoneos/PackageFrameworks -F /Users/admin/builder/spi-builder-workspace/.derivedData/Build/Products/Debug-iphoneos/PackageFrameworks -F /Users/admin/builder/spi-builder-workspace/.derivedData/Build/Products/Debug-iphoneos -F /Applications/Xcode-16.3.0.app/Contents/Developer/Platforms/iPhoneOS.platform/Developer/Library/Frameworks -F /Applications/Xcode-16.3.0.app/Contents/Developer/Platforms/iPhoneOS.platform/Developer/SDKs/iPhoneOS18.4.sdk/Developer/Library/Frameworks -c -j10 -enable-batch-mode -incremental -Xcc -ivfsstatcache -Xcc /Users/admin/builder/spi-builder-workspace/.derivedData/SDKStatCaches.noindex/iphoneos18.4-22E235-339d34bc69d7fc736c3220795c36f340.sdkstatcache -output-file-map /Users/admin/builder/spi-builder-workspace/.derivedData/Build/Intermediates.noindex/SwiftPM.build/Debug-iphoneos/LLBuildManifest.build/Objects-normal/arm64/LLBuildManifest-OutputFileMap.json -use-frontend-parseable-output -save-temps -no-color-diagnostics -serialize-diagnostics -emit-dependencies -emit-module -emit-module-path /Users/admin/builder/spi-builder-workspace/.derivedData/Build/Intermediates.noindex/SwiftPM.build/Debug-iphoneos/LLBuildManifest.build/Objects-normal/arm64/LLBuildManifest.swiftmodule -validate-clang-modules-once -clang-build-session-file /Users/admin/builder/spi-builder-workspace/.derivedData/ModuleCache.noindex/Session.modulevalidation -Xcc -I/Users/admin/builder/spi-builder-workspace/.derivedData/Build/Intermediates.noindex/SwiftPM.build/Debug-iphoneos/LLBuildManifest.build/swift-overrides.hmap -emit-const-values -Xfrontend -const-gather-protocols-file -Xfrontend /Users/admin/builder/spi-builder-workspace/.derivedData/Build/Intermediates.noindex/SwiftPM.build/Debug-iphoneos/LLBuildManifest.build/Objects-normal/arm64/LLBuildManifest_const_extract_protocols.json -Xcc -I/Users/admin/builder/spi-builder-workspace/.dependencies/checkouts/swift-tools-support-core/Sources/TSCclibc/include -Xcc -I/Users/admin/builder/spi-builder-workspace/.derivedData/Build/Products/Debug-iphoneos/include -Xcc -I/Users/admin/builder/spi-builder-workspace/.derivedData/Build/Intermediates.noindex/SwiftPM.build/Debug-iphoneos/LLBuildManifest.build/DerivedSources-normal/arm64 -Xcc -I/Users/admin/builder/spi-builder-workspace/.derivedData/Build/Intermediates.noindex/SwiftPM.build/Debug-iphoneos/LLBuildManifest.build/DerivedSources/arm64 -Xcc -I/Users/admin/builder/spi-builder-workspace/.derivedData/Build/Intermediates.noindex/SwiftPM.build/Debug-iphoneos/LLBuildManifest.build/DerivedSources -Xcc -DSWIFT_PACKAGE -Xcc -DDEBUG\=1 -emit-objc-header -emit-objc-header-path /Users/admin/builder/spi-builder-workspace/.derivedData/Build/Intermediates.noindex/SwiftPM.build/Debug-iphoneos/LLBuildManifest.build/Objects-normal/arm64/LLBuildManifest-Swift.h -working-directory /Users/admin/builder/spi-builder-workspace/.swiftpm/xcode -experimental-emit-module-separately -disable-cmo
SwiftCompile normal arm64 Compiling\ GitRepository.swift /Users/admin/builder/spi-builder-workspace/.dependencies/checkouts/swift-package-manager/Sources/SourceControl/GitRepository.swift (in target 'SourceControl' from project 'SwiftPM')
Command SwiftCompile failed with a nonzero exit code
** BUILD FAILED **
The following build commands failed:
SwiftCompile normal arm64 Compiling\ ByteString+Extensions.swift /Users/admin/builder/spi-builder-workspace/.dependencies/checkouts/swift-package-manager/Sources/Basics/ByteString+Extensions.swift (in target 'Basics' from project 'SwiftPM')
SwiftCompile normal arm64 /Users/admin/builder/spi-builder-workspace/.dependencies/checkouts/swift-package-manager/Sources/Basics/ByteString+Extensions.swift (in target 'Basics' from project 'SwiftPM')
SwiftCompile normal arm64 Compiling\ GitRepository.swift /Users/admin/builder/spi-builder-workspace/.dependencies/checkouts/swift-package-manager/Sources/SourceControl/GitRepository.swift (in target 'SourceControl' from project 'SwiftPM')
Building workspace spi-builder-workspace with scheme swift-package-api-diff
(4 failures)
BUILD FAILURE 6.1 iOS