The Swift Package Index logo.Swift Package Index

Track the adoption of Swift 6 strict concurrency checks for data race safety. How many packages are Ready for Swift 6?

Build Information

Failed to build AWSAppSync, reference main (589d58), with Swift 5.10 for macOS (Xcode) using Xcode 15.4 on 4 Nov 2024 17:57:48 UTC.

Build Command

env DEVELOPER_DIR=/Applications/Xcode-15.4.0.app xcrun xcodebuild -IDEClonedSourcePackagesDirPathOverride=$PWD/.dependencies -skipMacroValidation -skipPackagePluginValidation -derivedDataPath $PWD/.derivedData build -scheme AWSAppSync -destination platform=macOS,arch=arm64

Build Log

========================================
RunAll
========================================
Builder version: 4.56.0
Interrupt handler set up.
========================================
Checkout
========================================
Clone URL: https://github.com/awslabs/aws-mobile-appsync-sdk-ios.git
Reference: main
Initialized empty Git repository in /Users/admin/builder/spi-builder-workspace/.git/
From https://github.com/awslabs/aws-mobile-appsync-sdk-ios
 * branch            main       -> FETCH_HEAD
 * [new branch]      main       -> origin/main
HEAD is now at 589d58b chore(deps): bump rexml from 3.3.6 to 3.3.9 (#609)
Cloned https://github.com/awslabs/aws-mobile-appsync-sdk-ios.git
Revision (git rev-parse @):
589d58ba0e2ae7eac0058235f27bf2b41f66fb85
SUCCESS checkout https://github.com/awslabs/aws-mobile-appsync-sdk-ios.git at main
========================================
Build
========================================
Selected platform:         macosXcodebuild
Swift version:             5.10
Building package at path:  $PWD
https://github.com/awslabs/aws-mobile-appsync-sdk-ios.git
Command line invocation:
    /Applications/Xcode-15.4.0.app/Contents/Developer/usr/bin/xcodebuild -IDEClonedSourcePackagesDirPathOverride=/Users/admin/builder/spi-builder-workspace/.dependencies -resolvePackageDependencies
User defaults from command line:
    IDEClonedSourcePackagesDirPathOverride = /Users/admin/builder/spi-builder-workspace/.dependencies
    IDEPackageSupportUseBuiltinSCM = YES
resolved source packages:
{
  "dependencies" : [
    {
      "identity" : "aws-sdk-ios-spm",
      "requirement" : {
        "range" : [
          {
            "lower_bound" : "2.36.0",
            "upper_bound" : "2.37.0"
          }
        ]
      },
      "type" : "sourceControl",
      "url" : "https://github.com/aws-amplify/aws-sdk-ios-spm.git"
    },
    {
      "identity" : "aws-appsync-realtime-client-ios",
      "requirement" : {
        "range" : [
          {
            "lower_bound" : "3.2.0",
            "upper_bound" : "3.3.0"
          }
        ]
      },
      "type" : "sourceControl",
      "url" : "https://github.com/aws-amplify/aws-appsync-realtime-client-ios.git"
    },
    {
      "identity" : "sqlite.swift",
      "requirement" : {
        "range" : [
          {
            "lower_bound" : "0.12.0",
            "upper_bound" : "0.13.0"
          }
        ]
      },
      "type" : "sourceControl",
      "url" : "https://github.com/stephencelis/SQLite.swift.git"
    }
  ],
  "manifest_display_name" : "AWSAppSync",
  "name" : "AWSAppSync",
  "path" : "/Users/admin/builder/spi-builder-workspace",
  "platforms" : [
  ],
  "products" : [
    {
      "name" : "AWSAppSync",
      "targets" : [
        "AWSAppSync"
      ],
      "type" : {
        "library" : [
          "automatic"
        ]
      }
    }
  ],
  "targets" : [
    {
      "c99name" : "AWSAppSync",
      "module_type" : "SwiftTarget",
      "name" : "AWSAppSync",
      "path" : "AWSAppSyncClient",
      "product_dependencies" : [
        "SQLite",
        "AppSyncRealTimeClient",
        "AWSCore"
      ],
      "product_memberships" : [
        "AWSAppSync"
      ],
      "sources" : [
        "AWSAppSyncAuthProvider.swift",
        "AWSAppSyncAuthType.swift",
        "AWSAppSyncCache.swift",
        "AWSAppSyncCacheConfigurationMigration.swift",
        "AWSAppSyncClient.swift",
        "AWSAppSyncClientConfiguration.swift",
        "AWSAppSyncClientConfigurationError.swift",
        "AWSAppSyncClientConflictResolutionExtensions.swift",
        "AWSAppSyncClientError.swift",
        "AWSAppSyncClientInfo.swift",
        "AWSAppSyncClientInfoError.swift",
        "AWSAppSyncClientLogFormatter.swift",
        "AWSAppSyncClientS3ObjectsExtensions.swift",
        "AWSAppSyncConnection.swift",
        "AWSAppSyncHTTPNetworkTransport.swift",
        "AWSAppSyncMutations.swift",
        "AWSAppSyncReachability.swift",
        "AWSAppSyncRetryStrategy.swift",
        "AWSAppSyncServiceConfig.swift",
        "AWSAppSyncServiceConfigError.swift",
        "AWSAppSyncSubscriptionError.swift",
        "AWSAppSyncSubscriptionWatcher.swift",
        "AWSAppSyncSubscriptionWatcherStatus.swift",
        "AWSNetworkTransport.swift",
        "AWSS3ObjectProtocol.swift",
        "Apollo/Sources/Apollo/AWSGraphQLSubscriptionResponse.swift",
        "Apollo/Sources/Apollo/ApolloClient.swift",
        "Apollo/Sources/Apollo/ApolloStore.swift",
        "Apollo/Sources/Apollo/AsynchronousOperation.swift",
        "Apollo/Sources/Apollo/Collections.swift",
        "Apollo/Sources/Apollo/DataLoader.swift",
        "Apollo/Sources/Apollo/GraphQLDependencyTracker.swift",
        "Apollo/Sources/Apollo/GraphQLError.swift",
        "Apollo/Sources/Apollo/GraphQLExecutor.swift",
        "Apollo/Sources/Apollo/GraphQLInputValue.swift",
        "Apollo/Sources/Apollo/GraphQLOperation.swift",
        "Apollo/Sources/Apollo/GraphQLQueryWatcher.swift",
        "Apollo/Sources/Apollo/GraphQLResponse.swift",
        "Apollo/Sources/Apollo/GraphQLResponseGenerator.swift",
        "Apollo/Sources/Apollo/GraphQLResult.swift",
        "Apollo/Sources/Apollo/GraphQLResultAccumulator.swift",
        "Apollo/Sources/Apollo/GraphQLResultNormalizer.swift",
        "Apollo/Sources/Apollo/GraphQLSelectionSet.swift",
        "Apollo/Sources/Apollo/GraphQLSelectionSetMapper.swift",
        "Apollo/Sources/Apollo/HTTPNetworkTransport.swift",
        "Apollo/Sources/Apollo/InMemoryNormalizedCache.swift",
        "Apollo/Sources/Apollo/JSON.swift",
        "Apollo/Sources/Apollo/JSONSerializationFormat.swift",
        "Apollo/Sources/Apollo/JSONStandardTypeConversions.swift",
        "Apollo/Sources/Apollo/Locking.swift",
        "Apollo/Sources/Apollo/NetworkTransport.swift",
        "Apollo/Sources/Apollo/NormalizedCache.swift",
        "Apollo/Sources/Apollo/Promise.swift",
        "Apollo/Sources/Apollo/Record.swift",
        "Apollo/Sources/Apollo/RecordSet.swift",
        "Apollo/Sources/Apollo/Result.swift",
        "Apollo/Sources/Apollo/ResultOrPromise.swift",
        "Apollo/Sources/Apollo/Utilities.swift",
        "Internal/AWSAppSyncRetryHandler.swift",
        "Internal/AWSAppSyncSubscriptionMetadataCache.swift",
        "Internal/AWSConfigurationFile.swift",
        "Internal/AWSMutationCache.swift",
        "Internal/AWSMutationRetryAdviceHelper.swift",
        "Internal/AWSMutationRetryNotifier.swift",
        "Internal/AWSMutationState.swift",
        "Internal/AWSOfflineMutation.swift",
        "Internal/AWSPerformMutationQueue.swift",
        "Internal/AWSRequestBuilder.swift",
        "Internal/AWSSQLiteNormalizedCache.swift",
        "Internal/AppSyncLogHelper.swift",
        "Internal/AppSyncLogWrapper.swift",
        "Internal/AppSyncSubscriptionWithSync.swift",
        "Internal/AuthInterceptor/IAMAuthInterceptor.swift",
        "Internal/AuthInterceptor/LambdaAuthInterceptor.swift",
        "Internal/BasicAWSAPIKeyAuthProvider.swift",
        "Internal/CachedMutationOperation.swift",
        "Internal/Foundation+Utils.swift",
        "Internal/InternalS3ObjectDetails.swift",
        "Internal/NetworkReachabilityNotifier.swift",
        "Internal/SQLiteSerialization.swift",
        "Internal/SessionMutationOperation.swift",
        "Internal/SubscriptionFactory/APIKeyBasedConnectionPool.swift",
        "Internal/SubscriptionFactory/AppSyncRealTimeClientOIDCAuthProvider.swift",
        "Internal/SubscriptionFactory/ConnectionPool/BasicSubscriptionConnectionFactory.swift",
        "Internal/SubscriptionFactory/IAMBasedConnectionPool.swift",
        "Internal/SubscriptionFactory/LambdaBasedConnectionPool.swift",
        "Internal/SubscriptionFactory/OIDCBasedConnectionPool.swift",
        "Internal/SubscriptionFactory/SubscriptionConnectionFactory.swift",
        "Internal/SubscriptionFactory/UserPoolsBasedConnectionPool.swift",
        "Internal/SubscriptionMessageQueue.swift",
        "Internal/SyncConfiguration.swift",
        "Internal/SyncStrategy.swift",
        "NetworkReachability.swift"
      ],
      "type" : "library"
    }
  ],
  "tools_version" : "5.3"
}
{
  "project" : {
    "configurations" : [
      "Debug",
      "Release"
    ],
    "name" : "AWSAppSyncClient",
    "schemes" : [
      "AWSAppSync",
      "AWSAppSync-IntegTests",
      "AWSAppSyncTestApp",
      "AWSAppSyncTestCommon",
      "AWSAppSyncTestHostApp",
      "StarWarsAPI"
    ],
    "targets" : [
      "AWSAppSync",
      "AWSAppSyncTestCommon",
      "AWSAppSyncTestHostApp",
      "AWSAppSyncUnitTests",
      "AWSAppSyncIntegrationTests",
      "AWSAppSyncTestApp",
      "AWSAppSyncTestAppUITests",
      "ApolloTests",
      "StarWarsAPI"
    ]
  }
}
{
  "workspace" : {
    "name" : "spi-builder-workspace",
    "schemes" : [
      "AWSAppSync"
    ]
  }
}
Running build ...
env DEVELOPER_DIR=/Applications/Xcode-15.4.0.app xcrun xcodebuild -IDEClonedSourcePackagesDirPathOverride=$PWD/.dependencies -skipMacroValidation -skipPackagePluginValidation -derivedDataPath $PWD/.derivedData build -scheme AWSAppSync -destination platform=macOS,arch=arm64
Command line invocation:
    /Applications/Xcode-15.4.0.app/Contents/Developer/usr/bin/xcodebuild -IDEClonedSourcePackagesDirPathOverride=/Users/admin/builder/spi-builder-workspace/.dependencies -skipMacroValidation -skipPackagePluginValidation -derivedDataPath /Users/admin/builder/spi-builder-workspace/.derivedData build -scheme AWSAppSync -destination platform=macOS,arch=arm64
User defaults from command line:
    IDEClonedSourcePackagesDirPathOverride = /Users/admin/builder/spi-builder-workspace/.dependencies
    IDEDerivedDataPathOverride = /Users/admin/builder/spi-builder-workspace/.derivedData
    IDEPackageSupportUseBuiltinSCM = YES
Resolve Package Graph
Resolved source packages:
  AppSyncRealTimeClient: https://github.com/aws-amplify/aws-appsync-realtime-client-ios.git @ 3.2.0
  AWSAppSync: /Users/admin/builder/spi-builder-workspace
  Starscream: https://github.com/daltoniam/Starscream @ 4.0.8
  SQLite.swift: https://github.com/stephencelis/SQLite.swift.git @ 0.12.2
  AWSiOSSDKV2: https://github.com/aws-amplify/aws-sdk-ios-spm.git @ 2.36.7
Prepare packages
ComputeTargetDependencyGraph
note: Building targets in dependency order
note: Target dependency graph (11 targets)
    Target 'AWSAppSync' in project 'AWSAppSync'
        ➜ Explicit dependency on target 'AWSAppSync' in project 'AWSAppSync'
        ➜ Explicit dependency on target 'SQLite' in project 'SQLite.swift'
        ➜ Explicit dependency on target 'AppSyncRealTimeClient' in project 'AppSyncRealTimeClient'
        ➜ Explicit dependency on target 'AWSCore' in project 'AWSiOSSDKV2'
    Target 'AWSAppSync' in project 'AWSAppSync'
        ➜ Explicit dependency on target 'SQLite' in project 'SQLite.swift'
        ➜ Explicit dependency on target 'AppSyncRealTimeClient' in project 'AppSyncRealTimeClient'
        ➜ Explicit dependency on target 'AWSCore' in project 'AWSiOSSDKV2'
    Target 'AWSCore' in project 'AWSiOSSDKV2' (no dependencies)
    Target 'AppSyncRealTimeClient' in project 'AppSyncRealTimeClient'
        ➜ Explicit dependency on target 'AppSyncRealTimeClient' in project 'AppSyncRealTimeClient'
        ➜ Explicit dependency on target 'Starscream' in project 'Starscream'
    Target 'AppSyncRealTimeClient' in project 'AppSyncRealTimeClient'
        ➜ Explicit dependency on target 'Starscream' in project 'Starscream'
    Target 'Starscream' in project 'Starscream'
        ➜ Explicit dependency on target 'Starscream' in project 'Starscream'
        ➜ Explicit dependency on target 'Starscream_Starscream' in project 'Starscream'
    Target 'Starscream' in project 'Starscream'
        ➜ Explicit dependency on target 'Starscream_Starscream' in project 'Starscream'
    Target 'Starscream_Starscream' in project 'Starscream' (no dependencies)
    Target 'SQLite' in project 'SQLite.swift'
        ➜ Explicit dependency on target 'SQLite' in project 'SQLite.swift'
        ➜ Explicit dependency on target 'SQLiteObjc' in project 'SQLite.swift'
    Target 'SQLite' in project 'SQLite.swift'
        ➜ Explicit dependency on target 'SQLiteObjc' in project 'SQLite.swift'
    Target 'SQLiteObjc' in project 'SQLite.swift' (no dependencies)
GatherProvisioningInputs
CreateBuildDescription
ExecuteExternalTool /Applications/Xcode-15.4.0.app/Contents/Developer/Toolchains/XcodeDefault.xctoolchain/usr/bin/clang -v -E -dM -arch arm64 -isysroot /Applications/Xcode-15.4.0.app/Contents/Developer/Platforms/MacOSX.platform/Developer/SDKs/MacOSX14.5.sdk -x objective-c -c /dev/null
ExecuteExternalTool /Applications/Xcode-15.4.0.app/Contents/Developer/Toolchains/XcodeDefault.xctoolchain/usr/bin/swiftc -v
ExecuteExternalTool /Applications/Xcode-15.4.0.app/Contents/Developer/Toolchains/XcodeDefault.xctoolchain/usr/bin/clang -v -E -dM -isysroot /Applications/Xcode-15.4.0.app/Contents/Developer/Platforms/MacOSX.platform/Developer/SDKs/MacOSX14.5.sdk -x c -c /dev/null
ExecuteExternalTool /Applications/Xcode-15.4.0.app/Contents/Developer/Toolchains/XcodeDefault.xctoolchain/usr/bin/clang -v -E -dM -arch arm64 -isysroot /Applications/Xcode-15.4.0.app/Contents/Developer/Platforms/MacOSX.platform/Developer/SDKs/MacOSX14.5.sdk -x c -c /dev/null
ExecuteExternalTool /Applications/Xcode-15.4.0.app/Contents/Developer/Toolchains/XcodeDefault.xctoolchain/usr/bin/ld -version_details
Build description signature: b4ad6b16c7995f70371847e07dca2620
Build description path: /Users/admin/builder/spi-builder-workspace/.derivedData/Build/Intermediates.noindex/XCBuildData/b4ad6b16c7995f70371847e07dca2620.xcbuilddata
/Users/admin/builder/spi-builder-workspace/.dependencies/artifacts/aws-sdk-ios-spm/AWSCore/AWSCore.xcframework:1:1: error: While building for macOS, no library for this platform was found in '/Users/admin/builder/spi-builder-workspace/.dependencies/artifacts/aws-sdk-ios-spm/AWSCore/AWSCore.xcframework'. (in target 'AWSCore' from project 'AWSiOSSDKV2')
/Users/admin/builder/spi-builder-workspace/.dependencies/artifacts/aws-sdk-ios-spm/AWSCore/AWSCore.xcframework:1:1: error: While building for macOS, no library for this platform was found in '/Users/admin/builder/spi-builder-workspace/.dependencies/artifacts/aws-sdk-ios-spm/AWSCore/AWSCore.xcframework'. (in target 'AWSAppSync' from project 'AWSAppSync')
/Users/admin/builder/spi-builder-workspace/.dependencies/artifacts/aws-sdk-ios-spm/AWSCore/AWSCore.xcframework:1:1: error: While building for macOS, no library for this platform was found in '/Users/admin/builder/spi-builder-workspace/.dependencies/artifacts/aws-sdk-ios-spm/AWSCore/AWSCore.xcframework'. (in target 'AWSAppSync' from project 'AWSAppSync')
/Users/admin/builder/spi-builder-workspace/.dependencies/artifacts/aws-sdk-ios-spm/AWSCore/AWSCore.xcframework:1:1: error: While building for macOS, no library for this platform was found in '/Users/admin/builder/spi-builder-workspace/.dependencies/artifacts/aws-sdk-ios-spm/AWSCore/AWSCore.xcframework'. (in target 'AWSAppSync' from project 'AWSAppSync')
--- xcodebuild: WARNING: Using the first of multiple matching destinations:
{ platform:macOS, arch:arm64, id:0000FE00-8C151E3703BE51BE, name:My Mac }
{ platform:macOS, arch:arm64, variant:Mac Catalyst, id:0000FE00-8C151E3703BE51BE, name:My Mac }
{ platform:macOS, arch:arm64, variant:DriverKit, id:0000FE00-8C151E3703BE51BE, name:My Mac }
{ platform:macOS, arch:arm64, variant:Designed for [iPad,iPhone], id:0000FE00-8C151E3703BE51BE, name:My Mac }
** BUILD FAILED **
Command line invocation:
    /Applications/Xcode-15.4.0.app/Contents/Developer/usr/bin/xcodebuild -IDEClonedSourcePackagesDirPathOverride=/Users/admin/builder/spi-builder-workspace/.dependencies -skipMacroValidation -skipPackagePluginValidation -derivedDataPath /Users/admin/builder/spi-builder-workspace/.derivedData build -scheme AWSAppSync -destination platform=macOS,arch=arm64
User defaults from command line:
    IDEClonedSourcePackagesDirPathOverride = /Users/admin/builder/spi-builder-workspace/.dependencies
    IDEDerivedDataPathOverride = /Users/admin/builder/spi-builder-workspace/.derivedData
    IDEPackageSupportUseBuiltinSCM = YES
Resolve Package Graph
Resolved source packages:
  Starscream: https://github.com/daltoniam/Starscream @ 4.0.8
  AppSyncRealTimeClient: https://github.com/aws-amplify/aws-appsync-realtime-client-ios.git @ 3.2.0
  SQLite.swift: https://github.com/stephencelis/SQLite.swift.git @ 0.12.2
  AWSAppSync: /Users/admin/builder/spi-builder-workspace
  AWSiOSSDKV2: https://github.com/aws-amplify/aws-sdk-ios-spm.git @ 2.36.7
Prepare packages
ComputeTargetDependencyGraph
note: Building targets in dependency order
note: Target dependency graph (11 targets)
    Target 'AWSAppSync' in project 'AWSAppSync'
        ➜ Explicit dependency on target 'AWSAppSync' in project 'AWSAppSync'
        ➜ Explicit dependency on target 'SQLite' in project 'SQLite.swift'
        ➜ Explicit dependency on target 'AppSyncRealTimeClient' in project 'AppSyncRealTimeClient'
        ➜ Explicit dependency on target 'AWSCore' in project 'AWSiOSSDKV2'
    Target 'AWSAppSync' in project 'AWSAppSync'
        ➜ Explicit dependency on target 'SQLite' in project 'SQLite.swift'
        ➜ Explicit dependency on target 'AppSyncRealTimeClient' in project 'AppSyncRealTimeClient'
        ➜ Explicit dependency on target 'AWSCore' in project 'AWSiOSSDKV2'
    Target 'AWSCore' in project 'AWSiOSSDKV2' (no dependencies)
    Target 'AppSyncRealTimeClient' in project 'AppSyncRealTimeClient'
        ➜ Explicit dependency on target 'AppSyncRealTimeClient' in project 'AppSyncRealTimeClient'
        ➜ Explicit dependency on target 'Starscream' in project 'Starscream'
    Target 'AppSyncRealTimeClient' in project 'AppSyncRealTimeClient'
        ➜ Explicit dependency on target 'Starscream' in project 'Starscream'
    Target 'Starscream' in project 'Starscream'
        ➜ Explicit dependency on target 'Starscream' in project 'Starscream'
        ➜ Explicit dependency on target 'Starscream_Starscream' in project 'Starscream'
    Target 'Starscream' in project 'Starscream'
        ➜ Explicit dependency on target 'Starscream_Starscream' in project 'Starscream'
    Target 'Starscream_Starscream' in project 'Starscream' (no dependencies)
    Target 'SQLite' in project 'SQLite.swift'
        ➜ Explicit dependency on target 'SQLite' in project 'SQLite.swift'
        ➜ Explicit dependency on target 'SQLiteObjc' in project 'SQLite.swift'
    Target 'SQLite' in project 'SQLite.swift'
        ➜ Explicit dependency on target 'SQLiteObjc' in project 'SQLite.swift'
    Target 'SQLiteObjc' in project 'SQLite.swift' (no dependencies)
GatherProvisioningInputs
CreateBuildDescription
ExecuteExternalTool /Applications/Xcode-15.4.0.app/Contents/Developer/Toolchains/XcodeDefault.xctoolchain/usr/bin/clang -v -E -dM -arch arm64 -isysroot /Applications/Xcode-15.4.0.app/Contents/Developer/Platforms/MacOSX.platform/Developer/SDKs/MacOSX14.5.sdk -x objective-c -c /dev/null
ExecuteExternalTool /Applications/Xcode-15.4.0.app/Contents/Developer/Toolchains/XcodeDefault.xctoolchain/usr/bin/swiftc -v
ExecuteExternalTool /Applications/Xcode-15.4.0.app/Contents/Developer/Toolchains/XcodeDefault.xctoolchain/usr/bin/clang -v -E -dM -isysroot /Applications/Xcode-15.4.0.app/Contents/Developer/Platforms/MacOSX.platform/Developer/SDKs/MacOSX14.5.sdk -x c -c /dev/null
ExecuteExternalTool /Applications/Xcode-15.4.0.app/Contents/Developer/Toolchains/XcodeDefault.xctoolchain/usr/bin/clang -v -E -dM -arch arm64 -isysroot /Applications/Xcode-15.4.0.app/Contents/Developer/Platforms/MacOSX.platform/Developer/SDKs/MacOSX14.5.sdk -x c -c /dev/null
ExecuteExternalTool /Applications/Xcode-15.4.0.app/Contents/Developer/Toolchains/XcodeDefault.xctoolchain/usr/bin/ld -version_details
Build description signature: b4ad6b16c7995f70371847e07dca2620
Build description path: /Users/admin/builder/spi-builder-workspace/.derivedData/Build/Intermediates.noindex/XCBuildData/b4ad6b16c7995f70371847e07dca2620.xcbuilddata
/Users/admin/builder/spi-builder-workspace/.dependencies/artifacts/aws-sdk-ios-spm/AWSCore/AWSCore.xcframework:1:1: error: While building for macOS, no library for this platform was found in '/Users/admin/builder/spi-builder-workspace/.dependencies/artifacts/aws-sdk-ios-spm/AWSCore/AWSCore.xcframework'. (in target 'AWSAppSync' from project 'AWSAppSync')
/Users/admin/builder/spi-builder-workspace/.dependencies/artifacts/aws-sdk-ios-spm/AWSCore/AWSCore.xcframework:1:1: error: While building for macOS, no library for this platform was found in '/Users/admin/builder/spi-builder-workspace/.dependencies/artifacts/aws-sdk-ios-spm/AWSCore/AWSCore.xcframework'. (in target 'AWSAppSync' from project 'AWSAppSync')
/Users/admin/builder/spi-builder-workspace/.dependencies/artifacts/aws-sdk-ios-spm/AWSCore/AWSCore.xcframework:1:1: error: While building for macOS, no library for this platform was found in '/Users/admin/builder/spi-builder-workspace/.dependencies/artifacts/aws-sdk-ios-spm/AWSCore/AWSCore.xcframework'. (in target 'AWSAppSync' from project 'AWSAppSync')
/Users/admin/builder/spi-builder-workspace/.dependencies/artifacts/aws-sdk-ios-spm/AWSCore/AWSCore.xcframework:1:1: error: While building for macOS, no library for this platform was found in '/Users/admin/builder/spi-builder-workspace/.dependencies/artifacts/aws-sdk-ios-spm/AWSCore/AWSCore.xcframework'. (in target 'AWSCore' from project 'AWSiOSSDKV2')
--- xcodebuild: WARNING: Using the first of multiple matching destinations:
{ platform:macOS, arch:arm64, id:0000FE00-8C151E3703BE51BE, name:My Mac }
{ platform:macOS, arch:arm64, variant:Mac Catalyst, id:0000FE00-8C151E3703BE51BE, name:My Mac }
{ platform:macOS, arch:arm64, variant:DriverKit, id:0000FE00-8C151E3703BE51BE, name:My Mac }
{ platform:macOS, arch:arm64, variant:Designed for [iPad,iPhone], id:0000FE00-8C151E3703BE51BE, name:My Mac }
** BUILD FAILED **
BUILD FAILURE 5.10 macosXcodebuild