Build Information
Failed to build BVSwift, reference master (7bc390
), with Swift 5.9 for macOS (SPM) on 30 Apr 2025 11:03:24 UTC.
Build Command
env DEVELOPER_DIR=/Applications/Xcode-15.2.0.app xcrun swift build --arch arm64
Build Log
========================================
RunAll
========================================
Builder version: 4.61.1
Interrupt handler set up.
========================================
Checkout
========================================
Clone URL: https://github.com/bazaarvoice/bv-ios-swift-sdk.git
Reference: master
Initialized empty Git repository in /Users/admin/builder/spi-builder-workspace/.git/
From https://github.com/bazaarvoice/bv-ios-swift-sdk
* branch master -> FETCH_HEAD
* [new branch] master -> origin/master
HEAD is now at 7bc3905 Develop (#73)
Cloned https://github.com/bazaarvoice/bv-ios-swift-sdk.git
Revision (git rev-parse @):
7bc39054f4c57e36c71774022debfdc7f89f3952
SUCCESS checkout https://github.com/bazaarvoice/bv-ios-swift-sdk.git at master
========================================
Build
========================================
Selected platform: macosSpm
Swift version: 5.9
Building package at path: $PWD
https://github.com/bazaarvoice/bv-ios-swift-sdk.git
Running build ...
env DEVELOPER_DIR=/Applications/Xcode-15.2.0.app xcrun swift build --arch arm64
Building for debugging...
[1/226] Compiling BVSwift BVBag.swift
/Users/admin/builder/spi-builder-workspace/BVSwift/BVAnalytics/BVAnalyticsManagerAppState.swift:10:8: error: no such module 'UIKit'
import UIKit
^
[2/226] Compiling BVSwift BVCodable.swift
/Users/admin/builder/spi-builder-workspace/BVSwift/BVAnalytics/BVAnalyticsManagerAppState.swift:10:8: error: no such module 'UIKit'
import UIKit
^
[3/226] Compiling BVSwift BVExpungeable.swift
/Users/admin/builder/spi-builder-workspace/BVSwift/BVAnalytics/BVAnalyticsManagerAppState.swift:10:8: error: no such module 'UIKit'
import UIKit
^
[4/226] Compiling BVSwift BVFingerprint.swift
/Users/admin/builder/spi-builder-workspace/BVSwift/BVAnalytics/BVAnalyticsManagerAppState.swift:10:8: error: no such module 'UIKit'
import UIKit
^
[5/226] Compiling BVSwift BVLock.swift
/Users/admin/builder/spi-builder-workspace/BVSwift/BVAnalytics/BVAnalyticsManagerAppState.swift:10:8: error: no such module 'UIKit'
import UIKit
^
[6/226] Compiling BVSwift BVPRNG.swift
/Users/admin/builder/spi-builder-workspace/BVSwift/BVAnalytics/BVAnalyticsManagerAppState.swift:10:8: error: no such module 'UIKit'
import UIKit
^
[7/226] Compiling BVSwift BVProxyObject.swift
/Users/admin/builder/spi-builder-workspace/BVSwift/BVAnalytics/BVAnalyticsManagerAppState.swift:10:8: error: no such module 'UIKit'
import UIKit
^
[8/226] Compiling BVSwift BVReactive.swift
/Users/admin/builder/spi-builder-workspace/BVSwift/BVAnalytics/BVAnalyticsManagerAppState.swift:10:8: error: no such module 'UIKit'
import UIKit
^
[9/226] Compiling BVSwift BVUtilities.swift
/Users/admin/builder/spi-builder-workspace/BVSwift/BVAnalytics/BVAnalyticsManagerAppState.swift:10:8: error: no such module 'UIKit'
import UIKit
^
[10/226] Compiling BVSwift BVWeak.swift
/Users/admin/builder/spi-builder-workspace/BVSwift/BVAnalytics/BVAnalyticsManagerAppState.swift:10:8: error: no such module 'UIKit'
import UIKit
^
[11/226] Compiling BVSwift BVXMLParser.swift
/Users/admin/builder/spi-builder-workspace/BVSwift/BVAnalytics/BVAnalyticsManagerAppState.swift:10:8: error: no such module 'UIKit'
import UIKit
^
[12/226] Compiling BVSwift BVConversationsConfiguration.swift
/Users/admin/builder/spi-builder-workspace/BVSwift/BVAnalytics/BVAnalyticsManagerAppState.swift:10:8: error: no such module 'UIKit'
import UIKit
^
[13/226] Compiling BVSwift BVConversationsConstants.swift
/Users/admin/builder/spi-builder-workspace/BVSwift/BVAnalytics/BVAnalyticsManagerAppState.swift:10:8: error: no such module 'UIKit'
import UIKit
^
[14/226] Compiling BVSwift BVConversationsError.swift
/Users/admin/builder/spi-builder-workspace/BVSwift/BVAnalytics/BVAnalyticsManagerAppState.swift:10:8: error: no such module 'UIKit'
import UIKit
^
[15/226] Compiling BVSwift BVManagerConversations.swift
/Users/admin/builder/spi-builder-workspace/BVSwift/BVAnalytics/BVAnalyticsManagerAppState.swift:10:8: error: no such module 'UIKit'
import UIKit
^
[16/226] Compiling BVSwift BVManagerConversationsQuery.swift
/Users/admin/builder/spi-builder-workspace/BVSwift/BVAnalytics/BVAnalyticsManagerAppState.swift:10:8: error: no such module 'UIKit'
import UIKit
^
[17/226] Compiling BVSwift BVManagerConversationsSubmission.swift
/Users/admin/builder/spi-builder-workspace/BVSwift/BVAnalytics/BVAnalyticsManagerAppState.swift:10:8: error: no such module 'UIKit'
import UIKit
^
[18/226] Compiling BVSwift BVConversationsQuery.swift
/Users/admin/builder/spi-builder-workspace/BVSwift/BVAnalytics/BVAnalyticsManagerAppState.swift:10:8: error: no such module 'UIKit'
import UIKit
^
[19/226] Compiling BVSwift BVConversationsQueryResponse.swift
/Users/admin/builder/spi-builder-workspace/BVSwift/BVAnalytics/BVAnalyticsManagerAppState.swift:10:8: error: no such module 'UIKit'
import UIKit
^
[20/226] Compiling BVSwift BVConversationsQueryable.swift
/Users/admin/builder/spi-builder-workspace/BVSwift/BVAnalytics/BVAnalyticsManagerAppState.swift:10:8: error: no such module 'UIKit'
import UIKit
^
[21/226] Compiling BVSwift BVConversationsFilterOperator.swift
/Users/admin/builder/spi-builder-workspace/BVSwift/BVAnalytics/BVAnalyticsManagerAppState.swift:10:8: error: no such module 'UIKit'
import UIKit
^
[22/226] Compiling BVSwift BVConversationsSortOrder.swift
/Users/admin/builder/spi-builder-workspace/BVSwift/BVAnalytics/BVAnalyticsManagerAppState.swift:10:8: error: no such module 'UIKit'
import UIKit
^
[23/226] Compiling BVSwift BVRelevancySortOrder.swift
/Users/admin/builder/spi-builder-workspace/BVSwift/BVAnalytics/BVAnalyticsManagerAppState.swift:10:8: error: no such module 'UIKit'
import UIKit
^
[24/226] Compiling BVSwift BVAnswerFilter.swift
/Users/admin/builder/spi-builder-workspace/BVSwift/BVAnalytics/BVAnalyticsManagerAppState.swift:10:8: error: no such module 'UIKit'
import UIKit
^
[25/226] Compiling BVSwift BVAnswerSort.swift
/Users/admin/builder/spi-builder-workspace/BVSwift/BVAnalytics/BVAnalyticsManagerAppState.swift:10:8: error: no such module 'UIKit'
import UIKit
^
[26/226] Compiling BVSwift BVPhotoSubmission.swift
/Users/admin/builder/spi-builder-workspace/BVSwift/BVAnalytics/BVAnalyticsManagerAppState.swift:10:8: error: no such module 'UIKit'
import UIKit
^
[27/226] Compiling BVSwift BVProgressiveReviewSubmission.swift
/Users/admin/builder/spi-builder-workspace/BVSwift/BVAnalytics/BVAnalyticsManagerAppState.swift:10:8: error: no such module 'UIKit'
import UIKit
^
[28/226] Compiling BVSwift BVQuestionSubmission.swift
/Users/admin/builder/spi-builder-workspace/BVSwift/BVAnalytics/BVAnalyticsManagerAppState.swift:10:8: error: no such module 'UIKit'
import UIKit
^
[29/226] Compiling BVSwift BVReviewSubmission.swift
/Users/admin/builder/spi-builder-workspace/BVSwift/BVAnalytics/BVAnalyticsManagerAppState.swift:10:8: error: no such module 'UIKit'
import UIKit
^
[30/226] Compiling BVSwift BVUASSubmission.swift
/Users/admin/builder/spi-builder-workspace/BVSwift/BVAnalytics/BVAnalyticsManagerAppState.swift:10:8: error: no such module 'UIKit'
import UIKit
^
[31/226] Compiling BVSwift BVVideoSubmission.swift
/Users/admin/builder/spi-builder-workspace/BVSwift/BVAnalytics/BVAnalyticsManagerAppState.swift:10:8: error: no such module 'UIKit'
import UIKit
^
[32/226] Compiling BVSwift BVCurationsConfiguration.swift
/Users/admin/builder/spi-builder-workspace/BVSwift/BVAnalytics/BVAnalyticsManagerAppState.swift:10:8: error: no such module 'UIKit'
import UIKit
^
[33/226] Compiling BVSwift BVCurationsConstants.swift
/Users/admin/builder/spi-builder-workspace/BVSwift/BVAnalytics/BVAnalyticsManagerAppState.swift:10:8: error: no such module 'UIKit'
import UIKit
^
[34/226] Compiling BVSwift BVCurationsError.swift
/Users/admin/builder/spi-builder-workspace/BVSwift/BVAnalytics/BVAnalyticsManagerAppState.swift:10:8: error: no such module 'UIKit'
import UIKit
^
[35/226] Compiling BVSwift BVManagerCurations.swift
/Users/admin/builder/spi-builder-workspace/BVSwift/BVAnalytics/BVAnalyticsManagerAppState.swift:10:8: error: no such module 'UIKit'
import UIKit
^
[36/226] Compiling BVSwift BVManagerCurationsQuery.swift
/Users/admin/builder/spi-builder-workspace/BVSwift/BVAnalytics/BVAnalyticsManagerAppState.swift:10:8: error: no such module 'UIKit'
import UIKit
^
[37/226] Compiling BVSwift BVManagerCurationsSubmission.swift
/Users/admin/builder/spi-builder-workspace/BVSwift/BVAnalytics/BVAnalyticsManagerAppState.swift:10:8: error: no such module 'UIKit'
import UIKit
^
[38/226] Compiling BVSwift BVCurationsQuery.swift
/Users/admin/builder/spi-builder-workspace/BVSwift/BVAnalytics/BVAnalyticsManagerAppState.swift:10:8: error: no such module 'UIKit'
import UIKit
^
[39/226] Compiling BVSwift BVCurationsQueryResponse.swift
/Users/admin/builder/spi-builder-workspace/BVSwift/BVAnalytics/BVAnalyticsManagerAppState.swift:10:8: error: no such module 'UIKit'
import UIKit
^
[40/226] Compiling BVSwift BVCurationsQueryable.swift
/Users/admin/builder/spi-builder-workspace/BVSwift/BVAnalytics/BVAnalyticsManagerAppState.swift:10:8: error: no such module 'UIKit'
import UIKit
^
[41/226] Compiling BVSwift BVCurationsFeedItemField.swift
/Users/admin/builder/spi-builder-workspace/BVSwift/BVAnalytics/BVAnalyticsManagerAppState.swift:10:8: error: no such module 'UIKit'
import UIKit
^
[42/226] Compiling BVSwift BVCurationsFeedItemQuery.swift
/Users/admin/builder/spi-builder-workspace/BVSwift/BVAnalytics/BVAnalyticsManagerAppState.swift:10:8: error: no such module 'UIKit'
import UIKit
^
[43/226] Compiling BVSwift BVCurationsAuthor.swift
/Users/admin/builder/spi-builder-workspace/BVSwift/BVAnalytics/BVAnalyticsManagerAppState.swift:10:8: error: no such module 'UIKit'
import UIKit
^
[44/226] Compiling BVSwift BVCurationsBrand.swift
/Users/admin/builder/spi-builder-workspace/BVSwift/BVAnalytics/BVAnalyticsManagerAppState.swift:10:8: error: no such module 'UIKit'
import UIKit
^
[45/226] Compiling BVSwift BVCurationsChannelContent.swift
/Users/admin/builder/spi-builder-workspace/BVSwift/BVAnalytics/BVAnalyticsManagerAppState.swift:10:8: error: no such module 'UIKit'
import UIKit
^
[46/226] Compiling BVSwift BVCurationsCoordinates.swift
/Users/admin/builder/spi-builder-workspace/BVSwift/BVAnalytics/BVAnalyticsManagerAppState.swift:10:8: error: no such module 'UIKit'
import UIKit
^
[47/226] Compiling BVSwift BVCurationsCustomContent.swift
/Users/admin/builder/spi-builder-workspace/BVSwift/BVAnalytics/BVAnalyticsManagerAppState.swift:10:8: error: no such module 'UIKit'
import UIKit
^
[48/226] Compiling BVSwift BVCurationsDistributionElement.swift
/Users/admin/builder/spi-builder-workspace/BVSwift/BVAnalytics/BVAnalyticsManagerAppState.swift:10:8: error: no such module 'UIKit'
import UIKit
^
[49/226] Compiling BVSwift BVCurationsDistributionValue.swift
/Users/admin/builder/spi-builder-workspace/BVSwift/BVAnalytics/BVAnalyticsManagerAppState.swift:10:8: error: no such module 'UIKit'
import UIKit
^
[50/226] Compiling BVSwift BVCurationsFeedItem.swift
/Users/admin/builder/spi-builder-workspace/BVSwift/BVAnalytics/BVAnalyticsManagerAppState.swift:10:8: error: no such module 'UIKit'
import UIKit
^
[51/251] Compiling BVSwift BVAuthorFilter.swift
/Users/admin/builder/spi-builder-workspace/BVSwift/BVAnalytics/BVAnalyticsManagerAppState.swift:10:8: error: no such module 'UIKit'
import UIKit
^
[52/251] Compiling BVSwift BVAuthorInclude.swift
/Users/admin/builder/spi-builder-workspace/BVSwift/BVAnalytics/BVAnalyticsManagerAppState.swift:10:8: error: no such module 'UIKit'
import UIKit
^
[53/251] Compiling BVSwift BVAuthorSort.swift
/Users/admin/builder/spi-builder-workspace/BVSwift/BVAnalytics/BVAnalyticsManagerAppState.swift:10:8: error: no such module 'UIKit'
import UIKit
^
[54/251] Compiling BVSwift BVAuthorStat.swift
/Users/admin/builder/spi-builder-workspace/BVSwift/BVAnalytics/BVAnalyticsManagerAppState.swift:10:8: error: no such module 'UIKit'
import UIKit
^
[55/251] Compiling BVSwift BVCommentFilter.swift
/Users/admin/builder/spi-builder-workspace/BVSwift/BVAnalytics/BVAnalyticsManagerAppState.swift:10:8: error: no such module 'UIKit'
import UIKit
^
[56/251] Compiling BVSwift BVCommentInclude.swift
/Users/admin/builder/spi-builder-workspace/BVSwift/BVAnalytics/BVAnalyticsManagerAppState.swift:10:8: error: no such module 'UIKit'
import UIKit
^
[57/251] Compiling BVSwift BVCommentSort.swift
/Users/admin/builder/spi-builder-workspace/BVSwift/BVAnalytics/BVAnalyticsManagerAppState.swift:10:8: error: no such module 'UIKit'
import UIKit
^
[58/251] Compiling BVSwift BVCostomSort.swift
/Users/admin/builder/spi-builder-workspace/BVSwift/BVAnalytics/BVAnalyticsManagerAppState.swift:10:8: error: no such module 'UIKit'
import UIKit
^
[59/251] Compiling BVSwift BVFeatureStats.swift
/Users/admin/builder/spi-builder-workspace/BVSwift/BVAnalytics/BVAnalyticsManagerAppState.swift:10:8: error: no such module 'UIKit'
import UIKit
^
[60/251] Compiling BVSwift BVFormatStats.swift
/Users/admin/builder/spi-builder-workspace/BVSwift/BVAnalytics/BVAnalyticsManagerAppState.swift:10:8: error: no such module 'UIKit'
import UIKit
^
[61/251] Compiling BVSwift BVIncentivizedStats.swift
/Users/admin/builder/spi-builder-workspace/BVSwift/BVAnalytics/BVAnalyticsManagerAppState.swift:10:8: error: no such module 'UIKit'
import UIKit
^
[62/251] Compiling BVSwift BVLanguageStat.swift
/Users/admin/builder/spi-builder-workspace/BVSwift/BVAnalytics/BVAnalyticsManagerAppState.swift:10:8: error: no such module 'UIKit'
import UIKit
^
[63/251] Compiling BVSwift BVProductFilter.swift
/Users/admin/builder/spi-builder-workspace/BVSwift/BVAnalytics/BVAnalyticsManagerAppState.swift:10:8: error: no such module 'UIKit'
import UIKit
^
[64/251] Compiling BVSwift BVProductFilteredStat.swift
/Users/admin/builder/spi-builder-workspace/BVSwift/BVAnalytics/BVAnalyticsManagerAppState.swift:10:8: error: no such module 'UIKit'
import UIKit
^
[65/251] Compiling BVSwift BVProductInclude.swift
/Users/admin/builder/spi-builder-workspace/BVSwift/BVAnalytics/BVAnalyticsManagerAppState.swift:10:8: error: no such module 'UIKit'
import UIKit
^
[66/251] Compiling BVSwift BVProductSort.swift
/Users/admin/builder/spi-builder-workspace/BVSwift/BVAnalytics/BVAnalyticsManagerAppState.swift:10:8: error: no such module 'UIKit'
import UIKit
^
[67/251] Compiling BVSwift BVProductStat.swift
/Users/admin/builder/spi-builder-workspace/BVSwift/BVAnalytics/BVAnalyticsManagerAppState.swift:10:8: error: no such module 'UIKit'
import UIKit
^
[68/251] Compiling BVSwift BVProductStatisticsFilter.swift
/Users/admin/builder/spi-builder-workspace/BVSwift/BVAnalytics/BVAnalyticsManagerAppState.swift:10:8: error: no such module 'UIKit'
import UIKit
^
[69/251] Compiling BVSwift BVProductStatisticsStat.swift
/Users/admin/builder/spi-builder-workspace/BVSwift/BVAnalytics/BVAnalyticsManagerAppState.swift:10:8: error: no such module 'UIKit'
import UIKit
^
[70/251] Compiling BVSwift BVQuestionFilter.swift
/Users/admin/builder/spi-builder-workspace/BVSwift/BVAnalytics/BVAnalyticsManagerAppState.swift:10:8: error: no such module 'UIKit'
import UIKit
^
[71/251] Compiling BVSwift BVQuestionInclude.swift
/Users/admin/builder/spi-builder-workspace/BVSwift/BVAnalytics/BVAnalyticsManagerAppState.swift:10:8: error: no such module 'UIKit'
import UIKit
^
[72/251] Compiling BVSwift BVQuestionSort.swift
/Users/admin/builder/spi-builder-workspace/BVSwift/BVAnalytics/BVAnalyticsManagerAppState.swift:10:8: error: no such module 'UIKit'
import UIKit
^
[73/251] Compiling BVSwift BVRelevancySort.swift
/Users/admin/builder/spi-builder-workspace/BVSwift/BVAnalytics/BVAnalyticsManagerAppState.swift:10:8: error: no such module 'UIKit'
import UIKit
^
[74/251] Compiling BVSwift BVReviewFilter.swift
/Users/admin/builder/spi-builder-workspace/BVSwift/BVAnalytics/BVAnalyticsManagerAppState.swift:10:8: error: no such module 'UIKit'
import UIKit
^
[75/251] Compiling BVSwift BVReviewFilteredStat.swift
/Users/admin/builder/spi-builder-workspace/BVSwift/BVAnalytics/BVAnalyticsManagerAppState.swift:10:8: error: no such module 'UIKit'
import UIKit
^
error: emit-module command failed with exit code 1 (use -v to see invocation)
[76/251] Emitting module BVSwift
/Users/admin/builder/spi-builder-workspace/BVSwift/BVAnalytics/BVAnalyticsManagerAppState.swift:10:8: error: no such module 'UIKit'
import UIKit
^
[77/251] Compiling BVSwift BVReviewInclude.swift
/Users/admin/builder/spi-builder-workspace/BVSwift/BVAnalytics/BVAnalyticsManagerAppState.swift:10:8: error: no such module 'UIKit'
import UIKit
^
[78/251] Compiling BVSwift BVReviewSort.swift
/Users/admin/builder/spi-builder-workspace/BVSwift/BVAnalytics/BVAnalyticsManagerAppState.swift:10:8: error: no such module 'UIKit'
import UIKit
^
[79/251] Compiling BVSwift BVReviewStat.swift
/Users/admin/builder/spi-builder-workspace/BVSwift/BVAnalytics/BVAnalyticsManagerAppState.swift:10:8: error: no such module 'UIKit'
import UIKit
^
[80/251] Compiling BVSwift BVSecondaryRatingStat.swift
/Users/admin/builder/spi-builder-workspace/BVSwift/BVAnalytics/BVAnalyticsManagerAppState.swift:10:8: error: no such module 'UIKit'
import UIKit
^
[81/251] Compiling BVSwift BVTagStats.swift
/Users/admin/builder/spi-builder-workspace/BVSwift/BVAnalytics/BVAnalyticsManagerAppState.swift:10:8: error: no such module 'UIKit'
import UIKit
^
[82/251] Compiling BVSwift BVAuthorQuery.swift
/Users/admin/builder/spi-builder-workspace/BVSwift/BVAnalytics/BVAnalyticsManagerAppState.swift:10:8: error: no such module 'UIKit'
import UIKit
^
[83/251] Compiling BVSwift BVCommentQuery.swift
/Users/admin/builder/spi-builder-workspace/BVSwift/BVAnalytics/BVAnalyticsManagerAppState.swift:10:8: error: no such module 'UIKit'
import UIKit
^
[84/251] Compiling BVSwift BVCommentsQuery.swift
/Users/admin/builder/spi-builder-workspace/BVSwift/BVAnalytics/BVAnalyticsManagerAppState.swift:10:8: error: no such module 'UIKit'
import UIKit
^
[85/251] Compiling BVSwift BVFeatureQuery.swift
/Users/admin/builder/spi-builder-workspace/BVSwift/BVAnalytics/BVAnalyticsManagerAppState.swift:10:8: error: no such module 'UIKit'
import UIKit
^
[86/251] Compiling BVSwift BVMultiProductQuery.swift
/Users/admin/builder/spi-builder-workspace/BVSwift/BVAnalytics/BVAnalyticsManagerAppState.swift:10:8: error: no such module 'UIKit'
import UIKit
^
[87/251] Compiling BVSwift BVMultiProductQueryResponse.swift
/Users/admin/builder/spi-builder-workspace/BVSwift/BVAnalytics/BVAnalyticsManagerAppState.swift:10:8: error: no such module 'UIKit'
import UIKit
^
[88/251] Compiling BVSwift BVProductQuery.swift
/Users/admin/builder/spi-builder-workspace/BVSwift/BVAnalytics/BVAnalyticsManagerAppState.swift:10:8: error: no such module 'UIKit'
import UIKit
^
[89/251] Compiling BVSwift BVProductSearchQuery.swift
/Users/admin/builder/spi-builder-workspace/BVSwift/BVAnalytics/BVAnalyticsManagerAppState.swift:10:8: error: no such module 'UIKit'
import UIKit
^
[90/251] Compiling BVSwift BVProductStatisticsQuery.swift
/Users/admin/builder/spi-builder-workspace/BVSwift/BVAnalytics/BVAnalyticsManagerAppState.swift:10:8: error: no such module 'UIKit'
import UIKit
^
[91/251] Compiling BVSwift BVProductsQuery.swift
/Users/admin/builder/spi-builder-workspace/BVSwift/BVAnalytics/BVAnalyticsManagerAppState.swift:10:8: error: no such module 'UIKit'
import UIKit
^
[92/251] Compiling BVSwift BVQuestionQuery.swift
/Users/admin/builder/spi-builder-workspace/BVSwift/BVAnalytics/BVAnalyticsManagerAppState.swift:10:8: error: no such module 'UIKit'
import UIKit
^
[93/251] Compiling BVSwift BVQuestionSearchQuery.swift
/Users/admin/builder/spi-builder-workspace/BVSwift/BVAnalytics/BVAnalyticsManagerAppState.swift:10:8: error: no such module 'UIKit'
import UIKit
^
[94/251] Compiling BVSwift BVReviewQuery.swift
/Users/admin/builder/spi-builder-workspace/BVSwift/BVAnalytics/BVAnalyticsManagerAppState.swift:10:8: error: no such module 'UIKit'
import UIKit
^
[95/251] Compiling BVSwift BVReviewSearchQuery.swift
/Users/admin/builder/spi-builder-workspace/BVSwift/BVAnalytics/BVAnalyticsManagerAppState.swift:10:8: error: no such module 'UIKit'
import UIKit
^
[96/251] Compiling BVSwift BVReviewSummaryQuery.swift
/Users/admin/builder/spi-builder-workspace/BVSwift/BVAnalytics/BVAnalyticsManagerAppState.swift:10:8: error: no such module 'UIKit'
import UIKit
^
[97/251] Compiling BVSwift BVReviewSummaryQueryResponse.swift
/Users/admin/builder/spi-builder-workspace/BVSwift/BVAnalytics/BVAnalyticsManagerAppState.swift:10:8: error: no such module 'UIKit'
import UIKit
^
[98/251] Compiling BVSwift BVReviewSummaryQueryable.swift
/Users/admin/builder/spi-builder-workspace/BVSwift/BVAnalytics/BVAnalyticsManagerAppState.swift:10:8: error: no such module 'UIKit'
import UIKit
^
[99/251] Compiling BVSwift BVProductReviewSummaryQuery.swift
/Users/admin/builder/spi-builder-workspace/BVSwift/BVAnalytics/BVAnalyticsManagerAppState.swift:10:8: error: no such module 'UIKit'
import UIKit
^
[100/251] Compiling BVSwift BVReviewSummary.swift
/Users/admin/builder/spi-builder-workspace/BVSwift/BVAnalytics/BVAnalyticsManagerAppState.swift:10:8: error: no such module 'UIKit'
import UIKit
^
[101/251] Compiling BVSwift BVAnswer.swift
/Users/admin/builder/spi-builder-workspace/BVSwift/BVAnalytics/BVAnalyticsManagerAppState.swift:10:8: error: no such module 'UIKit'
import UIKit
^
[102/251] Compiling BVSwift BVReview.swift
/Users/admin/builder/spi-builder-workspace/BVSwift/BVAnalytics/BVAnalyticsManagerAppState.swift:10:8: error: no such module 'UIKit'
import UIKit
^
[103/251] Compiling BVSwift BVReviewStatistics.swift
/Users/admin/builder/spi-builder-workspace/BVSwift/BVAnalytics/BVAnalyticsManagerAppState.swift:10:8: error: no such module 'UIKit'
import UIKit
^
[104/251] Compiling BVSwift BVSecondaryRating.swift
/Users/admin/builder/spi-builder-workspace/BVSwift/BVAnalytics/BVAnalyticsManagerAppState.swift:10:8: error: no such module 'UIKit'
import UIKit
^
[105/251] Compiling BVSwift BVSecondaryRatingsAverage.swift
/Users/admin/builder/spi-builder-workspace/BVSwift/BVAnalytics/BVAnalyticsManagerAppState.swift:10:8: error: no such module 'UIKit'
import UIKit
^
[106/251] Compiling BVSwift BVSecondaryRatingsDistribution.swift
/Users/admin/builder/spi-builder-workspace/BVSwift/BVAnalytics/BVAnalyticsManagerAppState.swift:10:8: error: no such module 'UIKit'
import UIKit
^
[107/251] Compiling BVSwift BVSecondaryRatingsDistributionValue.swift
/Users/admin/builder/spi-builder-workspace/BVSwift/BVAnalytics/BVAnalyticsManagerAppState.swift:10:8: error: no such module 'UIKit'
import UIKit
^
[108/251] Compiling BVSwift BVSyndicationSource.swift
/Users/admin/builder/spi-builder-workspace/BVSwift/BVAnalytics/BVAnalyticsManagerAppState.swift:10:8: error: no such module 'UIKit'
import UIKit
^
[109/251] Compiling BVSwift BVUAS.swift
/Users/admin/builder/spi-builder-workspace/BVSwift/BVAnalytics/BVAnalyticsManagerAppState.swift:10:8: error: no such module 'UIKit'
import UIKit
^
[110/251] Compiling BVSwift BVVideo.swift
/Users/admin/builder/spi-builder-workspace/BVSwift/BVAnalytics/BVAnalyticsManagerAppState.swift:10:8: error: no such module 'UIKit'
import UIKit
^
[111/251] Compiling BVSwift ProgressiveSubmissionReview.swift
/Users/admin/builder/spi-builder-workspace/BVSwift/BVAnalytics/BVAnalyticsManagerAppState.swift:10:8: error: no such module 'UIKit'
import UIKit
^
[112/251] Compiling BVSwift BVReviewHighlightsConfiguration.swift
/Users/admin/builder/spi-builder-workspace/BVSwift/BVAnalytics/BVAnalyticsManagerAppState.swift:10:8: error: no such module 'UIKit'
import UIKit
^
[113/251] Compiling BVSwift BVReviewHighlightsQuery.swift
/Users/admin/builder/spi-builder-workspace/BVSwift/BVAnalytics/BVAnalyticsManagerAppState.swift:10:8: error: no such module 'UIKit'
import UIKit
^
[114/251] Compiling BVSwift BVReviewHighlightsQueryResponse.swift
/Users/admin/builder/spi-builder-workspace/BVSwift/BVAnalytics/BVAnalyticsManagerAppState.swift:10:8: error: no such module 'UIKit'
import UIKit
^
[115/251] Compiling BVSwift BVReviewHighlightsQueryable.swift
/Users/admin/builder/spi-builder-workspace/BVSwift/BVAnalytics/BVAnalyticsManagerAppState.swift:10:8: error: no such module 'UIKit'
import UIKit
^
[116/251] Compiling BVSwift BVProductReviewHighlightsQuery.swift
/Users/admin/builder/spi-builder-workspace/BVSwift/BVAnalytics/BVAnalyticsManagerAppState.swift:10:8: error: no such module 'UIKit'
import UIKit
^
[117/251] Compiling BVSwift BVReviewHighlight.swift
/Users/admin/builder/spi-builder-workspace/BVSwift/BVAnalytics/BVAnalyticsManagerAppState.swift:10:8: error: no such module 'UIKit'
import UIKit
^
[118/251] Compiling BVSwift BVReviewHighlights.swift
/Users/admin/builder/spi-builder-workspace/BVSwift/BVAnalytics/BVAnalyticsManagerAppState.swift:10:8: error: no such module 'UIKit'
import UIKit
^
[119/251] Compiling BVSwift BVReviewHighlightsReview.swift
/Users/admin/builder/spi-builder-workspace/BVSwift/BVAnalytics/BVAnalyticsManagerAppState.swift:10:8: error: no such module 'UIKit'
import UIKit
^
[120/251] Compiling BVSwift BVConversationsSubmission.swift
/Users/admin/builder/spi-builder-workspace/BVSwift/BVAnalytics/BVAnalyticsManagerAppState.swift:10:8: error: no such module 'UIKit'
import UIKit
^
[121/251] Compiling BVSwift BVConversationsSubmissionResponse.swift
/Users/admin/builder/spi-builder-workspace/BVSwift/BVAnalytics/BVAnalyticsManagerAppState.swift:10:8: error: no such module 'UIKit'
import UIKit
^
[122/251] Compiling BVSwift BVConversationsSubmissionable.swift
/Users/admin/builder/spi-builder-workspace/BVSwift/BVAnalytics/BVAnalyticsManagerAppState.swift:10:8: error: no such module 'UIKit'
import UIKit
^
[123/251] Compiling BVSwift BVAnswerSubmission.swift
/Users/admin/builder/spi-builder-workspace/BVSwift/BVAnalytics/BVAnalyticsManagerAppState.swift:10:8: error: no such module 'UIKit'
import UIKit
^
[124/251] Compiling BVSwift BVCommentSubmission.swift
/Users/admin/builder/spi-builder-workspace/BVSwift/BVAnalytics/BVAnalyticsManagerAppState.swift:10:8: error: no such module 'UIKit'
import UIKit
^
[125/251] Compiling BVSwift BVFeedbackSubmission.swift
/Users/admin/builder/spi-builder-workspace/BVSwift/BVAnalytics/BVAnalyticsManagerAppState.swift:10:8: error: no such module 'UIKit'
import UIKit
^
[126/251] Compiling BVSwift BVMediaSubmission.swift
/Users/admin/builder/spi-builder-workspace/BVSwift/BVAnalytics/BVAnalyticsManagerAppState.swift:10:8: error: no such module 'UIKit'
import UIKit
^
[127/251] Compiling BVSwift BVAuthor.swift
/Users/admin/builder/spi-builder-workspace/BVSwift/BVAnalytics/BVAnalyticsManagerAppState.swift:10:8: error: no such module 'UIKit'
import UIKit
^
[128/251] Compiling BVSwift BVBadge.swift
/Users/admin/builder/spi-builder-workspace/BVSwift/BVAnalytics/BVAnalyticsManagerAppState.swift:10:8: error: no such module 'UIKit'
import UIKit
^
[129/251] Compiling BVSwift BVBrand.swift
/Users/admin/builder/spi-builder-workspace/BVSwift/BVAnalytics/BVAnalyticsManagerAppState.swift:10:8: error: no such module 'UIKit'
import UIKit
^
[130/251] Compiling BVSwift BVComment.swift
/Users/admin/builder/spi-builder-workspace/BVSwift/BVAnalytics/BVAnalyticsManagerAppState.swift:10:8: error: no such module 'UIKit'
import UIKit
^
[131/251] Compiling BVSwift BVContextDataValue.swift
/Users/admin/builder/spi-builder-workspace/BVSwift/BVAnalytics/BVAnalyticsManagerAppState.swift:10:8: error: no such module 'UIKit'
import UIKit
^
[132/251] Compiling BVSwift BVDimensionElement.swift
/Users/admin/builder/spi-builder-workspace/BVSwift/BVAnalytics/BVAnalyticsManagerAppState.swift:10:8: error: no such module 'UIKit'
import UIKit
^
[133/251] Compiling BVSwift BVDistributionElement.swift
/Users/admin/builder/spi-builder-workspace/BVSwift/BVAnalytics/BVAnalyticsManagerAppState.swift:10:8: error: no such module 'UIKit'
import UIKit
^
[134/251] Compiling BVSwift BVDistributionValue.swift
/Users/admin/builder/spi-builder-workspace/BVSwift/BVAnalytics/BVAnalyticsManagerAppState.swift:10:8: error: no such module 'UIKit'
import UIKit
^
[135/251] Compiling BVSwift BVFeature.swift
/Users/admin/builder/spi-builder-workspace/BVSwift/BVAnalytics/BVAnalyticsManagerAppState.swift:10:8: error: no such module 'UIKit'
import UIKit
^
[136/251] Compiling BVSwift BVFeatures.swift
/Users/admin/builder/spi-builder-workspace/BVSwift/BVAnalytics/BVAnalyticsManagerAppState.swift:10:8: error: no such module 'UIKit'
import UIKit
^
[137/251] Compiling BVSwift BVFeedback.swift
/Users/admin/builder/spi-builder-workspace/BVSwift/BVAnalytics/BVAnalyticsManagerAppState.swift:10:8: error: no such module 'UIKit'
import UIKit
^
[138/251] Compiling BVSwift BVFormField.swift
/Users/admin/builder/spi-builder-workspace/BVSwift/BVAnalytics/BVAnalyticsManagerAppState.swift:10:8: error: no such module 'UIKit'
import UIKit
^
[139/251] Compiling BVSwift BVMultiProductError.swift
/Users/admin/builder/spi-builder-workspace/BVSwift/BVAnalytics/BVAnalyticsManagerAppState.swift:10:8: error: no such module 'UIKit'
import UIKit
^
[140/251] Compiling BVSwift BVMultiProductFormData.swift
/Users/admin/builder/spi-builder-workspace/BVSwift/BVAnalytics/BVAnalyticsManagerAppState.swift:10:8: error: no such module 'UIKit'
import UIKit
^
[141/251] Compiling BVSwift BVMultiProductReviewSummary.swift
/Users/admin/builder/spi-builder-workspace/BVSwift/BVAnalytics/BVAnalyticsManagerAppState.swift:10:8: error: no such module 'UIKit'
import UIKit
^
[142/251] Compiling BVSwift BVMultiproduct.swift
/Users/admin/builder/spi-builder-workspace/BVSwift/BVAnalytics/BVAnalyticsManagerAppState.swift:10:8: error: no such module 'UIKit'
import UIKit
^
[143/251] Compiling BVSwift BVPhoto.swift
/Users/admin/builder/spi-builder-workspace/BVSwift/BVAnalytics/BVAnalyticsManagerAppState.swift:10:8: error: no such module 'UIKit'
import UIKit
^
[144/251] Compiling BVSwift BVProduct.swift
/Users/admin/builder/spi-builder-workspace/BVSwift/BVAnalytics/BVAnalyticsManagerAppState.swift:10:8: error: no such module 'UIKit'
import UIKit
^
[145/251] Compiling BVSwift BVProductAttribute.swift
/Users/admin/builder/spi-builder-workspace/BVSwift/BVAnalytics/BVAnalyticsManagerAppState.swift:10:8: error: no such module 'UIKit'
import UIKit
^
[146/251] Compiling BVSwift BVProductStatistics.swift
/Users/admin/builder/spi-builder-workspace/BVSwift/BVAnalytics/BVAnalyticsManagerAppState.swift:10:8: error: no such module 'UIKit'
import UIKit
^
[147/251] Compiling BVSwift BVProgressiveReview.swift
/Users/admin/builder/spi-builder-workspace/BVSwift/BVAnalytics/BVAnalyticsManagerAppState.swift:10:8: error: no such module 'UIKit'
import UIKit
^
[148/251] Compiling BVSwift BVProgressiveReviewFields.swift
/Users/admin/builder/spi-builder-workspace/BVSwift/BVAnalytics/BVAnalyticsManagerAppState.swift:10:8: error: no such module 'UIKit'
import UIKit
^
[149/251] Compiling BVSwift BVQAStatistics.swift
/Users/admin/builder/spi-builder-workspace/BVSwift/BVAnalytics/BVAnalyticsManagerAppState.swift:10:8: error: no such module 'UIKit'
import UIKit
^
[150/251] Compiling BVSwift BVQuestion.swift
/Users/admin/builder/spi-builder-workspace/BVSwift/BVAnalytics/BVAnalyticsManagerAppState.swift:10:8: error: no such module 'UIKit'
import UIKit
^
[151/251] Compiling BVSwift BVRatingDistribution.swift
/Users/admin/builder/spi-builder-workspace/BVSwift/BVAnalytics/BVAnalyticsManagerAppState.swift:10:8: error: no such module 'UIKit'
import UIKit
^
[152/251] Compiling BVSwift BVAnalyticsConfiguration.swift
/Users/admin/builder/spi-builder-workspace/BVSwift/BVAnalytics/BVAnalyticsManagerAppState.swift:10:8: error: no such module 'UIKit'
import UIKit
^
[153/251] Compiling BVSwift BVAnalyticsConstants.swift
/Users/admin/builder/spi-builder-workspace/BVSwift/BVAnalytics/BVAnalyticsManagerAppState.swift:10:8: error: no such module 'UIKit'
import UIKit
^
[154/251] Compiling BVSwift BVAnalyticsEvent.swift
/Users/admin/builder/spi-builder-workspace/BVSwift/BVAnalytics/BVAnalyticsManagerAppState.swift:10:8: error: no such module 'UIKit'
import UIKit
^
[155/251] Compiling BVSwift BVAnalyticsEventable.swift
/Users/admin/builder/spi-builder-workspace/BVSwift/BVAnalytics/BVAnalyticsManagerAppState.swift:10:8: error: no such module 'UIKit'
import UIKit
^
[156/251] Compiling BVSwift BVAnalyticsLocaleService.swift
/Users/admin/builder/spi-builder-workspace/BVSwift/BVAnalytics/BVAnalyticsManagerAppState.swift:10:8: error: no such module 'UIKit'
import UIKit
^
[157/251] Compiling BVSwift BVAnalyticsManager.swift
/Users/admin/builder/spi-builder-workspace/BVSwift/BVAnalytics/BVAnalyticsManagerAppState.swift:10:8: error: no such module 'UIKit'
import UIKit
^
[158/251] Compiling BVSwift BVAnalyticsManagerAppState.swift
/Users/admin/builder/spi-builder-workspace/BVSwift/BVAnalytics/BVAnalyticsManagerAppState.swift:10:8: error: no such module 'UIKit'
import UIKit
^
[159/251] Compiling BVSwift BVAnalyticsRemoteLogger.swift
/Users/admin/builder/spi-builder-workspace/BVSwift/BVAnalytics/BVAnalyticsManagerAppState.swift:10:8: error: no such module 'UIKit'
import UIKit
^
[160/251] Compiling BVSwift BVPixel.swift
/Users/admin/builder/spi-builder-workspace/BVSwift/BVAnalytics/BVAnalyticsManagerAppState.swift:10:8: error: no such module 'UIKit'
import UIKit
^
[161/251] Compiling BVSwift BVAnalyticsEventBatch.swift
/Users/admin/builder/spi-builder-workspace/BVSwift/BVAnalytics/BVAnalyticsManagerAppState.swift:10:8: error: no such module 'UIKit'
import UIKit
^
[162/251] Compiling BVSwift BVAnalyticsFeatureType.swift
/Users/admin/builder/spi-builder-workspace/BVSwift/BVAnalytics/BVAnalyticsManagerAppState.swift:10:8: error: no such module 'UIKit'
import UIKit
^
[163/251] Compiling BVSwift BVAnalyticsImpressionType.swift
/Users/admin/builder/spi-builder-workspace/BVSwift/BVAnalytics/BVAnalyticsManagerAppState.swift:10:8: error: no such module 'UIKit'
import UIKit
^
[164/251] Compiling BVSwift BVAnalyticsProductType.swift
/Users/admin/builder/spi-builder-workspace/BVSwift/BVAnalytics/BVAnalyticsManagerAppState.swift:10:8: error: no such module 'UIKit'
import UIKit
^
[165/251] Compiling BVSwift BVAnalyticsRemoteLog.swift
/Users/admin/builder/spi-builder-workspace/BVSwift/BVAnalytics/BVAnalyticsManagerAppState.swift:10:8: error: no such module 'UIKit'
import UIKit
^
[166/251] Compiling BVSwift BVAnalyticsTransactionItem.swift
/Users/admin/builder/spi-builder-workspace/BVSwift/BVAnalytics/BVAnalyticsManagerAppState.swift:10:8: error: no such module 'UIKit'
import UIKit
^
[167/251] Compiling BVSwift BVAnalyticsSubmission.swift
/Users/admin/builder/spi-builder-workspace/BVSwift/BVAnalytics/BVAnalyticsManagerAppState.swift:10:8: error: no such module 'UIKit'
import UIKit
^
[168/251] Compiling BVSwift BVAnalyticsEventConversion.swift
/Users/admin/builder/spi-builder-workspace/BVSwift/BVAnalytics/BVAnalyticsManagerAppState.swift:10:8: error: no such module 'UIKit'
import UIKit
^
[169/251] Compiling BVSwift BVAnalyticsEventFeature.swift
/Users/admin/builder/spi-builder-workspace/BVSwift/BVAnalytics/BVAnalyticsManagerAppState.swift:10:8: error: no such module 'UIKit'
import UIKit
^
[170/251] Compiling BVSwift BVAnalyticsEventImpression.swift
/Users/admin/builder/spi-builder-workspace/BVSwift/BVAnalytics/BVAnalyticsManagerAppState.swift:10:8: error: no such module 'UIKit'
import UIKit
^
[171/251] Compiling BVSwift BVAnalyticsEventInView.swift
/Users/admin/builder/spi-builder-workspace/BVSwift/BVAnalytics/BVAnalyticsManagerAppState.swift:10:8: error: no such module 'UIKit'
import UIKit
^
[172/251] Compiling BVSwift BVAnalyticsEventPageView.swift
/Users/admin/builder/spi-builder-workspace/BVSwift/BVAnalytics/BVAnalyticsManagerAppState.swift:10:8: error: no such module 'UIKit'
import UIKit
^
[173/251] Compiling BVSwift BVAnalyticsEventPersonalization.swift
/Users/admin/builder/spi-builder-workspace/BVSwift/BVAnalytics/BVAnalyticsManagerAppState.swift:10:8: error: no such module 'UIKit'
import UIKit
^
[174/251] Compiling BVSwift BVAnalyticsEventTransaction.swift
/Users/admin/builder/spi-builder-workspace/BVSwift/BVAnalytics/BVAnalyticsManagerAppState.swift:10:8: error: no such module 'UIKit'
import UIKit
^
[175/251] Compiling BVSwift BVAnalyticsEventViewed.swift
/Users/admin/builder/spi-builder-workspace/BVSwift/BVAnalytics/BVAnalyticsManagerAppState.swift:10:8: error: no such module 'UIKit'
import UIKit
^
[176/251] Compiling BVSwift BVConfiguration.swift
/Users/admin/builder/spi-builder-workspace/BVSwift/BVAnalytics/BVAnalyticsManagerAppState.swift:10:8: error: no such module 'UIKit'
import UIKit
^
[177/251] Compiling BVSwift BVConstants.swift
/Users/admin/builder/spi-builder-workspace/BVSwift/BVAnalytics/BVAnalyticsManagerAppState.swift:10:8: error: no such module 'UIKit'
import UIKit
^
[178/251] Compiling BVSwift BVManager.swift
/Users/admin/builder/spi-builder-workspace/BVSwift/BVAnalytics/BVAnalyticsManagerAppState.swift:10:8: error: no such module 'UIKit'
import UIKit
^
[179/251] Compiling BVSwift BVError.swift
/Users/admin/builder/spi-builder-workspace/BVSwift/BVAnalytics/BVAnalyticsManagerAppState.swift:10:8: error: no such module 'UIKit'
import UIKit
^
[180/251] Compiling BVSwift BVLogMessage.swift
/Users/admin/builder/spi-builder-workspace/BVSwift/BVAnalytics/BVAnalyticsManagerAppState.swift:10:8: error: no such module 'UIKit'
import UIKit
^
[181/251] Compiling BVSwift BVLogNotifier.swift
/Users/admin/builder/spi-builder-workspace/BVSwift/BVAnalytics/BVAnalyticsManagerAppState.swift:10:8: error: no such module 'UIKit'
import UIKit
^
[182/251] Compiling BVSwift BVLogger.swift
/Users/admin/builder/spi-builder-workspace/BVSwift/BVAnalytics/BVAnalyticsManagerAppState.swift:10:8: error: no such module 'UIKit'
import UIKit
^
[183/251] Compiling BVSwift BVDispatch.swift
/Users/admin/builder/spi-builder-workspace/BVSwift/BVAnalytics/BVAnalyticsManagerAppState.swift:10:8: error: no such module 'UIKit'
import UIKit
^
[184/251] Compiling BVSwift BVNetworkingManager.swift
/Users/admin/builder/spi-builder-workspace/BVSwift/BVAnalytics/BVAnalyticsManagerAppState.swift:10:8: error: no such module 'UIKit'
import UIKit
^
[185/251] Compiling BVSwift BVParameter.swift
/Users/admin/builder/spi-builder-workspace/BVSwift/BVAnalytics/BVAnalyticsManagerAppState.swift:10:8: error: no such module 'UIKit'
import UIKit
^
[186/251] Compiling BVSwift BVURLCacheManager.swift
/Users/admin/builder/spi-builder-workspace/BVSwift/BVAnalytics/BVAnalyticsManagerAppState.swift:10:8: error: no such module 'UIKit'
import UIKit
^
[187/251] Compiling BVSwift BVURLParameter.swift
/Users/admin/builder/spi-builder-workspace/BVSwift/BVAnalytics/BVAnalyticsManagerAppState.swift:10:8: error: no such module 'UIKit'
import UIKit
^
[188/251] Compiling BVSwift BVURLParameterable.swift
/Users/admin/builder/spi-builder-workspace/BVSwift/BVAnalytics/BVAnalyticsManagerAppState.swift:10:8: error: no such module 'UIKit'
import UIKit
^
[189/251] Compiling BVSwift BVURLRequest.swift
/Users/admin/builder/spi-builder-workspace/BVSwift/BVAnalytics/BVAnalyticsManagerAppState.swift:10:8: error: no such module 'UIKit'
import UIKit
^
[190/251] Compiling BVSwift BVURLRequestable.swift
/Users/admin/builder/spi-builder-workspace/BVSwift/BVAnalytics/BVAnalyticsManagerAppState.swift:10:8: error: no such module 'UIKit'
import UIKit
^
[191/251] Compiling BVSwift BVURLRequestableInternal.swift
/Users/admin/builder/spi-builder-workspace/BVSwift/BVAnalytics/BVAnalyticsManagerAppState.swift:10:8: error: no such module 'UIKit'
import UIKit
^
[192/251] Compiling BVSwift BVURLSession.swift
/Users/admin/builder/spi-builder-workspace/BVSwift/BVAnalytics/BVAnalyticsManagerAppState.swift:10:8: error: no such module 'UIKit'
import UIKit
^
[193/251] Compiling BVSwift BVInternalQuery.swift
/Users/admin/builder/spi-builder-workspace/BVSwift/BVAnalytics/BVAnalyticsManagerAppState.swift:10:8: error: no such module 'UIKit'
import UIKit
^
[194/251] Compiling BVSwift BVQuery.swift
/Users/admin/builder/spi-builder-workspace/BVSwift/BVAnalytics/BVAnalyticsManagerAppState.swift:10:8: error: no such module 'UIKit'
import UIKit
^
[195/251] Compiling BVSwift BVQueryDispatchQueueable.swift
/Users/admin/builder/spi-builder-workspace/BVSwift/BVAnalytics/BVAnalyticsManagerAppState.swift:10:8: error: no such module 'UIKit'
import UIKit
^
[196/251] Compiling BVSwift BVQueryable.swift
/Users/admin/builder/spi-builder-workspace/BVSwift/BVAnalytics/BVAnalyticsManagerAppState.swift:10:8: error: no such module 'UIKit'
import UIKit
^
[197/251] Compiling BVSwift BVInternalSubmission.swift
/Users/admin/builder/spi-builder-workspace/BVSwift/BVAnalytics/BVAnalyticsManagerAppState.swift:10:8: error: no such module 'UIKit'
import UIKit
^
[198/251] Compiling BVSwift BVSubmission.swift
/Users/admin/builder/spi-builder-workspace/BVSwift/BVAnalytics/BVAnalyticsManagerAppState.swift:10:8: error: no such module 'UIKit'
import UIKit
^
[199/251] Compiling BVSwift BVSubmissionDispatchQueueable.swift
/Users/admin/builder/spi-builder-workspace/BVSwift/BVAnalytics/BVAnalyticsManagerAppState.swift:10:8: error: no such module 'UIKit'
import UIKit
^
[200/251] Compiling BVSwift BVSubmissionable.swift
/Users/admin/builder/spi-builder-workspace/BVSwift/BVAnalytics/BVAnalyticsManagerAppState.swift:10:8: error: no such module 'UIKit'
import UIKit
^
[201/251] Compiling BVSwift BVAtomic.swift
/Users/admin/builder/spi-builder-workspace/BVSwift/BVAnalytics/BVAnalyticsManagerAppState.swift:10:8: error: no such module 'UIKit'
import UIKit
^
[202/251] Compiling BVSwift BVCurationsLink.swift
/Users/admin/builder/spi-builder-workspace/BVSwift/BVAnalytics/BVAnalyticsManagerAppState.swift:10:8: error: no such module 'UIKit'
import UIKit
^
[203/251] Compiling BVSwift BVCurationsMedia.swift
/Users/admin/builder/spi-builder-workspace/BVSwift/BVAnalytics/BVAnalyticsManagerAppState.swift:10:8: error: no such module 'UIKit'
import UIKit
^
[204/251] Compiling BVSwift BVCurationsPhoto.swift
/Users/admin/builder/spi-builder-workspace/BVSwift/BVAnalytics/BVAnalyticsManagerAppState.swift:10:8: error: no such module 'UIKit'
import UIKit
^
[205/251] Compiling BVSwift BVCurationsProduct.swift
/Users/admin/builder/spi-builder-workspace/BVSwift/BVAnalytics/BVAnalyticsManagerAppState.swift:10:8: error: no such module 'UIKit'
import UIKit
^
[206/251] Compiling BVSwift BVCurationsProductAttribute.swift
/Users/admin/builder/spi-builder-workspace/BVSwift/BVAnalytics/BVAnalyticsManagerAppState.swift:10:8: error: no such module 'UIKit'
import UIKit
^
[207/251] Compiling BVSwift BVCurationsQAStatistics.swift
/Users/admin/builder/spi-builder-workspace/BVSwift/BVAnalytics/BVAnalyticsManagerAppState.swift:10:8: error: no such module 'UIKit'
import UIKit
^
[208/251] Compiling BVSwift BVCurationsRatingDistribution.swift
/Users/admin/builder/spi-builder-workspace/BVSwift/BVAnalytics/BVAnalyticsManagerAppState.swift:10:8: error: no such module 'UIKit'
import UIKit
^
[209/251] Compiling BVSwift BVCurationsReviewStatistics.swift
/Users/admin/builder/spi-builder-workspace/BVSwift/BVAnalytics/BVAnalyticsManagerAppState.swift:10:8: error: no such module 'UIKit'
import UIKit
^
[210/251] Compiling BVSwift BVCurationsSecondaryRatingsAverage.swift
/Users/admin/builder/spi-builder-workspace/BVSwift/BVAnalytics/BVAnalyticsManagerAppState.swift:10:8: error: no such module 'UIKit'
import UIKit
^
[211/251] Compiling BVSwift BVCurationsVideo.swift
/Users/admin/builder/spi-builder-workspace/BVSwift/BVAnalytics/BVAnalyticsManagerAppState.swift:10:8: error: no such module 'UIKit'
import UIKit
^
[212/251] Compiling BVSwift BVCurationsSubmission.swift
/Users/admin/builder/spi-builder-workspace/BVSwift/BVAnalytics/BVAnalyticsManagerAppState.swift:10:8: error: no such module 'UIKit'
import UIKit
^
[213/251] Compiling BVSwift BVCurationsSubmissionResponse.swift
/Users/admin/builder/spi-builder-workspace/BVSwift/BVAnalytics/BVAnalyticsManagerAppState.swift:10:8: error: no such module 'UIKit'
import UIKit
^
[214/251] Compiling BVSwift BVCurationsSubmissionable.swift
/Users/admin/builder/spi-builder-workspace/BVSwift/BVAnalytics/BVAnalyticsManagerAppState.swift:10:8: error: no such module 'UIKit'
import UIKit
^
[215/251] Compiling BVSwift BVCurationsChannelContentSubmission.swift
/Users/admin/builder/spi-builder-workspace/BVSwift/BVAnalytics/BVAnalyticsManagerAppState.swift:10:8: error: no such module 'UIKit'
import UIKit
^
[216/251] Compiling BVSwift BVCurationsCustomContentSubmission.swift
/Users/admin/builder/spi-builder-workspace/BVSwift/BVAnalytics/BVAnalyticsManagerAppState.swift:10:8: error: no such module 'UIKit'
import UIKit
^
[217/251] Compiling BVSwift BVProductSentimentsConfiguration.swift
/Users/admin/builder/spi-builder-workspace/BVSwift/BVAnalytics/BVAnalyticsManagerAppState.swift:10:8: error: no such module 'UIKit'
import UIKit
^
[218/251] Compiling BVSwift BVProductSentimentsConstants.swift
/Users/admin/builder/spi-builder-workspace/BVSwift/BVAnalytics/BVAnalyticsManagerAppState.swift:10:8: error: no such module 'UIKit'
import UIKit
^
[219/251] Compiling BVSwift BVProductSentimentsError.swift
/Users/admin/builder/spi-builder-workspace/BVSwift/BVAnalytics/BVAnalyticsManagerAppState.swift:10:8: error: no such module 'UIKit'
import UIKit
^
[220/251] Compiling BVSwift BVExpressions.swift
/Users/admin/builder/spi-builder-workspace/BVSwift/BVAnalytics/BVAnalyticsManagerAppState.swift:10:8: error: no such module 'UIKit'
import UIKit
^
[221/251] Compiling BVSwift BVProductFeatures.swift
/Users/admin/builder/spi-builder-workspace/BVSwift/BVAnalytics/BVAnalyticsManagerAppState.swift:10:8: error: no such module 'UIKit'
import UIKit
^
[222/251] Compiling BVSwift BVQuotes.swift
/Users/admin/builder/spi-builder-workspace/BVSwift/BVAnalytics/BVAnalyticsManagerAppState.swift:10:8: error: no such module 'UIKit'
import UIKit
^
[223/251] Compiling BVSwift BVSummarisedFeature.swift
/Users/admin/builder/spi-builder-workspace/BVSwift/BVAnalytics/BVAnalyticsManagerAppState.swift:10:8: error: no such module 'UIKit'
import UIKit
^
[224/251] Compiling BVSwift BVProductSentimentsQuery.swift
/Users/admin/builder/spi-builder-workspace/BVSwift/BVAnalytics/BVAnalyticsManagerAppState.swift:10:8: error: no such module 'UIKit'
import UIKit
^
[225/251] Compiling BVSwift BVProductSentimentsQueryable.swift
/Users/admin/builder/spi-builder-workspace/BVSwift/BVAnalytics/BVAnalyticsManagerAppState.swift:10:8: error: no such module 'UIKit'
import UIKit
^
[226/251] Compiling BVSwift BVProductSentimentsResponse.swift
/Users/admin/builder/spi-builder-workspace/BVSwift/BVAnalytics/BVAnalyticsManagerAppState.swift:10:8: error: no such module 'UIKit'
import UIKit
^
[227/251] Compiling BVSwift BVEmbedStats.swift
/Users/admin/builder/spi-builder-workspace/BVSwift/BVAnalytics/BVAnalyticsManagerAppState.swift:10:8: error: no such module 'UIKit'
import UIKit
^
[228/251] Compiling BVSwift BVLanguageStats.swift
/Users/admin/builder/spi-builder-workspace/BVSwift/BVAnalytics/BVAnalyticsManagerAppState.swift:10:8: error: no such module 'UIKit'
import UIKit
^
[229/251] Compiling BVSwift BVProductExpressionsQuery.swift
/Users/admin/builder/spi-builder-workspace/BVSwift/BVAnalytics/BVAnalyticsManagerAppState.swift:10:8: error: no such module 'UIKit'
import UIKit
^
[230/251] Compiling BVSwift BVProductFeaturesQuery.swift
/Users/admin/builder/spi-builder-workspace/BVSwift/BVAnalytics/BVAnalyticsManagerAppState.swift:10:8: error: no such module 'UIKit'
import UIKit
^
[231/251] Compiling BVSwift BVProductQuotesQuery.swift
/Users/admin/builder/spi-builder-workspace/BVSwift/BVAnalytics/BVAnalyticsManagerAppState.swift:10:8: error: no such module 'UIKit'
import UIKit
^
[232/251] Compiling BVSwift BVSummarisedFeaturesQuery.swift
/Users/admin/builder/spi-builder-workspace/BVSwift/BVAnalytics/BVAnalyticsManagerAppState.swift:10:8: error: no such module 'UIKit'
import UIKit
^
[233/251] Compiling BVSwift BVSummarisedFeaturesQuotesQuery.swift
/Users/admin/builder/spi-builder-workspace/BVSwift/BVAnalytics/BVAnalyticsManagerAppState.swift:10:8: error: no such module 'UIKit'
import UIKit
^
[234/251] Compiling BVSwift BVManagerRecommendations.swift
/Users/admin/builder/spi-builder-workspace/BVSwift/BVAnalytics/BVAnalyticsManagerAppState.swift:10:8: error: no such module 'UIKit'
import UIKit
^
[235/251] Compiling BVSwift BVManagerRecommendationsQuery.swift
/Users/admin/builder/spi-builder-workspace/BVSwift/BVAnalytics/BVAnalyticsManagerAppState.swift:10:8: error: no such module 'UIKit'
import UIKit
^
[236/251] Compiling BVSwift BVRecommendationsAnalytics.swift
/Users/admin/builder/spi-builder-workspace/BVSwift/BVAnalytics/BVAnalyticsManagerAppState.swift:10:8: error: no such module 'UIKit'
import UIKit
^
[237/251] Compiling BVSwift BVRecommendationsConfiguration.swift
/Users/admin/builder/spi-builder-workspace/BVSwift/BVAnalytics/BVAnalyticsManagerAppState.swift:10:8: error: no such module 'UIKit'
import UIKit
^
[238/251] Compiling BVSwift BVRecommendationsConstants.swift
/Users/admin/builder/spi-builder-workspace/BVSwift/BVAnalytics/BVAnalyticsManagerAppState.swift:10:8: error: no such module 'UIKit'
import UIKit
^
[239/251] Compiling BVSwift BVRecommendationsError.swift
/Users/admin/builder/spi-builder-workspace/BVSwift/BVAnalytics/BVAnalyticsManagerAppState.swift:10:8: error: no such module 'UIKit'
import UIKit
^
[240/251] Compiling BVSwift BVRecommendationsQuery.swift
/Users/admin/builder/spi-builder-workspace/BVSwift/BVAnalytics/BVAnalyticsManagerAppState.swift:10:8: error: no such module 'UIKit'
import UIKit
^
[241/251] Compiling BVSwift BVRecommendationsQueryResponse.swift
/Users/admin/builder/spi-builder-workspace/BVSwift/BVAnalytics/BVAnalyticsManagerAppState.swift:10:8: error: no such module 'UIKit'
import UIKit
^
[242/251] Compiling BVSwift BVRecommendationsQueryable.swift
/Users/admin/builder/spi-builder-workspace/BVSwift/BVAnalytics/BVAnalyticsManagerAppState.swift:10:8: error: no such module 'UIKit'
import UIKit
^
[243/251] Compiling BVSwift BVRecommendationsProfileField.swift
/Users/admin/builder/spi-builder-workspace/BVSwift/BVAnalytics/BVAnalyticsManagerAppState.swift:10:8: error: no such module 'UIKit'
import UIKit
^
[244/251] Compiling BVSwift BVRecommendationsProfileInclude.swift
/Users/admin/builder/spi-builder-workspace/BVSwift/BVAnalytics/BVAnalyticsManagerAppState.swift:10:8: error: no such module 'UIKit'
import UIKit
^
[245/251] Compiling BVSwift BVRecommendationsProfilePurpose.swift
/Users/admin/builder/spi-builder-workspace/BVSwift/BVAnalytics/BVAnalyticsManagerAppState.swift:10:8: error: no such module 'UIKit'
import UIKit
^
[246/251] Compiling BVSwift BVRecommendationsProfileQuery.swift
/Users/admin/builder/spi-builder-workspace/BVSwift/BVAnalytics/BVAnalyticsManagerAppState.swift:10:8: error: no such module 'UIKit'
import UIKit
^
[247/251] Compiling BVSwift BVRecommendationsCategory.swift
/Users/admin/builder/spi-builder-workspace/BVSwift/BVAnalytics/BVAnalyticsManagerAppState.swift:10:8: error: no such module 'UIKit'
import UIKit
^
[248/251] Compiling BVSwift BVRecommendationsInterestLevel.swift
/Users/admin/builder/spi-builder-workspace/BVSwift/BVAnalytics/BVAnalyticsManagerAppState.swift:10:8: error: no such module 'UIKit'
import UIKit
^
[249/251] Compiling BVSwift BVRecommendationsProduct.swift
/Users/admin/builder/spi-builder-workspace/BVSwift/BVAnalytics/BVAnalyticsManagerAppState.swift:10:8: error: no such module 'UIKit'
import UIKit
^
[250/251] Compiling BVSwift BVRecommendationsProfile.swift
/Users/admin/builder/spi-builder-workspace/BVSwift/BVAnalytics/BVAnalyticsManagerAppState.swift:10:8: error: no such module 'UIKit'
import UIKit
^
[251/251] Compiling BVSwift BVRecommendationsStats.swift
/Users/admin/builder/spi-builder-workspace/BVSwift/BVAnalytics/BVAnalyticsManagerAppState.swift:10:8: error: no such module 'UIKit'
import UIKit
^
error: fatalError
BUILD FAILURE 5.9 macosSpm