The Swift Package Index logo.Swift Package Index

Track the adoption of Swift 6 strict concurrency checks for data race safety. How many packages are Ready for Swift 6?

Build Information

Failed to build SwiftMVI, reference main (9b5837), with Swift 6.1 for macOS (SPM) on 27 Apr 2025 08:28:31 UTC.

Build Command

env DEVELOPER_DIR=/Applications/Xcode-16.3.0.app xcrun swift build --arch arm64

Build Log

========================================
RunAll
========================================
Builder version: 4.61.0
Interrupt handler set up.
========================================
Checkout
========================================
Clone URL: https://github.com/xtro/SwiftMVI.git
Reference: main
Initialized empty Git repository in /Users/admin/builder/spi-builder-workspace/.git/
From https://github.com/xtro/SwiftMVI
 * branch            main       -> FETCH_HEAD
 * [new branch]      main       -> origin/main
HEAD is now at 9b58372 Update documents
Cloned https://github.com/xtro/SwiftMVI.git
Revision (git rev-parse @):
9b583728722b703b60f039b81998af04798c224e
SUCCESS checkout https://github.com/xtro/SwiftMVI.git at main
Fetching https://github.com/gringoireDM/EnumKit.git
Fetching https://github.com/xtro/SwiftUseCase.git
Fetching https://github.com/pointfreeco/swift-case-paths.git from cache
[1/319] Fetching enumkit
[113/414] Fetching enumkit, swiftusecase
Fetched https://github.com/xtro/SwiftUseCase.git from cache (0.72s)
Fetched https://github.com/pointfreeco/swift-case-paths.git from cache (0.72s)
Fetched https://github.com/gringoireDM/EnumKit.git from cache (0.72s)
Computing version for https://github.com/xtro/SwiftUseCase.git
Computed https://github.com/xtro/SwiftUseCase.git at 0.2.0 (1.22s)
Fetching https://github.com/apple/swift-syntax.git
[1/70233] Fetching swift-syntax
Fetched https://github.com/apple/swift-syntax.git from cache (3.12s)
Computing version for https://github.com/apple/swift-syntax.git
Computed https://github.com/apple/swift-syntax.git at 509.0.0 (3.85s)
Computing version for https://github.com/pointfreeco/swift-case-paths.git
Computed https://github.com/pointfreeco/swift-case-paths.git at 0.14.1 (0.59s)
Fetching https://github.com/pointfreeco/xctest-dynamic-overlay from cache
Fetched https://github.com/pointfreeco/xctest-dynamic-overlay from cache (0.43s)
Computing version for https://github.com/pointfreeco/xctest-dynamic-overlay
Computed https://github.com/pointfreeco/xctest-dynamic-overlay at 0.9.0 (1.02s)
Creating working copy for https://github.com/pointfreeco/swift-case-paths.git
Working copy of https://github.com/pointfreeco/swift-case-paths.git resolved at 0.14.1
Creating working copy for https://github.com/pointfreeco/xctest-dynamic-overlay
Working copy of https://github.com/pointfreeco/xctest-dynamic-overlay resolved at 0.9.0
Creating working copy for https://github.com/xtro/SwiftUseCase.git
Working copy of https://github.com/xtro/SwiftUseCase.git resolved at 0.2.0
Creating working copy for https://github.com/apple/swift-syntax.git
Working copy of https://github.com/apple/swift-syntax.git resolved at 509.0.0
========================================
ResolveProductDependencies
========================================
Resolving dependencies ...
{
  "identity": ".resolve-product-dependencies",
  "name": "resolve-dependencies",
  "url": "/Users/admin/builder/spi-builder-workspace/.resolve-product-dependencies",
  "version": "unspecified",
  "path": "/Users/admin/builder/spi-builder-workspace/.resolve-product-dependencies",
  "dependencies": [
    {
      "identity": "swiftmvi",
      "name": "SwiftMVI",
      "url": "https://github.com/xtro/SwiftMVI.git",
      "version": "unspecified",
      "path": "/Users/admin/builder/spi-builder-workspace/.resolve-product-dependencies/.build/checkouts/SwiftMVI",
      "dependencies": [
        {
          "identity": "swiftusecase",
          "name": "SwiftUseCase",
          "url": "https://github.com/xtro/SwiftUseCase.git",
          "version": "0.2.0",
          "path": "/Users/admin/builder/spi-builder-workspace/.resolve-product-dependencies/.build/checkouts/SwiftUseCase",
          "dependencies": [
            {
              "identity": "swift-syntax",
              "name": "swift-syntax",
              "url": "https://github.com/apple/swift-syntax.git",
              "version": "509.0.0",
              "path": "/Users/admin/builder/spi-builder-workspace/.resolve-product-dependencies/.build/checkouts/swift-syntax",
              "dependencies": [
              ]
            }
          ]
        },
        {
          "identity": "swift-case-paths",
          "name": "swift-case-paths",
          "url": "https://github.com/pointfreeco/swift-case-paths.git",
          "version": "0.14.1",
          "path": "/Users/admin/builder/spi-builder-workspace/.resolve-product-dependencies/.build/checkouts/swift-case-paths",
          "dependencies": [
            {
              "identity": "xctest-dynamic-overlay",
              "name": "xctest-dynamic-overlay",
              "url": "https://github.com/pointfreeco/xctest-dynamic-overlay",
              "version": "0.9.0",
              "path": "/Users/admin/builder/spi-builder-workspace/.resolve-product-dependencies/.build/checkouts/xctest-dynamic-overlay",
              "dependencies": [
              ]
            }
          ]
        }
      ]
    }
  ]
}
Fetching https://github.com/xtro/SwiftMVI.git
[1/239] Fetching swiftmvi
Fetched https://github.com/xtro/SwiftMVI.git from cache (0.83s)
Fetching https://github.com/xtro/SwiftUseCase.git from cache
Fetching https://github.com/pointfreeco/swift-case-paths.git from cache
Fetched https://github.com/pointfreeco/swift-case-paths.git from cache (0.45s)
Fetched https://github.com/xtro/SwiftUseCase.git from cache (0.45s)
Computing version for https://github.com/xtro/SwiftUseCase.git
Computed https://github.com/xtro/SwiftUseCase.git at 0.2.0 (0.50s)
Fetching https://github.com/apple/swift-syntax.git from cache
Fetched https://github.com/apple/swift-syntax.git from cache (0.85s)
Computing version for https://github.com/apple/swift-syntax.git
Computed https://github.com/apple/swift-syntax.git at 509.0.0 (0.91s)
Computing version for https://github.com/pointfreeco/swift-case-paths.git
Computed https://github.com/pointfreeco/swift-case-paths.git at 0.14.1 (0.04s)
Fetching https://github.com/pointfreeco/xctest-dynamic-overlay from cache
Fetched https://github.com/pointfreeco/xctest-dynamic-overlay from cache (0.43s)
Computing version for https://github.com/pointfreeco/xctest-dynamic-overlay
Computed https://github.com/pointfreeco/xctest-dynamic-overlay at 0.9.0 (0.48s)
Creating working copy for https://github.com/xtro/SwiftMVI.git
Working copy of https://github.com/xtro/SwiftMVI.git resolved at main (9b58372)
Creating working copy for https://github.com/apple/swift-syntax.git
Working copy of https://github.com/apple/swift-syntax.git resolved at 509.0.0
Creating working copy for https://github.com/xtro/SwiftUseCase.git
Working copy of https://github.com/xtro/SwiftUseCase.git resolved at 0.2.0
Creating working copy for https://github.com/pointfreeco/xctest-dynamic-overlay
Working copy of https://github.com/pointfreeco/xctest-dynamic-overlay resolved at 0.9.0
Creating working copy for https://github.com/pointfreeco/swift-case-paths.git
Working copy of https://github.com/pointfreeco/swift-case-paths.git resolved at 0.14.1
warning: '.resolve-product-dependencies': dependency 'swiftmvi' is not used by any target
Found 2 product dependencies
  - SwiftUseCase
  - swift-case-paths
========================================
Build
========================================
Selected platform:         macosSpm
Swift version:             6.1
Building package at path:  $PWD
https://github.com/xtro/SwiftMVI.git
https://github.com/xtro/SwiftMVI.git
{
  "dependencies" : [
    {
      "identity" : "swiftusecase",
      "requirement" : {
        "range" : [
          {
            "lower_bound" : "0.0.1",
            "upper_bound" : "1.0.0"
          }
        ]
      },
      "type" : "sourceControl",
      "url" : "https://github.com/xtro/SwiftUseCase.git"
    },
    {
      "identity" : "swift-case-paths",
      "requirement" : {
        "range" : [
          {
            "lower_bound" : "0.4.0",
            "upper_bound" : "1.0.0"
          }
        ]
      },
      "type" : "sourceControl",
      "url" : "https://github.com/pointfreeco/swift-case-paths.git"
    }
  ],
  "manifest_display_name" : "SwiftMVI",
  "name" : "SwiftMVI",
  "path" : "/Users/admin/builder/spi-builder-workspace",
  "platforms" : [
    {
      "name" : "macos",
      "version" : "10.15"
    },
    {
      "name" : "ios",
      "version" : "13.0"
    },
    {
      "name" : "tvos",
      "version" : "13.0"
    },
    {
      "name" : "watchos",
      "version" : "6.0"
    }
  ],
  "products" : [
    {
      "name" : "SwiftMVI",
      "targets" : [
        "SwiftMVI"
      ],
      "type" : {
        "library" : [
          "automatic"
        ]
      }
    }
  ],
  "targets" : [
    {
      "c99name" : "SwiftMVITests",
      "module_type" : "SwiftTarget",
      "name" : "SwiftMVITests",
      "path" : "Tests",
      "sources" : [
        "SwiftMVITests.swift"
      ],
      "target_dependencies" : [
        "SwiftMVI"
      ],
      "type" : "test"
    },
    {
      "c99name" : "SwiftMVI",
      "module_type" : "SwiftTarget",
      "name" : "SwiftMVI",
      "path" : "Sources",
      "product_dependencies" : [
        "SwiftUseCase",
        "CasePaths"
      ],
      "product_memberships" : [
        "SwiftMVI"
      ],
      "sources" : [
        "Core/AnyPath.swift",
        "Core/Binding.swift",
        "Core/FeatureModule.swift",
        "Core/Modulable.swift",
        "Core/Observer.swift",
        "Core/Processing+UseCase.swift",
        "Core/Processing.swift",
        "Core/Property.swift",
        "Core/Transformer.swift",
        "Core/ValuePublisher.swift",
        "Modules/ListFeature.swift",
        "Modules/OptionalValueFeature.swift",
        "Modules/ValueFeature+ViewLifecycle.swift",
        "Modules/ValueFeature.swift",
        "Reducers/ActionReducer.swift",
        "Reducers/AsyncActionReducer.swift",
        "Reducers/AsyncEffectReducer.swift",
        "Reducers/AsyncIntentReducer.swift",
        "Reducers/AsyncReactionReducer.swift",
        "Reducers/EffectReducer.swift",
        "Reducers/EventReducer.swift",
        "Reducers/IntentReducer.swift",
        "Reducers/ReactionReducer.swift",
        "Reducibles/OptionalReducibleState.swift",
        "Reducibles/ReducibleState.swift",
        "Use Cases/Network.swift",
        "Use Cases/Network/NetworkDataTask.swift",
        "Views/Alert+EventReducer.swift",
        "Views/Alert+StateReducer.swift",
        "Views/EventReducerView.swift",
        "Views/FeatureView.swift",
        "Views/PublishedPathView.swift",
        "Views/StateReducerView.swift"
      ],
      "type" : "library"
    }
  ],
  "tools_version" : "5.5"
}
Running build ...
env DEVELOPER_DIR=/Applications/Xcode-16.3.0.app xcrun swift build --arch arm64 -Xswiftc -Xfrontend -Xswiftc -stats-output-dir -Xswiftc -Xfrontend -Xswiftc .stats -Xswiftc -strict-concurrency=complete -Xswiftc -enable-upcoming-feature -Xswiftc StrictConcurrency -Xswiftc -enable-upcoming-feature -Xswiftc DisableOutwardActorInference -Xswiftc -enable-upcoming-feature -Xswiftc GlobalActorIsolatedTypesUsability -Xswiftc -enable-upcoming-feature -Xswiftc InferSendableFromCaptures
Building for debugging...
[0/21] Write sources
[18/21] Write swift-version-2F0A5646E1D333AE.txt
[20/32] Compiling SwiftSyntax509 Empty.swift
[21/32] Emitting module SwiftSyntax509
[22/78] Compiling SwiftSyntax MemoryLayout.swift
[23/78] Compiling SwiftSyntax MissingNodeInitializers.swift
[24/78] Compiling SwiftSyntax RawSyntax.swift
[25/78] Compiling SwiftSyntax RawSyntaxLayoutView.swift
[26/78] Compiling SwiftSyntax RawSyntaxNodeProtocol.swift
[27/83] Compiling SwiftSyntax SyntaxText.swift
[28/83] Compiling SwiftSyntax SyntaxTreeViewMode.swift
[29/83] Compiling SwiftSyntax TokenDiagnostic.swift
[30/83] Compiling SwiftSyntax TokenSyntax.swift
[31/83] Compiling SwiftSyntax Trivia.swift
[32/83] Compiling XCTestDynamicOverlay XCTCurrentTestCase.swift
[33/83] Compiling XCTestDynamicOverlay Unimplemented.swift
[34/83] Compiling XCTestDynamicOverlay GeneratePlaceholder.swift
[35/83] Compiling XCTestDynamicOverlay DefaultInitializable.swift
[36/83] Compiling XCTestDynamicOverlay Deprecations.swift
[37/83] Emitting module XCTestDynamicOverlay
[38/83] Compiling XCTestDynamicOverlay XCTIsTesting.swift
[39/83] Compiling XCTestDynamicOverlay XCTFail.swift
[40/83] Compiling XCTestDynamicOverlay RuntimeWarnings.swift
[41/91] Compiling SwiftSyntax SyntaxAnyVisitor.swift
[42/91] Compiling SwiftSyntax SyntaxBaseNodes.swift
[43/91] Compiling SwiftSyntax SyntaxCollections.swift
[44/91] Compiling SwiftSyntax SyntaxEnum.swift
[45/91] Compiling SwiftSyntax SyntaxKind.swift
[46/91] Compiling SwiftSyntax Syntax.swift
[47/91] Compiling SwiftSyntax SyntaxArena.swift
[48/91] Compiling SwiftSyntax SyntaxChildren.swift
[49/91] Compiling SwiftSyntax SyntaxCollection.swift
[50/91] Compiling SwiftSyntax SyntaxData.swift
[51/91] Compiling CasePaths CasePaths.swift
[52/91] Compiling CasePaths CasePath.swift
[53/91] Emitting module CasePaths
[54/91] Compiling CasePaths XCTUnwrap.swift
[55/91] Emitting module SwiftSyntax
[56/91] Compiling CasePaths EnumReflection.swift
[57/91] Compiling CasePaths OpenExistential.swift
[58/91] Compiling CasePaths Operators.swift
[59/91] Compiling CasePaths TypeName.swift
[60/91] Compiling SwiftSyntax Utils.swift
[61/91] Compiling SwiftSyntax ChildNameForKeyPath.swift
[62/91] Compiling SwiftSyntax Keyword.swift
[63/91] Compiling SwiftSyntax RenamedChildrenCompatibility.swift
[64/91] Compiling SwiftSyntax RenamedNodesCompatibility.swift
[65/91] Compiling SwiftSyntax RawSyntaxTokenView.swift
[66/91] Compiling SwiftSyntax SourceLength.swift
[67/91] Compiling SwiftSyntax SourceLocation.swift
[68/91] Compiling SwiftSyntax SourcePresence.swift
[69/91] Compiling SwiftSyntax SwiftSyntaxCompatibility.swift
[70/91] Compiling SwiftSyntax Tokens.swift
[71/91] Compiling SwiftSyntax TriviaPieces.swift
[72/91] Compiling SwiftSyntax RawSyntaxNodes.swift
[73/91] Compiling SwiftSyntax RawSyntaxValidation.swift
[74/91] Compiling SwiftSyntax SyntaxDeclNodes.swift
[75/91] Compiling SwiftSyntax SyntaxExprNodes.swift
[76/91] Compiling SwiftSyntax SyntaxNodes.swift
[77/91] Compiling SwiftSyntax SyntaxPatternNodes.swift
[78/91] Compiling SwiftSyntax SyntaxStmtNodes.swift
[79/91] Compiling SwiftSyntax SyntaxTypeNodes.swift
[80/91] Compiling SwiftSyntax AbsolutePosition.swift
[81/91] Compiling SwiftSyntax Assert.swift
[82/91] Compiling SwiftSyntax BumpPtrAllocator.swift
[83/91] Compiling SwiftSyntax CommonAncestor.swift
[84/91] Compiling SwiftSyntax Convenience.swift
[85/91] Compiling SwiftSyntax SyntaxRewriter.swift
[86/91] Compiling SwiftSyntax SyntaxTraits.swift
[87/91] Compiling SwiftSyntax SyntaxTransform.swift
[88/91] Compiling SwiftSyntax SyntaxVisitor.swift
[89/91] Compiling SwiftSyntax TokenKind.swift
[90/143] Compiling SwiftDiagnostics Message.swift
[91/143] Compiling SwiftDiagnostics Note.swift
[92/143] Compiling SwiftDiagnostics FixIt.swift
[93/143] Compiling SwiftBasicFormat SyntaxProtocol+Formatted.swift
[94/143] Compiling SwiftBasicFormat Trivia+FormatExtensions.swift
[95/143] Compiling SwiftBasicFormat Syntax+Extensions.swift
[96/143] Compiling SwiftDiagnostics Diagnostic.swift
[97/143] Compiling SwiftDiagnostics GroupedDiagnostics.swift
[98/143] Emitting module SwiftDiagnostics
[99/143] Compiling SwiftDiagnostics DiagnosticsFormatter.swift
[100/143] Compiling SwiftDiagnostics Convenience.swift
[101/143] Emitting module SwiftBasicFormat
[102/143] Compiling SwiftBasicFormat BasicFormat.swift
[103/143] Compiling SwiftParser Statements.swift
[104/143] Compiling SwiftParser StringLiteralRepresentedLiteralValue.swift
[105/143] Compiling SwiftParser StringLiterals.swift
[106/143] Compiling SwiftParser SwiftParserCompatibility.swift
[107/147] Compiling SwiftParser UnicodeScalarExtensions.swift
[108/147] Compiling SwiftParser Lookahead.swift
[109/147] Compiling SwiftParser LoopProgressCondition.swift
[110/147] Compiling SwiftParser Modifiers.swift
[111/147] Compiling SwiftParser Lexeme.swift
[112/147] Compiling SwiftParser LexemeSequence.swift
[113/147] Compiling SwiftParser Lexer.swift
[114/147] Compiling SwiftParser RegexLiteralLexer.swift
[115/147] Compiling SwiftParser Parser.swift
[116/147] Compiling SwiftParser Patterns.swift
[117/147] Compiling SwiftParser Recovery.swift
[118/147] Compiling SwiftParser Specifiers.swift
[119/147] Compiling SwiftParser Names.swift
[120/147] Compiling SwiftParser Nominals.swift
[121/147] Compiling SwiftParser Parameters.swift
[122/147] Compiling SwiftParser ParseSourceFile.swift
[123/147] Compiling SwiftParser SyntaxUtils.swift
[124/147] Compiling SwiftParser TokenConsumer.swift
[125/147] Compiling SwiftParser TokenPrecedence.swift
[126/147] Compiling SwiftParser TokenSpec.swift
[127/147] Compiling SwiftParser TokenSpecSet.swift
[128/147] Compiling SwiftParser TopLevel.swift
[129/147] Compiling SwiftParser TriviaParser.swift
[130/147] Compiling SwiftParser Types.swift
[131/147] Emitting module SwiftParser
[132/147] Compiling SwiftParser Attributes.swift
[133/147] Compiling SwiftParser Availability.swift
[134/147] Compiling SwiftParser CharacterInfo.swift
[135/147] Compiling SwiftParser CollectionNodes+Parsable.swift
[136/147] Compiling SwiftParser Declarations.swift
[137/147] Compiling SwiftParser Directives.swift
[138/147] Compiling SwiftParser ExperimentalFeatures.swift
[139/147] Compiling SwiftParser Expressions.swift
[140/147] Compiling SwiftParser IncrementalParseTransition.swift
[141/147] Compiling SwiftParser Cursor.swift
[142/147] Compiling SwiftParser IsLexerClassified.swift
[143/147] Compiling SwiftParser LayoutNodes+Parsable.swift
[144/147] Compiling SwiftParser Parser+TokenSpecSet.swift
[145/147] Compiling SwiftParser TokenSpecStaticMembers.swift
[146/170] Compiling SwiftOperators Operator.swift
[147/171] Compiling SwiftParserDiagnostics SyntaxKindNameForDiagnostics.swift
[148/172] Compiling SwiftParserDiagnostics Utils.swift
[149/172] Compiling SwiftOperators PrecedenceGroup.swift
[150/172] Compiling SwiftParserDiagnostics SyntaxExtensions.swift
[151/172] Compiling SwiftParserDiagnostics TokenNameForDiagnostics.swift
[152/172] Emitting module SwiftOperators
[153/172] Compiling SwiftOperators SyntaxSynthesis.swift
[154/172] Compiling SwiftParserDiagnostics PresenceUtils.swift
[155/172] Compiling SwiftOperators OperatorError+Diagnostics.swift
[156/172] Compiling SwiftOperators OperatorError.swift
[157/172] Compiling SwiftOperators OperatorTable+Defaults.swift
[158/172] Compiling SwiftOperators OperatorTable.swift
[159/172] Compiling SwiftOperators PrecedenceGraph.swift
[160/172] Compiling SwiftOperators OperatorTable+Folding.swift
[161/172] Compiling SwiftOperators OperatorTable+Semantics.swift
[162/172] Compiling SwiftParserDiagnostics ChildNameForDiagnostics.swift
[163/172] Compiling SwiftParserDiagnostics ParserDiagnosticMessages.swift
[164/172] Compiling SwiftParserDiagnostics DiagnosticExtensions.swift
[165/172] Compiling SwiftParserDiagnostics LexerDiagnosticMessages.swift
[166/172] Compiling SwiftParserDiagnostics MissingNodesError.swift
[167/172] Compiling SwiftParserDiagnostics MissingTokenError.swift
[168/172] Emitting module SwiftParserDiagnostics
[169/172] Compiling SwiftParserDiagnostics MultiLineStringLiteralDiagnosticsGenerator.swift
[170/172] Compiling SwiftParserDiagnostics ParseDiagnosticsGenerator.swift
[171/186] Compiling SwiftSyntaxBuilder Indenter.swift
[172/186] Compiling SwiftSyntaxBuilder ResultBuilderExtensions.swift
[173/186] Compiling SwiftSyntaxBuilder WithTrailingCommaSyntax+EnsuringTrailingComma.swift
[174/187] Compiling SwiftSyntaxBuilder SyntaxExpressibleByStringInterpolationConformances.swift
[175/187] Compiling SwiftSyntaxBuilder SyntaxNodeWithBody.swift
[176/187] Compiling SwiftSyntaxBuilder SyntaxParsable+ExpressibleByStringInterpolation.swift
[177/187] Compiling SwiftSyntaxBuilder RenamedChildrenBuilderCompatibility.swift
[178/187] Compiling SwiftSyntaxBuilder ValidatingSyntaxNodes.swift
[179/187] Compiling SwiftSyntaxBuilder SwiftSyntaxBuilderCompatibility.swift
[180/187] Compiling SwiftSyntaxBuilder Syntax+StringInterpolation.swift
[181/187] Compiling SwiftSyntaxBuilder BuildableNodes.swift
[182/187] Emitting module SwiftSyntaxBuilder
[183/187] Compiling SwiftSyntaxBuilder ConvenienceInitializers.swift
[184/187] Compiling SwiftSyntaxBuilder DeclSyntaxParseable.swift
[185/187] Compiling SwiftSyntaxBuilder ResultBuilders.swift
[186/201] Compiling SwiftSyntaxMacros MemberMacro.swift
[187/202] Compiling SwiftSyntaxMacros Macro.swift
[188/202] Compiling SwiftSyntaxMacros ExpressionMacro.swift
[189/202] Compiling SwiftSyntaxMacros ExtensionMacro.swift
[190/202] Compiling SwiftSyntaxMacros Macro+Format.swift
[191/202] Compiling SwiftSyntaxMacros FreestandingMacro.swift
[192/202] Compiling SwiftSyntaxMacros MemberAttributeMacro.swift
[193/202] Compiling SwiftSyntaxMacros CodeItemMacro.swift
[194/202] Compiling SwiftSyntaxMacros DeclarationMacro.swift
[195/202] Compiling SwiftSyntaxMacros AccessorMacro.swift
[196/202] Compiling SwiftSyntaxMacros AttachedMacro.swift
[197/202] Compiling SwiftSyntaxMacros AbstractSourceLocation.swift
[198/202] Compiling SwiftSyntaxMacros MacroExpansionContext.swift
[199/202] Emitting module SwiftSyntaxMacros
[200/202] Compiling SwiftSyntaxMacros PeerMacro.swift
[201/210] Compiling SwiftSyntaxMacroExpansion MacroExpansion.swift
[202/210] Compiling SwiftSyntaxMacroExpansion BasicMacroExpansionContext.swift
[203/210] Compiling SwiftSyntaxMacroExpansion MacroSystem.swift
[204/210] Emitting module SwiftSyntaxMacroExpansion
[205/210] Compiling SwiftSyntaxMacroExpansion FunctionParameterUtils.swift
[206/210] Compiling SwiftSyntaxMacroExpansion MacroExpansionDiagnosticMessages.swift
[207/210] Compiling SwiftSyntaxMacroExpansion IndentationUtils.swift
[208/210] Compiling SwiftSyntaxMacroExpansion MacroReplacement.swift
[209/217] Compiling SwiftCompilerPluginMessageHandling PluginMessageCompatibility.swift
[210/217] Compiling SwiftCompilerPluginMessageHandling Macros.swift
[211/217] Compiling SwiftCompilerPluginMessageHandling Diagnostics.swift
[212/217] Compiling SwiftCompilerPluginMessageHandling PluginMacroExpansionContext.swift
[213/217] Compiling SwiftCompilerPluginMessageHandling PluginMessages.swift
[214/217] Compiling SwiftCompilerPluginMessageHandling CompilerPluginMessageHandler.swift
[215/217] Emitting module SwiftCompilerPluginMessageHandling
[216/219] Compiling SwiftCompilerPlugin CompilerPlugin.swift
[217/219] Emitting module SwiftCompilerPlugin
[218/222] Compiling Macros UsecaseMacro.swift
[219/222] Emitting module Macros
[220/222] Compiling Macros Plugin.swift
[220/222] Write Objects.LinkFileList
[221/222] Linking Macros-tool
[223/224] Emitting module SwiftUseCaseMacro
[224/224] Compiling SwiftUseCaseMacro SwiftUseCaseMacro.swift
[225/244] Emitting module SwiftUseCase
[226/246] Compiling SwiftUseCase AsyncUseCase+Publisher.swift
[227/246] Compiling SwiftUseCase AsyncUseCase.swift
[228/246] Compiling SwiftUseCase UseCase+Callbacks.swift
[229/246] Compiling SwiftUseCase UseCase+Publisher.swift
[230/246] Compiling SwiftUseCase AsyncThrowingUseCase.swift
[231/246] Compiling SwiftUseCase AsyncUseCase+Callbacks.swift
[232/246] Compiling SwiftUseCase Executables.swift
[233/246] Compiling SwiftUseCase ThrowingUseCase+Callbacks.swift
[234/246] Compiling SwiftUseCase AsyncUsecaseable.swift
[235/246] Compiling SwiftUseCase CombineUseCase.swift
[236/246] Compiling SwiftUseCase ThrowingUseCase+Publisher.swift
[237/246] Compiling SwiftUseCase ThrowingUseCase.swift
[238/246] Compiling SwiftUseCase AsyncThrowingUseCase+Callbacks.swift
[239/246] Compiling SwiftUseCase AsyncThrowingUseCase+Publisher.swift
[240/246] Compiling SwiftUseCase AnyUseCase+Callbacks.swift
[241/246] Compiling SwiftUseCase AnyUseCase+Combine.swift
[242/246] Compiling SwiftUseCase AnyUseCase+Resolve.swift
[243/246] Compiling SwiftUseCase AnyUseCase.swift
[244/246] Compiling SwiftUseCase AsyncExecutables.swift
[245/246] Compiling SwiftUseCase UseCase.swift
[246/246] Compiling SwiftUseCase UseCaseable.swift
[247/277] Compiling SwiftMVI AsyncActionReducer.swift
/Users/admin/builder/spi-builder-workspace/Sources/Reducers/AsyncActionReducer.swift:29:43: warning: passing closure as a 'sending' parameter risks causing data races between code in the current task and concurrent execution of the closure; this is an error in the Swift 6 language mode
27 |     @discardableResult
28 |     func callAsFunction(action: Action, priority: TaskPriority? = nil) -> Task<Void, Never> {
29 |         Task.detached(priority: priority) { [self] in
   |                                           `- warning: passing closure as a 'sending' parameter risks causing data races between code in the current task and concurrent execution of the closure; this is an error in the Swift 6 language mode
30 |             await reduce(action: action)
   |                   |              `- note: closure captures non-Sendable 'action'
   |                   `- note: closure captures non-Sendable 'self'
31 |         }
32 |     }
/Users/admin/builder/spi-builder-workspace/Sources/Reducers/AsyncIntentReducer.swift:18:43: warning: passing closure as a 'sending' parameter risks causing data races between code in the current task and concurrent execution of the closure; this is an error in the Swift 6 language mode
16 |     @discardableResult
17 |     func callAsFunction(_ intent: Intent, priority: TaskPriority? = nil) -> Task<Void, Never> {
18 |         Task.detached(priority: priority) { [self] in
   |                                           `- warning: passing closure as a 'sending' parameter risks causing data races between code in the current task and concurrent execution of the closure; this is an error in the Swift 6 language mode
19 |             await reduce(intent: intent)
   |                   |              `- note: closure captures non-Sendable 'intent'
   |                   `- note: closure captures non-Sendable 'self'
20 |         }
21 |     }
[248/277] Compiling SwiftMVI AsyncEffectReducer.swift
/Users/admin/builder/spi-builder-workspace/Sources/Reducers/AsyncActionReducer.swift:29:43: warning: passing closure as a 'sending' parameter risks causing data races between code in the current task and concurrent execution of the closure; this is an error in the Swift 6 language mode
27 |     @discardableResult
28 |     func callAsFunction(action: Action, priority: TaskPriority? = nil) -> Task<Void, Never> {
29 |         Task.detached(priority: priority) { [self] in
   |                                           `- warning: passing closure as a 'sending' parameter risks causing data races between code in the current task and concurrent execution of the closure; this is an error in the Swift 6 language mode
30 |             await reduce(action: action)
   |                   |              `- note: closure captures non-Sendable 'action'
   |                   `- note: closure captures non-Sendable 'self'
31 |         }
32 |     }
/Users/admin/builder/spi-builder-workspace/Sources/Reducers/AsyncIntentReducer.swift:18:43: warning: passing closure as a 'sending' parameter risks causing data races between code in the current task and concurrent execution of the closure; this is an error in the Swift 6 language mode
16 |     @discardableResult
17 |     func callAsFunction(_ intent: Intent, priority: TaskPriority? = nil) -> Task<Void, Never> {
18 |         Task.detached(priority: priority) { [self] in
   |                                           `- warning: passing closure as a 'sending' parameter risks causing data races between code in the current task and concurrent execution of the closure; this is an error in the Swift 6 language mode
19 |             await reduce(intent: intent)
   |                   |              `- note: closure captures non-Sendable 'intent'
   |                   `- note: closure captures non-Sendable 'self'
20 |         }
21 |     }
[249/277] Compiling SwiftMVI AsyncIntentReducer.swift
/Users/admin/builder/spi-builder-workspace/Sources/Reducers/AsyncActionReducer.swift:29:43: warning: passing closure as a 'sending' parameter risks causing data races between code in the current task and concurrent execution of the closure; this is an error in the Swift 6 language mode
27 |     @discardableResult
28 |     func callAsFunction(action: Action, priority: TaskPriority? = nil) -> Task<Void, Never> {
29 |         Task.detached(priority: priority) { [self] in
   |                                           `- warning: passing closure as a 'sending' parameter risks causing data races between code in the current task and concurrent execution of the closure; this is an error in the Swift 6 language mode
30 |             await reduce(action: action)
   |                   |              `- note: closure captures non-Sendable 'action'
   |                   `- note: closure captures non-Sendable 'self'
31 |         }
32 |     }
/Users/admin/builder/spi-builder-workspace/Sources/Reducers/AsyncIntentReducer.swift:18:43: warning: passing closure as a 'sending' parameter risks causing data races between code in the current task and concurrent execution of the closure; this is an error in the Swift 6 language mode
16 |     @discardableResult
17 |     func callAsFunction(_ intent: Intent, priority: TaskPriority? = nil) -> Task<Void, Never> {
18 |         Task.detached(priority: priority) { [self] in
   |                                           `- warning: passing closure as a 'sending' parameter risks causing data races between code in the current task and concurrent execution of the closure; this is an error in the Swift 6 language mode
19 |             await reduce(intent: intent)
   |                   |              `- note: closure captures non-Sendable 'intent'
   |                   `- note: closure captures non-Sendable 'self'
20 |         }
21 |     }
error: emit-module command failed with exit code 1 (use -v to see invocation)
[250/280] Emitting module SwiftMVI
/Users/admin/builder/spi-builder-workspace/Sources/Core/Processing+UseCase.swift:15:17: error: cannot find type 'SyncUseCase' in scope
 13 |     ///   - usecase: An executable UseCase
 14 |     /// - Returns: Result of the executed usecase
 15 |     func run<U: SyncUseCase>(_ usecase: U) -> U.Result where U.Parameter == Void {
    |                 `- error: cannot find type 'SyncUseCase' in scope
 16 |         return run(usecase, ())
 17 |     }
/Users/admin/builder/spi-builder-workspace/Sources/Core/Processing+UseCase.swift:15:49: error: 'Result' is not a member type of type 'U'
 13 |     ///   - usecase: An executable UseCase
 14 |     /// - Returns: Result of the executed usecase
 15 |     func run<U: SyncUseCase>(_ usecase: U) -> U.Result where U.Parameter == Void {
    |                                                 `- error: 'Result' is not a member type of type 'U'
 16 |         return run(usecase, ())
 17 |     }
/Users/admin/builder/spi-builder-workspace/Sources/Core/Processing+UseCase.swift:15:64: error: 'Parameter' is not a member type of type 'U'
 13 |     ///   - usecase: An executable UseCase
 14 |     /// - Returns: Result of the executed usecase
 15 |     func run<U: SyncUseCase>(_ usecase: U) -> U.Result where U.Parameter == Void {
    |                                                                `- error: 'Parameter' is not a member type of type 'U'
 16 |         return run(usecase, ())
 17 |     }
/Users/admin/builder/spi-builder-workspace/Sources/Core/Processing+UseCase.swift:24:17: error: cannot find type 'SyncUseCase' in scope
 22 |     ///   - usecase: An executable UseCase
 23 |     /// - Returns: Result of the executed usecase
 24 |     func run<U: SyncUseCase>(_ usecase: U, _ parameters: U.Parameter) -> U.Result {
    |                 `- error: cannot find type 'SyncUseCase' in scope
 25 |         usecase(parameters)
 26 |     }
/Users/admin/builder/spi-builder-workspace/Sources/Core/Processing+UseCase.swift:24:76: error: 'Result' is not a member type of type 'U'
 22 |     ///   - usecase: An executable UseCase
 23 |     /// - Returns: Result of the executed usecase
 24 |     func run<U: SyncUseCase>(_ usecase: U, _ parameters: U.Parameter) -> U.Result {
    |                                                                            `- error: 'Result' is not a member type of type 'U'
 25 |         usecase(parameters)
 26 |     }
/Users/admin/builder/spi-builder-workspace/Sources/Core/Processing+UseCase.swift:24:60: error: 'Parameter' is not a member type of type 'U'
 22 |     ///   - usecase: An executable UseCase
 23 |     /// - Returns: Result of the executed usecase
 24 |     func run<U: SyncUseCase>(_ usecase: U, _ parameters: U.Parameter) -> U.Result {
    |                                                            `- error: 'Parameter' is not a member type of type 'U'
 25 |         usecase(parameters)
 26 |     }
/Users/admin/builder/spi-builder-workspace/Sources/Core/Processing+UseCase.swift:35:17: error: cannot find type 'SyncThrowingUseCase' in scope
 33 |     ///   - usecase: An executable UseCase
 34 |     /// - Returns: Result of the executed usecase
 35 |     func run<U: SyncThrowingUseCase>(_ usecase: U) throws -> U.Result where U.Parameter == Void {
    |                 `- error: cannot find type 'SyncThrowingUseCase' in scope
 36 |         return try run(usecase, ())
 37 |     }
/Users/admin/builder/spi-builder-workspace/Sources/Core/Processing+UseCase.swift:35:64: error: 'Result' is not a member type of type 'U'
 33 |     ///   - usecase: An executable UseCase
 34 |     /// - Returns: Result of the executed usecase
 35 |     func run<U: SyncThrowingUseCase>(_ usecase: U) throws -> U.Result where U.Parameter == Void {
    |                                                                `- error: 'Result' is not a member type of type 'U'
 36 |         return try run(usecase, ())
 37 |     }
/Users/admin/builder/spi-builder-workspace/Sources/Core/Processing+UseCase.swift:35:79: error: 'Parameter' is not a member type of type 'U'
 33 |     ///   - usecase: An executable UseCase
 34 |     /// - Returns: Result of the executed usecase
 35 |     func run<U: SyncThrowingUseCase>(_ usecase: U) throws -> U.Result where U.Parameter == Void {
    |                                                                               `- error: 'Parameter' is not a member type of type 'U'
 36 |         return try run(usecase, ())
 37 |     }
/Users/admin/builder/spi-builder-workspace/Sources/Core/Processing+UseCase.swift:44:17: error: cannot find type 'SyncThrowingUseCase' in scope
 42 |     ///   - usecase: An executable UseCase
 43 |     /// - Returns: Result of the executed usecase
 44 |     func run<U: SyncThrowingUseCase>(_ usecase: U, _ parameters: U.Parameter) throws -> U.Result {
    |                 `- error: cannot find type 'SyncThrowingUseCase' in scope
 45 |         try usecase(parameters)
 46 |     }
/Users/admin/builder/spi-builder-workspace/Sources/Core/Processing+UseCase.swift:44:91: error: 'Result' is not a member type of type 'U'
 42 |     ///   - usecase: An executable UseCase
 43 |     /// - Returns: Result of the executed usecase
 44 |     func run<U: SyncThrowingUseCase>(_ usecase: U, _ parameters: U.Parameter) throws -> U.Result {
    |                                                                                           `- error: 'Result' is not a member type of type 'U'
 45 |         try usecase(parameters)
 46 |     }
/Users/admin/builder/spi-builder-workspace/Sources/Core/Processing+UseCase.swift:44:68: error: 'Parameter' is not a member type of type 'U'
 42 |     ///   - usecase: An executable UseCase
 43 |     /// - Returns: Result of the executed usecase
 44 |     func run<U: SyncThrowingUseCase>(_ usecase: U, _ parameters: U.Parameter) throws -> U.Result {
    |                                                                    `- error: 'Parameter' is not a member type of type 'U'
 45 |         try usecase(parameters)
 46 |     }
/Users/admin/builder/spi-builder-workspace/Sources/Use Cases/Network.swift:9:23: warning: static property 'dataTask' is not concurrency-safe because non-'Sendable' type 'Network.DataTask' may have shared mutable state; this is an error in the Swift 6 language mode
 7 |
 8 | public enum Network {
 9 |     public static let dataTask: DataTask = .init()
   |                       |- warning: static property 'dataTask' is not concurrency-safe because non-'Sendable' type 'Network.DataTask' may have shared mutable state; this is an error in the Swift 6 language mode
   |                       |- note: add '@MainActor' to make static property 'dataTask' part of global actor 'MainActor'
   |                       `- note: disable concurrency-safety checks if accesses are protected by an external synchronization mechanism
10 | }
11 |
/Users/admin/builder/spi-builder-workspace/Sources/Use Cases/Network/NetworkDataTask.swift:11:12: note: consider making struct 'DataTask' conform to the 'Sendable' protocol
 9 | public extension Network {
10 |     /// A **DataTask** is an assyncronous usecase that able to download data from internet or throwing an error.
11 |     struct DataTask: AsyncThrowingUseCase {
   |            `- note: consider making struct 'DataTask' conform to the 'Sendable' protocol
12 |         public struct Parameter {
13 |             let request: URLRequest
/Users/admin/builder/spi-builder-workspace/Sources/Use Cases/Network/NetworkDataTask.swift:38:17: warning: capture of 'urlSessionTask' with non-sendable type 'CancellableWrapper' in a '@Sendable' closure; this is an error in the Swift 6 language mode
18 |
19 |         public var execute: AsyncThrowingExecutable<Parameter, Result> = { parameter in
20 |             class CancellableWrapper {
   |                   `- note: class 'CancellableWrapper' does not conform to the 'Sendable' protocol
21 |                 var dataTask: URLSessionDataTask?
22 |             }
   :
36 |                 }
37 |             } onCancel: {
38 |                 urlSessionTask.dataTask?.cancel()
   |                 `- warning: capture of 'urlSessionTask' with non-sendable type 'CancellableWrapper' in a '@Sendable' closure; this is an error in the Swift 6 language mode
39 |             }
40 |         }
/Users/admin/builder/spi-builder-workspace/Sources/Use Cases/Network/NetworkDataTask.swift:11:12: warning: type 'Network.DataTask.Parameter' does not conform to the 'Sendable' protocol; this is an error in the Swift 6 language mode
 9 | public extension Network {
10 |     /// A **DataTask** is an assyncronous usecase that able to download data from internet or throwing an error.
11 |     struct DataTask: AsyncThrowingUseCase {
   |            `- warning: type 'Network.DataTask.Parameter' does not conform to the 'Sendable' protocol; this is an error in the Swift 6 language mode
12 |         public struct Parameter {
   |                       `- note: consider making struct 'Parameter' conform to the 'Sendable' protocol
13 |             let request: URLRequest
14 |             let session: URLSession
[251/280] Compiling SwiftMVI IntentReducer.swift
[252/280] Compiling SwiftMVI ReactionReducer.swift
[253/280] Compiling SwiftMVI OptionalReducibleState.swift
[254/280] Compiling SwiftMVI AnyPath.swift
/Users/admin/builder/spi-builder-workspace/Sources/Core/Modulable.swift:20:13: warning: capture of 'self' with non-sendable type 'Self' in a '@Sendable' closure
18 |     var binding: Binding<Value> {
19 |         Binding { [self] in
20 |             value.get()
   |             `- warning: capture of 'self' with non-sendable type 'Self' in a '@Sendable' closure
21 |         } set: { [self] in
22 |             value.set($0)
SwiftMVI.Modulable.Self:2:1: note: consider making generic parameter 'Self' conform to the 'Sendable' protocol
1 | protocol Modulable {
2 | Self : SwiftMVI.Modulable}
  | `- note: consider making generic parameter 'Self' conform to the 'Sendable' protocol
3 |
/Users/admin/builder/spi-builder-workspace/Sources/Core/Modulable.swift:22:13: warning: capture of 'self' with non-sendable type 'Self' in a '@Sendable' closure
20 |             value.get()
21 |         } set: { [self] in
22 |             value.set($0)
   |             `- warning: capture of 'self' with non-sendable type 'Self' in a '@Sendable' closure
23 |         }
24 |     }
SwiftMVI.Modulable.Self:2:1: note: consider making generic parameter 'Self' conform to the 'Sendable' protocol
1 | protocol Modulable {
2 | Self : SwiftMVI.Modulable}
  | `- note: consider making generic parameter 'Self' conform to the 'Sendable' protocol
3 |
/Users/admin/builder/spi-builder-workspace/Sources/Core/Modulable.swift:39:23: warning: comparing non-optional value of type 'Self.State' to 'nil' always returns true
37 |             },
38 |             get: { [self] in
39 |                 state != nil
   |                       `- warning: comparing non-optional value of type 'Self.State' to 'nil' always returns true
40 |             }
41 |         )
[255/280] Compiling SwiftMVI Binding.swift
/Users/admin/builder/spi-builder-workspace/Sources/Core/Modulable.swift:20:13: warning: capture of 'self' with non-sendable type 'Self' in a '@Sendable' closure
18 |     var binding: Binding<Value> {
19 |         Binding { [self] in
20 |             value.get()
   |             `- warning: capture of 'self' with non-sendable type 'Self' in a '@Sendable' closure
21 |         } set: { [self] in
22 |             value.set($0)
SwiftMVI.Modulable.Self:2:1: note: consider making generic parameter 'Self' conform to the 'Sendable' protocol
1 | protocol Modulable {
2 | Self : SwiftMVI.Modulable}
  | `- note: consider making generic parameter 'Self' conform to the 'Sendable' protocol
3 |
/Users/admin/builder/spi-builder-workspace/Sources/Core/Modulable.swift:22:13: warning: capture of 'self' with non-sendable type 'Self' in a '@Sendable' closure
20 |             value.get()
21 |         } set: { [self] in
22 |             value.set($0)
   |             `- warning: capture of 'self' with non-sendable type 'Self' in a '@Sendable' closure
23 |         }
24 |     }
SwiftMVI.Modulable.Self:2:1: note: consider making generic parameter 'Self' conform to the 'Sendable' protocol
1 | protocol Modulable {
2 | Self : SwiftMVI.Modulable}
  | `- note: consider making generic parameter 'Self' conform to the 'Sendable' protocol
3 |
/Users/admin/builder/spi-builder-workspace/Sources/Core/Modulable.swift:39:23: warning: comparing non-optional value of type 'Self.State' to 'nil' always returns true
37 |             },
38 |             get: { [self] in
39 |                 state != nil
   |                       `- warning: comparing non-optional value of type 'Self.State' to 'nil' always returns true
40 |             }
41 |         )
[256/280] Compiling SwiftMVI FeatureModule.swift
/Users/admin/builder/spi-builder-workspace/Sources/Core/Modulable.swift:20:13: warning: capture of 'self' with non-sendable type 'Self' in a '@Sendable' closure
18 |     var binding: Binding<Value> {
19 |         Binding { [self] in
20 |             value.get()
   |             `- warning: capture of 'self' with non-sendable type 'Self' in a '@Sendable' closure
21 |         } set: { [self] in
22 |             value.set($0)
SwiftMVI.Modulable.Self:2:1: note: consider making generic parameter 'Self' conform to the 'Sendable' protocol
1 | protocol Modulable {
2 | Self : SwiftMVI.Modulable}
  | `- note: consider making generic parameter 'Self' conform to the 'Sendable' protocol
3 |
/Users/admin/builder/spi-builder-workspace/Sources/Core/Modulable.swift:22:13: warning: capture of 'self' with non-sendable type 'Self' in a '@Sendable' closure
20 |             value.get()
21 |         } set: { [self] in
22 |             value.set($0)
   |             `- warning: capture of 'self' with non-sendable type 'Self' in a '@Sendable' closure
23 |         }
24 |     }
SwiftMVI.Modulable.Self:2:1: note: consider making generic parameter 'Self' conform to the 'Sendable' protocol
1 | protocol Modulable {
2 | Self : SwiftMVI.Modulable}
  | `- note: consider making generic parameter 'Self' conform to the 'Sendable' protocol
3 |
/Users/admin/builder/spi-builder-workspace/Sources/Core/Modulable.swift:39:23: warning: comparing non-optional value of type 'Self.State' to 'nil' always returns true
37 |             },
38 |             get: { [self] in
39 |                 state != nil
   |                       `- warning: comparing non-optional value of type 'Self.State' to 'nil' always returns true
40 |             }
41 |         )
[257/280] Compiling SwiftMVI Modulable.swift
/Users/admin/builder/spi-builder-workspace/Sources/Core/Modulable.swift:20:13: warning: capture of 'self' with non-sendable type 'Self' in a '@Sendable' closure
18 |     var binding: Binding<Value> {
19 |         Binding { [self] in
20 |             value.get()
   |             `- warning: capture of 'self' with non-sendable type 'Self' in a '@Sendable' closure
21 |         } set: { [self] in
22 |             value.set($0)
SwiftMVI.Modulable.Self:2:1: note: consider making generic parameter 'Self' conform to the 'Sendable' protocol
1 | protocol Modulable {
2 | Self : SwiftMVI.Modulable}
  | `- note: consider making generic parameter 'Self' conform to the 'Sendable' protocol
3 |
/Users/admin/builder/spi-builder-workspace/Sources/Core/Modulable.swift:22:13: warning: capture of 'self' with non-sendable type 'Self' in a '@Sendable' closure
20 |             value.get()
21 |         } set: { [self] in
22 |             value.set($0)
   |             `- warning: capture of 'self' with non-sendable type 'Self' in a '@Sendable' closure
23 |         }
24 |     }
SwiftMVI.Modulable.Self:2:1: note: consider making generic parameter 'Self' conform to the 'Sendable' protocol
1 | protocol Modulable {
2 | Self : SwiftMVI.Modulable}
  | `- note: consider making generic parameter 'Self' conform to the 'Sendable' protocol
3 |
/Users/admin/builder/spi-builder-workspace/Sources/Core/Modulable.swift:39:23: warning: comparing non-optional value of type 'Self.State' to 'nil' always returns true
37 |             },
38 |             get: { [self] in
39 |                 state != nil
   |                       `- warning: comparing non-optional value of type 'Self.State' to 'nil' always returns true
40 |             }
41 |         )
[258/280] Compiling SwiftMVI Transformer.swift
/Users/admin/builder/spi-builder-workspace/Sources/Modules/OptionalValueFeature.swift:23:21: warning: capture of 'newState' with non-sendable type 'OptionalValueFeature<Value>.State?' (aka 'Optional<Value>') in a '@Sendable' closure; this is an error in the Swift 6 language mode
 7 | import SwiftUI
 8 |
 9 | public class OptionalValueFeature<Value: Equatable>: IntentReducer & Processing & OptionalReducibleState {
   |                                   `- note: consider making generic parameter 'OptionalValueFeature<Value>.State' (aka 'Value') conform to the 'Sendable' protocol
10 |     public typealias State = Value
11 |     public var state: State?
   :
21 |             if newState != state {
22 |                 state {
23 |                     newState
   |                     `- warning: capture of 'newState' with non-sendable type 'OptionalValueFeature<Value>.State?' (aka 'Optional<Value>') in a '@Sendable' closure; this is an error in the Swift 6 language mode
24 |                 }
25 |             }
[259/280] Compiling SwiftMVI ValuePublisher.swift
/Users/admin/builder/spi-builder-workspace/Sources/Modules/OptionalValueFeature.swift:23:21: warning: capture of 'newState' with non-sendable type 'OptionalValueFeature<Value>.State?' (aka 'Optional<Value>') in a '@Sendable' closure; this is an error in the Swift 6 language mode
 7 | import SwiftUI
 8 |
 9 | public class OptionalValueFeature<Value: Equatable>: IntentReducer & Processing & OptionalReducibleState {
   |                                   `- note: consider making generic parameter 'OptionalValueFeature<Value>.State' (aka 'Value') conform to the 'Sendable' protocol
10 |     public typealias State = Value
11 |     public var state: State?
   :
21 |             if newState != state {
22 |                 state {
23 |                     newState
   |                     `- warning: capture of 'newState' with non-sendable type 'OptionalValueFeature<Value>.State?' (aka 'Optional<Value>') in a '@Sendable' closure; this is an error in the Swift 6 language mode
24 |                 }
25 |             }
[260/280] Compiling SwiftMVI ListFeature.swift
/Users/admin/builder/spi-builder-workspace/Sources/Modules/OptionalValueFeature.swift:23:21: warning: capture of 'newState' with non-sendable type 'OptionalValueFeature<Value>.State?' (aka 'Optional<Value>') in a '@Sendable' closure; this is an error in the Swift 6 language mode
 7 | import SwiftUI
 8 |
 9 | public class OptionalValueFeature<Value: Equatable>: IntentReducer & Processing & OptionalReducibleState {
   |                                   `- note: consider making generic parameter 'OptionalValueFeature<Value>.State' (aka 'Value') conform to the 'Sendable' protocol
10 |     public typealias State = Value
11 |     public var state: State?
   :
21 |             if newState != state {
22 |                 state {
23 |                     newState
   |                     `- warning: capture of 'newState' with non-sendable type 'OptionalValueFeature<Value>.State?' (aka 'Optional<Value>') in a '@Sendable' closure; this is an error in the Swift 6 language mode
24 |                 }
25 |             }
[261/280] Compiling SwiftMVI OptionalValueFeature.swift
/Users/admin/builder/spi-builder-workspace/Sources/Modules/OptionalValueFeature.swift:23:21: warning: capture of 'newState' with non-sendable type 'OptionalValueFeature<Value>.State?' (aka 'Optional<Value>') in a '@Sendable' closure; this is an error in the Swift 6 language mode
 7 | import SwiftUI
 8 |
 9 | public class OptionalValueFeature<Value: Equatable>: IntentReducer & Processing & OptionalReducibleState {
   |                                   `- note: consider making generic parameter 'OptionalValueFeature<Value>.State' (aka 'Value') conform to the 'Sendable' protocol
10 |     public typealias State = Value
11 |     public var state: State?
   :
21 |             if newState != state {
22 |                 state {
23 |                     newState
   |                     `- warning: capture of 'newState' with non-sendable type 'OptionalValueFeature<Value>.State?' (aka 'Optional<Value>') in a '@Sendable' closure; this is an error in the Swift 6 language mode
24 |                 }
25 |             }
[262/280] Compiling SwiftMVI FeatureView.swift
/Users/admin/builder/spi-builder-workspace/Sources/Views/StateReducerView.swift:45:72: warning: main actor-isolated property 'reducer' can not be referenced from a Sendable closure; this is an error in the Swift 6 language mode
 9 |
10 | public struct StateReducerView<Content: View, Reducer: ReducibleState, Value>: View {
11 |     private let reducer: Reducer
   |                 `- note: property declared here
12 |     private let path: AnyPath<Reducer.State, Value>
13 |     private let content: (Value) -> Content
   :
43 |
44 |     public var body: some View {
45 |         PublishedPathView(reducer, persistent: persistent, map: { _ in reducer.state }, publisher: reducer.statePublisher, path: path, content: content)
   |                                                                        `- warning: main actor-isolated property 'reducer' can not be referenced from a Sendable closure; this is an error in the Swift 6 language mode
46 |     }
47 | }
[263/280] Compiling SwiftMVI PublishedPathView.swift
/Users/admin/builder/spi-builder-workspace/Sources/Views/StateReducerView.swift:45:72: warning: main actor-isolated property 'reducer' can not be referenced from a Sendable closure; this is an error in the Swift 6 language mode
 9 |
10 | public struct StateReducerView<Content: View, Reducer: ReducibleState, Value>: View {
11 |     private let reducer: Reducer
   |                 `- note: property declared here
12 |     private let path: AnyPath<Reducer.State, Value>
13 |     private let content: (Value) -> Content
   :
43 |
44 |     public var body: some View {
45 |         PublishedPathView(reducer, persistent: persistent, map: { _ in reducer.state }, publisher: reducer.statePublisher, path: path, content: content)
   |                                                                        `- warning: main actor-isolated property 'reducer' can not be referenced from a Sendable closure; this is an error in the Swift 6 language mode
46 |     }
47 | }
[264/280] Compiling SwiftMVI StateReducerView.swift
/Users/admin/builder/spi-builder-workspace/Sources/Views/StateReducerView.swift:45:72: warning: main actor-isolated property 'reducer' can not be referenced from a Sendable closure; this is an error in the Swift 6 language mode
 9 |
10 | public struct StateReducerView<Content: View, Reducer: ReducibleState, Value>: View {
11 |     private let reducer: Reducer
   |                 `- note: property declared here
12 |     private let path: AnyPath<Reducer.State, Value>
13 |     private let content: (Value) -> Content
   :
43 |
44 |     public var body: some View {
45 |         PublishedPathView(reducer, persistent: persistent, map: { _ in reducer.state }, publisher: reducer.statePublisher, path: path, content: content)
   |                                                                        `- warning: main actor-isolated property 'reducer' can not be referenced from a Sendable closure; this is an error in the Swift 6 language mode
46 |     }
47 | }
[265/280] Compiling SwiftMVI AsyncReactionReducer.swift
/Users/admin/builder/spi-builder-workspace/Sources/Reducers/EventReducer.swift:124:34: warning: sending '$0' risks causing data races; this is an error in the Swift 6 language mode
122 |                 .sink { _ in
123 |                 } receiveValue: {
124 |                     continuation.resume(returning: $0)
    |                                  |- warning: sending '$0' risks causing data races; this is an error in the Swift 6 language mode
    |                                  `- note: task-isolated '$0' is passed as a 'sending' parameter; Uses in callee may race with later task-isolated uses
125 |                     cancellable?.cancel()
126 |                 }
/Users/admin/builder/spi-builder-workspace/Sources/Reducers/EventReducer.swift:139:34: warning: sending '$0' risks causing data races; this is an error in the Swift 6 language mode
137 |                 .sink { _ in
138 |                 } receiveValue: {
139 |                     continuation.resume(returning: $0)
    |                                  |- warning: sending '$0' risks causing data races; this is an error in the Swift 6 language mode
    |                                  `- note: task-isolated '$0' is passed as a 'sending' parameter; Uses in callee may race with later task-isolated uses
140 |                     cancellable?.cancel()
141 |                 }
/Users/admin/builder/spi-builder-workspace/Sources/Reducers/EventReducer.swift:155:34: warning: sending '$0' risks causing data races; this is an error in the Swift 6 language mode
153 |                 .sink { _ in
154 |                 } receiveValue: {
155 |                     continuation.resume(returning: $0)
    |                                  |- warning: sending '$0' risks causing data races; this is an error in the Swift 6 language mode
    |                                  `- note: task-isolated '$0' is passed as a 'sending' parameter; Uses in callee may race with later task-isolated uses
156 |                     cancellable?.cancel()
157 |                 }
[266/280] Compiling SwiftMVI EffectReducer.swift
/Users/admin/builder/spi-builder-workspace/Sources/Reducers/EventReducer.swift:124:34: warning: sending '$0' risks causing data races; this is an error in the Swift 6 language mode
122 |                 .sink { _ in
123 |                 } receiveValue: {
124 |                     continuation.resume(returning: $0)
    |                                  |- warning: sending '$0' risks causing data races; this is an error in the Swift 6 language mode
    |                                  `- note: task-isolated '$0' is passed as a 'sending' parameter; Uses in callee may race with later task-isolated uses
125 |                     cancellable?.cancel()
126 |                 }
/Users/admin/builder/spi-builder-workspace/Sources/Reducers/EventReducer.swift:139:34: warning: sending '$0' risks causing data races; this is an error in the Swift 6 language mode
137 |                 .sink { _ in
138 |                 } receiveValue: {
139 |                     continuation.resume(returning: $0)
    |                                  |- warning: sending '$0' risks causing data races; this is an error in the Swift 6 language mode
    |                                  `- note: task-isolated '$0' is passed as a 'sending' parameter; Uses in callee may race with later task-isolated uses
140 |                     cancellable?.cancel()
141 |                 }
/Users/admin/builder/spi-builder-workspace/Sources/Reducers/EventReducer.swift:155:34: warning: sending '$0' risks causing data races; this is an error in the Swift 6 language mode
153 |                 .sink { _ in
154 |                 } receiveValue: {
155 |                     continuation.resume(returning: $0)
    |                                  |- warning: sending '$0' risks causing data races; this is an error in the Swift 6 language mode
    |                                  `- note: task-isolated '$0' is passed as a 'sending' parameter; Uses in callee may race with later task-isolated uses
156 |                     cancellable?.cancel()
157 |                 }
[267/280] Compiling SwiftMVI EventReducer.swift
/Users/admin/builder/spi-builder-workspace/Sources/Reducers/EventReducer.swift:124:34: warning: sending '$0' risks causing data races; this is an error in the Swift 6 language mode
122 |                 .sink { _ in
123 |                 } receiveValue: {
124 |                     continuation.resume(returning: $0)
    |                                  |- warning: sending '$0' risks causing data races; this is an error in the Swift 6 language mode
    |                                  `- note: task-isolated '$0' is passed as a 'sending' parameter; Uses in callee may race with later task-isolated uses
125 |                     cancellable?.cancel()
126 |                 }
/Users/admin/builder/spi-builder-workspace/Sources/Reducers/EventReducer.swift:139:34: warning: sending '$0' risks causing data races; this is an error in the Swift 6 language mode
137 |                 .sink { _ in
138 |                 } receiveValue: {
139 |                     continuation.resume(returning: $0)
    |                                  |- warning: sending '$0' risks causing data races; this is an error in the Swift 6 language mode
    |                                  `- note: task-isolated '$0' is passed as a 'sending' parameter; Uses in callee may race with later task-isolated uses
140 |                     cancellable?.cancel()
141 |                 }
/Users/admin/builder/spi-builder-workspace/Sources/Reducers/EventReducer.swift:155:34: warning: sending '$0' risks causing data races; this is an error in the Swift 6 language mode
153 |                 .sink { _ in
154 |                 } receiveValue: {
155 |                     continuation.resume(returning: $0)
    |                                  |- warning: sending '$0' risks causing data races; this is an error in the Swift 6 language mode
    |                                  `- note: task-isolated '$0' is passed as a 'sending' parameter; Uses in callee may race with later task-isolated uses
156 |                     cancellable?.cancel()
157 |                 }
[268/280] Compiling SwiftMVI ReducibleState.swift
/Users/admin/builder/spi-builder-workspace/Sources/Use Cases/Network.swift:9:23: warning: static property 'dataTask' is not concurrency-safe because non-'Sendable' type 'Network.DataTask' may have shared mutable state; this is an error in the Swift 6 language mode
 7 |
 8 | public enum Network {
 9 |     public static let dataTask: DataTask = .init()
   |                       |- warning: static property 'dataTask' is not concurrency-safe because non-'Sendable' type 'Network.DataTask' may have shared mutable state; this is an error in the Swift 6 language mode
   |                       |- note: add '@MainActor' to make static property 'dataTask' part of global actor 'MainActor'
   |                       `- note: disable concurrency-safety checks if accesses are protected by an external synchronization mechanism
10 | }
11 |
/Users/admin/builder/spi-builder-workspace/Sources/Use Cases/Network/NetworkDataTask.swift:11:12: note: consider making struct 'DataTask' conform to the 'Sendable' protocol
 9 | public extension Network {
10 |     /// A **DataTask** is an assyncronous usecase that able to download data from internet or throwing an error.
11 |     struct DataTask: AsyncThrowingUseCase {
   |            `- note: consider making struct 'DataTask' conform to the 'Sendable' protocol
12 |         public struct Parameter {
13 |             let request: URLRequest
/Users/admin/builder/spi-builder-workspace/Sources/Use Cases/Network/NetworkDataTask.swift:38:17: warning: capture of 'urlSessionTask' with non-sendable type 'CancellableWrapper' in a '@Sendable' closure; this is an error in the Swift 6 language mode
18 |
19 |         public var execute: AsyncThrowingExecutable<Parameter, Result> = { parameter in
20 |             class CancellableWrapper {
   |                   `- note: class 'CancellableWrapper' does not conform to the 'Sendable' protocol
21 |                 var dataTask: URLSessionDataTask?
22 |             }
   :
36 |                 }
37 |             } onCancel: {
38 |                 urlSessionTask.dataTask?.cancel()
   |                 `- warning: capture of 'urlSessionTask' with non-sendable type 'CancellableWrapper' in a '@Sendable' closure; this is an error in the Swift 6 language mode
39 |             }
40 |         }
/Users/admin/builder/spi-builder-workspace/Sources/Use Cases/Network/NetworkDataTask.swift:11:12: warning: type 'Network.DataTask.Parameter' does not conform to the 'Sendable' protocol; this is an error in the Swift 6 language mode
 9 | public extension Network {
10 |     /// A **DataTask** is an assyncronous usecase that able to download data from internet or throwing an error.
11 |     struct DataTask: AsyncThrowingUseCase {
   |            `- warning: type 'Network.DataTask.Parameter' does not conform to the 'Sendable' protocol; this is an error in the Swift 6 language mode
12 |         public struct Parameter {
   |                       `- note: consider making struct 'Parameter' conform to the 'Sendable' protocol
13 |             let request: URLRequest
14 |             let session: URLSession
[269/280] Compiling SwiftMVI Network.swift
/Users/admin/builder/spi-builder-workspace/Sources/Use Cases/Network.swift:9:23: warning: static property 'dataTask' is not concurrency-safe because non-'Sendable' type 'Network.DataTask' may have shared mutable state; this is an error in the Swift 6 language mode
 7 |
 8 | public enum Network {
 9 |     public static let dataTask: DataTask = .init()
   |                       |- warning: static property 'dataTask' is not concurrency-safe because non-'Sendable' type 'Network.DataTask' may have shared mutable state; this is an error in the Swift 6 language mode
   |                       |- note: add '@MainActor' to make static property 'dataTask' part of global actor 'MainActor'
   |                       `- note: disable concurrency-safety checks if accesses are protected by an external synchronization mechanism
10 | }
11 |
/Users/admin/builder/spi-builder-workspace/Sources/Use Cases/Network/NetworkDataTask.swift:11:12: note: consider making struct 'DataTask' conform to the 'Sendable' protocol
 9 | public extension Network {
10 |     /// A **DataTask** is an assyncronous usecase that able to download data from internet or throwing an error.
11 |     struct DataTask: AsyncThrowingUseCase {
   |            `- note: consider making struct 'DataTask' conform to the 'Sendable' protocol
12 |         public struct Parameter {
13 |             let request: URLRequest
/Users/admin/builder/spi-builder-workspace/Sources/Use Cases/Network/NetworkDataTask.swift:38:17: warning: capture of 'urlSessionTask' with non-sendable type 'CancellableWrapper' in a '@Sendable' closure; this is an error in the Swift 6 language mode
18 |
19 |         public var execute: AsyncThrowingExecutable<Parameter, Result> = { parameter in
20 |             class CancellableWrapper {
   |                   `- note: class 'CancellableWrapper' does not conform to the 'Sendable' protocol
21 |                 var dataTask: URLSessionDataTask?
22 |             }
   :
36 |                 }
37 |             } onCancel: {
38 |                 urlSessionTask.dataTask?.cancel()
   |                 `- warning: capture of 'urlSessionTask' with non-sendable type 'CancellableWrapper' in a '@Sendable' closure; this is an error in the Swift 6 language mode
39 |             }
40 |         }
/Users/admin/builder/spi-builder-workspace/Sources/Use Cases/Network/NetworkDataTask.swift:11:12: warning: type 'Network.DataTask.Parameter' does not conform to the 'Sendable' protocol; this is an error in the Swift 6 language mode
 9 | public extension Network {
10 |     /// A **DataTask** is an assyncronous usecase that able to download data from internet or throwing an error.
11 |     struct DataTask: AsyncThrowingUseCase {
   |            `- warning: type 'Network.DataTask.Parameter' does not conform to the 'Sendable' protocol; this is an error in the Swift 6 language mode
12 |         public struct Parameter {
   |                       `- note: consider making struct 'Parameter' conform to the 'Sendable' protocol
13 |             let request: URLRequest
14 |             let session: URLSession
[270/280] Compiling SwiftMVI NetworkDataTask.swift
/Users/admin/builder/spi-builder-workspace/Sources/Use Cases/Network.swift:9:23: warning: static property 'dataTask' is not concurrency-safe because non-'Sendable' type 'Network.DataTask' may have shared mutable state; this is an error in the Swift 6 language mode
 7 |
 8 | public enum Network {
 9 |     public static let dataTask: DataTask = .init()
   |                       |- warning: static property 'dataTask' is not concurrency-safe because non-'Sendable' type 'Network.DataTask' may have shared mutable state; this is an error in the Swift 6 language mode
   |                       |- note: add '@MainActor' to make static property 'dataTask' part of global actor 'MainActor'
   |                       `- note: disable concurrency-safety checks if accesses are protected by an external synchronization mechanism
10 | }
11 |
/Users/admin/builder/spi-builder-workspace/Sources/Use Cases/Network/NetworkDataTask.swift:11:12: note: consider making struct 'DataTask' conform to the 'Sendable' protocol
 9 | public extension Network {
10 |     /// A **DataTask** is an assyncronous usecase that able to download data from internet or throwing an error.
11 |     struct DataTask: AsyncThrowingUseCase {
   |            `- note: consider making struct 'DataTask' conform to the 'Sendable' protocol
12 |         public struct Parameter {
13 |             let request: URLRequest
/Users/admin/builder/spi-builder-workspace/Sources/Use Cases/Network/NetworkDataTask.swift:38:17: warning: capture of 'urlSessionTask' with non-sendable type 'CancellableWrapper' in a '@Sendable' closure; this is an error in the Swift 6 language mode
18 |
19 |         public var execute: AsyncThrowingExecutable<Parameter, Result> = { parameter in
20 |             class CancellableWrapper {
   |                   `- note: class 'CancellableWrapper' does not conform to the 'Sendable' protocol
21 |                 var dataTask: URLSessionDataTask?
22 |             }
   :
36 |                 }
37 |             } onCancel: {
38 |                 urlSessionTask.dataTask?.cancel()
   |                 `- warning: capture of 'urlSessionTask' with non-sendable type 'CancellableWrapper' in a '@Sendable' closure; this is an error in the Swift 6 language mode
39 |             }
40 |         }
/Users/admin/builder/spi-builder-workspace/Sources/Use Cases/Network/NetworkDataTask.swift:11:12: warning: type 'Network.DataTask.Parameter' does not conform to the 'Sendable' protocol; this is an error in the Swift 6 language mode
 9 | public extension Network {
10 |     /// A **DataTask** is an assyncronous usecase that able to download data from internet or throwing an error.
11 |     struct DataTask: AsyncThrowingUseCase {
   |            `- warning: type 'Network.DataTask.Parameter' does not conform to the 'Sendable' protocol; this is an error in the Swift 6 language mode
12 |         public struct Parameter {
   |                       `- note: consider making struct 'Parameter' conform to the 'Sendable' protocol
13 |             let request: URLRequest
14 |             let session: URLSession
[271/280] Compiling SwiftMVI Observer.swift
/Users/admin/builder/spi-builder-workspace/Sources/Core/Processing+UseCase.swift:15:17: error: cannot find type 'SyncUseCase' in scope
 13 |     ///   - usecase: An executable UseCase
 14 |     /// - Returns: Result of the executed usecase
 15 |     func run<U: SyncUseCase>(_ usecase: U) -> U.Result where U.Parameter == Void {
    |                 `- error: cannot find type 'SyncUseCase' in scope
 16 |         return run(usecase, ())
 17 |     }
/Users/admin/builder/spi-builder-workspace/Sources/Core/Processing+UseCase.swift:15:49: error: 'Result' is not a member type of type 'U'
 13 |     ///   - usecase: An executable UseCase
 14 |     /// - Returns: Result of the executed usecase
 15 |     func run<U: SyncUseCase>(_ usecase: U) -> U.Result where U.Parameter == Void {
    |                                                 `- error: 'Result' is not a member type of type 'U'
 16 |         return run(usecase, ())
 17 |     }
/Users/admin/builder/spi-builder-workspace/Sources/Core/Processing+UseCase.swift:15:64: error: 'Parameter' is not a member type of type 'U'
 13 |     ///   - usecase: An executable UseCase
 14 |     /// - Returns: Result of the executed usecase
 15 |     func run<U: SyncUseCase>(_ usecase: U) -> U.Result where U.Parameter == Void {
    |                                                                `- error: 'Parameter' is not a member type of type 'U'
 16 |         return run(usecase, ())
 17 |     }
/Users/admin/builder/spi-builder-workspace/Sources/Core/Processing+UseCase.swift:24:17: error: cannot find type 'SyncUseCase' in scope
 22 |     ///   - usecase: An executable UseCase
 23 |     /// - Returns: Result of the executed usecase
 24 |     func run<U: SyncUseCase>(_ usecase: U, _ parameters: U.Parameter) -> U.Result {
    |                 `- error: cannot find type 'SyncUseCase' in scope
 25 |         usecase(parameters)
 26 |     }
/Users/admin/builder/spi-builder-workspace/Sources/Core/Processing+UseCase.swift:24:76: error: 'Result' is not a member type of type 'U'
 22 |     ///   - usecase: An executable UseCase
 23 |     /// - Returns: Result of the executed usecase
 24 |     func run<U: SyncUseCase>(_ usecase: U, _ parameters: U.Parameter) -> U.Result {
    |                                                                            `- error: 'Result' is not a member type of type 'U'
 25 |         usecase(parameters)
 26 |     }
/Users/admin/builder/spi-builder-workspace/Sources/Core/Processing+UseCase.swift:24:60: error: 'Parameter' is not a member type of type 'U'
 22 |     ///   - usecase: An executable UseCase
 23 |     /// - Returns: Result of the executed usecase
 24 |     func run<U: SyncUseCase>(_ usecase: U, _ parameters: U.Parameter) -> U.Result {
    |                                                            `- error: 'Parameter' is not a member type of type 'U'
 25 |         usecase(parameters)
 26 |     }
/Users/admin/builder/spi-builder-workspace/Sources/Core/Processing+UseCase.swift:35:17: error: cannot find type 'SyncThrowingUseCase' in scope
 33 |     ///   - usecase: An executable UseCase
 34 |     /// - Returns: Result of the executed usecase
 35 |     func run<U: SyncThrowingUseCase>(_ usecase: U) throws -> U.Result where U.Parameter == Void {
    |                 `- error: cannot find type 'SyncThrowingUseCase' in scope
 36 |         return try run(usecase, ())
 37 |     }
/Users/admin/builder/spi-builder-workspace/Sources/Core/Processing+UseCase.swift:35:64: error: 'Result' is not a member type of type 'U'
 33 |     ///   - usecase: An executable UseCase
 34 |     /// - Returns: Result of the executed usecase
 35 |     func run<U: SyncThrowingUseCase>(_ usecase: U) throws -> U.Result where U.Parameter == Void {
    |                                                                `- error: 'Result' is not a member type of type 'U'
 36 |         return try run(usecase, ())
 37 |     }
/Users/admin/builder/spi-builder-workspace/Sources/Core/Processing+UseCase.swift:35:79: error: 'Parameter' is not a member type of type 'U'
 33 |     ///   - usecase: An executable UseCase
 34 |     /// - Returns: Result of the executed usecase
 35 |     func run<U: SyncThrowingUseCase>(_ usecase: U) throws -> U.Result where U.Parameter == Void {
    |                                                                               `- error: 'Parameter' is not a member type of type 'U'
 36 |         return try run(usecase, ())
 37 |     }
/Users/admin/builder/spi-builder-workspace/Sources/Core/Processing+UseCase.swift:44:17: error: cannot find type 'SyncThrowingUseCase' in scope
 42 |     ///   - usecase: An executable UseCase
 43 |     /// - Returns: Result of the executed usecase
 44 |     func run<U: SyncThrowingUseCase>(_ usecase: U, _ parameters: U.Parameter) throws -> U.Result {
    |                 `- error: cannot find type 'SyncThrowingUseCase' in scope
 45 |         try usecase(parameters)
 46 |     }
/Users/admin/builder/spi-builder-workspace/Sources/Core/Processing+UseCase.swift:44:91: error: 'Result' is not a member type of type 'U'
 42 |     ///   - usecase: An executable UseCase
 43 |     /// - Returns: Result of the executed usecase
 44 |     func run<U: SyncThrowingUseCase>(_ usecase: U, _ parameters: U.Parameter) throws -> U.Result {
    |                                                                                           `- error: 'Result' is not a member type of type 'U'
 45 |         try usecase(parameters)
 46 |     }
/Users/admin/builder/spi-builder-workspace/Sources/Core/Processing+UseCase.swift:44:68: error: 'Parameter' is not a member type of type 'U'
 42 |     ///   - usecase: An executable UseCase
 43 |     /// - Returns: Result of the executed usecase
 44 |     func run<U: SyncThrowingUseCase>(_ usecase: U, _ parameters: U.Parameter) throws -> U.Result {
    |                                                                    `- error: 'Parameter' is not a member type of type 'U'
 45 |         try usecase(parameters)
 46 |     }
/Users/admin/builder/spi-builder-workspace/Sources/Core/Property.swift:57:13: warning: capture of 'self' with non-sendable type 'Property<Value>' in a '@Sendable' closure
 9 |
10 | /// Feature representation as a property. A property has a setter and getter function with the same type of a value.
11 | public struct Property<Value> {
   |               `- note: consider making generic struct 'Property' conform to the 'Sendable' protocol
12 |     public init(set: @escaping (Value) -> Void, get: @escaping () -> Value) {
13 |         self.set = set
   :
55 |     var binding: Binding<Value> {
56 |         Binding { [self] in
57 |             get()
   |             `- warning: capture of 'self' with non-sendable type 'Property<Value>' in a '@Sendable' closure
58 |         } set: { [self] in
59 |             set($0)
/Users/admin/builder/spi-builder-workspace/Sources/Core/Property.swift:59:13: warning: capture of 'self' with non-sendable type 'Property<Value>' in a '@Sendable' closure
 9 |
10 | /// Feature representation as a property. A property has a setter and getter function with the same type of a value.
11 | public struct Property<Value> {
   |               `- note: consider making generic struct 'Property' conform to the 'Sendable' protocol
12 |     public init(set: @escaping (Value) -> Void, get: @escaping () -> Value) {
13 |         self.set = set
   :
57 |             get()
58 |         } set: { [self] in
59 |             set($0)
   |             `- warning: capture of 'self' with non-sendable type 'Property<Value>' in a '@Sendable' closure
60 |         }
61 |     }
[272/280] Compiling SwiftMVI Processing+UseCase.swift
/Users/admin/builder/spi-builder-workspace/Sources/Core/Processing+UseCase.swift:15:17: error: cannot find type 'SyncUseCase' in scope
 13 |     ///   - usecase: An executable UseCase
 14 |     /// - Returns: Result of the executed usecase
 15 |     func run<U: SyncUseCase>(_ usecase: U) -> U.Result where U.Parameter == Void {
    |                 `- error: cannot find type 'SyncUseCase' in scope
 16 |         return run(usecase, ())
 17 |     }
/Users/admin/builder/spi-builder-workspace/Sources/Core/Processing+UseCase.swift:15:49: error: 'Result' is not a member type of type 'U'
 13 |     ///   - usecase: An executable UseCase
 14 |     /// - Returns: Result of the executed usecase
 15 |     func run<U: SyncUseCase>(_ usecase: U) -> U.Result where U.Parameter == Void {
    |                                                 `- error: 'Result' is not a member type of type 'U'
 16 |         return run(usecase, ())
 17 |     }
/Users/admin/builder/spi-builder-workspace/Sources/Core/Processing+UseCase.swift:15:64: error: 'Parameter' is not a member type of type 'U'
 13 |     ///   - usecase: An executable UseCase
 14 |     /// - Returns: Result of the executed usecase
 15 |     func run<U: SyncUseCase>(_ usecase: U) -> U.Result where U.Parameter == Void {
    |                                                                `- error: 'Parameter' is not a member type of type 'U'
 16 |         return run(usecase, ())
 17 |     }
/Users/admin/builder/spi-builder-workspace/Sources/Core/Processing+UseCase.swift:24:17: error: cannot find type 'SyncUseCase' in scope
 22 |     ///   - usecase: An executable UseCase
 23 |     /// - Returns: Result of the executed usecase
 24 |     func run<U: SyncUseCase>(_ usecase: U, _ parameters: U.Parameter) -> U.Result {
    |                 `- error: cannot find type 'SyncUseCase' in scope
 25 |         usecase(parameters)
 26 |     }
/Users/admin/builder/spi-builder-workspace/Sources/Core/Processing+UseCase.swift:24:76: error: 'Result' is not a member type of type 'U'
 22 |     ///   - usecase: An executable UseCase
 23 |     /// - Returns: Result of the executed usecase
 24 |     func run<U: SyncUseCase>(_ usecase: U, _ parameters: U.Parameter) -> U.Result {
    |                                                                            `- error: 'Result' is not a member type of type 'U'
 25 |         usecase(parameters)
 26 |     }
/Users/admin/builder/spi-builder-workspace/Sources/Core/Processing+UseCase.swift:24:60: error: 'Parameter' is not a member type of type 'U'
 22 |     ///   - usecase: An executable UseCase
 23 |     /// - Returns: Result of the executed usecase
 24 |     func run<U: SyncUseCase>(_ usecase: U, _ parameters: U.Parameter) -> U.Result {
    |                                                            `- error: 'Parameter' is not a member type of type 'U'
 25 |         usecase(parameters)
 26 |     }
/Users/admin/builder/spi-builder-workspace/Sources/Core/Processing+UseCase.swift:35:17: error: cannot find type 'SyncThrowingUseCase' in scope
 33 |     ///   - usecase: An executable UseCase
 34 |     /// - Returns: Result of the executed usecase
 35 |     func run<U: SyncThrowingUseCase>(_ usecase: U) throws -> U.Result where U.Parameter == Void {
    |                 `- error: cannot find type 'SyncThrowingUseCase' in scope
 36 |         return try run(usecase, ())
 37 |     }
/Users/admin/builder/spi-builder-workspace/Sources/Core/Processing+UseCase.swift:35:64: error: 'Result' is not a member type of type 'U'
 33 |     ///   - usecase: An executable UseCase
 34 |     /// - Returns: Result of the executed usecase
 35 |     func run<U: SyncThrowingUseCase>(_ usecase: U) throws -> U.Result where U.Parameter == Void {
    |                                                                `- error: 'Result' is not a member type of type 'U'
 36 |         return try run(usecase, ())
 37 |     }
/Users/admin/builder/spi-builder-workspace/Sources/Core/Processing+UseCase.swift:35:79: error: 'Parameter' is not a member type of type 'U'
 33 |     ///   - usecase: An executable UseCase
 34 |     /// - Returns: Result of the executed usecase
 35 |     func run<U: SyncThrowingUseCase>(_ usecase: U) throws -> U.Result where U.Parameter == Void {
    |                                                                               `- error: 'Parameter' is not a member type of type 'U'
 36 |         return try run(usecase, ())
 37 |     }
/Users/admin/builder/spi-builder-workspace/Sources/Core/Processing+UseCase.swift:44:17: error: cannot find type 'SyncThrowingUseCase' in scope
 42 |     ///   - usecase: An executable UseCase
 43 |     /// - Returns: Result of the executed usecase
 44 |     func run<U: SyncThrowingUseCase>(_ usecase: U, _ parameters: U.Parameter) throws -> U.Result {
    |                 `- error: cannot find type 'SyncThrowingUseCase' in scope
 45 |         try usecase(parameters)
 46 |     }
/Users/admin/builder/spi-builder-workspace/Sources/Core/Processing+UseCase.swift:44:91: error: 'Result' is not a member type of type 'U'
 42 |     ///   - usecase: An executable UseCase
 43 |     /// - Returns: Result of the executed usecase
 44 |     func run<U: SyncThrowingUseCase>(_ usecase: U, _ parameters: U.Parameter) throws -> U.Result {
    |                                                                                           `- error: 'Result' is not a member type of type 'U'
 45 |         try usecase(parameters)
 46 |     }
/Users/admin/builder/spi-builder-workspace/Sources/Core/Processing+UseCase.swift:44:68: error: 'Parameter' is not a member type of type 'U'
 42 |     ///   - usecase: An executable UseCase
 43 |     /// - Returns: Result of the executed usecase
 44 |     func run<U: SyncThrowingUseCase>(_ usecase: U, _ parameters: U.Parameter) throws -> U.Result {
    |                                                                    `- error: 'Parameter' is not a member type of type 'U'
 45 |         try usecase(parameters)
 46 |     }
/Users/admin/builder/spi-builder-workspace/Sources/Core/Property.swift:57:13: warning: capture of 'self' with non-sendable type 'Property<Value>' in a '@Sendable' closure
 9 |
10 | /// Feature representation as a property. A property has a setter and getter function with the same type of a value.
11 | public struct Property<Value> {
   |               `- note: consider making generic struct 'Property' conform to the 'Sendable' protocol
12 |     public init(set: @escaping (Value) -> Void, get: @escaping () -> Value) {
13 |         self.set = set
   :
55 |     var binding: Binding<Value> {
56 |         Binding { [self] in
57 |             get()
   |             `- warning: capture of 'self' with non-sendable type 'Property<Value>' in a '@Sendable' closure
58 |         } set: { [self] in
59 |             set($0)
/Users/admin/builder/spi-builder-workspace/Sources/Core/Property.swift:59:13: warning: capture of 'self' with non-sendable type 'Property<Value>' in a '@Sendable' closure
 9 |
10 | /// Feature representation as a property. A property has a setter and getter function with the same type of a value.
11 | public struct Property<Value> {
   |               `- note: consider making generic struct 'Property' conform to the 'Sendable' protocol
12 |     public init(set: @escaping (Value) -> Void, get: @escaping () -> Value) {
13 |         self.set = set
   :
57 |             get()
58 |         } set: { [self] in
59 |             set($0)
   |             `- warning: capture of 'self' with non-sendable type 'Property<Value>' in a '@Sendable' closure
60 |         }
61 |     }
[273/280] Compiling SwiftMVI Processing.swift
/Users/admin/builder/spi-builder-workspace/Sources/Core/Processing+UseCase.swift:15:17: error: cannot find type 'SyncUseCase' in scope
 13 |     ///   - usecase: An executable UseCase
 14 |     /// - Returns: Result of the executed usecase
 15 |     func run<U: SyncUseCase>(_ usecase: U) -> U.Result where U.Parameter == Void {
    |                 `- error: cannot find type 'SyncUseCase' in scope
 16 |         return run(usecase, ())
 17 |     }
/Users/admin/builder/spi-builder-workspace/Sources/Core/Processing+UseCase.swift:15:49: error: 'Result' is not a member type of type 'U'
 13 |     ///   - usecase: An executable UseCase
 14 |     /// - Returns: Result of the executed usecase
 15 |     func run<U: SyncUseCase>(_ usecase: U) -> U.Result where U.Parameter == Void {
    |                                                 `- error: 'Result' is not a member type of type 'U'
 16 |         return run(usecase, ())
 17 |     }
/Users/admin/builder/spi-builder-workspace/Sources/Core/Processing+UseCase.swift:15:64: error: 'Parameter' is not a member type of type 'U'
 13 |     ///   - usecase: An executable UseCase
 14 |     /// - Returns: Result of the executed usecase
 15 |     func run<U: SyncUseCase>(_ usecase: U) -> U.Result where U.Parameter == Void {
    |                                                                `- error: 'Parameter' is not a member type of type 'U'
 16 |         return run(usecase, ())
 17 |     }
/Users/admin/builder/spi-builder-workspace/Sources/Core/Processing+UseCase.swift:24:17: error: cannot find type 'SyncUseCase' in scope
 22 |     ///   - usecase: An executable UseCase
 23 |     /// - Returns: Result of the executed usecase
 24 |     func run<U: SyncUseCase>(_ usecase: U, _ parameters: U.Parameter) -> U.Result {
    |                 `- error: cannot find type 'SyncUseCase' in scope
 25 |         usecase(parameters)
 26 |     }
/Users/admin/builder/spi-builder-workspace/Sources/Core/Processing+UseCase.swift:24:76: error: 'Result' is not a member type of type 'U'
 22 |     ///   - usecase: An executable UseCase
 23 |     /// - Returns: Result of the executed usecase
 24 |     func run<U: SyncUseCase>(_ usecase: U, _ parameters: U.Parameter) -> U.Result {
    |                                                                            `- error: 'Result' is not a member type of type 'U'
 25 |         usecase(parameters)
 26 |     }
/Users/admin/builder/spi-builder-workspace/Sources/Core/Processing+UseCase.swift:24:60: error: 'Parameter' is not a member type of type 'U'
 22 |     ///   - usecase: An executable UseCase
 23 |     /// - Returns: Result of the executed usecase
 24 |     func run<U: SyncUseCase>(_ usecase: U, _ parameters: U.Parameter) -> U.Result {
    |                                                            `- error: 'Parameter' is not a member type of type 'U'
 25 |         usecase(parameters)
 26 |     }
/Users/admin/builder/spi-builder-workspace/Sources/Core/Processing+UseCase.swift:35:17: error: cannot find type 'SyncThrowingUseCase' in scope
 33 |     ///   - usecase: An executable UseCase
 34 |     /// - Returns: Result of the executed usecase
 35 |     func run<U: SyncThrowingUseCase>(_ usecase: U) throws -> U.Result where U.Parameter == Void {
    |                 `- error: cannot find type 'SyncThrowingUseCase' in scope
 36 |         return try run(usecase, ())
 37 |     }
/Users/admin/builder/spi-builder-workspace/Sources/Core/Processing+UseCase.swift:35:64: error: 'Result' is not a member type of type 'U'
 33 |     ///   - usecase: An executable UseCase
 34 |     /// - Returns: Result of the executed usecase
 35 |     func run<U: SyncThrowingUseCase>(_ usecase: U) throws -> U.Result where U.Parameter == Void {
    |                                                                `- error: 'Result' is not a member type of type 'U'
 36 |         return try run(usecase, ())
 37 |     }
/Users/admin/builder/spi-builder-workspace/Sources/Core/Processing+UseCase.swift:35:79: error: 'Parameter' is not a member type of type 'U'
 33 |     ///   - usecase: An executable UseCase
 34 |     /// - Returns: Result of the executed usecase
 35 |     func run<U: SyncThrowingUseCase>(_ usecase: U) throws -> U.Result where U.Parameter == Void {
    |                                                                               `- error: 'Parameter' is not a member type of type 'U'
 36 |         return try run(usecase, ())
 37 |     }
/Users/admin/builder/spi-builder-workspace/Sources/Core/Processing+UseCase.swift:44:17: error: cannot find type 'SyncThrowingUseCase' in scope
 42 |     ///   - usecase: An executable UseCase
 43 |     /// - Returns: Result of the executed usecase
 44 |     func run<U: SyncThrowingUseCase>(_ usecase: U, _ parameters: U.Parameter) throws -> U.Result {
    |                 `- error: cannot find type 'SyncThrowingUseCase' in scope
 45 |         try usecase(parameters)
 46 |     }
/Users/admin/builder/spi-builder-workspace/Sources/Core/Processing+UseCase.swift:44:91: error: 'Result' is not a member type of type 'U'
 42 |     ///   - usecase: An executable UseCase
 43 |     /// - Returns: Result of the executed usecase
 44 |     func run<U: SyncThrowingUseCase>(_ usecase: U, _ parameters: U.Parameter) throws -> U.Result {
    |                                                                                           `- error: 'Result' is not a member type of type 'U'
 45 |         try usecase(parameters)
 46 |     }
/Users/admin/builder/spi-builder-workspace/Sources/Core/Processing+UseCase.swift:44:68: error: 'Parameter' is not a member type of type 'U'
 42 |     ///   - usecase: An executable UseCase
 43 |     /// - Returns: Result of the executed usecase
 44 |     func run<U: SyncThrowingUseCase>(_ usecase: U, _ parameters: U.Parameter) throws -> U.Result {
    |                                                                    `- error: 'Parameter' is not a member type of type 'U'
 45 |         try usecase(parameters)
 46 |     }
/Users/admin/builder/spi-builder-workspace/Sources/Core/Property.swift:57:13: warning: capture of 'self' with non-sendable type 'Property<Value>' in a '@Sendable' closure
 9 |
10 | /// Feature representation as a property. A property has a setter and getter function with the same type of a value.
11 | public struct Property<Value> {
   |               `- note: consider making generic struct 'Property' conform to the 'Sendable' protocol
12 |     public init(set: @escaping (Value) -> Void, get: @escaping () -> Value) {
13 |         self.set = set
   :
55 |     var binding: Binding<Value> {
56 |         Binding { [self] in
57 |             get()
   |             `- warning: capture of 'self' with non-sendable type 'Property<Value>' in a '@Sendable' closure
58 |         } set: { [self] in
59 |             set($0)
/Users/admin/builder/spi-builder-workspace/Sources/Core/Property.swift:59:13: warning: capture of 'self' with non-sendable type 'Property<Value>' in a '@Sendable' closure
 9 |
10 | /// Feature representation as a property. A property has a setter and getter function with the same type of a value.
11 | public struct Property<Value> {
   |               `- note: consider making generic struct 'Property' conform to the 'Sendable' protocol
12 |     public init(set: @escaping (Value) -> Void, get: @escaping () -> Value) {
13 |         self.set = set
   :
57 |             get()
58 |         } set: { [self] in
59 |             set($0)
   |             `- warning: capture of 'self' with non-sendable type 'Property<Value>' in a '@Sendable' closure
60 |         }
61 |     }
[274/280] Compiling SwiftMVI Property.swift
/Users/admin/builder/spi-builder-workspace/Sources/Core/Processing+UseCase.swift:15:17: error: cannot find type 'SyncUseCase' in scope
 13 |     ///   - usecase: An executable UseCase
 14 |     /// - Returns: Result of the executed usecase
 15 |     func run<U: SyncUseCase>(_ usecase: U) -> U.Result where U.Parameter == Void {
    |                 `- error: cannot find type 'SyncUseCase' in scope
 16 |         return run(usecase, ())
 17 |     }
/Users/admin/builder/spi-builder-workspace/Sources/Core/Processing+UseCase.swift:15:49: error: 'Result' is not a member type of type 'U'
 13 |     ///   - usecase: An executable UseCase
 14 |     /// - Returns: Result of the executed usecase
 15 |     func run<U: SyncUseCase>(_ usecase: U) -> U.Result where U.Parameter == Void {
    |                                                 `- error: 'Result' is not a member type of type 'U'
 16 |         return run(usecase, ())
 17 |     }
/Users/admin/builder/spi-builder-workspace/Sources/Core/Processing+UseCase.swift:15:64: error: 'Parameter' is not a member type of type 'U'
 13 |     ///   - usecase: An executable UseCase
 14 |     /// - Returns: Result of the executed usecase
 15 |     func run<U: SyncUseCase>(_ usecase: U) -> U.Result where U.Parameter == Void {
    |                                                                `- error: 'Parameter' is not a member type of type 'U'
 16 |         return run(usecase, ())
 17 |     }
/Users/admin/builder/spi-builder-workspace/Sources/Core/Processing+UseCase.swift:24:17: error: cannot find type 'SyncUseCase' in scope
 22 |     ///   - usecase: An executable UseCase
 23 |     /// - Returns: Result of the executed usecase
 24 |     func run<U: SyncUseCase>(_ usecase: U, _ parameters: U.Parameter) -> U.Result {
    |                 `- error: cannot find type 'SyncUseCase' in scope
 25 |         usecase(parameters)
 26 |     }
/Users/admin/builder/spi-builder-workspace/Sources/Core/Processing+UseCase.swift:24:76: error: 'Result' is not a member type of type 'U'
 22 |     ///   - usecase: An executable UseCase
 23 |     /// - Returns: Result of the executed usecase
 24 |     func run<U: SyncUseCase>(_ usecase: U, _ parameters: U.Parameter) -> U.Result {
    |                                                                            `- error: 'Result' is not a member type of type 'U'
 25 |         usecase(parameters)
 26 |     }
/Users/admin/builder/spi-builder-workspace/Sources/Core/Processing+UseCase.swift:24:60: error: 'Parameter' is not a member type of type 'U'
 22 |     ///   - usecase: An executable UseCase
 23 |     /// - Returns: Result of the executed usecase
 24 |     func run<U: SyncUseCase>(_ usecase: U, _ parameters: U.Parameter) -> U.Result {
    |                                                            `- error: 'Parameter' is not a member type of type 'U'
 25 |         usecase(parameters)
 26 |     }
/Users/admin/builder/spi-builder-workspace/Sources/Core/Processing+UseCase.swift:35:17: error: cannot find type 'SyncThrowingUseCase' in scope
 33 |     ///   - usecase: An executable UseCase
 34 |     /// - Returns: Result of the executed usecase
 35 |     func run<U: SyncThrowingUseCase>(_ usecase: U) throws -> U.Result where U.Parameter == Void {
    |                 `- error: cannot find type 'SyncThrowingUseCase' in scope
 36 |         return try run(usecase, ())
 37 |     }
/Users/admin/builder/spi-builder-workspace/Sources/Core/Processing+UseCase.swift:35:64: error: 'Result' is not a member type of type 'U'
 33 |     ///   - usecase: An executable UseCase
 34 |     /// - Returns: Result of the executed usecase
 35 |     func run<U: SyncThrowingUseCase>(_ usecase: U) throws -> U.Result where U.Parameter == Void {
    |                                                                `- error: 'Result' is not a member type of type 'U'
 36 |         return try run(usecase, ())
 37 |     }
/Users/admin/builder/spi-builder-workspace/Sources/Core/Processing+UseCase.swift:35:79: error: 'Parameter' is not a member type of type 'U'
 33 |     ///   - usecase: An executable UseCase
 34 |     /// - Returns: Result of the executed usecase
 35 |     func run<U: SyncThrowingUseCase>(_ usecase: U) throws -> U.Result where U.Parameter == Void {
    |                                                                               `- error: 'Parameter' is not a member type of type 'U'
 36 |         return try run(usecase, ())
 37 |     }
/Users/admin/builder/spi-builder-workspace/Sources/Core/Processing+UseCase.swift:44:17: error: cannot find type 'SyncThrowingUseCase' in scope
 42 |     ///   - usecase: An executable UseCase
 43 |     /// - Returns: Result of the executed usecase
 44 |     func run<U: SyncThrowingUseCase>(_ usecase: U, _ parameters: U.Parameter) throws -> U.Result {
    |                 `- error: cannot find type 'SyncThrowingUseCase' in scope
 45 |         try usecase(parameters)
 46 |     }
/Users/admin/builder/spi-builder-workspace/Sources/Core/Processing+UseCase.swift:44:91: error: 'Result' is not a member type of type 'U'
 42 |     ///   - usecase: An executable UseCase
 43 |     /// - Returns: Result of the executed usecase
 44 |     func run<U: SyncThrowingUseCase>(_ usecase: U, _ parameters: U.Parameter) throws -> U.Result {
    |                                                                                           `- error: 'Result' is not a member type of type 'U'
 45 |         try usecase(parameters)
 46 |     }
/Users/admin/builder/spi-builder-workspace/Sources/Core/Processing+UseCase.swift:44:68: error: 'Parameter' is not a member type of type 'U'
 42 |     ///   - usecase: An executable UseCase
 43 |     /// - Returns: Result of the executed usecase
 44 |     func run<U: SyncThrowingUseCase>(_ usecase: U, _ parameters: U.Parameter) throws -> U.Result {
    |                                                                    `- error: 'Parameter' is not a member type of type 'U'
 45 |         try usecase(parameters)
 46 |     }
/Users/admin/builder/spi-builder-workspace/Sources/Core/Property.swift:57:13: warning: capture of 'self' with non-sendable type 'Property<Value>' in a '@Sendable' closure
 9 |
10 | /// Feature representation as a property. A property has a setter and getter function with the same type of a value.
11 | public struct Property<Value> {
   |               `- note: consider making generic struct 'Property' conform to the 'Sendable' protocol
12 |     public init(set: @escaping (Value) -> Void, get: @escaping () -> Value) {
13 |         self.set = set
   :
55 |     var binding: Binding<Value> {
56 |         Binding { [self] in
57 |             get()
   |             `- warning: capture of 'self' with non-sendable type 'Property<Value>' in a '@Sendable' closure
58 |         } set: { [self] in
59 |             set($0)
/Users/admin/builder/spi-builder-workspace/Sources/Core/Property.swift:59:13: warning: capture of 'self' with non-sendable type 'Property<Value>' in a '@Sendable' closure
 9 |
10 | /// Feature representation as a property. A property has a setter and getter function with the same type of a value.
11 | public struct Property<Value> {
   |               `- note: consider making generic struct 'Property' conform to the 'Sendable' protocol
12 |     public init(set: @escaping (Value) -> Void, get: @escaping () -> Value) {
13 |         self.set = set
   :
57 |             get()
58 |         } set: { [self] in
59 |             set($0)
   |             `- warning: capture of 'self' with non-sendable type 'Property<Value>' in a '@Sendable' closure
60 |         }
61 |     }
[275/280] Compiling SwiftMVI ValueFeature+ViewLifecycle.swift
/Users/admin/builder/spi-builder-workspace/Sources/Modules/ValueFeature.swift:28:17: warning: capture of 'newState' with non-sendable type 'ValueFeature<Value>.State' (aka 'Value') in a '@Sendable' closure; this is an error in the Swift 6 language mode
 6 | import SwiftUI
 7 |
 8 | public class ValueFeature<Value>: ReducibleState {
   |                           `- note: consider making generic parameter 'ValueFeature<Value>.State' (aka 'Value') conform to the 'Sendable' protocol
 9 |     public typealias State = Value
10 |     public var state: State
   :
26 |         case let .update(newState):
27 |             state {
28 |                 newState
   |                 `- warning: capture of 'newState' with non-sendable type 'ValueFeature<Value>.State' (aka 'Value') in a '@Sendable' closure; this is an error in the Swift 6 language mode
29 |             }
30 |         }
[276/280] Compiling SwiftMVI ValueFeature.swift
/Users/admin/builder/spi-builder-workspace/Sources/Modules/ValueFeature.swift:28:17: warning: capture of 'newState' with non-sendable type 'ValueFeature<Value>.State' (aka 'Value') in a '@Sendable' closure; this is an error in the Swift 6 language mode
 6 | import SwiftUI
 7 |
 8 | public class ValueFeature<Value>: ReducibleState {
   |                           `- note: consider making generic parameter 'ValueFeature<Value>.State' (aka 'Value') conform to the 'Sendable' protocol
 9 |     public typealias State = Value
10 |     public var state: State
   :
26 |         case let .update(newState):
27 |             state {
28 |                 newState
   |                 `- warning: capture of 'newState' with non-sendable type 'ValueFeature<Value>.State' (aka 'Value') in a '@Sendable' closure; this is an error in the Swift 6 language mode
29 |             }
30 |         }
[277/280] Compiling SwiftMVI ActionReducer.swift
/Users/admin/builder/spi-builder-workspace/Sources/Modules/ValueFeature.swift:28:17: warning: capture of 'newState' with non-sendable type 'ValueFeature<Value>.State' (aka 'Value') in a '@Sendable' closure; this is an error in the Swift 6 language mode
 6 | import SwiftUI
 7 |
 8 | public class ValueFeature<Value>: ReducibleState {
   |                           `- note: consider making generic parameter 'ValueFeature<Value>.State' (aka 'Value') conform to the 'Sendable' protocol
 9 |     public typealias State = Value
10 |     public var state: State
   :
26 |         case let .update(newState):
27 |             state {
28 |                 newState
   |                 `- warning: capture of 'newState' with non-sendable type 'ValueFeature<Value>.State' (aka 'Value') in a '@Sendable' closure; this is an error in the Swift 6 language mode
29 |             }
30 |         }
[278/280] Compiling SwiftMVI Alert+EventReducer.swift
[279/280] Compiling SwiftMVI Alert+StateReducer.swift
[280/280] Compiling SwiftMVI EventReducerView.swift
Running build ...
env DEVELOPER_DIR=/Applications/Xcode-16.3.0.app xcrun swift build --arch arm64
[0/1] Planning build
Building for debugging...
[0/3] Write swift-version-2F0A5646E1D333AE.txt
[2/14] Emitting module SwiftSyntax509
[3/14] Compiling SwiftSyntax509 Empty.swift
[4/14] Compiling XCTestDynamicOverlay XCTIsTesting.swift
[5/14] Compiling XCTestDynamicOverlay Unimplemented.swift
[6/14] Compiling XCTestDynamicOverlay RuntimeWarnings.swift
[7/14] Compiling XCTestDynamicOverlay XCTCurrentTestCase.swift
[8/14] Compiling XCTestDynamicOverlay GeneratePlaceholder.swift
[9/14] Emitting module XCTestDynamicOverlay
[10/14] Compiling XCTestDynamicOverlay DefaultInitializable.swift
[11/14] Compiling XCTestDynamicOverlay Deprecations.swift
[12/14] Compiling XCTestDynamicOverlay XCTFail.swift
[13/68] Compiling CasePaths Operators.swift
[14/68] Compiling CasePaths XCTUnwrap.swift
[15/68] Compiling SwiftSyntax AbsolutePosition.swift
[16/68] Compiling SwiftSyntax Assert.swift
[17/68] Compiling SwiftSyntax BumpPtrAllocator.swift
[18/68] Compiling SwiftSyntax CommonAncestor.swift
[19/68] Compiling SwiftSyntax Convenience.swift
[20/73] Compiling CasePaths TypeName.swift
[21/73] Compiling CasePaths CasePaths.swift
[22/73] Compiling CasePaths OpenExistential.swift
[23/73] Emitting module CasePaths
[24/73] Compiling CasePaths CasePath.swift
[25/73] Compiling CasePaths EnumReflection.swift
[26/73] Compiling SwiftSyntax SyntaxText.swift
[27/73] Compiling SwiftSyntax SyntaxTreeViewMode.swift
[28/73] Compiling SwiftSyntax TokenDiagnostic.swift
[29/73] Compiling SwiftSyntax TokenSyntax.swift
[30/73] Compiling SwiftSyntax Trivia.swift
[31/73] Compiling SwiftSyntax Syntax.swift
[32/73] Compiling SwiftSyntax SyntaxArena.swift
[33/73] Compiling SwiftSyntax SyntaxChildren.swift
[34/73] Compiling SwiftSyntax SyntaxCollection.swift
[35/73] Compiling SwiftSyntax SyntaxData.swift
[36/73] Compiling SwiftSyntax SyntaxAnyVisitor.swift
[37/73] Compiling SwiftSyntax SyntaxBaseNodes.swift
[38/73] Compiling SwiftSyntax SyntaxCollections.swift
[39/73] Compiling SwiftSyntax SyntaxEnum.swift
[40/73] Compiling SwiftSyntax SyntaxKind.swift
[41/73] Emitting module SwiftSyntax
[42/73] Compiling SwiftSyntax RawSyntaxTokenView.swift
[43/73] Compiling SwiftSyntax SourceLength.swift
[44/73] Compiling SwiftSyntax SourceLocation.swift
[45/73] Compiling SwiftSyntax SourcePresence.swift
[46/73] Compiling SwiftSyntax SwiftSyntaxCompatibility.swift
[47/73] Compiling SwiftSyntax MemoryLayout.swift
[48/73] Compiling SwiftSyntax MissingNodeInitializers.swift
[49/73] Compiling SwiftSyntax RawSyntax.swift
[50/73] Compiling SwiftSyntax RawSyntaxLayoutView.swift
[51/73] Compiling SwiftSyntax RawSyntaxNodeProtocol.swift
[52/73] Compiling SwiftSyntax Utils.swift
[53/73] Compiling SwiftSyntax ChildNameForKeyPath.swift
[54/73] Compiling SwiftSyntax Keyword.swift
[55/73] Compiling SwiftSyntax RenamedChildrenCompatibility.swift
[56/73] Compiling SwiftSyntax RenamedNodesCompatibility.swift
[57/73] Compiling SwiftSyntax SyntaxExprNodes.swift
[58/73] Compiling SwiftSyntax SyntaxNodes.swift
[59/73] Compiling SwiftSyntax SyntaxPatternNodes.swift
[60/73] Compiling SwiftSyntax SyntaxStmtNodes.swift
[61/73] Compiling SwiftSyntax SyntaxTypeNodes.swift
[62/73] Compiling SwiftSyntax Tokens.swift
[63/73] Compiling SwiftSyntax TriviaPieces.swift
[64/73] Compiling SwiftSyntax RawSyntaxNodes.swift
[65/73] Compiling SwiftSyntax RawSyntaxValidation.swift
[66/73] Compiling SwiftSyntax SyntaxDeclNodes.swift
[67/73] Compiling SwiftSyntax SyntaxRewriter.swift
[68/73] Compiling SwiftSyntax SyntaxTraits.swift
[69/73] Compiling SwiftSyntax SyntaxTransform.swift
[70/73] Compiling SwiftSyntax SyntaxVisitor.swift
[71/73] Compiling SwiftSyntax TokenKind.swift
[72/125] Compiling SwiftDiagnostics FixIt.swift
[73/125] Compiling SwiftDiagnostics Note.swift
[74/125] Compiling SwiftDiagnostics Message.swift
[75/125] Compiling SwiftBasicFormat SyntaxProtocol+Formatted.swift
[76/125] Compiling SwiftBasicFormat Trivia+FormatExtensions.swift
[77/125] Compiling SwiftBasicFormat Syntax+Extensions.swift
[78/125] Compiling SwiftDiagnostics Convenience.swift
[79/125] Compiling SwiftDiagnostics GroupedDiagnostics.swift
[80/125] Emitting module SwiftDiagnostics
[81/125] Compiling SwiftDiagnostics DiagnosticsFormatter.swift
[82/125] Compiling SwiftDiagnostics Diagnostic.swift
[83/125] Emitting module SwiftBasicFormat
[84/125] Compiling SwiftBasicFormat BasicFormat.swift
[85/125] Compiling SwiftParser SyntaxUtils.swift
[86/125] Compiling SwiftParser TokenConsumer.swift
[87/125] Compiling SwiftParser TokenPrecedence.swift
[88/125] Compiling SwiftParser TokenSpec.swift
[89/129] Compiling SwiftParser Statements.swift
[90/129] Compiling SwiftParser StringLiteralRepresentedLiteralValue.swift
[91/129] Compiling SwiftParser StringLiterals.swift
[92/129] Compiling SwiftParser SwiftParserCompatibility.swift
[93/129] Compiling SwiftParser UnicodeScalarExtensions.swift
[94/129] Compiling SwiftParser Lookahead.swift
[95/129] Compiling SwiftParser LoopProgressCondition.swift
[96/129] Compiling SwiftParser Modifiers.swift
[97/129] Emitting module SwiftParser
[98/129] Compiling SwiftParser Parser.swift
[99/129] Compiling SwiftParser Patterns.swift
[100/129] Compiling SwiftParser Recovery.swift
[101/129] Compiling SwiftParser Specifiers.swift
[102/129] Compiling SwiftParser Names.swift
[103/129] Compiling SwiftParser Nominals.swift
[104/129] Compiling SwiftParser Parameters.swift
[105/129] Compiling SwiftParser ParseSourceFile.swift
[106/129] Compiling SwiftParser IsLexerClassified.swift
[107/129] Compiling SwiftParser LayoutNodes+Parsable.swift
[108/129] Compiling SwiftParser Parser+TokenSpecSet.swift
[109/129] Compiling SwiftParser TokenSpecStaticMembers.swift
[110/129] Compiling SwiftParser Lexeme.swift
[111/129] Compiling SwiftParser LexemeSequence.swift
[112/129] Compiling SwiftParser Lexer.swift
[113/129] Compiling SwiftParser RegexLiteralLexer.swift
[114/129] Compiling SwiftParser TokenSpecSet.swift
[115/129] Compiling SwiftParser TopLevel.swift
[116/129] Compiling SwiftParser TriviaParser.swift
[117/129] Compiling SwiftParser Types.swift
[118/129] Compiling SwiftParser Directives.swift
[119/129] Compiling SwiftParser ExperimentalFeatures.swift
[120/129] Compiling SwiftParser Expressions.swift
[121/129] Compiling SwiftParser IncrementalParseTransition.swift
[122/129] Compiling SwiftParser Cursor.swift
[123/129] Compiling SwiftParser Attributes.swift
[124/129] Compiling SwiftParser Availability.swift
[125/129] Compiling SwiftParser CharacterInfo.swift
[126/129] Compiling SwiftParser CollectionNodes+Parsable.swift
[127/129] Compiling SwiftParser Declarations.swift
[128/152] Compiling SwiftParserDiagnostics SyntaxKindNameForDiagnostics.swift
[129/153] Compiling SwiftParserDiagnostics TokenNameForDiagnostics.swift
[130/153] Compiling SwiftOperators PrecedenceGroup.swift
[131/153] Compiling SwiftOperators PrecedenceGraph.swift
[132/153] Compiling SwiftOperators OperatorTable+Folding.swift
[133/153] Compiling SwiftOperators OperatorTable.swift
[134/153] Compiling SwiftOperators OperatorTable+Defaults.swift
[135/153] Compiling SwiftOperators OperatorError.swift
[136/153] Compiling SwiftOperators OperatorError+Diagnostics.swift
[137/153] Compiling SwiftOperators Operator.swift
[138/153] Emitting module SwiftOperators
[139/153] Compiling SwiftOperators OperatorTable+Semantics.swift
[140/154] Compiling SwiftParserDiagnostics ChildNameForDiagnostics.swift
[141/154] Compiling SwiftParserDiagnostics SyntaxExtensions.swift
[142/154] Compiling SwiftParserDiagnostics Utils.swift
[143/154] Compiling SwiftParserDiagnostics PresenceUtils.swift
[144/154] Compiling SwiftOperators SyntaxSynthesis.swift
[145/154] Compiling SwiftParserDiagnostics ParserDiagnosticMessages.swift
[146/154] Emitting module SwiftParserDiagnostics
[147/154] Compiling SwiftParserDiagnostics MissingNodesError.swift
[148/154] Compiling SwiftParserDiagnostics MissingTokenError.swift
[149/154] Compiling SwiftParserDiagnostics DiagnosticExtensions.swift
[150/154] Compiling SwiftParserDiagnostics LexerDiagnosticMessages.swift
[151/154] Compiling SwiftParserDiagnostics MultiLineStringLiteralDiagnosticsGenerator.swift
[152/154] Compiling SwiftParserDiagnostics ParseDiagnosticsGenerator.swift
[153/168] Compiling SwiftSyntaxBuilder RenamedChildrenBuilderCompatibility.swift
[154/169] Compiling SwiftSyntaxBuilder ValidatingSyntaxNodes.swift
[155/169] Compiling SwiftSyntaxBuilder SwiftSyntaxBuilderCompatibility.swift
[156/169] Compiling SwiftSyntaxBuilder Syntax+StringInterpolation.swift
[157/169] Compiling SwiftSyntaxBuilder WithTrailingCommaSyntax+EnsuringTrailingComma.swift
[158/169] Compiling SwiftSyntaxBuilder SyntaxNodeWithBody.swift
[159/169] Compiling SwiftSyntaxBuilder SyntaxParsable+ExpressibleByStringInterpolation.swift
[160/169] Compiling SwiftSyntaxBuilder Indenter.swift
[161/169] Compiling SwiftSyntaxBuilder ResultBuilderExtensions.swift
[162/169] Emitting module SwiftSyntaxBuilder
[163/169] Compiling SwiftSyntaxBuilder ConvenienceInitializers.swift
[164/169] Compiling SwiftSyntaxBuilder DeclSyntaxParseable.swift
[165/169] Compiling SwiftSyntaxBuilder ResultBuilders.swift
[166/169] Compiling SwiftSyntaxBuilder BuildableNodes.swift
[167/169] Compiling SwiftSyntaxBuilder SyntaxExpressibleByStringInterpolationConformances.swift
[168/183] Compiling SwiftSyntaxMacros MemberMacro.swift
[169/183] Compiling SwiftSyntaxMacros Macro.swift
[170/183] Compiling SwiftSyntaxMacros MemberAttributeMacro.swift
[171/184] Compiling SwiftSyntaxMacros ExpressionMacro.swift
[172/184] Compiling SwiftSyntaxMacros ExtensionMacro.swift
[173/184] Compiling SwiftSyntaxMacros FreestandingMacro.swift
[174/184] Compiling SwiftSyntaxMacros CodeItemMacro.swift
[175/184] Compiling SwiftSyntaxMacros DeclarationMacro.swift
[176/184] Compiling SwiftSyntaxMacros Macro+Format.swift
[177/184] Compiling SwiftSyntaxMacros AccessorMacro.swift
[178/184] Compiling SwiftSyntaxMacros AttachedMacro.swift
[179/184] Compiling SwiftSyntaxMacros AbstractSourceLocation.swift
[180/184] Compiling SwiftSyntaxMacros MacroExpansionContext.swift
[181/184] Emitting module SwiftSyntaxMacros
[182/184] Compiling SwiftSyntaxMacros PeerMacro.swift
[183/192] Compiling SwiftSyntaxMacroExpansion MacroReplacement.swift
[184/192] Emitting module SwiftSyntaxMacroExpansion
[185/192] Compiling SwiftSyntaxMacroExpansion FunctionParameterUtils.swift
[186/192] Compiling SwiftSyntaxMacroExpansion MacroExpansionDiagnosticMessages.swift
[187/192] Compiling SwiftSyntaxMacroExpansion IndentationUtils.swift
[188/192] Compiling SwiftSyntaxMacroExpansion MacroSystem.swift
[189/192] Compiling SwiftSyntaxMacroExpansion BasicMacroExpansionContext.swift
[190/192] Compiling SwiftSyntaxMacroExpansion MacroExpansion.swift
[191/199] Compiling SwiftCompilerPluginMessageHandling PluginMessageCompatibility.swift
[192/199] Compiling SwiftCompilerPluginMessageHandling Macros.swift
[193/199] Compiling SwiftCompilerPluginMessageHandling CompilerPluginMessageHandler.swift
[194/199] Compiling SwiftCompilerPluginMessageHandling Diagnostics.swift
[195/199] Compiling SwiftCompilerPluginMessageHandling PluginMacroExpansionContext.swift
[196/199] Emitting module SwiftCompilerPluginMessageHandling
[197/199] Compiling SwiftCompilerPluginMessageHandling PluginMessages.swift
[198/201] Compiling SwiftCompilerPlugin CompilerPlugin.swift
[199/201] Emitting module SwiftCompilerPlugin
[200/204] Compiling Macros UsecaseMacro.swift
[201/204] Compiling Macros Plugin.swift
[202/204] Emitting module Macros
[202/204] Write Objects.LinkFileList
[203/204] Linking Macros-tool
[205/206] Emitting module SwiftUseCaseMacro
[206/206] Compiling SwiftUseCaseMacro SwiftUseCaseMacro.swift
[207/226] Emitting module SwiftUseCase
[208/228] Compiling SwiftUseCase Executables.swift
[209/228] Compiling SwiftUseCase ThrowingUseCase+Callbacks.swift
[210/228] Compiling SwiftUseCase UseCase+Callbacks.swift
[211/228] Compiling SwiftUseCase UseCase+Publisher.swift
[212/228] Compiling SwiftUseCase AsyncThrowingUseCase.swift
[213/228] Compiling SwiftUseCase AsyncUseCase+Callbacks.swift
[214/228] Compiling SwiftUseCase ThrowingUseCase+Publisher.swift
[215/228] Compiling SwiftUseCase ThrowingUseCase.swift
[216/228] Compiling SwiftUseCase AsyncThrowingUseCase+Callbacks.swift
[217/228] Compiling SwiftUseCase AsyncThrowingUseCase+Publisher.swift
[218/228] Compiling SwiftUseCase AsyncUsecaseable.swift
[219/228] Compiling SwiftUseCase CombineUseCase.swift
[220/228] Compiling SwiftUseCase AnyUseCase.swift
[221/228] Compiling SwiftUseCase AsyncExecutables.swift
[222/228] Compiling SwiftUseCase AsyncUseCase+Publisher.swift
[223/228] Compiling SwiftUseCase AsyncUseCase.swift
[224/228] Compiling SwiftUseCase AnyUseCase+Callbacks.swift
[225/228] Compiling SwiftUseCase AnyUseCase+Combine.swift
[226/228] Compiling SwiftUseCase AnyUseCase+Resolve.swift
[227/228] Compiling SwiftUseCase UseCase.swift
[228/228] Compiling SwiftUseCase UseCaseable.swift
[229/259] Compiling SwiftMVI Observer.swift
/Users/admin/builder/spi-builder-workspace/Sources/Core/Processing+UseCase.swift:15:17: error: cannot find type 'SyncUseCase' in scope
 13 |     ///   - usecase: An executable UseCase
 14 |     /// - Returns: Result of the executed usecase
 15 |     func run<U: SyncUseCase>(_ usecase: U) -> U.Result where U.Parameter == Void {
    |                 `- error: cannot find type 'SyncUseCase' in scope
 16 |         return run(usecase, ())
 17 |     }
/Users/admin/builder/spi-builder-workspace/Sources/Core/Processing+UseCase.swift:15:49: error: 'Result' is not a member type of type 'U'
 13 |     ///   - usecase: An executable UseCase
 14 |     /// - Returns: Result of the executed usecase
 15 |     func run<U: SyncUseCase>(_ usecase: U) -> U.Result where U.Parameter == Void {
    |                                                 `- error: 'Result' is not a member type of type 'U'
 16 |         return run(usecase, ())
 17 |     }
/Users/admin/builder/spi-builder-workspace/Sources/Core/Processing+UseCase.swift:15:64: error: 'Parameter' is not a member type of type 'U'
 13 |     ///   - usecase: An executable UseCase
 14 |     /// - Returns: Result of the executed usecase
 15 |     func run<U: SyncUseCase>(_ usecase: U) -> U.Result where U.Parameter == Void {
    |                                                                `- error: 'Parameter' is not a member type of type 'U'
 16 |         return run(usecase, ())
 17 |     }
/Users/admin/builder/spi-builder-workspace/Sources/Core/Processing+UseCase.swift:24:17: error: cannot find type 'SyncUseCase' in scope
 22 |     ///   - usecase: An executable UseCase
 23 |     /// - Returns: Result of the executed usecase
 24 |     func run<U: SyncUseCase>(_ usecase: U, _ parameters: U.Parameter) -> U.Result {
    |                 `- error: cannot find type 'SyncUseCase' in scope
 25 |         usecase(parameters)
 26 |     }
/Users/admin/builder/spi-builder-workspace/Sources/Core/Processing+UseCase.swift:24:76: error: 'Result' is not a member type of type 'U'
 22 |     ///   - usecase: An executable UseCase
 23 |     /// - Returns: Result of the executed usecase
 24 |     func run<U: SyncUseCase>(_ usecase: U, _ parameters: U.Parameter) -> U.Result {
    |                                                                            `- error: 'Result' is not a member type of type 'U'
 25 |         usecase(parameters)
 26 |     }
/Users/admin/builder/spi-builder-workspace/Sources/Core/Processing+UseCase.swift:24:60: error: 'Parameter' is not a member type of type 'U'
 22 |     ///   - usecase: An executable UseCase
 23 |     /// - Returns: Result of the executed usecase
 24 |     func run<U: SyncUseCase>(_ usecase: U, _ parameters: U.Parameter) -> U.Result {
    |                                                            `- error: 'Parameter' is not a member type of type 'U'
 25 |         usecase(parameters)
 26 |     }
/Users/admin/builder/spi-builder-workspace/Sources/Core/Processing+UseCase.swift:35:17: error: cannot find type 'SyncThrowingUseCase' in scope
 33 |     ///   - usecase: An executable UseCase
 34 |     /// - Returns: Result of the executed usecase
 35 |     func run<U: SyncThrowingUseCase>(_ usecase: U) throws -> U.Result where U.Parameter == Void {
    |                 `- error: cannot find type 'SyncThrowingUseCase' in scope
 36 |         return try run(usecase, ())
 37 |     }
/Users/admin/builder/spi-builder-workspace/Sources/Core/Processing+UseCase.swift:35:64: error: 'Result' is not a member type of type 'U'
 33 |     ///   - usecase: An executable UseCase
 34 |     /// - Returns: Result of the executed usecase
 35 |     func run<U: SyncThrowingUseCase>(_ usecase: U) throws -> U.Result where U.Parameter == Void {
    |                                                                `- error: 'Result' is not a member type of type 'U'
 36 |         return try run(usecase, ())
 37 |     }
/Users/admin/builder/spi-builder-workspace/Sources/Core/Processing+UseCase.swift:35:79: error: 'Parameter' is not a member type of type 'U'
 33 |     ///   - usecase: An executable UseCase
 34 |     /// - Returns: Result of the executed usecase
 35 |     func run<U: SyncThrowingUseCase>(_ usecase: U) throws -> U.Result where U.Parameter == Void {
    |                                                                               `- error: 'Parameter' is not a member type of type 'U'
 36 |         return try run(usecase, ())
 37 |     }
/Users/admin/builder/spi-builder-workspace/Sources/Core/Processing+UseCase.swift:44:17: error: cannot find type 'SyncThrowingUseCase' in scope
 42 |     ///   - usecase: An executable UseCase
 43 |     /// - Returns: Result of the executed usecase
 44 |     func run<U: SyncThrowingUseCase>(_ usecase: U, _ parameters: U.Parameter) throws -> U.Result {
    |                 `- error: cannot find type 'SyncThrowingUseCase' in scope
 45 |         try usecase(parameters)
 46 |     }
/Users/admin/builder/spi-builder-workspace/Sources/Core/Processing+UseCase.swift:44:91: error: 'Result' is not a member type of type 'U'
 42 |     ///   - usecase: An executable UseCase
 43 |     /// - Returns: Result of the executed usecase
 44 |     func run<U: SyncThrowingUseCase>(_ usecase: U, _ parameters: U.Parameter) throws -> U.Result {
    |                                                                                           `- error: 'Result' is not a member type of type 'U'
 45 |         try usecase(parameters)
 46 |     }
/Users/admin/builder/spi-builder-workspace/Sources/Core/Processing+UseCase.swift:44:68: error: 'Parameter' is not a member type of type 'U'
 42 |     ///   - usecase: An executable UseCase
 43 |     /// - Returns: Result of the executed usecase
 44 |     func run<U: SyncThrowingUseCase>(_ usecase: U, _ parameters: U.Parameter) throws -> U.Result {
    |                                                                    `- error: 'Parameter' is not a member type of type 'U'
 45 |         try usecase(parameters)
 46 |     }
[230/259] Compiling SwiftMVI Processing+UseCase.swift
/Users/admin/builder/spi-builder-workspace/Sources/Core/Processing+UseCase.swift:15:17: error: cannot find type 'SyncUseCase' in scope
 13 |     ///   - usecase: An executable UseCase
 14 |     /// - Returns: Result of the executed usecase
 15 |     func run<U: SyncUseCase>(_ usecase: U) -> U.Result where U.Parameter == Void {
    |                 `- error: cannot find type 'SyncUseCase' in scope
 16 |         return run(usecase, ())
 17 |     }
/Users/admin/builder/spi-builder-workspace/Sources/Core/Processing+UseCase.swift:15:49: error: 'Result' is not a member type of type 'U'
 13 |     ///   - usecase: An executable UseCase
 14 |     /// - Returns: Result of the executed usecase
 15 |     func run<U: SyncUseCase>(_ usecase: U) -> U.Result where U.Parameter == Void {
    |                                                 `- error: 'Result' is not a member type of type 'U'
 16 |         return run(usecase, ())
 17 |     }
/Users/admin/builder/spi-builder-workspace/Sources/Core/Processing+UseCase.swift:15:64: error: 'Parameter' is not a member type of type 'U'
 13 |     ///   - usecase: An executable UseCase
 14 |     /// - Returns: Result of the executed usecase
 15 |     func run<U: SyncUseCase>(_ usecase: U) -> U.Result where U.Parameter == Void {
    |                                                                `- error: 'Parameter' is not a member type of type 'U'
 16 |         return run(usecase, ())
 17 |     }
/Users/admin/builder/spi-builder-workspace/Sources/Core/Processing+UseCase.swift:24:17: error: cannot find type 'SyncUseCase' in scope
 22 |     ///   - usecase: An executable UseCase
 23 |     /// - Returns: Result of the executed usecase
 24 |     func run<U: SyncUseCase>(_ usecase: U, _ parameters: U.Parameter) -> U.Result {
    |                 `- error: cannot find type 'SyncUseCase' in scope
 25 |         usecase(parameters)
 26 |     }
/Users/admin/builder/spi-builder-workspace/Sources/Core/Processing+UseCase.swift:24:76: error: 'Result' is not a member type of type 'U'
 22 |     ///   - usecase: An executable UseCase
 23 |     /// - Returns: Result of the executed usecase
 24 |     func run<U: SyncUseCase>(_ usecase: U, _ parameters: U.Parameter) -> U.Result {
    |                                                                            `- error: 'Result' is not a member type of type 'U'
 25 |         usecase(parameters)
 26 |     }
/Users/admin/builder/spi-builder-workspace/Sources/Core/Processing+UseCase.swift:24:60: error: 'Parameter' is not a member type of type 'U'
 22 |     ///   - usecase: An executable UseCase
 23 |     /// - Returns: Result of the executed usecase
 24 |     func run<U: SyncUseCase>(_ usecase: U, _ parameters: U.Parameter) -> U.Result {
    |                                                            `- error: 'Parameter' is not a member type of type 'U'
 25 |         usecase(parameters)
 26 |     }
/Users/admin/builder/spi-builder-workspace/Sources/Core/Processing+UseCase.swift:35:17: error: cannot find type 'SyncThrowingUseCase' in scope
 33 |     ///   - usecase: An executable UseCase
 34 |     /// - Returns: Result of the executed usecase
 35 |     func run<U: SyncThrowingUseCase>(_ usecase: U) throws -> U.Result where U.Parameter == Void {
    |                 `- error: cannot find type 'SyncThrowingUseCase' in scope
 36 |         return try run(usecase, ())
 37 |     }
/Users/admin/builder/spi-builder-workspace/Sources/Core/Processing+UseCase.swift:35:64: error: 'Result' is not a member type of type 'U'
 33 |     ///   - usecase: An executable UseCase
 34 |     /// - Returns: Result of the executed usecase
 35 |     func run<U: SyncThrowingUseCase>(_ usecase: U) throws -> U.Result where U.Parameter == Void {
    |                                                                `- error: 'Result' is not a member type of type 'U'
 36 |         return try run(usecase, ())
 37 |     }
/Users/admin/builder/spi-builder-workspace/Sources/Core/Processing+UseCase.swift:35:79: error: 'Parameter' is not a member type of type 'U'
 33 |     ///   - usecase: An executable UseCase
 34 |     /// - Returns: Result of the executed usecase
 35 |     func run<U: SyncThrowingUseCase>(_ usecase: U) throws -> U.Result where U.Parameter == Void {
    |                                                                               `- error: 'Parameter' is not a member type of type 'U'
 36 |         return try run(usecase, ())
 37 |     }
/Users/admin/builder/spi-builder-workspace/Sources/Core/Processing+UseCase.swift:44:17: error: cannot find type 'SyncThrowingUseCase' in scope
 42 |     ///   - usecase: An executable UseCase
 43 |     /// - Returns: Result of the executed usecase
 44 |     func run<U: SyncThrowingUseCase>(_ usecase: U, _ parameters: U.Parameter) throws -> U.Result {
    |                 `- error: cannot find type 'SyncThrowingUseCase' in scope
 45 |         try usecase(parameters)
 46 |     }
/Users/admin/builder/spi-builder-workspace/Sources/Core/Processing+UseCase.swift:44:91: error: 'Result' is not a member type of type 'U'
 42 |     ///   - usecase: An executable UseCase
 43 |     /// - Returns: Result of the executed usecase
 44 |     func run<U: SyncThrowingUseCase>(_ usecase: U, _ parameters: U.Parameter) throws -> U.Result {
    |                                                                                           `- error: 'Result' is not a member type of type 'U'
 45 |         try usecase(parameters)
 46 |     }
/Users/admin/builder/spi-builder-workspace/Sources/Core/Processing+UseCase.swift:44:68: error: 'Parameter' is not a member type of type 'U'
 42 |     ///   - usecase: An executable UseCase
 43 |     /// - Returns: Result of the executed usecase
 44 |     func run<U: SyncThrowingUseCase>(_ usecase: U, _ parameters: U.Parameter) throws -> U.Result {
    |                                                                    `- error: 'Parameter' is not a member type of type 'U'
 45 |         try usecase(parameters)
 46 |     }
[231/259] Compiling SwiftMVI Processing.swift
/Users/admin/builder/spi-builder-workspace/Sources/Core/Processing+UseCase.swift:15:17: error: cannot find type 'SyncUseCase' in scope
 13 |     ///   - usecase: An executable UseCase
 14 |     /// - Returns: Result of the executed usecase
 15 |     func run<U: SyncUseCase>(_ usecase: U) -> U.Result where U.Parameter == Void {
    |                 `- error: cannot find type 'SyncUseCase' in scope
 16 |         return run(usecase, ())
 17 |     }
/Users/admin/builder/spi-builder-workspace/Sources/Core/Processing+UseCase.swift:15:49: error: 'Result' is not a member type of type 'U'
 13 |     ///   - usecase: An executable UseCase
 14 |     /// - Returns: Result of the executed usecase
 15 |     func run<U: SyncUseCase>(_ usecase: U) -> U.Result where U.Parameter == Void {
    |                                                 `- error: 'Result' is not a member type of type 'U'
 16 |         return run(usecase, ())
 17 |     }
/Users/admin/builder/spi-builder-workspace/Sources/Core/Processing+UseCase.swift:15:64: error: 'Parameter' is not a member type of type 'U'
 13 |     ///   - usecase: An executable UseCase
 14 |     /// - Returns: Result of the executed usecase
 15 |     func run<U: SyncUseCase>(_ usecase: U) -> U.Result where U.Parameter == Void {
    |                                                                `- error: 'Parameter' is not a member type of type 'U'
 16 |         return run(usecase, ())
 17 |     }
/Users/admin/builder/spi-builder-workspace/Sources/Core/Processing+UseCase.swift:24:17: error: cannot find type 'SyncUseCase' in scope
 22 |     ///   - usecase: An executable UseCase
 23 |     /// - Returns: Result of the executed usecase
 24 |     func run<U: SyncUseCase>(_ usecase: U, _ parameters: U.Parameter) -> U.Result {
    |                 `- error: cannot find type 'SyncUseCase' in scope
 25 |         usecase(parameters)
 26 |     }
/Users/admin/builder/spi-builder-workspace/Sources/Core/Processing+UseCase.swift:24:76: error: 'Result' is not a member type of type 'U'
 22 |     ///   - usecase: An executable UseCase
 23 |     /// - Returns: Result of the executed usecase
 24 |     func run<U: SyncUseCase>(_ usecase: U, _ parameters: U.Parameter) -> U.Result {
    |                                                                            `- error: 'Result' is not a member type of type 'U'
 25 |         usecase(parameters)
 26 |     }
/Users/admin/builder/spi-builder-workspace/Sources/Core/Processing+UseCase.swift:24:60: error: 'Parameter' is not a member type of type 'U'
 22 |     ///   - usecase: An executable UseCase
 23 |     /// - Returns: Result of the executed usecase
 24 |     func run<U: SyncUseCase>(_ usecase: U, _ parameters: U.Parameter) -> U.Result {
    |                                                            `- error: 'Parameter' is not a member type of type 'U'
 25 |         usecase(parameters)
 26 |     }
/Users/admin/builder/spi-builder-workspace/Sources/Core/Processing+UseCase.swift:35:17: error: cannot find type 'SyncThrowingUseCase' in scope
 33 |     ///   - usecase: An executable UseCase
 34 |     /// - Returns: Result of the executed usecase
 35 |     func run<U: SyncThrowingUseCase>(_ usecase: U) throws -> U.Result where U.Parameter == Void {
    |                 `- error: cannot find type 'SyncThrowingUseCase' in scope
 36 |         return try run(usecase, ())
 37 |     }
/Users/admin/builder/spi-builder-workspace/Sources/Core/Processing+UseCase.swift:35:64: error: 'Result' is not a member type of type 'U'
 33 |     ///   - usecase: An executable UseCase
 34 |     /// - Returns: Result of the executed usecase
 35 |     func run<U: SyncThrowingUseCase>(_ usecase: U) throws -> U.Result where U.Parameter == Void {
    |                                                                `- error: 'Result' is not a member type of type 'U'
 36 |         return try run(usecase, ())
 37 |     }
/Users/admin/builder/spi-builder-workspace/Sources/Core/Processing+UseCase.swift:35:79: error: 'Parameter' is not a member type of type 'U'
 33 |     ///   - usecase: An executable UseCase
 34 |     /// - Returns: Result of the executed usecase
 35 |     func run<U: SyncThrowingUseCase>(_ usecase: U) throws -> U.Result where U.Parameter == Void {
    |                                                                               `- error: 'Parameter' is not a member type of type 'U'
 36 |         return try run(usecase, ())
 37 |     }
/Users/admin/builder/spi-builder-workspace/Sources/Core/Processing+UseCase.swift:44:17: error: cannot find type 'SyncThrowingUseCase' in scope
 42 |     ///   - usecase: An executable UseCase
 43 |     /// - Returns: Result of the executed usecase
 44 |     func run<U: SyncThrowingUseCase>(_ usecase: U, _ parameters: U.Parameter) throws -> U.Result {
    |                 `- error: cannot find type 'SyncThrowingUseCase' in scope
 45 |         try usecase(parameters)
 46 |     }
/Users/admin/builder/spi-builder-workspace/Sources/Core/Processing+UseCase.swift:44:91: error: 'Result' is not a member type of type 'U'
 42 |     ///   - usecase: An executable UseCase
 43 |     /// - Returns: Result of the executed usecase
 44 |     func run<U: SyncThrowingUseCase>(_ usecase: U, _ parameters: U.Parameter) throws -> U.Result {
    |                                                                                           `- error: 'Result' is not a member type of type 'U'
 45 |         try usecase(parameters)
 46 |     }
/Users/admin/builder/spi-builder-workspace/Sources/Core/Processing+UseCase.swift:44:68: error: 'Parameter' is not a member type of type 'U'
 42 |     ///   - usecase: An executable UseCase
 43 |     /// - Returns: Result of the executed usecase
 44 |     func run<U: SyncThrowingUseCase>(_ usecase: U, _ parameters: U.Parameter) throws -> U.Result {
    |                                                                    `- error: 'Parameter' is not a member type of type 'U'
 45 |         try usecase(parameters)
 46 |     }
[232/259] Compiling SwiftMVI Property.swift
/Users/admin/builder/spi-builder-workspace/Sources/Core/Processing+UseCase.swift:15:17: error: cannot find type 'SyncUseCase' in scope
 13 |     ///   - usecase: An executable UseCase
 14 |     /// - Returns: Result of the executed usecase
 15 |     func run<U: SyncUseCase>(_ usecase: U) -> U.Result where U.Parameter == Void {
    |                 `- error: cannot find type 'SyncUseCase' in scope
 16 |         return run(usecase, ())
 17 |     }
/Users/admin/builder/spi-builder-workspace/Sources/Core/Processing+UseCase.swift:15:49: error: 'Result' is not a member type of type 'U'
 13 |     ///   - usecase: An executable UseCase
 14 |     /// - Returns: Result of the executed usecase
 15 |     func run<U: SyncUseCase>(_ usecase: U) -> U.Result where U.Parameter == Void {
    |                                                 `- error: 'Result' is not a member type of type 'U'
 16 |         return run(usecase, ())
 17 |     }
/Users/admin/builder/spi-builder-workspace/Sources/Core/Processing+UseCase.swift:15:64: error: 'Parameter' is not a member type of type 'U'
 13 |     ///   - usecase: An executable UseCase
 14 |     /// - Returns: Result of the executed usecase
 15 |     func run<U: SyncUseCase>(_ usecase: U) -> U.Result where U.Parameter == Void {
    |                                                                `- error: 'Parameter' is not a member type of type 'U'
 16 |         return run(usecase, ())
 17 |     }
/Users/admin/builder/spi-builder-workspace/Sources/Core/Processing+UseCase.swift:24:17: error: cannot find type 'SyncUseCase' in scope
 22 |     ///   - usecase: An executable UseCase
 23 |     /// - Returns: Result of the executed usecase
 24 |     func run<U: SyncUseCase>(_ usecase: U, _ parameters: U.Parameter) -> U.Result {
    |                 `- error: cannot find type 'SyncUseCase' in scope
 25 |         usecase(parameters)
 26 |     }
/Users/admin/builder/spi-builder-workspace/Sources/Core/Processing+UseCase.swift:24:76: error: 'Result' is not a member type of type 'U'
 22 |     ///   - usecase: An executable UseCase
 23 |     /// - Returns: Result of the executed usecase
 24 |     func run<U: SyncUseCase>(_ usecase: U, _ parameters: U.Parameter) -> U.Result {
    |                                                                            `- error: 'Result' is not a member type of type 'U'
 25 |         usecase(parameters)
 26 |     }
/Users/admin/builder/spi-builder-workspace/Sources/Core/Processing+UseCase.swift:24:60: error: 'Parameter' is not a member type of type 'U'
 22 |     ///   - usecase: An executable UseCase
 23 |     /// - Returns: Result of the executed usecase
 24 |     func run<U: SyncUseCase>(_ usecase: U, _ parameters: U.Parameter) -> U.Result {
    |                                                            `- error: 'Parameter' is not a member type of type 'U'
 25 |         usecase(parameters)
 26 |     }
/Users/admin/builder/spi-builder-workspace/Sources/Core/Processing+UseCase.swift:35:17: error: cannot find type 'SyncThrowingUseCase' in scope
 33 |     ///   - usecase: An executable UseCase
 34 |     /// - Returns: Result of the executed usecase
 35 |     func run<U: SyncThrowingUseCase>(_ usecase: U) throws -> U.Result where U.Parameter == Void {
    |                 `- error: cannot find type 'SyncThrowingUseCase' in scope
 36 |         return try run(usecase, ())
 37 |     }
/Users/admin/builder/spi-builder-workspace/Sources/Core/Processing+UseCase.swift:35:64: error: 'Result' is not a member type of type 'U'
 33 |     ///   - usecase: An executable UseCase
 34 |     /// - Returns: Result of the executed usecase
 35 |     func run<U: SyncThrowingUseCase>(_ usecase: U) throws -> U.Result where U.Parameter == Void {
    |                                                                `- error: 'Result' is not a member type of type 'U'
 36 |         return try run(usecase, ())
 37 |     }
/Users/admin/builder/spi-builder-workspace/Sources/Core/Processing+UseCase.swift:35:79: error: 'Parameter' is not a member type of type 'U'
 33 |     ///   - usecase: An executable UseCase
 34 |     /// - Returns: Result of the executed usecase
 35 |     func run<U: SyncThrowingUseCase>(_ usecase: U) throws -> U.Result where U.Parameter == Void {
    |                                                                               `- error: 'Parameter' is not a member type of type 'U'
 36 |         return try run(usecase, ())
 37 |     }
/Users/admin/builder/spi-builder-workspace/Sources/Core/Processing+UseCase.swift:44:17: error: cannot find type 'SyncThrowingUseCase' in scope
 42 |     ///   - usecase: An executable UseCase
 43 |     /// - Returns: Result of the executed usecase
 44 |     func run<U: SyncThrowingUseCase>(_ usecase: U, _ parameters: U.Parameter) throws -> U.Result {
    |                 `- error: cannot find type 'SyncThrowingUseCase' in scope
 45 |         try usecase(parameters)
 46 |     }
/Users/admin/builder/spi-builder-workspace/Sources/Core/Processing+UseCase.swift:44:91: error: 'Result' is not a member type of type 'U'
 42 |     ///   - usecase: An executable UseCase
 43 |     /// - Returns: Result of the executed usecase
 44 |     func run<U: SyncThrowingUseCase>(_ usecase: U, _ parameters: U.Parameter) throws -> U.Result {
    |                                                                                           `- error: 'Result' is not a member type of type 'U'
 45 |         try usecase(parameters)
 46 |     }
/Users/admin/builder/spi-builder-workspace/Sources/Core/Processing+UseCase.swift:44:68: error: 'Parameter' is not a member type of type 'U'
 42 |     ///   - usecase: An executable UseCase
 43 |     /// - Returns: Result of the executed usecase
 44 |     func run<U: SyncThrowingUseCase>(_ usecase: U, _ parameters: U.Parameter) throws -> U.Result {
    |                                                                    `- error: 'Parameter' is not a member type of type 'U'
 45 |         try usecase(parameters)
 46 |     }
error: emit-module command failed with exit code 1 (use -v to see invocation)
[233/262] Emitting module SwiftMVI
/Users/admin/builder/spi-builder-workspace/Sources/Core/Processing+UseCase.swift:15:17: error: cannot find type 'SyncUseCase' in scope
 13 |     ///   - usecase: An executable UseCase
 14 |     /// - Returns: Result of the executed usecase
 15 |     func run<U: SyncUseCase>(_ usecase: U) -> U.Result where U.Parameter == Void {
    |                 `- error: cannot find type 'SyncUseCase' in scope
 16 |         return run(usecase, ())
 17 |     }
/Users/admin/builder/spi-builder-workspace/Sources/Core/Processing+UseCase.swift:15:49: error: 'Result' is not a member type of type 'U'
 13 |     ///   - usecase: An executable UseCase
 14 |     /// - Returns: Result of the executed usecase
 15 |     func run<U: SyncUseCase>(_ usecase: U) -> U.Result where U.Parameter == Void {
    |                                                 `- error: 'Result' is not a member type of type 'U'
 16 |         return run(usecase, ())
 17 |     }
/Users/admin/builder/spi-builder-workspace/Sources/Core/Processing+UseCase.swift:15:64: error: 'Parameter' is not a member type of type 'U'
 13 |     ///   - usecase: An executable UseCase
 14 |     /// - Returns: Result of the executed usecase
 15 |     func run<U: SyncUseCase>(_ usecase: U) -> U.Result where U.Parameter == Void {
    |                                                                `- error: 'Parameter' is not a member type of type 'U'
 16 |         return run(usecase, ())
 17 |     }
/Users/admin/builder/spi-builder-workspace/Sources/Core/Processing+UseCase.swift:24:17: error: cannot find type 'SyncUseCase' in scope
 22 |     ///   - usecase: An executable UseCase
 23 |     /// - Returns: Result of the executed usecase
 24 |     func run<U: SyncUseCase>(_ usecase: U, _ parameters: U.Parameter) -> U.Result {
    |                 `- error: cannot find type 'SyncUseCase' in scope
 25 |         usecase(parameters)
 26 |     }
/Users/admin/builder/spi-builder-workspace/Sources/Core/Processing+UseCase.swift:24:76: error: 'Result' is not a member type of type 'U'
 22 |     ///   - usecase: An executable UseCase
 23 |     /// - Returns: Result of the executed usecase
 24 |     func run<U: SyncUseCase>(_ usecase: U, _ parameters: U.Parameter) -> U.Result {
    |                                                                            `- error: 'Result' is not a member type of type 'U'
 25 |         usecase(parameters)
 26 |     }
/Users/admin/builder/spi-builder-workspace/Sources/Core/Processing+UseCase.swift:24:60: error: 'Parameter' is not a member type of type 'U'
 22 |     ///   - usecase: An executable UseCase
 23 |     /// - Returns: Result of the executed usecase
 24 |     func run<U: SyncUseCase>(_ usecase: U, _ parameters: U.Parameter) -> U.Result {
    |                                                            `- error: 'Parameter' is not a member type of type 'U'
 25 |         usecase(parameters)
 26 |     }
/Users/admin/builder/spi-builder-workspace/Sources/Core/Processing+UseCase.swift:35:17: error: cannot find type 'SyncThrowingUseCase' in scope
 33 |     ///   - usecase: An executable UseCase
 34 |     /// - Returns: Result of the executed usecase
 35 |     func run<U: SyncThrowingUseCase>(_ usecase: U) throws -> U.Result where U.Parameter == Void {
    |                 `- error: cannot find type 'SyncThrowingUseCase' in scope
 36 |         return try run(usecase, ())
 37 |     }
/Users/admin/builder/spi-builder-workspace/Sources/Core/Processing+UseCase.swift:35:64: error: 'Result' is not a member type of type 'U'
 33 |     ///   - usecase: An executable UseCase
 34 |     /// - Returns: Result of the executed usecase
 35 |     func run<U: SyncThrowingUseCase>(_ usecase: U) throws -> U.Result where U.Parameter == Void {
    |                                                                `- error: 'Result' is not a member type of type 'U'
 36 |         return try run(usecase, ())
 37 |     }
/Users/admin/builder/spi-builder-workspace/Sources/Core/Processing+UseCase.swift:35:79: error: 'Parameter' is not a member type of type 'U'
 33 |     ///   - usecase: An executable UseCase
 34 |     /// - Returns: Result of the executed usecase
 35 |     func run<U: SyncThrowingUseCase>(_ usecase: U) throws -> U.Result where U.Parameter == Void {
    |                                                                               `- error: 'Parameter' is not a member type of type 'U'
 36 |         return try run(usecase, ())
 37 |     }
/Users/admin/builder/spi-builder-workspace/Sources/Core/Processing+UseCase.swift:44:17: error: cannot find type 'SyncThrowingUseCase' in scope
 42 |     ///   - usecase: An executable UseCase
 43 |     /// - Returns: Result of the executed usecase
 44 |     func run<U: SyncThrowingUseCase>(_ usecase: U, _ parameters: U.Parameter) throws -> U.Result {
    |                 `- error: cannot find type 'SyncThrowingUseCase' in scope
 45 |         try usecase(parameters)
 46 |     }
/Users/admin/builder/spi-builder-workspace/Sources/Core/Processing+UseCase.swift:44:91: error: 'Result' is not a member type of type 'U'
 42 |     ///   - usecase: An executable UseCase
 43 |     /// - Returns: Result of the executed usecase
 44 |     func run<U: SyncThrowingUseCase>(_ usecase: U, _ parameters: U.Parameter) throws -> U.Result {
    |                                                                                           `- error: 'Result' is not a member type of type 'U'
 45 |         try usecase(parameters)
 46 |     }
/Users/admin/builder/spi-builder-workspace/Sources/Core/Processing+UseCase.swift:44:68: error: 'Parameter' is not a member type of type 'U'
 42 |     ///   - usecase: An executable UseCase
 43 |     /// - Returns: Result of the executed usecase
 44 |     func run<U: SyncThrowingUseCase>(_ usecase: U, _ parameters: U.Parameter) throws -> U.Result {
    |                                                                    `- error: 'Parameter' is not a member type of type 'U'
 45 |         try usecase(parameters)
 46 |     }
[234/262] Compiling SwiftMVI IntentReducer.swift
[235/262] Compiling SwiftMVI ReactionReducer.swift
[236/262] Compiling SwiftMVI OptionalReducibleState.swift
[237/262] Compiling SwiftMVI AsyncActionReducer.swift
[238/262] Compiling SwiftMVI AsyncEffectReducer.swift
[239/262] Compiling SwiftMVI AsyncIntentReducer.swift
[240/262] Compiling SwiftMVI AnyPath.swift
/Users/admin/builder/spi-builder-workspace/Sources/Core/Modulable.swift:39:23: warning: comparing non-optional value of type 'Self.State' to 'nil' always returns true
37 |             },
38 |             get: { [self] in
39 |                 state != nil
   |                       `- warning: comparing non-optional value of type 'Self.State' to 'nil' always returns true
40 |             }
41 |         )
[241/262] Compiling SwiftMVI Binding.swift
/Users/admin/builder/spi-builder-workspace/Sources/Core/Modulable.swift:39:23: warning: comparing non-optional value of type 'Self.State' to 'nil' always returns true
37 |             },
38 |             get: { [self] in
39 |                 state != nil
   |                       `- warning: comparing non-optional value of type 'Self.State' to 'nil' always returns true
40 |             }
41 |         )
[242/262] Compiling SwiftMVI FeatureModule.swift
/Users/admin/builder/spi-builder-workspace/Sources/Core/Modulable.swift:39:23: warning: comparing non-optional value of type 'Self.State' to 'nil' always returns true
37 |             },
38 |             get: { [self] in
39 |                 state != nil
   |                       `- warning: comparing non-optional value of type 'Self.State' to 'nil' always returns true
40 |             }
41 |         )
[243/262] Compiling SwiftMVI Modulable.swift
/Users/admin/builder/spi-builder-workspace/Sources/Core/Modulable.swift:39:23: warning: comparing non-optional value of type 'Self.State' to 'nil' always returns true
37 |             },
38 |             get: { [self] in
39 |                 state != nil
   |                       `- warning: comparing non-optional value of type 'Self.State' to 'nil' always returns true
40 |             }
41 |         )
[244/262] Compiling SwiftMVI ValueFeature+ViewLifecycle.swift
[245/262] Compiling SwiftMVI ValueFeature.swift
[246/262] Compiling SwiftMVI ActionReducer.swift
[247/262] Compiling SwiftMVI ReducibleState.swift
[248/262] Compiling SwiftMVI Network.swift
[249/262] Compiling SwiftMVI NetworkDataTask.swift
[250/262] Compiling SwiftMVI AsyncReactionReducer.swift
[251/262] Compiling SwiftMVI EffectReducer.swift
[252/262] Compiling SwiftMVI EventReducer.swift
[253/262] Compiling SwiftMVI Alert+EventReducer.swift
[254/262] Compiling SwiftMVI Alert+StateReducer.swift
[255/262] Compiling SwiftMVI EventReducerView.swift
[256/262] Compiling SwiftMVI Transformer.swift
[257/262] Compiling SwiftMVI ValuePublisher.swift
[258/262] Compiling SwiftMVI ListFeature.swift
[259/262] Compiling SwiftMVI OptionalValueFeature.swift
[260/262] Compiling SwiftMVI FeatureView.swift
[261/262] Compiling SwiftMVI PublishedPathView.swift
[262/262] Compiling SwiftMVI StateReducerView.swift
BUILD FAILURE 6.1 macosSpm