The Swift Package Index logo.Swift Package Index

Track the adoption of Swift 6 strict concurrency checks for data race safety. How many packages are Ready for Swift 6?

Build Information

Failed to build DeclarativeTextKit, reference main (c114d1), with Swift 5.9 for macOS (Xcode) using Xcode 15.2 on 25 Jan 2025 08:30:14 UTC.

Build Command

env DEVELOPER_DIR=/Applications/Xcode-15.2.0.app xcrun xcodebuild -IDEClonedSourcePackagesDirPathOverride=$PWD/.dependencies -skipMacroValidation -skipPackagePluginValidation -derivedDataPath $PWD/.derivedData build -scheme DeclarativeTextKit -destination platform=macOS,arch=arm64

Build Log

SwiftCompile normal arm64 /Users/admin/builder/spi-builder-workspace/Tests/DeclarativeTextKitTests/ConditionalTests.swift (in target 'DeclarativeTextKitTests' from project 'DeclarativeTextKit')
    cd /Users/admin/builder/spi-builder-workspace
    /Applications/Xcode-15.2.0.app/Contents/Developer/Toolchains/XcodeDefault.xctoolchain/usr/bin/swift-frontend -c /Users/admin/builder/spi-builder-workspace/Tests/DeclarativeTextKitTests/AffectedRangeTests.swift /Users/admin/builder/spi-builder-workspace/Tests/DeclarativeTextKitTests/AssertModification.swift -primary-file /Users/admin/builder/spi-builder-workspace/Tests/DeclarativeTextKitTests/ConditionalTests.swift -primary-file /Users/admin/builder/spi-builder-workspace/Tests/DeclarativeTextKitTests/DeleteTests.swift /Users/admin/builder/spi-builder-workspace/Tests/DeclarativeTextKitTests/Helpers.swift /Users/admin/builder/spi-builder-workspace/Tests/DeclarativeTextKitTests/InsertTests.swift /Users/admin/builder/spi-builder-workspace/Tests/DeclarativeTextKitTests/LoggingUndoManager.swift /Users/admin/builder/spi-builder-workspace/Tests/DeclarativeTextKitTests/ModifyingTests.swift /Users/admin/builder/spi-builder-workspace/Tests/DeclarativeTextKitTests/ScopedBufferSliceTests.swift /Users/admin/builder/spi-builder-workspace/Tests/DeclarativeTextKitTests/SelectTests.swift /Users/admin/builder/spi-builder-workspace/Tests/DeclarativeTextKitTests/UndoableBufferTests.swift /Users/admin/builder/spi-builder-workspace/Tests/DeclarativeTextKitTests/UseCaseTests.swift -emit-dependencies-path /Users/admin/builder/spi-builder-workspace/.derivedData/Build/Intermediates.noindex/DeclarativeTextKit.build/Debug/DeclarativeTextKitTests.build/Objects-normal/arm64/ConditionalTests.d -emit-const-values-path /Users/admin/builder/spi-builder-workspace/.derivedData/Build/Intermediates.noindex/DeclarativeTextKit.build/Debug/DeclarativeTextKitTests.build/Objects-normal/arm64/ConditionalTests.swiftconstvalues -emit-reference-dependencies-path /Users/admin/builder/spi-builder-workspace/.derivedData/Build/Intermediates.noindex/DeclarativeTextKit.build/Debug/DeclarativeTextKitTests.build/Objects-normal/arm64/ConditionalTests.swiftdeps -serialize-diagnostics-path /Users/admin/builder/spi-builder-workspace/.derivedData/Build/Intermediates.noindex/DeclarativeTextKit.build/Debug/DeclarativeTextKitTests.build/Objects-normal/arm64/ConditionalTests.dia -emit-dependencies-path /Users/admin/builder/spi-builder-workspace/.derivedData/Build/Intermediates.noindex/DeclarativeTextKit.build/Debug/DeclarativeTextKitTests.build/Objects-normal/arm64/DeleteTests.d -emit-const-values-path /Users/admin/builder/spi-builder-workspace/.derivedData/Build/Intermediates.noindex/DeclarativeTextKit.build/Debug/DeclarativeTextKitTests.build/Objects-normal/arm64/DeleteTests.swiftconstvalues -emit-reference-dependencies-path /Users/admin/builder/spi-builder-workspace/.derivedData/Build/Intermediates.noindex/DeclarativeTextKit.build/Debug/DeclarativeTextKitTests.build/Objects-normal/arm64/DeleteTests.swiftdeps -serialize-diagnostics-path /Users/admin/builder/spi-builder-workspace/.derivedData/Build/Intermediates.noindex/DeclarativeTextKit.build/Debug/DeclarativeTextKitTests.build/Objects-normal/arm64/DeleteTests.dia -target arm64-apple-macos13.0 -Xllvm -aarch64-use-tbi -enable-objc-interop -stack-check -sdk /Applications/Xcode-15.2.0.app/Contents/Developer/Platforms/MacOSX.platform/Developer/SDKs/MacOSX14.2.sdk -I /Users/admin/builder/spi-builder-workspace/.derivedData/Build/Products/Debug -I /Applications/Xcode-15.2.0.app/Contents/Developer/Platforms/MacOSX.platform/Developer/usr/lib -F /Users/admin/builder/spi-builder-workspace/.derivedData/Build/Products/Debug/PackageFrameworks -F /Users/admin/builder/spi-builder-workspace/.derivedData/Build/Products/Debug/PackageFrameworks -F /Users/admin/builder/spi-builder-workspace/.derivedData/Build/Products/Debug/PackageFrameworks -F /Users/admin/builder/spi-builder-workspace/.derivedData/Build/Products/Debug -F /Applications/Xcode-15.2.0.app/Contents/Developer/Platforms/MacOSX.platform/Developer/Library/Frameworks -no-color-diagnostics -enable-testing -g -module-cache-path /Users/admin/builder/spi-builder-workspace/.derivedData/ModuleCache.noindex -profile-generate -profile-coverage-mapping -swift-version 5 -enforce-exclusivity\=checked -Onone -D SWIFT_PACKAGE -D DEBUG -D Xcode -serialize-debugging-options -package-name spi_builder_workspace -const-gather-protocols-file /Users/admin/builder/spi-builder-workspace/.derivedData/Build/Intermediates.noindex/DeclarativeTextKit.build/Debug/DeclarativeTextKitTests.build/Objects-normal/arm64/DeclarativeTextKitTests_const_extract_protocols.json -empty-abi-descriptor -validate-clang-modules-once -clang-build-session-file /Users/admin/builder/spi-builder-workspace/.derivedData/ModuleCache.noindex/Session.modulevalidation -Xcc -working-directory -Xcc /Users/admin/builder/spi-builder-workspace -resource-dir /Applications/Xcode-15.2.0.app/Contents/Developer/Toolchains/XcodeDefault.xctoolchain/usr/lib/swift -enable-anonymous-context-mangled-names -Xcc -ivfsstatcache -Xcc /Users/admin/builder/spi-builder-workspace/.derivedData/SDKStatCaches.noindex/macosx14.2-23C53-ddea79c7890ab41bba4a63928c655a96.sdkstatcache -Xcc -I/Users/admin/builder/spi-builder-workspace/.derivedData/Build/Products/Debug/include -Xcc -I/Users/admin/builder/spi-builder-workspace/.derivedData/Build/Intermediates.noindex/DeclarativeTextKit.build/Debug/DeclarativeTextKitTests.build/DerivedSources-normal/arm64 -Xcc -I/Users/admin/builder/spi-builder-workspace/.derivedData/Build/Intermediates.noindex/DeclarativeTextKit.build/Debug/DeclarativeTextKitTests.build/DerivedSources/arm64 -Xcc -I/Users/admin/builder/spi-builder-workspace/.derivedData/Build/Intermediates.noindex/DeclarativeTextKit.build/Debug/DeclarativeTextKitTests.build/DerivedSources -Xcc -DSWIFT_PACKAGE -Xcc -DDEBUG\=1 -module-name DeclarativeTextKitTests -frontend-parseable-output -disable-clang-spi -target-sdk-version 14.2 -target-sdk-name macosx14.2 -external-plugin-path /Applications/Xcode-15.2.0.app/Contents/Developer/Platforms/MacOSX.platform/Developer/SDKs/MacOSX14.2.sdk/usr/lib/swift/host/plugins\#/Applications/Xcode-15.2.0.app/Contents/Developer/Platforms/MacOSX.platform/Developer/SDKs/MacOSX14.2.sdk/usr/bin/swift-plugin-server -external-plugin-path /Applications/Xcode-15.2.0.app/Contents/Developer/Platforms/MacOSX.platform/Developer/SDKs/MacOSX14.2.sdk/usr/local/lib/swift/host/plugins\#/Applications/Xcode-15.2.0.app/Contents/Developer/Platforms/MacOSX.platform/Developer/SDKs/MacOSX14.2.sdk/usr/bin/swift-plugin-server -external-plugin-path /Applications/Xcode-15.2.0.app/Contents/Developer/Platforms/MacOSX.platform/Developer/usr/lib/swift/host/plugins\#/Applications/Xcode-15.2.0.app/Contents/Developer/Platforms/MacOSX.platform/Developer/usr/bin/swift-plugin-server -external-plugin-path /Applications/Xcode-15.2.0.app/Contents/Developer/Platforms/MacOSX.platform/Developer/usr/local/lib/swift/host/plugins\#/Applications/Xcode-15.2.0.app/Contents/Developer/Platforms/MacOSX.platform/Developer/usr/bin/swift-plugin-server -plugin-path /Applications/Xcode-15.2.0.app/Contents/Developer/Toolchains/XcodeDefault.xctoolchain/usr/lib/swift/host/plugins -plugin-path /Applications/Xcode-15.2.0.app/Contents/Developer/Toolchains/XcodeDefault.xctoolchain/usr/local/lib/swift/host/plugins -o /Users/admin/builder/spi-builder-workspace/.derivedData/Build/Intermediates.noindex/DeclarativeTextKit.build/Debug/DeclarativeTextKitTests.build/Objects-normal/arm64/ConditionalTests.o -o /Users/admin/builder/spi-builder-workspace/.derivedData/Build/Intermediates.noindex/DeclarativeTextKit.build/Debug/DeclarativeTextKitTests.build/Objects-normal/arm64/DeleteTests.o -index-unit-output-path /DeclarativeTextKit.build/Debug/DeclarativeTextKitTests.build/Objects-normal/arm64/ConditionalTests.o -index-unit-output-path /DeclarativeTextKit.build/Debug/DeclarativeTextKitTests.build/Objects-normal/arm64/DeleteTests.o -index-store-path /Users/admin/builder/spi-builder-workspace/.derivedData/Index.noindex/DataStore -index-system-modules
SwiftCompile normal arm64 /Users/admin/builder/spi-builder-workspace/Tests/DeclarativeTextKitTests/DeleteTests.swift (in target 'DeclarativeTextKitTests' from project 'DeclarativeTextKit')
    cd /Users/admin/builder/spi-builder-workspace
    /Applications/Xcode-15.2.0.app/Contents/Developer/Toolchains/XcodeDefault.xctoolchain/usr/bin/swift-frontend -c /Users/admin/builder/spi-builder-workspace/Tests/DeclarativeTextKitTests/AffectedRangeTests.swift /Users/admin/builder/spi-builder-workspace/Tests/DeclarativeTextKitTests/AssertModification.swift -primary-file /Users/admin/builder/spi-builder-workspace/Tests/DeclarativeTextKitTests/ConditionalTests.swift -primary-file /Users/admin/builder/spi-builder-workspace/Tests/DeclarativeTextKitTests/DeleteTests.swift /Users/admin/builder/spi-builder-workspace/Tests/DeclarativeTextKitTests/Helpers.swift /Users/admin/builder/spi-builder-workspace/Tests/DeclarativeTextKitTests/InsertTests.swift /Users/admin/builder/spi-builder-workspace/Tests/DeclarativeTextKitTests/LoggingUndoManager.swift /Users/admin/builder/spi-builder-workspace/Tests/DeclarativeTextKitTests/ModifyingTests.swift /Users/admin/builder/spi-builder-workspace/Tests/DeclarativeTextKitTests/ScopedBufferSliceTests.swift /Users/admin/builder/spi-builder-workspace/Tests/DeclarativeTextKitTests/SelectTests.swift /Users/admin/builder/spi-builder-workspace/Tests/DeclarativeTextKitTests/UndoableBufferTests.swift /Users/admin/builder/spi-builder-workspace/Tests/DeclarativeTextKitTests/UseCaseTests.swift -emit-dependencies-path /Users/admin/builder/spi-builder-workspace/.derivedData/Build/Intermediates.noindex/DeclarativeTextKit.build/Debug/DeclarativeTextKitTests.build/Objects-normal/arm64/ConditionalTests.d -emit-const-values-path /Users/admin/builder/spi-builder-workspace/.derivedData/Build/Intermediates.noindex/DeclarativeTextKit.build/Debug/DeclarativeTextKitTests.build/Objects-normal/arm64/ConditionalTests.swiftconstvalues -emit-reference-dependencies-path /Users/admin/builder/spi-builder-workspace/.derivedData/Build/Intermediates.noindex/DeclarativeTextKit.build/Debug/DeclarativeTextKitTests.build/Objects-normal/arm64/ConditionalTests.swiftdeps -serialize-diagnostics-path /Users/admin/builder/spi-builder-workspace/.derivedData/Build/Intermediates.noindex/DeclarativeTextKit.build/Debug/DeclarativeTextKitTests.build/Objects-normal/arm64/ConditionalTests.dia -emit-dependencies-path /Users/admin/builder/spi-builder-workspace/.derivedData/Build/Intermediates.noindex/DeclarativeTextKit.build/Debug/DeclarativeTextKitTests.build/Objects-normal/arm64/DeleteTests.d -emit-const-values-path /Users/admin/builder/spi-builder-workspace/.derivedData/Build/Intermediates.noindex/DeclarativeTextKit.build/Debug/DeclarativeTextKitTests.build/Objects-normal/arm64/DeleteTests.swiftconstvalues -emit-reference-dependencies-path /Users/admin/builder/spi-builder-workspace/.derivedData/Build/Intermediates.noindex/DeclarativeTextKit.build/Debug/DeclarativeTextKitTests.build/Objects-normal/arm64/DeleteTests.swiftdeps -serialize-diagnostics-path /Users/admin/builder/spi-builder-workspace/.derivedData/Build/Intermediates.noindex/DeclarativeTextKit.build/Debug/DeclarativeTextKitTests.build/Objects-normal/arm64/DeleteTests.dia -target arm64-apple-macos13.0 -Xllvm -aarch64-use-tbi -enable-objc-interop -stack-check -sdk /Applications/Xcode-15.2.0.app/Contents/Developer/Platforms/MacOSX.platform/Developer/SDKs/MacOSX14.2.sdk -I /Users/admin/builder/spi-builder-workspace/.derivedData/Build/Products/Debug -I /Applications/Xcode-15.2.0.app/Contents/Developer/Platforms/MacOSX.platform/Developer/usr/lib -F /Users/admin/builder/spi-builder-workspace/.derivedData/Build/Products/Debug/PackageFrameworks -F /Users/admin/builder/spi-builder-workspace/.derivedData/Build/Products/Debug/PackageFrameworks -F /Users/admin/builder/spi-builder-workspace/.derivedData/Build/Products/Debug/PackageFrameworks -F /Users/admin/builder/spi-builder-workspace/.derivedData/Build/Products/Debug -F /Applications/Xcode-15.2.0.app/Contents/Developer/Platforms/MacOSX.platform/Developer/Library/Frameworks -no-color-diagnostics -enable-testing -g -module-cache-path /Users/admin/builder/spi-builder-workspace/.derivedData/ModuleCache.noindex -profile-generate -profile-coverage-mapping -swift-version 5 -enforce-exclusivity\=checked -Onone -D SWIFT_PACKAGE -D DEBUG -D Xcode -serialize-debugging-options -package-name spi_builder_workspace -const-gather-protocols-file /Users/admin/builder/spi-builder-workspace/.derivedData/Build/Intermediates.noindex/DeclarativeTextKit.build/Debug/DeclarativeTextKitTests.build/Objects-normal/arm64/DeclarativeTextKitTests_const_extract_protocols.json -empty-abi-descriptor -validate-clang-modules-once -clang-build-session-file /Users/admin/builder/spi-builder-workspace/.derivedData/ModuleCache.noindex/Session.modulevalidation -Xcc -working-directory -Xcc /Users/admin/builder/spi-builder-workspace -resource-dir /Applications/Xcode-15.2.0.app/Contents/Developer/Toolchains/XcodeDefault.xctoolchain/usr/lib/swift -enable-anonymous-context-mangled-names -Xcc -ivfsstatcache -Xcc /Users/admin/builder/spi-builder-workspace/.derivedData/SDKStatCaches.noindex/macosx14.2-23C53-ddea79c7890ab41bba4a63928c655a96.sdkstatcache -Xcc -I/Users/admin/builder/spi-builder-workspace/.derivedData/Build/Products/Debug/include -Xcc -I/Users/admin/builder/spi-builder-workspace/.derivedData/Build/Intermediates.noindex/DeclarativeTextKit.build/Debug/DeclarativeTextKitTests.build/DerivedSources-normal/arm64 -Xcc -I/Users/admin/builder/spi-builder-workspace/.derivedData/Build/Intermediates.noindex/DeclarativeTextKit.build/Debug/DeclarativeTextKitTests.build/DerivedSources/arm64 -Xcc -I/Users/admin/builder/spi-builder-workspace/.derivedData/Build/Intermediates.noindex/DeclarativeTextKit.build/Debug/DeclarativeTextKitTests.build/DerivedSources -Xcc -DSWIFT_PACKAGE -Xcc -DDEBUG\=1 -module-name DeclarativeTextKitTests -frontend-parseable-output -disable-clang-spi -target-sdk-version 14.2 -target-sdk-name macosx14.2 -external-plugin-path /Applications/Xcode-15.2.0.app/Contents/Developer/Platforms/MacOSX.platform/Developer/SDKs/MacOSX14.2.sdk/usr/lib/swift/host/plugins\#/Applications/Xcode-15.2.0.app/Contents/Developer/Platforms/MacOSX.platform/Developer/SDKs/MacOSX14.2.sdk/usr/bin/swift-plugin-server -external-plugin-path /Applications/Xcode-15.2.0.app/Contents/Developer/Platforms/MacOSX.platform/Developer/SDKs/MacOSX14.2.sdk/usr/local/lib/swift/host/plugins\#/Applications/Xcode-15.2.0.app/Contents/Developer/Platforms/MacOSX.platform/Developer/SDKs/MacOSX14.2.sdk/usr/bin/swift-plugin-server -external-plugin-path /Applications/Xcode-15.2.0.app/Contents/Developer/Platforms/MacOSX.platform/Developer/usr/lib/swift/host/plugins\#/Applications/Xcode-15.2.0.app/Contents/Developer/Platforms/MacOSX.platform/Developer/usr/bin/swift-plugin-server -external-plugin-path /Applications/Xcode-15.2.0.app/Contents/Developer/Platforms/MacOSX.platform/Developer/usr/local/lib/swift/host/plugins\#/Applications/Xcode-15.2.0.app/Contents/Developer/Platforms/MacOSX.platform/Developer/usr/bin/swift-plugin-server -plugin-path /Applications/Xcode-15.2.0.app/Contents/Developer/Toolchains/XcodeDefault.xctoolchain/usr/lib/swift/host/plugins -plugin-path /Applications/Xcode-15.2.0.app/Contents/Developer/Toolchains/XcodeDefault.xctoolchain/usr/local/lib/swift/host/plugins -o /Users/admin/builder/spi-builder-workspace/.derivedData/Build/Intermediates.noindex/DeclarativeTextKit.build/Debug/DeclarativeTextKitTests.build/Objects-normal/arm64/ConditionalTests.o -o /Users/admin/builder/spi-builder-workspace/.derivedData/Build/Intermediates.noindex/DeclarativeTextKit.build/Debug/DeclarativeTextKitTests.build/Objects-normal/arm64/DeleteTests.o -index-unit-output-path /DeclarativeTextKit.build/Debug/DeclarativeTextKitTests.build/Objects-normal/arm64/ConditionalTests.o -index-unit-output-path /DeclarativeTextKit.build/Debug/DeclarativeTextKitTests.build/Objects-normal/arm64/DeleteTests.o -index-store-path /Users/admin/builder/spi-builder-workspace/.derivedData/Index.noindex/DataStore -index-system-modules
SwiftCompile normal arm64 Compiling\ AffectedRangeTests.swift,\ AssertModification.swift /Users/admin/builder/spi-builder-workspace/Tests/DeclarativeTextKitTests/AffectedRangeTests.swift /Users/admin/builder/spi-builder-workspace/Tests/DeclarativeTextKitTests/AssertModification.swift (in target 'DeclarativeTextKitTests' from project 'DeclarativeTextKit')
    cd /Users/admin/builder/spi-builder-workspace
    builtin-swiftTaskExecution -- /Applications/Xcode-15.2.0.app/Contents/Developer/Toolchains/XcodeDefault.xctoolchain/usr/bin/swift-frontend -frontend -c -primary-file /Users/admin/builder/spi-builder-workspace/Tests/DeclarativeTextKitTests/AffectedRangeTests.swift -primary-file /Users/admin/builder/spi-builder-workspace/Tests/DeclarativeTextKitTests/AssertModification.swift /Users/admin/builder/spi-builder-workspace/Tests/DeclarativeTextKitTests/ConditionalTests.swift /Users/admin/builder/spi-builder-workspace/Tests/DeclarativeTextKitTests/DeleteTests.swift /Users/admin/builder/spi-builder-workspace/Tests/DeclarativeTextKitTests/Helpers.swift /Users/admin/builder/spi-builder-workspace/Tests/DeclarativeTextKitTests/InsertTests.swift /Users/admin/builder/spi-builder-workspace/Tests/DeclarativeTextKitTests/LoggingUndoManager.swift /Users/admin/builder/spi-builder-workspace/Tests/DeclarativeTextKitTests/ModifyingTests.swift /Users/admin/builder/spi-builder-workspace/Tests/DeclarativeTextKitTests/ScopedBufferSliceTests.swift /Users/admin/builder/spi-builder-workspace/Tests/DeclarativeTextKitTests/SelectTests.swift /Users/admin/builder/spi-builder-workspace/Tests/DeclarativeTextKitTests/UndoableBufferTests.swift /Users/admin/builder/spi-builder-workspace/Tests/DeclarativeTextKitTests/UseCaseTests.swift -emit-dependencies-path /Users/admin/builder/spi-builder-workspace/.derivedData/Build/Intermediates.noindex/DeclarativeTextKit.build/Debug/DeclarativeTextKitTests.build/Objects-normal/arm64/AffectedRangeTests.d -emit-const-values-path /Users/admin/builder/spi-builder-workspace/.derivedData/Build/Intermediates.noindex/DeclarativeTextKit.build/Debug/DeclarativeTextKitTests.build/Objects-normal/arm64/AffectedRangeTests.swiftconstvalues -emit-reference-dependencies-path /Users/admin/builder/spi-builder-workspace/.derivedData/Build/Intermediates.noindex/DeclarativeTextKit.build/Debug/DeclarativeTextKitTests.build/Objects-normal/arm64/AffectedRangeTests.swiftdeps -serialize-diagnostics-path /Users/admin/builder/spi-builder-workspace/.derivedData/Build/Intermediates.noindex/DeclarativeTextKit.build/Debug/DeclarativeTextKitTests.build/Objects-normal/arm64/AffectedRangeTests.dia -emit-dependencies-path /Users/admin/builder/spi-builder-workspace/.derivedData/Build/Intermediates.noindex/DeclarativeTextKit.build/Debug/DeclarativeTextKitTests.build/Objects-normal/arm64/AssertModification.d -emit-const-values-path /Users/admin/builder/spi-builder-workspace/.derivedData/Build/Intermediates.noindex/DeclarativeTextKit.build/Debug/DeclarativeTextKitTests.build/Objects-normal/arm64/AssertModification.swiftconstvalues -emit-reference-dependencies-path /Users/admin/builder/spi-builder-workspace/.derivedData/Build/Intermediates.noindex/DeclarativeTextKit.build/Debug/DeclarativeTextKitTests.build/Objects-normal/arm64/AssertModification.swiftdeps -serialize-diagnostics-path /Users/admin/builder/spi-builder-workspace/.derivedData/Build/Intermediates.noindex/DeclarativeTextKit.build/Debug/DeclarativeTextKitTests.build/Objects-normal/arm64/AssertModification.dia -target arm64-apple-macos13.0 -Xllvm -aarch64-use-tbi -enable-objc-interop -stack-check -sdk /Applications/Xcode-15.2.0.app/Contents/Developer/Platforms/MacOSX.platform/Developer/SDKs/MacOSX14.2.sdk -I /Users/admin/builder/spi-builder-workspace/.derivedData/Build/Products/Debug -I /Applications/Xcode-15.2.0.app/Contents/Developer/Platforms/MacOSX.platform/Developer/usr/lib -F /Users/admin/builder/spi-builder-workspace/.derivedData/Build/Products/Debug/PackageFrameworks -F /Users/admin/builder/spi-builder-workspace/.derivedData/Build/Products/Debug/PackageFrameworks -F /Users/admin/builder/spi-builder-workspace/.derivedData/Build/Products/Debug/PackageFrameworks -F /Users/admin/builder/spi-builder-workspace/.derivedData/Build/Products/Debug -F /Applications/Xcode-15.2.0.app/Contents/Developer/Platforms/MacOSX.platform/Developer/Library/Frameworks -no-color-diagnostics -enable-testing -g -module-cache-path /Users/admin/builder/spi-builder-workspace/.derivedData/ModuleCache.noindex -profile-generate -profile-coverage-mapping -swift-version 5 -enforce-exclusivity\=checked -Onone -D SWIFT_PACKAGE -D DEBUG -D Xcode -serialize-debugging-options -package-name spi_builder_workspace -const-gather-protocols-file /Users/admin/builder/spi-builder-workspace/.derivedData/Build/Intermediates.noindex/DeclarativeTextKit.build/Debug/DeclarativeTextKitTests.build/Objects-normal/arm64/DeclarativeTextKitTests_const_extract_protocols.json -empty-abi-descriptor -validate-clang-modules-once -clang-build-session-file /Users/admin/builder/spi-builder-workspace/.derivedData/ModuleCache.noindex/Session.modulevalidation -Xcc -working-directory -Xcc /Users/admin/builder/spi-builder-workspace -resource-dir /Applications/Xcode-15.2.0.app/Contents/Developer/Toolchains/XcodeDefault.xctoolchain/usr/lib/swift -enable-anonymous-context-mangled-names -Xcc -ivfsstatcache -Xcc /Users/admin/builder/spi-builder-workspace/.derivedData/SDKStatCaches.noindex/macosx14.2-23C53-ddea79c7890ab41bba4a63928c655a96.sdkstatcache -Xcc -I/Users/admin/builder/spi-builder-workspace/.derivedData/Build/Products/Debug/include -Xcc -I/Users/admin/builder/spi-builder-workspace/.derivedData/Build/Intermediates.noindex/DeclarativeTextKit.build/Debug/DeclarativeTextKitTests.build/DerivedSources-normal/arm64 -Xcc -I/Users/admin/builder/spi-builder-workspace/.derivedData/Build/Intermediates.noindex/DeclarativeTextKit.build/Debug/DeclarativeTextKitTests.build/DerivedSources/arm64 -Xcc -I/Users/admin/builder/spi-builder-workspace/.derivedData/Build/Intermediates.noindex/DeclarativeTextKit.build/Debug/DeclarativeTextKitTests.build/DerivedSources -Xcc -DSWIFT_PACKAGE -Xcc -DDEBUG\=1 -module-name DeclarativeTextKitTests -frontend-parseable-output -disable-clang-spi -target-sdk-version 14.2 -target-sdk-name macosx14.2 -external-plugin-path /Applications/Xcode-15.2.0.app/Contents/Developer/Platforms/MacOSX.platform/Developer/SDKs/MacOSX14.2.sdk/usr/lib/swift/host/plugins\#/Applications/Xcode-15.2.0.app/Contents/Developer/Platforms/MacOSX.platform/Developer/SDKs/MacOSX14.2.sdk/usr/bin/swift-plugin-server -external-plugin-path /Applications/Xcode-15.2.0.app/Contents/Developer/Platforms/MacOSX.platform/Developer/SDKs/MacOSX14.2.sdk/usr/local/lib/swift/host/plugins\#/Applications/Xcode-15.2.0.app/Contents/Developer/Platforms/MacOSX.platform/Developer/SDKs/MacOSX14.2.sdk/usr/bin/swift-plugin-server -external-plugin-path /Applications/Xcode-15.2.0.app/Contents/Developer/Platforms/MacOSX.platform/Developer/usr/lib/swift/host/plugins\#/Applications/Xcode-15.2.0.app/Contents/Developer/Platforms/MacOSX.platform/Developer/usr/bin/swift-plugin-server -external-plugin-path /Applications/Xcode-15.2.0.app/Contents/Developer/Platforms/MacOSX.platform/Developer/usr/local/lib/swift/host/plugins\#/Applications/Xcode-15.2.0.app/Contents/Developer/Platforms/MacOSX.platform/Developer/usr/bin/swift-plugin-server -plugin-path /Applications/Xcode-15.2.0.app/Contents/Developer/Toolchains/XcodeDefault.xctoolchain/usr/lib/swift/host/plugins -plugin-path /Applications/Xcode-15.2.0.app/Contents/Developer/Toolchains/XcodeDefault.xctoolchain/usr/local/lib/swift/host/plugins -o /Users/admin/builder/spi-builder-workspace/.derivedData/Build/Intermediates.noindex/DeclarativeTextKit.build/Debug/DeclarativeTextKitTests.build/Objects-normal/arm64/AffectedRangeTests.o -o /Users/admin/builder/spi-builder-workspace/.derivedData/Build/Intermediates.noindex/DeclarativeTextKit.build/Debug/DeclarativeTextKitTests.build/Objects-normal/arm64/AssertModification.o -index-unit-output-path /DeclarativeTextKit.build/Debug/DeclarativeTextKitTests.build/Objects-normal/arm64/AffectedRangeTests.o -index-unit-output-path /DeclarativeTextKit.build/Debug/DeclarativeTextKitTests.build/Objects-normal/arm64/AssertModification.o -index-store-path /Users/admin/builder/spi-builder-workspace/.derivedData/Index.noindex/DataStore -index-system-modules
SwiftCompile normal arm64 /Users/admin/builder/spi-builder-workspace/Tests/DeclarativeTextKitTests/AffectedRangeTests.swift (in target 'DeclarativeTextKitTests' from project 'DeclarativeTextKit')
    cd /Users/admin/builder/spi-builder-workspace
    /Applications/Xcode-15.2.0.app/Contents/Developer/Toolchains/XcodeDefault.xctoolchain/usr/bin/swift-frontend -c -primary-file /Users/admin/builder/spi-builder-workspace/Tests/DeclarativeTextKitTests/AffectedRangeTests.swift -primary-file /Users/admin/builder/spi-builder-workspace/Tests/DeclarativeTextKitTests/AssertModification.swift /Users/admin/builder/spi-builder-workspace/Tests/DeclarativeTextKitTests/ConditionalTests.swift /Users/admin/builder/spi-builder-workspace/Tests/DeclarativeTextKitTests/DeleteTests.swift /Users/admin/builder/spi-builder-workspace/Tests/DeclarativeTextKitTests/Helpers.swift /Users/admin/builder/spi-builder-workspace/Tests/DeclarativeTextKitTests/InsertTests.swift /Users/admin/builder/spi-builder-workspace/Tests/DeclarativeTextKitTests/LoggingUndoManager.swift /Users/admin/builder/spi-builder-workspace/Tests/DeclarativeTextKitTests/ModifyingTests.swift /Users/admin/builder/spi-builder-workspace/Tests/DeclarativeTextKitTests/ScopedBufferSliceTests.swift /Users/admin/builder/spi-builder-workspace/Tests/DeclarativeTextKitTests/SelectTests.swift /Users/admin/builder/spi-builder-workspace/Tests/DeclarativeTextKitTests/UndoableBufferTests.swift /Users/admin/builder/spi-builder-workspace/Tests/DeclarativeTextKitTests/UseCaseTests.swift -emit-dependencies-path /Users/admin/builder/spi-builder-workspace/.derivedData/Build/Intermediates.noindex/DeclarativeTextKit.build/Debug/DeclarativeTextKitTests.build/Objects-normal/arm64/AffectedRangeTests.d -emit-const-values-path /Users/admin/builder/spi-builder-workspace/.derivedData/Build/Intermediates.noindex/DeclarativeTextKit.build/Debug/DeclarativeTextKitTests.build/Objects-normal/arm64/AffectedRangeTests.swiftconstvalues -emit-reference-dependencies-path /Users/admin/builder/spi-builder-workspace/.derivedData/Build/Intermediates.noindex/DeclarativeTextKit.build/Debug/DeclarativeTextKitTests.build/Objects-normal/arm64/AffectedRangeTests.swiftdeps -serialize-diagnostics-path /Users/admin/builder/spi-builder-workspace/.derivedData/Build/Intermediates.noindex/DeclarativeTextKit.build/Debug/DeclarativeTextKitTests.build/Objects-normal/arm64/AffectedRangeTests.dia -emit-dependencies-path /Users/admin/builder/spi-builder-workspace/.derivedData/Build/Intermediates.noindex/DeclarativeTextKit.build/Debug/DeclarativeTextKitTests.build/Objects-normal/arm64/AssertModification.d -emit-const-values-path /Users/admin/builder/spi-builder-workspace/.derivedData/Build/Intermediates.noindex/DeclarativeTextKit.build/Debug/DeclarativeTextKitTests.build/Objects-normal/arm64/AssertModification.swiftconstvalues -emit-reference-dependencies-path /Users/admin/builder/spi-builder-workspace/.derivedData/Build/Intermediates.noindex/DeclarativeTextKit.build/Debug/DeclarativeTextKitTests.build/Objects-normal/arm64/AssertModification.swiftdeps -serialize-diagnostics-path /Users/admin/builder/spi-builder-workspace/.derivedData/Build/Intermediates.noindex/DeclarativeTextKit.build/Debug/DeclarativeTextKitTests.build/Objects-normal/arm64/AssertModification.dia -target arm64-apple-macos13.0 -Xllvm -aarch64-use-tbi -enable-objc-interop -stack-check -sdk /Applications/Xcode-15.2.0.app/Contents/Developer/Platforms/MacOSX.platform/Developer/SDKs/MacOSX14.2.sdk -I /Users/admin/builder/spi-builder-workspace/.derivedData/Build/Products/Debug -I /Applications/Xcode-15.2.0.app/Contents/Developer/Platforms/MacOSX.platform/Developer/usr/lib -F /Users/admin/builder/spi-builder-workspace/.derivedData/Build/Products/Debug/PackageFrameworks -F /Users/admin/builder/spi-builder-workspace/.derivedData/Build/Products/Debug/PackageFrameworks -F /Users/admin/builder/spi-builder-workspace/.derivedData/Build/Products/Debug/PackageFrameworks -F /Users/admin/builder/spi-builder-workspace/.derivedData/Build/Products/Debug -F /Applications/Xcode-15.2.0.app/Contents/Developer/Platforms/MacOSX.platform/Developer/Library/Frameworks -no-color-diagnostics -enable-testing -g -module-cache-path /Users/admin/builder/spi-builder-workspace/.derivedData/ModuleCache.noindex -profile-generate -profile-coverage-mapping -swift-version 5 -enforce-exclusivity\=checked -Onone -D SWIFT_PACKAGE -D DEBUG -D Xcode -serialize-debugging-options -package-name spi_builder_workspace -const-gather-protocols-file /Users/admin/builder/spi-builder-workspace/.derivedData/Build/Intermediates.noindex/DeclarativeTextKit.build/Debug/DeclarativeTextKitTests.build/Objects-normal/arm64/DeclarativeTextKitTests_const_extract_protocols.json -empty-abi-descriptor -validate-clang-modules-once -clang-build-session-file /Users/admin/builder/spi-builder-workspace/.derivedData/ModuleCache.noindex/Session.modulevalidation -Xcc -working-directory -Xcc /Users/admin/builder/spi-builder-workspace -resource-dir /Applications/Xcode-15.2.0.app/Contents/Developer/Toolchains/XcodeDefault.xctoolchain/usr/lib/swift -enable-anonymous-context-mangled-names -Xcc -ivfsstatcache -Xcc /Users/admin/builder/spi-builder-workspace/.derivedData/SDKStatCaches.noindex/macosx14.2-23C53-ddea79c7890ab41bba4a63928c655a96.sdkstatcache -Xcc -I/Users/admin/builder/spi-builder-workspace/.derivedData/Build/Products/Debug/include -Xcc -I/Users/admin/builder/spi-builder-workspace/.derivedData/Build/Intermediates.noindex/DeclarativeTextKit.build/Debug/DeclarativeTextKitTests.build/DerivedSources-normal/arm64 -Xcc -I/Users/admin/builder/spi-builder-workspace/.derivedData/Build/Intermediates.noindex/DeclarativeTextKit.build/Debug/DeclarativeTextKitTests.build/DerivedSources/arm64 -Xcc -I/Users/admin/builder/spi-builder-workspace/.derivedData/Build/Intermediates.noindex/DeclarativeTextKit.build/Debug/DeclarativeTextKitTests.build/DerivedSources -Xcc -DSWIFT_PACKAGE -Xcc -DDEBUG\=1 -module-name DeclarativeTextKitTests -frontend-parseable-output -disable-clang-spi -target-sdk-version 14.2 -target-sdk-name macosx14.2 -external-plugin-path /Applications/Xcode-15.2.0.app/Contents/Developer/Platforms/MacOSX.platform/Developer/SDKs/MacOSX14.2.sdk/usr/lib/swift/host/plugins\#/Applications/Xcode-15.2.0.app/Contents/Developer/Platforms/MacOSX.platform/Developer/SDKs/MacOSX14.2.sdk/usr/bin/swift-plugin-server -external-plugin-path /Applications/Xcode-15.2.0.app/Contents/Developer/Platforms/MacOSX.platform/Developer/SDKs/MacOSX14.2.sdk/usr/local/lib/swift/host/plugins\#/Applications/Xcode-15.2.0.app/Contents/Developer/Platforms/MacOSX.platform/Developer/SDKs/MacOSX14.2.sdk/usr/bin/swift-plugin-server -external-plugin-path /Applications/Xcode-15.2.0.app/Contents/Developer/Platforms/MacOSX.platform/Developer/usr/lib/swift/host/plugins\#/Applications/Xcode-15.2.0.app/Contents/Developer/Platforms/MacOSX.platform/Developer/usr/bin/swift-plugin-server -external-plugin-path /Applications/Xcode-15.2.0.app/Contents/Developer/Platforms/MacOSX.platform/Developer/usr/local/lib/swift/host/plugins\#/Applications/Xcode-15.2.0.app/Contents/Developer/Platforms/MacOSX.platform/Developer/usr/bin/swift-plugin-server -plugin-path /Applications/Xcode-15.2.0.app/Contents/Developer/Toolchains/XcodeDefault.xctoolchain/usr/lib/swift/host/plugins -plugin-path /Applications/Xcode-15.2.0.app/Contents/Developer/Toolchains/XcodeDefault.xctoolchain/usr/local/lib/swift/host/plugins -o /Users/admin/builder/spi-builder-workspace/.derivedData/Build/Intermediates.noindex/DeclarativeTextKit.build/Debug/DeclarativeTextKitTests.build/Objects-normal/arm64/AffectedRangeTests.o -o /Users/admin/builder/spi-builder-workspace/.derivedData/Build/Intermediates.noindex/DeclarativeTextKit.build/Debug/DeclarativeTextKitTests.build/Objects-normal/arm64/AssertModification.o -index-unit-output-path /DeclarativeTextKit.build/Debug/DeclarativeTextKitTests.build/Objects-normal/arm64/AffectedRangeTests.o -index-unit-output-path /DeclarativeTextKit.build/Debug/DeclarativeTextKitTests.build/Objects-normal/arm64/AssertModification.o -index-store-path /Users/admin/builder/spi-builder-workspace/.derivedData/Index.noindex/DataStore -index-system-modules
SwiftCompile normal arm64 /Users/admin/builder/spi-builder-workspace/Tests/DeclarativeTextKitTests/AssertModification.swift (in target 'DeclarativeTextKitTests' from project 'DeclarativeTextKit')
    cd /Users/admin/builder/spi-builder-workspace
    /Applications/Xcode-15.2.0.app/Contents/Developer/Toolchains/XcodeDefault.xctoolchain/usr/bin/swift-frontend -c -primary-file /Users/admin/builder/spi-builder-workspace/Tests/DeclarativeTextKitTests/AffectedRangeTests.swift -primary-file /Users/admin/builder/spi-builder-workspace/Tests/DeclarativeTextKitTests/AssertModification.swift /Users/admin/builder/spi-builder-workspace/Tests/DeclarativeTextKitTests/ConditionalTests.swift /Users/admin/builder/spi-builder-workspace/Tests/DeclarativeTextKitTests/DeleteTests.swift /Users/admin/builder/spi-builder-workspace/Tests/DeclarativeTextKitTests/Helpers.swift /Users/admin/builder/spi-builder-workspace/Tests/DeclarativeTextKitTests/InsertTests.swift /Users/admin/builder/spi-builder-workspace/Tests/DeclarativeTextKitTests/LoggingUndoManager.swift /Users/admin/builder/spi-builder-workspace/Tests/DeclarativeTextKitTests/ModifyingTests.swift /Users/admin/builder/spi-builder-workspace/Tests/DeclarativeTextKitTests/ScopedBufferSliceTests.swift /Users/admin/builder/spi-builder-workspace/Tests/DeclarativeTextKitTests/SelectTests.swift /Users/admin/builder/spi-builder-workspace/Tests/DeclarativeTextKitTests/UndoableBufferTests.swift /Users/admin/builder/spi-builder-workspace/Tests/DeclarativeTextKitTests/UseCaseTests.swift -emit-dependencies-path /Users/admin/builder/spi-builder-workspace/.derivedData/Build/Intermediates.noindex/DeclarativeTextKit.build/Debug/DeclarativeTextKitTests.build/Objects-normal/arm64/AffectedRangeTests.d -emit-const-values-path /Users/admin/builder/spi-builder-workspace/.derivedData/Build/Intermediates.noindex/DeclarativeTextKit.build/Debug/DeclarativeTextKitTests.build/Objects-normal/arm64/AffectedRangeTests.swiftconstvalues -emit-reference-dependencies-path /Users/admin/builder/spi-builder-workspace/.derivedData/Build/Intermediates.noindex/DeclarativeTextKit.build/Debug/DeclarativeTextKitTests.build/Objects-normal/arm64/AffectedRangeTests.swiftdeps -serialize-diagnostics-path /Users/admin/builder/spi-builder-workspace/.derivedData/Build/Intermediates.noindex/DeclarativeTextKit.build/Debug/DeclarativeTextKitTests.build/Objects-normal/arm64/AffectedRangeTests.dia -emit-dependencies-path /Users/admin/builder/spi-builder-workspace/.derivedData/Build/Intermediates.noindex/DeclarativeTextKit.build/Debug/DeclarativeTextKitTests.build/Objects-normal/arm64/AssertModification.d -emit-const-values-path /Users/admin/builder/spi-builder-workspace/.derivedData/Build/Intermediates.noindex/DeclarativeTextKit.build/Debug/DeclarativeTextKitTests.build/Objects-normal/arm64/AssertModification.swiftconstvalues -emit-reference-dependencies-path /Users/admin/builder/spi-builder-workspace/.derivedData/Build/Intermediates.noindex/DeclarativeTextKit.build/Debug/DeclarativeTextKitTests.build/Objects-normal/arm64/AssertModification.swiftdeps -serialize-diagnostics-path /Users/admin/builder/spi-builder-workspace/.derivedData/Build/Intermediates.noindex/DeclarativeTextKit.build/Debug/DeclarativeTextKitTests.build/Objects-normal/arm64/AssertModification.dia -target arm64-apple-macos13.0 -Xllvm -aarch64-use-tbi -enable-objc-interop -stack-check -sdk /Applications/Xcode-15.2.0.app/Contents/Developer/Platforms/MacOSX.platform/Developer/SDKs/MacOSX14.2.sdk -I /Users/admin/builder/spi-builder-workspace/.derivedData/Build/Products/Debug -I /Applications/Xcode-15.2.0.app/Contents/Developer/Platforms/MacOSX.platform/Developer/usr/lib -F /Users/admin/builder/spi-builder-workspace/.derivedData/Build/Products/Debug/PackageFrameworks -F /Users/admin/builder/spi-builder-workspace/.derivedData/Build/Products/Debug/PackageFrameworks -F /Users/admin/builder/spi-builder-workspace/.derivedData/Build/Products/Debug/PackageFrameworks -F /Users/admin/builder/spi-builder-workspace/.derivedData/Build/Products/Debug -F /Applications/Xcode-15.2.0.app/Contents/Developer/Platforms/MacOSX.platform/Developer/Library/Frameworks -no-color-diagnostics -enable-testing -g -module-cache-path /Users/admin/builder/spi-builder-workspace/.derivedData/ModuleCache.noindex -profile-generate -profile-coverage-mapping -swift-version 5 -enforce-exclusivity\=checked -Onone -D SWIFT_PACKAGE -D DEBUG -D Xcode -serialize-debugging-options -package-name spi_builder_workspace -const-gather-protocols-file /Users/admin/builder/spi-builder-workspace/.derivedData/Build/Intermediates.noindex/DeclarativeTextKit.build/Debug/DeclarativeTextKitTests.build/Objects-normal/arm64/DeclarativeTextKitTests_const_extract_protocols.json -empty-abi-descriptor -validate-clang-modules-once -clang-build-session-file /Users/admin/builder/spi-builder-workspace/.derivedData/ModuleCache.noindex/Session.modulevalidation -Xcc -working-directory -Xcc /Users/admin/builder/spi-builder-workspace -resource-dir /Applications/Xcode-15.2.0.app/Contents/Developer/Toolchains/XcodeDefault.xctoolchain/usr/lib/swift -enable-anonymous-context-mangled-names -Xcc -ivfsstatcache -Xcc /Users/admin/builder/spi-builder-workspace/.derivedData/SDKStatCaches.noindex/macosx14.2-23C53-ddea79c7890ab41bba4a63928c655a96.sdkstatcache -Xcc -I/Users/admin/builder/spi-builder-workspace/.derivedData/Build/Products/Debug/include -Xcc -I/Users/admin/builder/spi-builder-workspace/.derivedData/Build/Intermediates.noindex/DeclarativeTextKit.build/Debug/DeclarativeTextKitTests.build/DerivedSources-normal/arm64 -Xcc -I/Users/admin/builder/spi-builder-workspace/.derivedData/Build/Intermediates.noindex/DeclarativeTextKit.build/Debug/DeclarativeTextKitTests.build/DerivedSources/arm64 -Xcc -I/Users/admin/builder/spi-builder-workspace/.derivedData/Build/Intermediates.noindex/DeclarativeTextKit.build/Debug/DeclarativeTextKitTests.build/DerivedSources -Xcc -DSWIFT_PACKAGE -Xcc -DDEBUG\=1 -module-name DeclarativeTextKitTests -frontend-parseable-output -disable-clang-spi -target-sdk-version 14.2 -target-sdk-name macosx14.2 -external-plugin-path /Applications/Xcode-15.2.0.app/Contents/Developer/Platforms/MacOSX.platform/Developer/SDKs/MacOSX14.2.sdk/usr/lib/swift/host/plugins\#/Applications/Xcode-15.2.0.app/Contents/Developer/Platforms/MacOSX.platform/Developer/SDKs/MacOSX14.2.sdk/usr/bin/swift-plugin-server -external-plugin-path /Applications/Xcode-15.2.0.app/Contents/Developer/Platforms/MacOSX.platform/Developer/SDKs/MacOSX14.2.sdk/usr/local/lib/swift/host/plugins\#/Applications/Xcode-15.2.0.app/Contents/Developer/Platforms/MacOSX.platform/Developer/SDKs/MacOSX14.2.sdk/usr/bin/swift-plugin-server -external-plugin-path /Applications/Xcode-15.2.0.app/Contents/Developer/Platforms/MacOSX.platform/Developer/usr/lib/swift/host/plugins\#/Applications/Xcode-15.2.0.app/Contents/Developer/Platforms/MacOSX.platform/Developer/usr/bin/swift-plugin-server -external-plugin-path /Applications/Xcode-15.2.0.app/Contents/Developer/Platforms/MacOSX.platform/Developer/usr/local/lib/swift/host/plugins\#/Applications/Xcode-15.2.0.app/Contents/Developer/Platforms/MacOSX.platform/Developer/usr/bin/swift-plugin-server -plugin-path /Applications/Xcode-15.2.0.app/Contents/Developer/Toolchains/XcodeDefault.xctoolchain/usr/lib/swift/host/plugins -plugin-path /Applications/Xcode-15.2.0.app/Contents/Developer/Toolchains/XcodeDefault.xctoolchain/usr/local/lib/swift/host/plugins -o /Users/admin/builder/spi-builder-workspace/.derivedData/Build/Intermediates.noindex/DeclarativeTextKit.build/Debug/DeclarativeTextKitTests.build/Objects-normal/arm64/AffectedRangeTests.o -o /Users/admin/builder/spi-builder-workspace/.derivedData/Build/Intermediates.noindex/DeclarativeTextKit.build/Debug/DeclarativeTextKitTests.build/Objects-normal/arm64/AssertModification.o -index-unit-output-path /DeclarativeTextKit.build/Debug/DeclarativeTextKitTests.build/Objects-normal/arm64/AffectedRangeTests.o -index-unit-output-path /DeclarativeTextKit.build/Debug/DeclarativeTextKitTests.build/Objects-normal/arm64/AssertModification.o -index-store-path /Users/admin/builder/spi-builder-workspace/.derivedData/Index.noindex/DataStore -index-system-modules
SwiftCompile normal arm64 Compiling\ ModifyingTests.swift /Users/admin/builder/spi-builder-workspace/Tests/DeclarativeTextKitTests/ModifyingTests.swift (in target 'DeclarativeTextKitTests' from project 'DeclarativeTextKit')
    cd /Users/admin/builder/spi-builder-workspace
    builtin-swiftTaskExecution -- /Applications/Xcode-15.2.0.app/Contents/Developer/Toolchains/XcodeDefault.xctoolchain/usr/bin/swift-frontend -frontend -c /Users/admin/builder/spi-builder-workspace/Tests/DeclarativeTextKitTests/AffectedRangeTests.swift /Users/admin/builder/spi-builder-workspace/Tests/DeclarativeTextKitTests/AssertModification.swift /Users/admin/builder/spi-builder-workspace/Tests/DeclarativeTextKitTests/ConditionalTests.swift /Users/admin/builder/spi-builder-workspace/Tests/DeclarativeTextKitTests/DeleteTests.swift /Users/admin/builder/spi-builder-workspace/Tests/DeclarativeTextKitTests/Helpers.swift /Users/admin/builder/spi-builder-workspace/Tests/DeclarativeTextKitTests/InsertTests.swift /Users/admin/builder/spi-builder-workspace/Tests/DeclarativeTextKitTests/LoggingUndoManager.swift -primary-file /Users/admin/builder/spi-builder-workspace/Tests/DeclarativeTextKitTests/ModifyingTests.swift /Users/admin/builder/spi-builder-workspace/Tests/DeclarativeTextKitTests/ScopedBufferSliceTests.swift /Users/admin/builder/spi-builder-workspace/Tests/DeclarativeTextKitTests/SelectTests.swift /Users/admin/builder/spi-builder-workspace/Tests/DeclarativeTextKitTests/UndoableBufferTests.swift /Users/admin/builder/spi-builder-workspace/Tests/DeclarativeTextKitTests/UseCaseTests.swift -emit-dependencies-path /Users/admin/builder/spi-builder-workspace/.derivedData/Build/Intermediates.noindex/DeclarativeTextKit.build/Debug/DeclarativeTextKitTests.build/Objects-normal/arm64/ModifyingTests.d -emit-const-values-path /Users/admin/builder/spi-builder-workspace/.derivedData/Build/Intermediates.noindex/DeclarativeTextKit.build/Debug/DeclarativeTextKitTests.build/Objects-normal/arm64/ModifyingTests.swiftconstvalues -emit-reference-dependencies-path /Users/admin/builder/spi-builder-workspace/.derivedData/Build/Intermediates.noindex/DeclarativeTextKit.build/Debug/DeclarativeTextKitTests.build/Objects-normal/arm64/ModifyingTests.swiftdeps -serialize-diagnostics-path /Users/admin/builder/spi-builder-workspace/.derivedData/Build/Intermediates.noindex/DeclarativeTextKit.build/Debug/DeclarativeTextKitTests.build/Objects-normal/arm64/ModifyingTests.dia -target arm64-apple-macos13.0 -Xllvm -aarch64-use-tbi -enable-objc-interop -stack-check -sdk /Applications/Xcode-15.2.0.app/Contents/Developer/Platforms/MacOSX.platform/Developer/SDKs/MacOSX14.2.sdk -I /Users/admin/builder/spi-builder-workspace/.derivedData/Build/Products/Debug -I /Applications/Xcode-15.2.0.app/Contents/Developer/Platforms/MacOSX.platform/Developer/usr/lib -F /Users/admin/builder/spi-builder-workspace/.derivedData/Build/Products/Debug/PackageFrameworks -F /Users/admin/builder/spi-builder-workspace/.derivedData/Build/Products/Debug/PackageFrameworks -F /Users/admin/builder/spi-builder-workspace/.derivedData/Build/Products/Debug/PackageFrameworks -F /Users/admin/builder/spi-builder-workspace/.derivedData/Build/Products/Debug -F /Applications/Xcode-15.2.0.app/Contents/Developer/Platforms/MacOSX.platform/Developer/Library/Frameworks -no-color-diagnostics -enable-testing -g -module-cache-path /Users/admin/builder/spi-builder-workspace/.derivedData/ModuleCache.noindex -profile-generate -profile-coverage-mapping -swift-version 5 -enforce-exclusivity\=checked -Onone -D SWIFT_PACKAGE -D DEBUG -D Xcode -serialize-debugging-options -package-name spi_builder_workspace -const-gather-protocols-file /Users/admin/builder/spi-builder-workspace/.derivedData/Build/Intermediates.noindex/DeclarativeTextKit.build/Debug/DeclarativeTextKitTests.build/Objects-normal/arm64/DeclarativeTextKitTests_const_extract_protocols.json -empty-abi-descriptor -validate-clang-modules-once -clang-build-session-file /Users/admin/builder/spi-builder-workspace/.derivedData/ModuleCache.noindex/Session.modulevalidation -Xcc -working-directory -Xcc /Users/admin/builder/spi-builder-workspace -resource-dir /Applications/Xcode-15.2.0.app/Contents/Developer/Toolchains/XcodeDefault.xctoolchain/usr/lib/swift -enable-anonymous-context-mangled-names -Xcc -ivfsstatcache -Xcc /Users/admin/builder/spi-builder-workspace/.derivedData/SDKStatCaches.noindex/macosx14.2-23C53-ddea79c7890ab41bba4a63928c655a96.sdkstatcache -Xcc -I/Users/admin/builder/spi-builder-workspace/.derivedData/Build/Products/Debug/include -Xcc -I/Users/admin/builder/spi-builder-workspace/.derivedData/Build/Intermediates.noindex/DeclarativeTextKit.build/Debug/DeclarativeTextKitTests.build/DerivedSources-normal/arm64 -Xcc -I/Users/admin/builder/spi-builder-workspace/.derivedData/Build/Intermediates.noindex/DeclarativeTextKit.build/Debug/DeclarativeTextKitTests.build/DerivedSources/arm64 -Xcc -I/Users/admin/builder/spi-builder-workspace/.derivedData/Build/Intermediates.noindex/DeclarativeTextKit.build/Debug/DeclarativeTextKitTests.build/DerivedSources -Xcc -DSWIFT_PACKAGE -Xcc -DDEBUG\=1 -module-name DeclarativeTextKitTests -frontend-parseable-output -disable-clang-spi -target-sdk-version 14.2 -target-sdk-name macosx14.2 -external-plugin-path /Applications/Xcode-15.2.0.app/Contents/Developer/Platforms/MacOSX.platform/Developer/SDKs/MacOSX14.2.sdk/usr/lib/swift/host/plugins\#/Applications/Xcode-15.2.0.app/Contents/Developer/Platforms/MacOSX.platform/Developer/SDKs/MacOSX14.2.sdk/usr/bin/swift-plugin-server -external-plugin-path /Applications/Xcode-15.2.0.app/Contents/Developer/Platforms/MacOSX.platform/Developer/SDKs/MacOSX14.2.sdk/usr/local/lib/swift/host/plugins\#/Applications/Xcode-15.2.0.app/Contents/Developer/Platforms/MacOSX.platform/Developer/SDKs/MacOSX14.2.sdk/usr/bin/swift-plugin-server -external-plugin-path /Applications/Xcode-15.2.0.app/Contents/Developer/Platforms/MacOSX.platform/Developer/usr/lib/swift/host/plugins\#/Applications/Xcode-15.2.0.app/Contents/Developer/Platforms/MacOSX.platform/Developer/usr/bin/swift-plugin-server -external-plugin-path /Applications/Xcode-15.2.0.app/Contents/Developer/Platforms/MacOSX.platform/Developer/usr/local/lib/swift/host/plugins\#/Applications/Xcode-15.2.0.app/Contents/Developer/Platforms/MacOSX.platform/Developer/usr/bin/swift-plugin-server -plugin-path /Applications/Xcode-15.2.0.app/Contents/Developer/Toolchains/XcodeDefault.xctoolchain/usr/lib/swift/host/plugins -plugin-path /Applications/Xcode-15.2.0.app/Contents/Developer/Toolchains/XcodeDefault.xctoolchain/usr/local/lib/swift/host/plugins -o /Users/admin/builder/spi-builder-workspace/.derivedData/Build/Intermediates.noindex/DeclarativeTextKit.build/Debug/DeclarativeTextKitTests.build/Objects-normal/arm64/ModifyingTests.o -index-unit-output-path /DeclarativeTextKit.build/Debug/DeclarativeTextKitTests.build/Objects-normal/arm64/ModifyingTests.o -index-store-path /Users/admin/builder/spi-builder-workspace/.derivedData/Index.noindex/DataStore -index-system-modules
SwiftCompile normal arm64 /Users/admin/builder/spi-builder-workspace/Tests/DeclarativeTextKitTests/ModifyingTests.swift (in target 'DeclarativeTextKitTests' from project 'DeclarativeTextKit')
    cd /Users/admin/builder/spi-builder-workspace
    /Applications/Xcode-15.2.0.app/Contents/Developer/Toolchains/XcodeDefault.xctoolchain/usr/bin/swift-frontend -c /Users/admin/builder/spi-builder-workspace/Tests/DeclarativeTextKitTests/AffectedRangeTests.swift /Users/admin/builder/spi-builder-workspace/Tests/DeclarativeTextKitTests/AssertModification.swift /Users/admin/builder/spi-builder-workspace/Tests/DeclarativeTextKitTests/ConditionalTests.swift /Users/admin/builder/spi-builder-workspace/Tests/DeclarativeTextKitTests/DeleteTests.swift /Users/admin/builder/spi-builder-workspace/Tests/DeclarativeTextKitTests/Helpers.swift /Users/admin/builder/spi-builder-workspace/Tests/DeclarativeTextKitTests/InsertTests.swift /Users/admin/builder/spi-builder-workspace/Tests/DeclarativeTextKitTests/LoggingUndoManager.swift -primary-file /Users/admin/builder/spi-builder-workspace/Tests/DeclarativeTextKitTests/ModifyingTests.swift /Users/admin/builder/spi-builder-workspace/Tests/DeclarativeTextKitTests/ScopedBufferSliceTests.swift /Users/admin/builder/spi-builder-workspace/Tests/DeclarativeTextKitTests/SelectTests.swift /Users/admin/builder/spi-builder-workspace/Tests/DeclarativeTextKitTests/UndoableBufferTests.swift /Users/admin/builder/spi-builder-workspace/Tests/DeclarativeTextKitTests/UseCaseTests.swift -emit-dependencies-path /Users/admin/builder/spi-builder-workspace/.derivedData/Build/Intermediates.noindex/DeclarativeTextKit.build/Debug/DeclarativeTextKitTests.build/Objects-normal/arm64/ModifyingTests.d -emit-const-values-path /Users/admin/builder/spi-builder-workspace/.derivedData/Build/Intermediates.noindex/DeclarativeTextKit.build/Debug/DeclarativeTextKitTests.build/Objects-normal/arm64/ModifyingTests.swiftconstvalues -emit-reference-dependencies-path /Users/admin/builder/spi-builder-workspace/.derivedData/Build/Intermediates.noindex/DeclarativeTextKit.build/Debug/DeclarativeTextKitTests.build/Objects-normal/arm64/ModifyingTests.swiftdeps -serialize-diagnostics-path /Users/admin/builder/spi-builder-workspace/.derivedData/Build/Intermediates.noindex/DeclarativeTextKit.build/Debug/DeclarativeTextKitTests.build/Objects-normal/arm64/ModifyingTests.dia -target arm64-apple-macos13.0 -Xllvm -aarch64-use-tbi -enable-objc-interop -stack-check -sdk /Applications/Xcode-15.2.0.app/Contents/Developer/Platforms/MacOSX.platform/Developer/SDKs/MacOSX14.2.sdk -I /Users/admin/builder/spi-builder-workspace/.derivedData/Build/Products/Debug -I /Applications/Xcode-15.2.0.app/Contents/Developer/Platforms/MacOSX.platform/Developer/usr/lib -F /Users/admin/builder/spi-builder-workspace/.derivedData/Build/Products/Debug/PackageFrameworks -F /Users/admin/builder/spi-builder-workspace/.derivedData/Build/Products/Debug/PackageFrameworks -F /Users/admin/builder/spi-builder-workspace/.derivedData/Build/Products/Debug/PackageFrameworks -F /Users/admin/builder/spi-builder-workspace/.derivedData/Build/Products/Debug -F /Applications/Xcode-15.2.0.app/Contents/Developer/Platforms/MacOSX.platform/Developer/Library/Frameworks -no-color-diagnostics -enable-testing -g -module-cache-path /Users/admin/builder/spi-builder-workspace/.derivedData/ModuleCache.noindex -profile-generate -profile-coverage-mapping -swift-version 5 -enforce-exclusivity\=checked -Onone -D SWIFT_PACKAGE -D DEBUG -D Xcode -serialize-debugging-options -package-name spi_builder_workspace -const-gather-protocols-file /Users/admin/builder/spi-builder-workspace/.derivedData/Build/Intermediates.noindex/DeclarativeTextKit.build/Debug/DeclarativeTextKitTests.build/Objects-normal/arm64/DeclarativeTextKitTests_const_extract_protocols.json -empty-abi-descriptor -validate-clang-modules-once -clang-build-session-file /Users/admin/builder/spi-builder-workspace/.derivedData/ModuleCache.noindex/Session.modulevalidation -Xcc -working-directory -Xcc /Users/admin/builder/spi-builder-workspace -resource-dir /Applications/Xcode-15.2.0.app/Contents/Developer/Toolchains/XcodeDefault.xctoolchain/usr/lib/swift -enable-anonymous-context-mangled-names -Xcc -ivfsstatcache -Xcc /Users/admin/builder/spi-builder-workspace/.derivedData/SDKStatCaches.noindex/macosx14.2-23C53-ddea79c7890ab41bba4a63928c655a96.sdkstatcache -Xcc -I/Users/admin/builder/spi-builder-workspace/.derivedData/Build/Products/Debug/include -Xcc -I/Users/admin/builder/spi-builder-workspace/.derivedData/Build/Intermediates.noindex/DeclarativeTextKit.build/Debug/DeclarativeTextKitTests.build/DerivedSources-normal/arm64 -Xcc -I/Users/admin/builder/spi-builder-workspace/.derivedData/Build/Intermediates.noindex/DeclarativeTextKit.build/Debug/DeclarativeTextKitTests.build/DerivedSources/arm64 -Xcc -I/Users/admin/builder/spi-builder-workspace/.derivedData/Build/Intermediates.noindex/DeclarativeTextKit.build/Debug/DeclarativeTextKitTests.build/DerivedSources -Xcc -DSWIFT_PACKAGE -Xcc -DDEBUG\=1 -module-name DeclarativeTextKitTests -frontend-parseable-output -disable-clang-spi -target-sdk-version 14.2 -target-sdk-name macosx14.2 -external-plugin-path /Applications/Xcode-15.2.0.app/Contents/Developer/Platforms/MacOSX.platform/Developer/SDKs/MacOSX14.2.sdk/usr/lib/swift/host/plugins\#/Applications/Xcode-15.2.0.app/Contents/Developer/Platforms/MacOSX.platform/Developer/SDKs/MacOSX14.2.sdk/usr/bin/swift-plugin-server -external-plugin-path /Applications/Xcode-15.2.0.app/Contents/Developer/Platforms/MacOSX.platform/Developer/SDKs/MacOSX14.2.sdk/usr/local/lib/swift/host/plugins\#/Applications/Xcode-15.2.0.app/Contents/Developer/Platforms/MacOSX.platform/Developer/SDKs/MacOSX14.2.sdk/usr/bin/swift-plugin-server -external-plugin-path /Applications/Xcode-15.2.0.app/Contents/Developer/Platforms/MacOSX.platform/Developer/usr/lib/swift/host/plugins\#/Applications/Xcode-15.2.0.app/Contents/Developer/Platforms/MacOSX.platform/Developer/usr/bin/swift-plugin-server -external-plugin-path /Applications/Xcode-15.2.0.app/Contents/Developer/Platforms/MacOSX.platform/Developer/usr/local/lib/swift/host/plugins\#/Applications/Xcode-15.2.0.app/Contents/Developer/Platforms/MacOSX.platform/Developer/usr/bin/swift-plugin-server -plugin-path /Applications/Xcode-15.2.0.app/Contents/Developer/Toolchains/XcodeDefault.xctoolchain/usr/lib/swift/host/plugins -plugin-path /Applications/Xcode-15.2.0.app/Contents/Developer/Toolchains/XcodeDefault.xctoolchain/usr/local/lib/swift/host/plugins -o /Users/admin/builder/spi-builder-workspace/.derivedData/Build/Intermediates.noindex/DeclarativeTextKit.build/Debug/DeclarativeTextKitTests.build/Objects-normal/arm64/ModifyingTests.o -index-unit-output-path /DeclarativeTextKit.build/Debug/DeclarativeTextKitTests.build/Objects-normal/arm64/ModifyingTests.o -index-store-path /Users/admin/builder/spi-builder-workspace/.derivedData/Index.noindex/DataStore -index-system-modules
SwiftCompile normal arm64 Compiling\ UseCaseTests.swift /Users/admin/builder/spi-builder-workspace/Tests/DeclarativeTextKitTests/UseCaseTests.swift (in target 'DeclarativeTextKitTests' from project 'DeclarativeTextKit')
    cd /Users/admin/builder/spi-builder-workspace
    builtin-swiftTaskExecution -- /Applications/Xcode-15.2.0.app/Contents/Developer/Toolchains/XcodeDefault.xctoolchain/usr/bin/swift-frontend -frontend -c /Users/admin/builder/spi-builder-workspace/Tests/DeclarativeTextKitTests/AffectedRangeTests.swift /Users/admin/builder/spi-builder-workspace/Tests/DeclarativeTextKitTests/AssertModification.swift /Users/admin/builder/spi-builder-workspace/Tests/DeclarativeTextKitTests/ConditionalTests.swift /Users/admin/builder/spi-builder-workspace/Tests/DeclarativeTextKitTests/DeleteTests.swift /Users/admin/builder/spi-builder-workspace/Tests/DeclarativeTextKitTests/Helpers.swift /Users/admin/builder/spi-builder-workspace/Tests/DeclarativeTextKitTests/InsertTests.swift /Users/admin/builder/spi-builder-workspace/Tests/DeclarativeTextKitTests/LoggingUndoManager.swift /Users/admin/builder/spi-builder-workspace/Tests/DeclarativeTextKitTests/ModifyingTests.swift /Users/admin/builder/spi-builder-workspace/Tests/DeclarativeTextKitTests/ScopedBufferSliceTests.swift /Users/admin/builder/spi-builder-workspace/Tests/DeclarativeTextKitTests/SelectTests.swift /Users/admin/builder/spi-builder-workspace/Tests/DeclarativeTextKitTests/UndoableBufferTests.swift -primary-file /Users/admin/builder/spi-builder-workspace/Tests/DeclarativeTextKitTests/UseCaseTests.swift -emit-dependencies-path /Users/admin/builder/spi-builder-workspace/.derivedData/Build/Intermediates.noindex/DeclarativeTextKit.build/Debug/DeclarativeTextKitTests.build/Objects-normal/arm64/UseCaseTests.d -emit-const-values-path /Users/admin/builder/spi-builder-workspace/.derivedData/Build/Intermediates.noindex/DeclarativeTextKit.build/Debug/DeclarativeTextKitTests.build/Objects-normal/arm64/UseCaseTests.swiftconstvalues -emit-reference-dependencies-path /Users/admin/builder/spi-builder-workspace/.derivedData/Build/Intermediates.noindex/DeclarativeTextKit.build/Debug/DeclarativeTextKitTests.build/Objects-normal/arm64/UseCaseTests.swiftdeps -serialize-diagnostics-path /Users/admin/builder/spi-builder-workspace/.derivedData/Build/Intermediates.noindex/DeclarativeTextKit.build/Debug/DeclarativeTextKitTests.build/Objects-normal/arm64/UseCaseTests.dia -target arm64-apple-macos13.0 -Xllvm -aarch64-use-tbi -enable-objc-interop -stack-check -sdk /Applications/Xcode-15.2.0.app/Contents/Developer/Platforms/MacOSX.platform/Developer/SDKs/MacOSX14.2.sdk -I /Users/admin/builder/spi-builder-workspace/.derivedData/Build/Products/Debug -I /Applications/Xcode-15.2.0.app/Contents/Developer/Platforms/MacOSX.platform/Developer/usr/lib -F /Users/admin/builder/spi-builder-workspace/.derivedData/Build/Products/Debug/PackageFrameworks -F /Users/admin/builder/spi-builder-workspace/.derivedData/Build/Products/Debug/PackageFrameworks -F /Users/admin/builder/spi-builder-workspace/.derivedData/Build/Products/Debug/PackageFrameworks -F /Users/admin/builder/spi-builder-workspace/.derivedData/Build/Products/Debug -F /Applications/Xcode-15.2.0.app/Contents/Developer/Platforms/MacOSX.platform/Developer/Library/Frameworks -no-color-diagnostics -enable-testing -g -module-cache-path /Users/admin/builder/spi-builder-workspace/.derivedData/ModuleCache.noindex -profile-generate -profile-coverage-mapping -swift-version 5 -enforce-exclusivity\=checked -Onone -D SWIFT_PACKAGE -D DEBUG -D Xcode -serialize-debugging-options -package-name spi_builder_workspace -const-gather-protocols-file /Users/admin/builder/spi-builder-workspace/.derivedData/Build/Intermediates.noindex/DeclarativeTextKit.build/Debug/DeclarativeTextKitTests.build/Objects-normal/arm64/DeclarativeTextKitTests_const_extract_protocols.json -empty-abi-descriptor -validate-clang-modules-once -clang-build-session-file /Users/admin/builder/spi-builder-workspace/.derivedData/ModuleCache.noindex/Session.modulevalidation -Xcc -working-directory -Xcc /Users/admin/builder/spi-builder-workspace -resource-dir /Applications/Xcode-15.2.0.app/Contents/Developer/Toolchains/XcodeDefault.xctoolchain/usr/lib/swift -enable-anonymous-context-mangled-names -Xcc -ivfsstatcache -Xcc /Users/admin/builder/spi-builder-workspace/.derivedData/SDKStatCaches.noindex/macosx14.2-23C53-ddea79c7890ab41bba4a63928c655a96.sdkstatcache -Xcc -I/Users/admin/builder/spi-builder-workspace/.derivedData/Build/Products/Debug/include -Xcc -I/Users/admin/builder/spi-builder-workspace/.derivedData/Build/Intermediates.noindex/DeclarativeTextKit.build/Debug/DeclarativeTextKitTests.build/DerivedSources-normal/arm64 -Xcc -I/Users/admin/builder/spi-builder-workspace/.derivedData/Build/Intermediates.noindex/DeclarativeTextKit.build/Debug/DeclarativeTextKitTests.build/DerivedSources/arm64 -Xcc -I/Users/admin/builder/spi-builder-workspace/.derivedData/Build/Intermediates.noindex/DeclarativeTextKit.build/Debug/DeclarativeTextKitTests.build/DerivedSources -Xcc -DSWIFT_PACKAGE -Xcc -DDEBUG\=1 -module-name DeclarativeTextKitTests -frontend-parseable-output -disable-clang-spi -target-sdk-version 14.2 -target-sdk-name macosx14.2 -external-plugin-path /Applications/Xcode-15.2.0.app/Contents/Developer/Platforms/MacOSX.platform/Developer/SDKs/MacOSX14.2.sdk/usr/lib/swift/host/plugins\#/Applications/Xcode-15.2.0.app/Contents/Developer/Platforms/MacOSX.platform/Developer/SDKs/MacOSX14.2.sdk/usr/bin/swift-plugin-server -external-plugin-path /Applications/Xcode-15.2.0.app/Contents/Developer/Platforms/MacOSX.platform/Developer/SDKs/MacOSX14.2.sdk/usr/local/lib/swift/host/plugins\#/Applications/Xcode-15.2.0.app/Contents/Developer/Platforms/MacOSX.platform/Developer/SDKs/MacOSX14.2.sdk/usr/bin/swift-plugin-server -external-plugin-path /Applications/Xcode-15.2.0.app/Contents/Developer/Platforms/MacOSX.platform/Developer/usr/lib/swift/host/plugins\#/Applications/Xcode-15.2.0.app/Contents/Developer/Platforms/MacOSX.platform/Developer/usr/bin/swift-plugin-server -external-plugin-path /Applications/Xcode-15.2.0.app/Contents/Developer/Platforms/MacOSX.platform/Developer/usr/local/lib/swift/host/plugins\#/Applications/Xcode-15.2.0.app/Contents/Developer/Platforms/MacOSX.platform/Developer/usr/bin/swift-plugin-server -plugin-path /Applications/Xcode-15.2.0.app/Contents/Developer/Toolchains/XcodeDefault.xctoolchain/usr/lib/swift/host/plugins -plugin-path /Applications/Xcode-15.2.0.app/Contents/Developer/Toolchains/XcodeDefault.xctoolchain/usr/local/lib/swift/host/plugins -o /Users/admin/builder/spi-builder-workspace/.derivedData/Build/Intermediates.noindex/DeclarativeTextKit.build/Debug/DeclarativeTextKitTests.build/Objects-normal/arm64/UseCaseTests.o -index-unit-output-path /DeclarativeTextKit.build/Debug/DeclarativeTextKitTests.build/Objects-normal/arm64/UseCaseTests.o -index-store-path /Users/admin/builder/spi-builder-workspace/.derivedData/Index.noindex/DataStore -index-system-modules
SwiftCompile normal arm64 /Users/admin/builder/spi-builder-workspace/Tests/DeclarativeTextKitTests/UseCaseTests.swift (in target 'DeclarativeTextKitTests' from project 'DeclarativeTextKit')
    cd /Users/admin/builder/spi-builder-workspace
    /Applications/Xcode-15.2.0.app/Contents/Developer/Toolchains/XcodeDefault.xctoolchain/usr/bin/swift-frontend -c /Users/admin/builder/spi-builder-workspace/Tests/DeclarativeTextKitTests/AffectedRangeTests.swift /Users/admin/builder/spi-builder-workspace/Tests/DeclarativeTextKitTests/AssertModification.swift /Users/admin/builder/spi-builder-workspace/Tests/DeclarativeTextKitTests/ConditionalTests.swift /Users/admin/builder/spi-builder-workspace/Tests/DeclarativeTextKitTests/DeleteTests.swift /Users/admin/builder/spi-builder-workspace/Tests/DeclarativeTextKitTests/Helpers.swift /Users/admin/builder/spi-builder-workspace/Tests/DeclarativeTextKitTests/InsertTests.swift /Users/admin/builder/spi-builder-workspace/Tests/DeclarativeTextKitTests/LoggingUndoManager.swift /Users/admin/builder/spi-builder-workspace/Tests/DeclarativeTextKitTests/ModifyingTests.swift /Users/admin/builder/spi-builder-workspace/Tests/DeclarativeTextKitTests/ScopedBufferSliceTests.swift /Users/admin/builder/spi-builder-workspace/Tests/DeclarativeTextKitTests/SelectTests.swift /Users/admin/builder/spi-builder-workspace/Tests/DeclarativeTextKitTests/UndoableBufferTests.swift -primary-file /Users/admin/builder/spi-builder-workspace/Tests/DeclarativeTextKitTests/UseCaseTests.swift -emit-dependencies-path /Users/admin/builder/spi-builder-workspace/.derivedData/Build/Intermediates.noindex/DeclarativeTextKit.build/Debug/DeclarativeTextKitTests.build/Objects-normal/arm64/UseCaseTests.d -emit-const-values-path /Users/admin/builder/spi-builder-workspace/.derivedData/Build/Intermediates.noindex/DeclarativeTextKit.build/Debug/DeclarativeTextKitTests.build/Objects-normal/arm64/UseCaseTests.swiftconstvalues -emit-reference-dependencies-path /Users/admin/builder/spi-builder-workspace/.derivedData/Build/Intermediates.noindex/DeclarativeTextKit.build/Debug/DeclarativeTextKitTests.build/Objects-normal/arm64/UseCaseTests.swiftdeps -serialize-diagnostics-path /Users/admin/builder/spi-builder-workspace/.derivedData/Build/Intermediates.noindex/DeclarativeTextKit.build/Debug/DeclarativeTextKitTests.build/Objects-normal/arm64/UseCaseTests.dia -target arm64-apple-macos13.0 -Xllvm -aarch64-use-tbi -enable-objc-interop -stack-check -sdk /Applications/Xcode-15.2.0.app/Contents/Developer/Platforms/MacOSX.platform/Developer/SDKs/MacOSX14.2.sdk -I /Users/admin/builder/spi-builder-workspace/.derivedData/Build/Products/Debug -I /Applications/Xcode-15.2.0.app/Contents/Developer/Platforms/MacOSX.platform/Developer/usr/lib -F /Users/admin/builder/spi-builder-workspace/.derivedData/Build/Products/Debug/PackageFrameworks -F /Users/admin/builder/spi-builder-workspace/.derivedData/Build/Products/Debug/PackageFrameworks -F /Users/admin/builder/spi-builder-workspace/.derivedData/Build/Products/Debug/PackageFrameworks -F /Users/admin/builder/spi-builder-workspace/.derivedData/Build/Products/Debug -F /Applications/Xcode-15.2.0.app/Contents/Developer/Platforms/MacOSX.platform/Developer/Library/Frameworks -no-color-diagnostics -enable-testing -g -module-cache-path /Users/admin/builder/spi-builder-workspace/.derivedData/ModuleCache.noindex -profile-generate -profile-coverage-mapping -swift-version 5 -enforce-exclusivity\=checked -Onone -D SWIFT_PACKAGE -D DEBUG -D Xcode -serialize-debugging-options -package-name spi_builder_workspace -const-gather-protocols-file /Users/admin/builder/spi-builder-workspace/.derivedData/Build/Intermediates.noindex/DeclarativeTextKit.build/Debug/DeclarativeTextKitTests.build/Objects-normal/arm64/DeclarativeTextKitTests_const_extract_protocols.json -empty-abi-descriptor -validate-clang-modules-once -clang-build-session-file /Users/admin/builder/spi-builder-workspace/.derivedData/ModuleCache.noindex/Session.modulevalidation -Xcc -working-directory -Xcc /Users/admin/builder/spi-builder-workspace -resource-dir /Applications/Xcode-15.2.0.app/Contents/Developer/Toolchains/XcodeDefault.xctoolchain/usr/lib/swift -enable-anonymous-context-mangled-names -Xcc -ivfsstatcache -Xcc /Users/admin/builder/spi-builder-workspace/.derivedData/SDKStatCaches.noindex/macosx14.2-23C53-ddea79c7890ab41bba4a63928c655a96.sdkstatcache -Xcc -I/Users/admin/builder/spi-builder-workspace/.derivedData/Build/Products/Debug/include -Xcc -I/Users/admin/builder/spi-builder-workspace/.derivedData/Build/Intermediates.noindex/DeclarativeTextKit.build/Debug/DeclarativeTextKitTests.build/DerivedSources-normal/arm64 -Xcc -I/Users/admin/builder/spi-builder-workspace/.derivedData/Build/Intermediates.noindex/DeclarativeTextKit.build/Debug/DeclarativeTextKitTests.build/DerivedSources/arm64 -Xcc -I/Users/admin/builder/spi-builder-workspace/.derivedData/Build/Intermediates.noindex/DeclarativeTextKit.build/Debug/DeclarativeTextKitTests.build/DerivedSources -Xcc -DSWIFT_PACKAGE -Xcc -DDEBUG\=1 -module-name DeclarativeTextKitTests -frontend-parseable-output -disable-clang-spi -target-sdk-version 14.2 -target-sdk-name macosx14.2 -external-plugin-path /Applications/Xcode-15.2.0.app/Contents/Developer/Platforms/MacOSX.platform/Developer/SDKs/MacOSX14.2.sdk/usr/lib/swift/host/plugins\#/Applications/Xcode-15.2.0.app/Contents/Developer/Platforms/MacOSX.platform/Developer/SDKs/MacOSX14.2.sdk/usr/bin/swift-plugin-server -external-plugin-path /Applications/Xcode-15.2.0.app/Contents/Developer/Platforms/MacOSX.platform/Developer/SDKs/MacOSX14.2.sdk/usr/local/lib/swift/host/plugins\#/Applications/Xcode-15.2.0.app/Contents/Developer/Platforms/MacOSX.platform/Developer/SDKs/MacOSX14.2.sdk/usr/bin/swift-plugin-server -external-plugin-path /Applications/Xcode-15.2.0.app/Contents/Developer/Platforms/MacOSX.platform/Developer/usr/lib/swift/host/plugins\#/Applications/Xcode-15.2.0.app/Contents/Developer/Platforms/MacOSX.platform/Developer/usr/bin/swift-plugin-server -external-plugin-path /Applications/Xcode-15.2.0.app/Contents/Developer/Platforms/MacOSX.platform/Developer/usr/local/lib/swift/host/plugins\#/Applications/Xcode-15.2.0.app/Contents/Developer/Platforms/MacOSX.platform/Developer/usr/bin/swift-plugin-server -plugin-path /Applications/Xcode-15.2.0.app/Contents/Developer/Toolchains/XcodeDefault.xctoolchain/usr/lib/swift/host/plugins -plugin-path /Applications/Xcode-15.2.0.app/Contents/Developer/Toolchains/XcodeDefault.xctoolchain/usr/local/lib/swift/host/plugins -o /Users/admin/builder/spi-builder-workspace/.derivedData/Build/Intermediates.noindex/DeclarativeTextKit.build/Debug/DeclarativeTextKitTests.build/Objects-normal/arm64/UseCaseTests.o -index-unit-output-path /DeclarativeTextKit.build/Debug/DeclarativeTextKitTests.build/Objects-normal/arm64/UseCaseTests.o -index-store-path /Users/admin/builder/spi-builder-workspace/.derivedData/Index.noindex/DataStore -index-system-modules
/Users/admin/builder/spi-builder-workspace/Tests/DeclarativeTextKitTests/UseCaseTests.swift:76:48: error: value of type 'UndoManager' has no member 'undoCount'
            XCTAssertEqual(buffer.undoManager?.undoCount, 0)
                           ~~~~~~~~~~~~~~~~~~~ ^~~~~~~~~
/Users/admin/builder/spi-builder-workspace/Tests/DeclarativeTextKitTests/UseCaseTests.swift:97:48: error: value of type 'UndoManager' has no member 'undoCount'
            XCTAssertEqual(buffer.undoManager?.undoCount, 1)
                           ~~~~~~~~~~~~~~~~~~~ ^~~~~~~~~
/Users/admin/builder/spi-builder-workspace/Tests/DeclarativeTextKitTests/UseCaseTests.swift:116:48: error: value of type 'UndoManager' has no member 'undoCount'
            XCTAssertEqual(buffer.undoManager?.undoCount, 2)
                           ~~~~~~~~~~~~~~~~~~~ ^~~~~~~~~
SwiftDriverJobDiscovery normal arm64 Compiling MakeBufferWithSelectionFromString.swift (in target 'TextBufferTesting' from project 'TextBuffer')
SwiftDriver\ Compilation TextBufferTesting normal arm64 com.apple.xcode.tools.swift.compiler (in target 'TextBufferTesting' from project 'TextBuffer')
    cd /Users/admin/builder/spi-builder-workspace/.dependencies/checkouts/TextBuffer
    builtin-Swift-Compilation -- /Applications/Xcode-15.2.0.app/Contents/Developer/Toolchains/XcodeDefault.xctoolchain/usr/bin/swiftc -module-name TextBufferTesting -Onone -enforce-exclusivity\=checked @/Users/admin/builder/spi-builder-workspace/.derivedData/Build/Intermediates.noindex/TextBuffer.build/Debug/TextBufferTesting.build/Objects-normal/arm64/TextBufferTesting.SwiftFileList -DSWIFT_PACKAGE -DDEBUG -DXcode -sdk /Applications/Xcode-15.2.0.app/Contents/Developer/Platforms/MacOSX.platform/Developer/SDKs/MacOSX14.2.sdk -target arm64-apple-macos10.13 -g -module-cache-path /Users/admin/builder/spi-builder-workspace/.derivedData/ModuleCache.noindex -Xfrontend -serialize-debugging-options -profile-coverage-mapping -profile-generate -enable-testing -suppress-warnings -index-store-path /Users/admin/builder/spi-builder-workspace/.derivedData/Index.noindex/DataStore -swift-version 5 -I /Users/admin/builder/spi-builder-workspace/.derivedData/Build/Products/Debug -I /Applications/Xcode-15.2.0.app/Contents/Developer/Platforms/MacOSX.platform/Developer/usr/lib -F /Users/admin/builder/spi-builder-workspace/.derivedData/Build/Products/Debug/PackageFrameworks -F /Users/admin/builder/spi-builder-workspace/.derivedData/Build/Products/Debug -F /Applications/Xcode-15.2.0.app/Contents/Developer/Platforms/MacOSX.platform/Developer/Library/Frameworks -c -j10 -enable-batch-mode -incremental -Xcc -ivfsstatcache -Xcc /Users/admin/builder/spi-builder-workspace/.derivedData/SDKStatCaches.noindex/macosx14.2-23C53-ddea79c7890ab41bba4a63928c655a96.sdkstatcache -output-file-map /Users/admin/builder/spi-builder-workspace/.derivedData/Build/Intermediates.noindex/TextBuffer.build/Debug/TextBufferTesting.build/Objects-normal/arm64/TextBufferTesting-OutputFileMap.json -use-frontend-parseable-output -save-temps -no-color-diagnostics -serialize-diagnostics -emit-dependencies -emit-module -emit-module-path /Users/admin/builder/spi-builder-workspace/.derivedData/Build/Intermediates.noindex/TextBuffer.build/Debug/TextBufferTesting.build/Objects-normal/arm64/TextBufferTesting.swiftmodule -validate-clang-modules-once -clang-build-session-file /Users/admin/builder/spi-builder-workspace/.derivedData/ModuleCache.noindex/Session.modulevalidation -Xfrontend -package-name -Xfrontend textbuffer -Xcc -I/Users/admin/builder/spi-builder-workspace/.derivedData/Build/Intermediates.noindex/TextBuffer.build/Debug/TextBufferTesting.build/swift-overrides.hmap -emit-const-values -Xfrontend -const-gather-protocols-file -Xfrontend /Users/admin/builder/spi-builder-workspace/.derivedData/Build/Intermediates.noindex/TextBuffer.build/Debug/TextBufferTesting.build/Objects-normal/arm64/TextBufferTesting_const_extract_protocols.json -Xcc -I/Users/admin/builder/spi-builder-workspace/.derivedData/Build/Products/Debug/include -Xcc -I/Users/admin/builder/spi-builder-workspace/.derivedData/Build/Intermediates.noindex/TextBuffer.build/Debug/TextBufferTesting.build/DerivedSources-normal/arm64 -Xcc -I/Users/admin/builder/spi-builder-workspace/.derivedData/Build/Intermediates.noindex/TextBuffer.build/Debug/TextBufferTesting.build/DerivedSources/arm64 -Xcc -I/Users/admin/builder/spi-builder-workspace/.derivedData/Build/Intermediates.noindex/TextBuffer.build/Debug/TextBufferTesting.build/DerivedSources -Xcc -DSWIFT_PACKAGE -Xcc -DDEBUG\=1 -emit-objc-header -emit-objc-header-path /Users/admin/builder/spi-builder-workspace/.derivedData/Build/Intermediates.noindex/TextBuffer.build/Debug/TextBufferTesting.build/Objects-normal/arm64/TextBufferTesting-Swift.h -working-directory /Users/admin/builder/spi-builder-workspace/.dependencies/checkouts/TextBuffer -experimental-emit-module-separately -disable-cmo
SwiftDriverJobDiscovery normal arm64 Emitting module for DeclarativeTextKitTests (in target 'DeclarativeTextKitTests' from project 'DeclarativeTextKit')
SwiftDriver\ Compilation\ Requirements DeclarativeTextKitTests normal arm64 com.apple.xcode.tools.swift.compiler (in target 'DeclarativeTextKitTests' from project 'DeclarativeTextKit')
    cd /Users/admin/builder/spi-builder-workspace
    builtin-Swift-Compilation-Requirements -- /Applications/Xcode-15.2.0.app/Contents/Developer/Toolchains/XcodeDefault.xctoolchain/usr/bin/swiftc -module-name DeclarativeTextKitTests -Onone -enforce-exclusivity\=checked @/Users/admin/builder/spi-builder-workspace/.derivedData/Build/Intermediates.noindex/DeclarativeTextKit.build/Debug/DeclarativeTextKitTests.build/Objects-normal/arm64/DeclarativeTextKitTests.SwiftFileList -DSWIFT_PACKAGE -DDEBUG -DXcode -sdk /Applications/Xcode-15.2.0.app/Contents/Developer/Platforms/MacOSX.platform/Developer/SDKs/MacOSX14.2.sdk -target arm64-apple-macos13.0 -g -module-cache-path /Users/admin/builder/spi-builder-workspace/.derivedData/ModuleCache.noindex -Xfrontend -serialize-debugging-options -profile-coverage-mapping -profile-generate -enable-testing -index-store-path /Users/admin/builder/spi-builder-workspace/.derivedData/Index.noindex/DataStore -swift-version 5 -I /Users/admin/builder/spi-builder-workspace/.derivedData/Build/Products/Debug -I /Applications/Xcode-15.2.0.app/Contents/Developer/Platforms/MacOSX.platform/Developer/usr/lib -F /Users/admin/builder/spi-builder-workspace/.derivedData/Build/Products/Debug/PackageFrameworks -F /Users/admin/builder/spi-builder-workspace/.derivedData/Build/Products/Debug/PackageFrameworks -F /Users/admin/builder/spi-builder-workspace/.derivedData/Build/Products/Debug/PackageFrameworks -F /Users/admin/builder/spi-builder-workspace/.derivedData/Build/Products/Debug -F /Applications/Xcode-15.2.0.app/Contents/Developer/Platforms/MacOSX.platform/Developer/Library/Frameworks -c -j10 -enable-batch-mode -incremental -Xcc -ivfsstatcache -Xcc /Users/admin/builder/spi-builder-workspace/.derivedData/SDKStatCaches.noindex/macosx14.2-23C53-ddea79c7890ab41bba4a63928c655a96.sdkstatcache -output-file-map /Users/admin/builder/spi-builder-workspace/.derivedData/Build/Intermediates.noindex/DeclarativeTextKit.build/Debug/DeclarativeTextKitTests.build/Objects-normal/arm64/DeclarativeTextKitTests-OutputFileMap.json -use-frontend-parseable-output -save-temps -no-color-diagnostics -serialize-diagnostics -emit-dependencies -emit-module -emit-module-path /Users/admin/builder/spi-builder-workspace/.derivedData/Build/Intermediates.noindex/DeclarativeTextKit.build/Debug/DeclarativeTextKitTests.build/Objects-normal/arm64/DeclarativeTextKitTests.swiftmodule -validate-clang-modules-once -clang-build-session-file /Users/admin/builder/spi-builder-workspace/.derivedData/ModuleCache.noindex/Session.modulevalidation -Xfrontend -package-name -Xfrontend spi_builder_workspace -emit-const-values -Xfrontend -const-gather-protocols-file -Xfrontend /Users/admin/builder/spi-builder-workspace/.derivedData/Build/Intermediates.noindex/DeclarativeTextKit.build/Debug/DeclarativeTextKitTests.build/Objects-normal/arm64/DeclarativeTextKitTests_const_extract_protocols.json -Xcc -I/Users/admin/builder/spi-builder-workspace/.derivedData/Build/Products/Debug/include -Xcc -I/Users/admin/builder/spi-builder-workspace/.derivedData/Build/Intermediates.noindex/DeclarativeTextKit.build/Debug/DeclarativeTextKitTests.build/DerivedSources-normal/arm64 -Xcc -I/Users/admin/builder/spi-builder-workspace/.derivedData/Build/Intermediates.noindex/DeclarativeTextKit.build/Debug/DeclarativeTextKitTests.build/DerivedSources/arm64 -Xcc -I/Users/admin/builder/spi-builder-workspace/.derivedData/Build/Intermediates.noindex/DeclarativeTextKit.build/Debug/DeclarativeTextKitTests.build/DerivedSources -Xcc -DSWIFT_PACKAGE -Xcc -DDEBUG\=1 -working-directory /Users/admin/builder/spi-builder-workspace -experimental-emit-module-separately -disable-cmo
Ld /Users/admin/builder/spi-builder-workspace/.derivedData/Build/Products/Debug/TextBufferTesting.o normal (in target 'TextBufferTesting' from project 'TextBuffer')
    cd /Users/admin/builder/spi-builder-workspace/.dependencies/checkouts/TextBuffer
    /Applications/Xcode-15.2.0.app/Contents/Developer/Toolchains/XcodeDefault.xctoolchain/usr/bin/clang -Xlinker -reproducible -target arm64-apple-macos10.13 -r -isysroot /Applications/Xcode-15.2.0.app/Contents/Developer/Platforms/MacOSX.platform/Developer/SDKs/MacOSX14.2.sdk -O0 -w -L/Users/admin/builder/spi-builder-workspace/.derivedData/Build/Intermediates.noindex/EagerLinkingTBDs/Debug -L/Users/admin/builder/spi-builder-workspace/.derivedData/Build/Products/Debug -L/Applications/Xcode-15.2.0.app/Contents/Developer/Platforms/MacOSX.platform/Developer/usr/lib -F/Users/admin/builder/spi-builder-workspace/.derivedData/Build/Intermediates.noindex/EagerLinkingTBDs/Debug -F/Users/admin/builder/spi-builder-workspace/.derivedData/Build/Products/Debug/PackageFrameworks -F/Users/admin/builder/spi-builder-workspace/.derivedData/Build/Products/Debug -F/Applications/Xcode-15.2.0.app/Contents/Developer/Platforms/MacOSX.platform/Developer/Library/Frameworks -iframework /Applications/Xcode-15.2.0.app/Contents/Developer/Platforms/MacOSX.platform/Developer/Library/Frameworks -filelist /Users/admin/builder/spi-builder-workspace/.derivedData/Build/Intermediates.noindex/TextBuffer.build/Debug/TextBufferTesting.build/Objects-normal/arm64/TextBufferTesting.LinkFileList -nostdlib -Xlinker -object_path_lto -Xlinker /Users/admin/builder/spi-builder-workspace/.derivedData/Build/Intermediates.noindex/TextBuffer.build/Debug/TextBufferTesting.build/Objects-normal/arm64/TextBufferTesting_lto.o -Xlinker -export_dynamic -Xlinker -no_deduplicate -Xlinker -debug_variant -fobjc-link-runtime -L/Applications/Xcode-15.2.0.app/Contents/Developer/Toolchains/XcodeDefault.xctoolchain/usr/lib/swift/macosx -L/usr/lib/swift -Xlinker -add_ast_path -Xlinker /Users/admin/builder/spi-builder-workspace/.derivedData/Build/Intermediates.noindex/TextBuffer.build/Debug/TextBufferTesting.build/Objects-normal/arm64/TextBufferTesting.swiftmodule -Xlinker -dependency_info -Xlinker /Users/admin/builder/spi-builder-workspace/.derivedData/Build/Intermediates.noindex/TextBuffer.build/Debug/TextBufferTesting.build/Objects-normal/arm64/TextBufferTesting_dependency_info.dat -o /Users/admin/builder/spi-builder-workspace/.derivedData/Build/Products/Debug/TextBufferTesting.o
SwiftDriverJobDiscovery normal arm64 Compiling LoggingUndoManager.swift (in target 'DeclarativeTextKitTests' from project 'DeclarativeTextKit')
SwiftCompile normal arm64 Compiling\ SelectTests.swift /Users/admin/builder/spi-builder-workspace/Tests/DeclarativeTextKitTests/SelectTests.swift (in target 'DeclarativeTextKitTests' from project 'DeclarativeTextKit')
    cd /Users/admin/builder/spi-builder-workspace
    builtin-swiftTaskExecution -- /Applications/Xcode-15.2.0.app/Contents/Developer/Toolchains/XcodeDefault.xctoolchain/usr/bin/swift-frontend -frontend -c /Users/admin/builder/spi-builder-workspace/Tests/DeclarativeTextKitTests/AffectedRangeTests.swift /Users/admin/builder/spi-builder-workspace/Tests/DeclarativeTextKitTests/AssertModification.swift /Users/admin/builder/spi-builder-workspace/Tests/DeclarativeTextKitTests/ConditionalTests.swift /Users/admin/builder/spi-builder-workspace/Tests/DeclarativeTextKitTests/DeleteTests.swift /Users/admin/builder/spi-builder-workspace/Tests/DeclarativeTextKitTests/Helpers.swift /Users/admin/builder/spi-builder-workspace/Tests/DeclarativeTextKitTests/InsertTests.swift /Users/admin/builder/spi-builder-workspace/Tests/DeclarativeTextKitTests/LoggingUndoManager.swift /Users/admin/builder/spi-builder-workspace/Tests/DeclarativeTextKitTests/ModifyingTests.swift /Users/admin/builder/spi-builder-workspace/Tests/DeclarativeTextKitTests/ScopedBufferSliceTests.swift -primary-file /Users/admin/builder/spi-builder-workspace/Tests/DeclarativeTextKitTests/SelectTests.swift /Users/admin/builder/spi-builder-workspace/Tests/DeclarativeTextKitTests/UndoableBufferTests.swift /Users/admin/builder/spi-builder-workspace/Tests/DeclarativeTextKitTests/UseCaseTests.swift -emit-dependencies-path /Users/admin/builder/spi-builder-workspace/.derivedData/Build/Intermediates.noindex/DeclarativeTextKit.build/Debug/DeclarativeTextKitTests.build/Objects-normal/arm64/SelectTests.d -emit-const-values-path /Users/admin/builder/spi-builder-workspace/.derivedData/Build/Intermediates.noindex/DeclarativeTextKit.build/Debug/DeclarativeTextKitTests.build/Objects-normal/arm64/SelectTests.swiftconstvalues -emit-reference-dependencies-path /Users/admin/builder/spi-builder-workspace/.derivedData/Build/Intermediates.noindex/DeclarativeTextKit.build/Debug/DeclarativeTextKitTests.build/Objects-normal/arm64/SelectTests.swiftdeps -serialize-diagnostics-path /Users/admin/builder/spi-builder-workspace/.derivedData/Build/Intermediates.noindex/DeclarativeTextKit.build/Debug/DeclarativeTextKitTests.build/Objects-normal/arm64/SelectTests.dia -target arm64-apple-macos13.0 -Xllvm -aarch64-use-tbi -enable-objc-interop -stack-check -sdk /Applications/Xcode-15.2.0.app/Contents/Developer/Platforms/MacOSX.platform/Developer/SDKs/MacOSX14.2.sdk -I /Users/admin/builder/spi-builder-workspace/.derivedData/Build/Products/Debug -I /Applications/Xcode-15.2.0.app/Contents/Developer/Platforms/MacOSX.platform/Developer/usr/lib -F /Users/admin/builder/spi-builder-workspace/.derivedData/Build/Products/Debug/PackageFrameworks -F /Users/admin/builder/spi-builder-workspace/.derivedData/Build/Products/Debug/PackageFrameworks -F /Users/admin/builder/spi-builder-workspace/.derivedData/Build/Products/Debug/PackageFrameworks -F /Users/admin/builder/spi-builder-workspace/.derivedData/Build/Products/Debug -F /Applications/Xcode-15.2.0.app/Contents/Developer/Platforms/MacOSX.platform/Developer/Library/Frameworks -no-color-diagnostics -enable-testing -g -module-cache-path /Users/admin/builder/spi-builder-workspace/.derivedData/ModuleCache.noindex -profile-generate -profile-coverage-mapping -swift-version 5 -enforce-exclusivity\=checked -Onone -D SWIFT_PACKAGE -D DEBUG -D Xcode -serialize-debugging-options -package-name spi_builder_workspace -const-gather-protocols-file /Users/admin/builder/spi-builder-workspace/.derivedData/Build/Intermediates.noindex/DeclarativeTextKit.build/Debug/DeclarativeTextKitTests.build/Objects-normal/arm64/DeclarativeTextKitTests_const_extract_protocols.json -empty-abi-descriptor -validate-clang-modules-once -clang-build-session-file /Users/admin/builder/spi-builder-workspace/.derivedData/ModuleCache.noindex/Session.modulevalidation -Xcc -working-directory -Xcc /Users/admin/builder/spi-builder-workspace -resource-dir /Applications/Xcode-15.2.0.app/Contents/Developer/Toolchains/XcodeDefault.xctoolchain/usr/lib/swift -enable-anonymous-context-mangled-names -Xcc -ivfsstatcache -Xcc /Users/admin/builder/spi-builder-workspace/.derivedData/SDKStatCaches.noindex/macosx14.2-23C53-ddea79c7890ab41bba4a63928c655a96.sdkstatcache -Xcc -I/Users/admin/builder/spi-builder-workspace/.derivedData/Build/Products/Debug/include -Xcc -I/Users/admin/builder/spi-builder-workspace/.derivedData/Build/Intermediates.noindex/DeclarativeTextKit.build/Debug/DeclarativeTextKitTests.build/DerivedSources-normal/arm64 -Xcc -I/Users/admin/builder/spi-builder-workspace/.derivedData/Build/Intermediates.noindex/DeclarativeTextKit.build/Debug/DeclarativeTextKitTests.build/DerivedSources/arm64 -Xcc -I/Users/admin/builder/spi-builder-workspace/.derivedData/Build/Intermediates.noindex/DeclarativeTextKit.build/Debug/DeclarativeTextKitTests.build/DerivedSources -Xcc -DSWIFT_PACKAGE -Xcc -DDEBUG\=1 -module-name DeclarativeTextKitTests -frontend-parseable-output -disable-clang-spi -target-sdk-version 14.2 -target-sdk-name macosx14.2 -external-plugin-path /Applications/Xcode-15.2.0.app/Contents/Developer/Platforms/MacOSX.platform/Developer/SDKs/MacOSX14.2.sdk/usr/lib/swift/host/plugins\#/Applications/Xcode-15.2.0.app/Contents/Developer/Platforms/MacOSX.platform/Developer/SDKs/MacOSX14.2.sdk/usr/bin/swift-plugin-server -external-plugin-path /Applications/Xcode-15.2.0.app/Contents/Developer/Platforms/MacOSX.platform/Developer/SDKs/MacOSX14.2.sdk/usr/local/lib/swift/host/plugins\#/Applications/Xcode-15.2.0.app/Contents/Developer/Platforms/MacOSX.platform/Developer/SDKs/MacOSX14.2.sdk/usr/bin/swift-plugin-server -external-plugin-path /Applications/Xcode-15.2.0.app/Contents/Developer/Platforms/MacOSX.platform/Developer/usr/lib/swift/host/plugins\#/Applications/Xcode-15.2.0.app/Contents/Developer/Platforms/MacOSX.platform/Developer/usr/bin/swift-plugin-server -external-plugin-path /Applications/Xcode-15.2.0.app/Contents/Developer/Platforms/MacOSX.platform/Developer/usr/local/lib/swift/host/plugins\#/Applications/Xcode-15.2.0.app/Contents/Developer/Platforms/MacOSX.platform/Developer/usr/bin/swift-plugin-server -plugin-path /Applications/Xcode-15.2.0.app/Contents/Developer/Toolchains/XcodeDefault.xctoolchain/usr/lib/swift/host/plugins -plugin-path /Applications/Xcode-15.2.0.app/Contents/Developer/Toolchains/XcodeDefault.xctoolchain/usr/local/lib/swift/host/plugins -o /Users/admin/builder/spi-builder-workspace/.derivedData/Build/Intermediates.noindex/DeclarativeTextKit.build/Debug/DeclarativeTextKitTests.build/Objects-normal/arm64/SelectTests.o -index-unit-output-path /DeclarativeTextKit.build/Debug/DeclarativeTextKitTests.build/Objects-normal/arm64/SelectTests.o -index-store-path /Users/admin/builder/spi-builder-workspace/.derivedData/Index.noindex/DataStore -index-system-modules
SwiftCompile normal arm64 /Users/admin/builder/spi-builder-workspace/Tests/DeclarativeTextKitTests/SelectTests.swift (in target 'DeclarativeTextKitTests' from project 'DeclarativeTextKit')
    cd /Users/admin/builder/spi-builder-workspace
    /Applications/Xcode-15.2.0.app/Contents/Developer/Toolchains/XcodeDefault.xctoolchain/usr/bin/swift-frontend -c /Users/admin/builder/spi-builder-workspace/Tests/DeclarativeTextKitTests/AffectedRangeTests.swift /Users/admin/builder/spi-builder-workspace/Tests/DeclarativeTextKitTests/AssertModification.swift /Users/admin/builder/spi-builder-workspace/Tests/DeclarativeTextKitTests/ConditionalTests.swift /Users/admin/builder/spi-builder-workspace/Tests/DeclarativeTextKitTests/DeleteTests.swift /Users/admin/builder/spi-builder-workspace/Tests/DeclarativeTextKitTests/Helpers.swift /Users/admin/builder/spi-builder-workspace/Tests/DeclarativeTextKitTests/InsertTests.swift /Users/admin/builder/spi-builder-workspace/Tests/DeclarativeTextKitTests/LoggingUndoManager.swift /Users/admin/builder/spi-builder-workspace/Tests/DeclarativeTextKitTests/ModifyingTests.swift /Users/admin/builder/spi-builder-workspace/Tests/DeclarativeTextKitTests/ScopedBufferSliceTests.swift -primary-file /Users/admin/builder/spi-builder-workspace/Tests/DeclarativeTextKitTests/SelectTests.swift /Users/admin/builder/spi-builder-workspace/Tests/DeclarativeTextKitTests/UndoableBufferTests.swift /Users/admin/builder/spi-builder-workspace/Tests/DeclarativeTextKitTests/UseCaseTests.swift -emit-dependencies-path /Users/admin/builder/spi-builder-workspace/.derivedData/Build/Intermediates.noindex/DeclarativeTextKit.build/Debug/DeclarativeTextKitTests.build/Objects-normal/arm64/SelectTests.d -emit-const-values-path /Users/admin/builder/spi-builder-workspace/.derivedData/Build/Intermediates.noindex/DeclarativeTextKit.build/Debug/DeclarativeTextKitTests.build/Objects-normal/arm64/SelectTests.swiftconstvalues -emit-reference-dependencies-path /Users/admin/builder/spi-builder-workspace/.derivedData/Build/Intermediates.noindex/DeclarativeTextKit.build/Debug/DeclarativeTextKitTests.build/Objects-normal/arm64/SelectTests.swiftdeps -serialize-diagnostics-path /Users/admin/builder/spi-builder-workspace/.derivedData/Build/Intermediates.noindex/DeclarativeTextKit.build/Debug/DeclarativeTextKitTests.build/Objects-normal/arm64/SelectTests.dia -target arm64-apple-macos13.0 -Xllvm -aarch64-use-tbi -enable-objc-interop -stack-check -sdk /Applications/Xcode-15.2.0.app/Contents/Developer/Platforms/MacOSX.platform/Developer/SDKs/MacOSX14.2.sdk -I /Users/admin/builder/spi-builder-workspace/.derivedData/Build/Products/Debug -I /Applications/Xcode-15.2.0.app/Contents/Developer/Platforms/MacOSX.platform/Developer/usr/lib -F /Users/admin/builder/spi-builder-workspace/.derivedData/Build/Products/Debug/PackageFrameworks -F /Users/admin/builder/spi-builder-workspace/.derivedData/Build/Products/Debug/PackageFrameworks -F /Users/admin/builder/spi-builder-workspace/.derivedData/Build/Products/Debug/PackageFrameworks -F /Users/admin/builder/spi-builder-workspace/.derivedData/Build/Products/Debug -F /Applications/Xcode-15.2.0.app/Contents/Developer/Platforms/MacOSX.platform/Developer/Library/Frameworks -no-color-diagnostics -enable-testing -g -module-cache-path /Users/admin/builder/spi-builder-workspace/.derivedData/ModuleCache.noindex -profile-generate -profile-coverage-mapping -swift-version 5 -enforce-exclusivity\=checked -Onone -D SWIFT_PACKAGE -D DEBUG -D Xcode -serialize-debugging-options -package-name spi_builder_workspace -const-gather-protocols-file /Users/admin/builder/spi-builder-workspace/.derivedData/Build/Intermediates.noindex/DeclarativeTextKit.build/Debug/DeclarativeTextKitTests.build/Objects-normal/arm64/DeclarativeTextKitTests_const_extract_protocols.json -empty-abi-descriptor -validate-clang-modules-once -clang-build-session-file /Users/admin/builder/spi-builder-workspace/.derivedData/ModuleCache.noindex/Session.modulevalidation -Xcc -working-directory -Xcc /Users/admin/builder/spi-builder-workspace -resource-dir /Applications/Xcode-15.2.0.app/Contents/Developer/Toolchains/XcodeDefault.xctoolchain/usr/lib/swift -enable-anonymous-context-mangled-names -Xcc -ivfsstatcache -Xcc /Users/admin/builder/spi-builder-workspace/.derivedData/SDKStatCaches.noindex/macosx14.2-23C53-ddea79c7890ab41bba4a63928c655a96.sdkstatcache -Xcc -I/Users/admin/builder/spi-builder-workspace/.derivedData/Build/Products/Debug/include -Xcc -I/Users/admin/builder/spi-builder-workspace/.derivedData/Build/Intermediates.noindex/DeclarativeTextKit.build/Debug/DeclarativeTextKitTests.build/DerivedSources-normal/arm64 -Xcc -I/Users/admin/builder/spi-builder-workspace/.derivedData/Build/Intermediates.noindex/DeclarativeTextKit.build/Debug/DeclarativeTextKitTests.build/DerivedSources/arm64 -Xcc -I/Users/admin/builder/spi-builder-workspace/.derivedData/Build/Intermediates.noindex/DeclarativeTextKit.build/Debug/DeclarativeTextKitTests.build/DerivedSources -Xcc -DSWIFT_PACKAGE -Xcc -DDEBUG\=1 -module-name DeclarativeTextKitTests -frontend-parseable-output -disable-clang-spi -target-sdk-version 14.2 -target-sdk-name macosx14.2 -external-plugin-path /Applications/Xcode-15.2.0.app/Contents/Developer/Platforms/MacOSX.platform/Developer/SDKs/MacOSX14.2.sdk/usr/lib/swift/host/plugins\#/Applications/Xcode-15.2.0.app/Contents/Developer/Platforms/MacOSX.platform/Developer/SDKs/MacOSX14.2.sdk/usr/bin/swift-plugin-server -external-plugin-path /Applications/Xcode-15.2.0.app/Contents/Developer/Platforms/MacOSX.platform/Developer/SDKs/MacOSX14.2.sdk/usr/local/lib/swift/host/plugins\#/Applications/Xcode-15.2.0.app/Contents/Developer/Platforms/MacOSX.platform/Developer/SDKs/MacOSX14.2.sdk/usr/bin/swift-plugin-server -external-plugin-path /Applications/Xcode-15.2.0.app/Contents/Developer/Platforms/MacOSX.platform/Developer/usr/lib/swift/host/plugins\#/Applications/Xcode-15.2.0.app/Contents/Developer/Platforms/MacOSX.platform/Developer/usr/bin/swift-plugin-server -external-plugin-path /Applications/Xcode-15.2.0.app/Contents/Developer/Platforms/MacOSX.platform/Developer/usr/local/lib/swift/host/plugins\#/Applications/Xcode-15.2.0.app/Contents/Developer/Platforms/MacOSX.platform/Developer/usr/bin/swift-plugin-server -plugin-path /Applications/Xcode-15.2.0.app/Contents/Developer/Toolchains/XcodeDefault.xctoolchain/usr/lib/swift/host/plugins -plugin-path /Applications/Xcode-15.2.0.app/Contents/Developer/Toolchains/XcodeDefault.xctoolchain/usr/local/lib/swift/host/plugins -o /Users/admin/builder/spi-builder-workspace/.derivedData/Build/Intermediates.noindex/DeclarativeTextKit.build/Debug/DeclarativeTextKitTests.build/Objects-normal/arm64/SelectTests.o -index-unit-output-path /DeclarativeTextKit.build/Debug/DeclarativeTextKitTests.build/Objects-normal/arm64/SelectTests.o -index-store-path /Users/admin/builder/spi-builder-workspace/.derivedData/Index.noindex/DataStore -index-system-modules
SwiftDriverJobDiscovery normal arm64 Compiling AffectedRangeTests.swift, AssertModification.swift (in target 'DeclarativeTextKitTests' from project 'DeclarativeTextKit')
Copy /Users/admin/builder/spi-builder-workspace/.derivedData/Build/Products/Debug/DeclarativeTextKitTests.swiftmodule/arm64-apple-macos.swiftmodule /Users/admin/builder/spi-builder-workspace/.derivedData/Build/Intermediates.noindex/DeclarativeTextKit.build/Debug/DeclarativeTextKitTests.build/Objects-normal/arm64/DeclarativeTextKitTests.swiftmodule (in target 'DeclarativeTextKitTests' from project 'DeclarativeTextKit')
    cd /Users/admin/builder/spi-builder-workspace
    builtin-copy -exclude .DS_Store -exclude CVS -exclude .svn -exclude .git -exclude .hg -resolve-src-symlinks -rename /Users/admin/builder/spi-builder-workspace/.derivedData/Build/Intermediates.noindex/DeclarativeTextKit.build/Debug/DeclarativeTextKitTests.build/Objects-normal/arm64/DeclarativeTextKitTests.swiftmodule /Users/admin/builder/spi-builder-workspace/.derivedData/Build/Products/Debug/DeclarativeTextKitTests.swiftmodule/arm64-apple-macos.swiftmodule
Copy /Users/admin/builder/spi-builder-workspace/.derivedData/Build/Products/Debug/DeclarativeTextKitTests.swiftmodule/arm64-apple-macos.swiftdoc /Users/admin/builder/spi-builder-workspace/.derivedData/Build/Intermediates.noindex/DeclarativeTextKit.build/Debug/DeclarativeTextKitTests.build/Objects-normal/arm64/DeclarativeTextKitTests.swiftdoc (in target 'DeclarativeTextKitTests' from project 'DeclarativeTextKit')
    cd /Users/admin/builder/spi-builder-workspace
    builtin-copy -exclude .DS_Store -exclude CVS -exclude .svn -exclude .git -exclude .hg -resolve-src-symlinks -rename /Users/admin/builder/spi-builder-workspace/.derivedData/Build/Intermediates.noindex/DeclarativeTextKit.build/Debug/DeclarativeTextKitTests.build/Objects-normal/arm64/DeclarativeTextKitTests.swiftdoc /Users/admin/builder/spi-builder-workspace/.derivedData/Build/Products/Debug/DeclarativeTextKitTests.swiftmodule/arm64-apple-macos.swiftdoc
Copy /Users/admin/builder/spi-builder-workspace/.derivedData/Build/Products/Debug/DeclarativeTextKitTests.swiftmodule/arm64-apple-macos.abi.json /Users/admin/builder/spi-builder-workspace/.derivedData/Build/Intermediates.noindex/DeclarativeTextKit.build/Debug/DeclarativeTextKitTests.build/Objects-normal/arm64/DeclarativeTextKitTests.abi.json (in target 'DeclarativeTextKitTests' from project 'DeclarativeTextKit')
    cd /Users/admin/builder/spi-builder-workspace
    builtin-copy -exclude .DS_Store -exclude CVS -exclude .svn -exclude .git -exclude .hg -resolve-src-symlinks -rename /Users/admin/builder/spi-builder-workspace/.derivedData/Build/Intermediates.noindex/DeclarativeTextKit.build/Debug/DeclarativeTextKitTests.build/Objects-normal/arm64/DeclarativeTextKitTests.abi.json /Users/admin/builder/spi-builder-workspace/.derivedData/Build/Products/Debug/DeclarativeTextKitTests.swiftmodule/arm64-apple-macos.abi.json
Copy /Users/admin/builder/spi-builder-workspace/.derivedData/Build/Products/Debug/DeclarativeTextKitTests.swiftmodule/Project/arm64-apple-macos.swiftsourceinfo /Users/admin/builder/spi-builder-workspace/.derivedData/Build/Intermediates.noindex/DeclarativeTextKit.build/Debug/DeclarativeTextKitTests.build/Objects-normal/arm64/DeclarativeTextKitTests.swiftsourceinfo (in target 'DeclarativeTextKitTests' from project 'DeclarativeTextKit')
    cd /Users/admin/builder/spi-builder-workspace
    builtin-copy -exclude .DS_Store -exclude CVS -exclude .svn -exclude .git -exclude .hg -resolve-src-symlinks -rename /Users/admin/builder/spi-builder-workspace/.derivedData/Build/Intermediates.noindex/DeclarativeTextKit.build/Debug/DeclarativeTextKitTests.build/Objects-normal/arm64/DeclarativeTextKitTests.swiftsourceinfo /Users/admin/builder/spi-builder-workspace/.derivedData/Build/Products/Debug/DeclarativeTextKitTests.swiftmodule/Project/arm64-apple-macos.swiftsourceinfo
SwiftDriverJobDiscovery normal arm64 Compiling Helpers.swift (in target 'DeclarativeTextKitTests' from project 'DeclarativeTextKit')
RegisterExecutionPolicyException /Users/admin/builder/spi-builder-workspace/.derivedData/Build/Products/Debug/TextBufferTesting.o (in target 'TextBufferTesting' from project 'TextBuffer')
    cd /Users/admin/builder/spi-builder-workspace/.dependencies/checkouts/TextBuffer
    builtin-RegisterExecutionPolicyException /Users/admin/builder/spi-builder-workspace/.derivedData/Build/Products/Debug/TextBufferTesting.o
WriteAuxiliaryFile /Users/admin/builder/spi-builder-workspace/.derivedData/Build/Intermediates.noindex/DeclarativeTextKit.build/Debug/DeclarativeTextKitTests.build/empty-DeclarativeTextKitTests.plist (in target 'DeclarativeTextKitTests' from project 'DeclarativeTextKit')
    cd /Users/admin/builder/spi-builder-workspace
    write-file /Users/admin/builder/spi-builder-workspace/.derivedData/Build/Intermediates.noindex/DeclarativeTextKit.build/Debug/DeclarativeTextKitTests.build/empty-DeclarativeTextKitTests.plist
WriteAuxiliaryFile /Users/admin/builder/spi-builder-workspace/.derivedData/Build/Intermediates.noindex/DeclarativeTextKit.build/Debug/DeclarativeTextKitTests.build/Objects-normal/arm64/DeclarativeTextKitTests.LinkFileList (in target 'DeclarativeTextKitTests' from project 'DeclarativeTextKit')
    cd /Users/admin/builder/spi-builder-workspace
    write-file /Users/admin/builder/spi-builder-workspace/.derivedData/Build/Intermediates.noindex/DeclarativeTextKit.build/Debug/DeclarativeTextKitTests.build/Objects-normal/arm64/DeclarativeTextKitTests.LinkFileList
ProcessInfoPlistFile /Users/admin/builder/spi-builder-workspace/.derivedData/Build/Products/Debug/DeclarativeTextKitTests.xctest/Contents/Info.plist /Users/admin/builder/spi-builder-workspace/.derivedData/Build/Intermediates.noindex/DeclarativeTextKit.build/Debug/DeclarativeTextKitTests.build/empty-DeclarativeTextKitTests.plist (in target 'DeclarativeTextKitTests' from project 'DeclarativeTextKit')
    cd /Users/admin/builder/spi-builder-workspace
    builtin-infoPlistUtility /Users/admin/builder/spi-builder-workspace/.derivedData/Build/Intermediates.noindex/DeclarativeTextKit.build/Debug/DeclarativeTextKitTests.build/empty-DeclarativeTextKitTests.plist -producttype com.apple.product-type.bundle.unit-test -expandbuildsettings -platform macosx -o /Users/admin/builder/spi-builder-workspace/.derivedData/Build/Products/Debug/DeclarativeTextKitTests.xctest/Contents/Info.plist
SwiftDriverJobDiscovery normal arm64 Compiling UndoableBufferTests.swift (in target 'DeclarativeTextKitTests' from project 'DeclarativeTextKit')
SwiftDriverJobDiscovery normal arm64 Compiling ModifyingTests.swift (in target 'DeclarativeTextKitTests' from project 'DeclarativeTextKit')
SwiftDriverJobDiscovery normal arm64 Compiling InsertTests.swift (in target 'DeclarativeTextKitTests' from project 'DeclarativeTextKit')
Resolve Package Graph
--- xcodebuild: WARNING: Using the first of multiple matching destinations:
{ platform:macOS, arch:arm64, id:0000FE00-8C151E3703BE51BE }
{ platform:macOS, arch:arm64, variant:Mac Catalyst, id:0000FE00-8C151E3703BE51BE }
{ platform:macOS, arch:arm64, variant:DriverKit, id:0000FE00-8C151E3703BE51BE }
{ platform:macOS, arch:arm64, variant:Designed for [iPad,iPhone], id:0000FE00-8C151E3703BE51BE }
** BUILD FAILED **
The following build commands failed:
	SwiftCompile normal arm64 Compiling\ UseCaseTests.swift /Users/admin/builder/spi-builder-workspace/Tests/DeclarativeTextKitTests/UseCaseTests.swift (in target 'DeclarativeTextKitTests' from project 'DeclarativeTextKit')
	SwiftCompile normal arm64 /Users/admin/builder/spi-builder-workspace/Tests/DeclarativeTextKitTests/UseCaseTests.swift (in target 'DeclarativeTextKitTests' from project 'DeclarativeTextKit')
(2 failures)
Command line invocation:
    /Applications/Xcode-15.2.0.app/Contents/Developer/usr/bin/xcodebuild -IDEClonedSourcePackagesDirPathOverride=/Users/admin/builder/spi-builder-workspace/.dependencies -resolvePackageDependencies
User defaults from command line:
    IDEClonedSourcePackagesDirPathOverride = /Users/admin/builder/spi-builder-workspace/.dependencies
    IDEPackageSupportUseBuiltinSCM = YES
Resolve Package Graph
Resolved source packages:
  DeclarativeTextKit: /Users/admin/builder/spi-builder-workspace
  TextBuffer: https://github.com/CleanCocoa/TextBuffer @ 0.1.0
resolved source packages: DeclarativeTextKit, TextBuffer
{
  "dependencies" : [
    {
      "identity" : "textbuffer",
      "requirement" : {
        "range" : [
          {
            "lower_bound" : "0.1.0",
            "upper_bound" : "1.0.0"
          }
        ]
      },
      "type" : "sourceControl",
      "url" : "https://github.com/CleanCocoa/TextBuffer"
    }
  ],
  "manifest_display_name" : "DeclarativeTextKit",
  "name" : "DeclarativeTextKit",
  "path" : "/Users/admin/builder/spi-builder-workspace",
  "platforms" : [
    {
      "name" : "macos",
      "version" : "10.13"
    }
  ],
  "products" : [
    {
      "name" : "DeclarativeTextKit",
      "targets" : [
        "DeclarativeTextKit"
      ],
      "type" : {
        "library" : [
          "automatic"
        ]
      }
    }
  ],
  "targets" : [
    {
      "c99name" : "DeclarativeTextKitTests",
      "module_type" : "SwiftTarget",
      "name" : "DeclarativeTextKitTests",
      "path" : "Tests/DeclarativeTextKitTests",
      "product_dependencies" : [
        "TextBuffer",
        "TextBufferTesting"
      ],
      "sources" : [
        "AffectedRangeTests.swift",
        "AssertModification.swift",
        "ConditionalTests.swift",
        "DeleteTests.swift",
        "Helpers.swift",
        "InsertTests.swift",
        "LoggingUndoManager.swift",
        "ModifyingTests.swift",
        "ScopedBufferSliceTests.swift",
        "SelectTests.swift",
        "UndoableBufferTests.swift",
        "UseCaseTests.swift"
      ],
      "target_dependencies" : [
        "DeclarativeTextKit"
      ],
      "type" : "test"
    },
    {
      "c99name" : "DeclarativeTextKit",
      "module_type" : "SwiftTarget",
      "name" : "DeclarativeTextKit",
      "path" : "Sources/DeclarativeTextKit",
      "product_dependencies" : [
        "TextBuffer"
      ],
      "product_memberships" : [
        "DeclarativeTextKit"
      ],
      "sources" : [
        "Expression/Debug.swift",
        "Expression/Expression.swift",
        "Expression/If.swift",
        "Expression/IfLet.swift",
        "Expression/Modification/ChangeInLength+Consume.swift",
        "Expression/Modification/ChangeInLength.swift",
        "Expression/Modification/Delete/Delete+Modification.swift",
        "Expression/Modification/Delete/Delete.swift",
        "Expression/Modification/Identity.swift",
        "Expression/Modification/Insert/Insert+Modification.swift",
        "Expression/Modification/Insert/Insert.swift",
        "Expression/Modification/Insert/Insertable.swift",
        "Expression/Modification/Insert/Line.swift",
        "Expression/Modification/Insert/String+Insertable.swift",
        "Expression/Modification/Insert/Word.swift",
        "Expression/Modification/Modification.swift",
        "Expression/Modification/ModificationBuilder.swift",
        "Expression/Modification/ModificationSequence.swift",
        "Expression/Modification/Modifying.swift",
        "Expression/Modification/ScopedBufferSlice.swift",
        "Expression/Select/AffectedRange.swift",
        "Expression/Select/Buffer+SelectRangeExpression.swift",
        "Expression/Select/BufferRangeExpression.swift",
        "Expression/Select/LineRange.swift",
        "Expression/Select/NSRange+BufferRangeExpression.swift",
        "Expression/Select/Select.swift",
        "Expression/Select/SelectedRange+BufferRangeExpression.swift",
        "Expression/Select/WordRange.swift",
        "ModifiableBuffer/Buffer+ModifiableBuffer.swift",
        "ModifiableBuffer/ModifiableBuffer+evaluate.swift",
        "ModifiableBuffer/ModifiableBuffer.swift",
        "ModifiableBuffer/Undoable+ModifiableBuffer.swift",
        "SortedArray.swift"
      ],
      "type" : "library"
    }
  ],
  "tools_version" : "5.9"
}
{
  "workspace" : {
    "name" : "spi-builder-workspace",
    "schemes" : [
      "DeclarativeTextKit"
    ]
  }
}
Running build ...
env DEVELOPER_DIR=/Applications/Xcode-15.2.0.app xcrun xcodebuild -IDEClonedSourcePackagesDirPathOverride=$PWD/.dependencies -skipMacroValidation -skipPackagePluginValidation -derivedDataPath $PWD/.derivedData build -scheme DeclarativeTextKit -destination platform=macOS,arch=arm64
Command line invocation:
    /Applications/Xcode-15.2.0.app/Contents/Developer/usr/bin/xcodebuild -IDEClonedSourcePackagesDirPathOverride=/Users/admin/builder/spi-builder-workspace/.dependencies -skipMacroValidation -skipPackagePluginValidation -derivedDataPath /Users/admin/builder/spi-builder-workspace/.derivedData build -scheme DeclarativeTextKit -destination platform=macOS,arch=arm64
User defaults from command line:
    IDEClonedSourcePackagesDirPathOverride = /Users/admin/builder/spi-builder-workspace/.dependencies
    IDEDerivedDataPathOverride = /Users/admin/builder/spi-builder-workspace/.derivedData
    IDEPackageSupportUseBuiltinSCM = YES
Resolve Package Graph
Resolved source packages:
  DeclarativeTextKit: /Users/admin/builder/spi-builder-workspace
  TextBuffer: https://github.com/CleanCocoa/TextBuffer @ 0.1.0
Prepare packages
ComputeTargetDependencyGraph
note: Building targets in dependency order
note: Target dependency graph (7 targets)
    Target 'DeclarativeTextKitTests' in project 'DeclarativeTextKit'
        ➜ Explicit dependency on target 'DeclarativeTextKit' in project 'DeclarativeTextKit'
        ➜ Explicit dependency on target 'TextBuffer' in project 'TextBuffer'
        ➜ Explicit dependency on target 'TextBufferTesting' in project 'TextBuffer'
    Target 'TextBufferTesting' in project 'TextBuffer'
        ➜ Explicit dependency on target 'TextBufferTesting' in project 'TextBuffer'
        ➜ Explicit dependency on target 'TextBuffer' in project 'TextBuffer'
    Target 'TextBufferTesting' in project 'TextBuffer'
        ➜ Explicit dependency on target 'TextBuffer' in project 'TextBuffer'
    Target 'DeclarativeTextKit' in project 'DeclarativeTextKit'
        ➜ Explicit dependency on target 'DeclarativeTextKit' in project 'DeclarativeTextKit'
        ➜ Explicit dependency on target 'TextBuffer' in project 'TextBuffer'
    Target 'DeclarativeTextKit' in project 'DeclarativeTextKit'
        ➜ Explicit dependency on target 'TextBuffer' in project 'TextBuffer'
    Target 'TextBuffer' in project 'TextBuffer'
        ➜ Explicit dependency on target 'TextBuffer' in project 'TextBuffer'
    Target 'TextBuffer' in project 'TextBuffer' (no dependencies)
GatherProvisioningInputs
CreateBuildDescription
ClangStatCache /Applications/Xcode-15.2.0.app/Contents/Developer/Toolchains/XcodeDefault.xctoolchain/usr/bin/clang-stat-cache /Applications/Xcode-15.2.0.app/Contents/Developer/Platforms/MacOSX.platform/Developer/SDKs/MacOSX14.2.sdk /Users/admin/builder/spi-builder-workspace/.derivedData/SDKStatCaches.noindex/macosx14.2-23C53-ddea79c7890ab41bba4a63928c655a96.sdkstatcache
    cd /Users/admin/builder/spi-builder-workspace/.swiftpm/xcode
    /Applications/Xcode-15.2.0.app/Contents/Developer/Toolchains/XcodeDefault.xctoolchain/usr/bin/clang-stat-cache /Applications/Xcode-15.2.0.app/Contents/Developer/Platforms/MacOSX.platform/Developer/SDKs/MacOSX14.2.sdk -o /Users/admin/builder/spi-builder-workspace/.derivedData/SDKStatCaches.noindex/macosx14.2-23C53-ddea79c7890ab41bba4a63928c655a96.sdkstatcache
SwiftDriver DeclarativeTextKitTests normal arm64 com.apple.xcode.tools.swift.compiler (in target 'DeclarativeTextKitTests' from project 'DeclarativeTextKit')
    cd /Users/admin/builder/spi-builder-workspace
    builtin-SwiftDriver -- /Applications/Xcode-15.2.0.app/Contents/Developer/Toolchains/XcodeDefault.xctoolchain/usr/bin/swiftc -module-name DeclarativeTextKitTests -Onone -enforce-exclusivity\=checked @/Users/admin/builder/spi-builder-workspace/.derivedData/Build/Intermediates.noindex/DeclarativeTextKit.build/Debug/DeclarativeTextKitTests.build/Objects-normal/arm64/DeclarativeTextKitTests.SwiftFileList -DSWIFT_PACKAGE -DDEBUG -DXcode -sdk /Applications/Xcode-15.2.0.app/Contents/Developer/Platforms/MacOSX.platform/Developer/SDKs/MacOSX14.2.sdk -target arm64-apple-macos13.0 -g -module-cache-path /Users/admin/builder/spi-builder-workspace/.derivedData/ModuleCache.noindex -Xfrontend -serialize-debugging-options -profile-coverage-mapping -profile-generate -enable-testing -index-store-path /Users/admin/builder/spi-builder-workspace/.derivedData/Index.noindex/DataStore -swift-version 5 -I /Users/admin/builder/spi-builder-workspace/.derivedData/Build/Products/Debug -I /Applications/Xcode-15.2.0.app/Contents/Developer/Platforms/MacOSX.platform/Developer/usr/lib -F /Users/admin/builder/spi-builder-workspace/.derivedData/Build/Products/Debug/PackageFrameworks -F /Users/admin/builder/spi-builder-workspace/.derivedData/Build/Products/Debug/PackageFrameworks -F /Users/admin/builder/spi-builder-workspace/.derivedData/Build/Products/Debug/PackageFrameworks -F /Users/admin/builder/spi-builder-workspace/.derivedData/Build/Products/Debug -F /Applications/Xcode-15.2.0.app/Contents/Developer/Platforms/MacOSX.platform/Developer/Library/Frameworks -c -j10 -enable-batch-mode -incremental -Xcc -ivfsstatcache -Xcc /Users/admin/builder/spi-builder-workspace/.derivedData/SDKStatCaches.noindex/macosx14.2-23C53-ddea79c7890ab41bba4a63928c655a96.sdkstatcache -output-file-map /Users/admin/builder/spi-builder-workspace/.derivedData/Build/Intermediates.noindex/DeclarativeTextKit.build/Debug/DeclarativeTextKitTests.build/Objects-normal/arm64/DeclarativeTextKitTests-OutputFileMap.json -use-frontend-parseable-output -save-temps -no-color-diagnostics -serialize-diagnostics -emit-dependencies -emit-module -emit-module-path /Users/admin/builder/spi-builder-workspace/.derivedData/Build/Intermediates.noindex/DeclarativeTextKit.build/Debug/DeclarativeTextKitTests.build/Objects-normal/arm64/DeclarativeTextKitTests.swiftmodule -validate-clang-modules-once -clang-build-session-file /Users/admin/builder/spi-builder-workspace/.derivedData/ModuleCache.noindex/Session.modulevalidation -Xfrontend -package-name -Xfrontend spi_builder_workspace -emit-const-values -Xfrontend -const-gather-protocols-file -Xfrontend /Users/admin/builder/spi-builder-workspace/.derivedData/Build/Intermediates.noindex/DeclarativeTextKit.build/Debug/DeclarativeTextKitTests.build/Objects-normal/arm64/DeclarativeTextKitTests_const_extract_protocols.json -Xcc -I/Users/admin/builder/spi-builder-workspace/.derivedData/Build/Products/Debug/include -Xcc -I/Users/admin/builder/spi-builder-workspace/.derivedData/Build/Intermediates.noindex/DeclarativeTextKit.build/Debug/DeclarativeTextKitTests.build/DerivedSources-normal/arm64 -Xcc -I/Users/admin/builder/spi-builder-workspace/.derivedData/Build/Intermediates.noindex/DeclarativeTextKit.build/Debug/DeclarativeTextKitTests.build/DerivedSources/arm64 -Xcc -I/Users/admin/builder/spi-builder-workspace/.derivedData/Build/Intermediates.noindex/DeclarativeTextKit.build/Debug/DeclarativeTextKitTests.build/DerivedSources -Xcc -DSWIFT_PACKAGE -Xcc -DDEBUG\=1 -working-directory /Users/admin/builder/spi-builder-workspace -experimental-emit-module-separately -disable-cmo
SwiftEmitModule normal arm64 Emitting\ module\ for\ DeclarativeTextKitTests (in target 'DeclarativeTextKitTests' from project 'DeclarativeTextKit')
    cd /Users/admin/builder/spi-builder-workspace
    builtin-swiftTaskExecution -- /Applications/Xcode-15.2.0.app/Contents/Developer/Toolchains/XcodeDefault.xctoolchain/usr/bin/swift-frontend -frontend -emit-module -experimental-skip-non-inlinable-function-bodies-without-types /Users/admin/builder/spi-builder-workspace/Tests/DeclarativeTextKitTests/AffectedRangeTests.swift /Users/admin/builder/spi-builder-workspace/Tests/DeclarativeTextKitTests/AssertModification.swift /Users/admin/builder/spi-builder-workspace/Tests/DeclarativeTextKitTests/ConditionalTests.swift /Users/admin/builder/spi-builder-workspace/Tests/DeclarativeTextKitTests/DeleteTests.swift /Users/admin/builder/spi-builder-workspace/Tests/DeclarativeTextKitTests/Helpers.swift /Users/admin/builder/spi-builder-workspace/Tests/DeclarativeTextKitTests/InsertTests.swift /Users/admin/builder/spi-builder-workspace/Tests/DeclarativeTextKitTests/LoggingUndoManager.swift /Users/admin/builder/spi-builder-workspace/Tests/DeclarativeTextKitTests/ModifyingTests.swift /Users/admin/builder/spi-builder-workspace/Tests/DeclarativeTextKitTests/ScopedBufferSliceTests.swift /Users/admin/builder/spi-builder-workspace/Tests/DeclarativeTextKitTests/SelectTests.swift /Users/admin/builder/spi-builder-workspace/Tests/DeclarativeTextKitTests/UndoableBufferTests.swift /Users/admin/builder/spi-builder-workspace/Tests/DeclarativeTextKitTests/UseCaseTests.swift -target arm64-apple-macos13.0 -Xllvm -aarch64-use-tbi -enable-objc-interop -stack-check -sdk /Applications/Xcode-15.2.0.app/Contents/Developer/Platforms/MacOSX.platform/Developer/SDKs/MacOSX14.2.sdk -I /Users/admin/builder/spi-builder-workspace/.derivedData/Build/Products/Debug -I /Applications/Xcode-15.2.0.app/Contents/Developer/Platforms/MacOSX.platform/Developer/usr/lib -F /Users/admin/builder/spi-builder-workspace/.derivedData/Build/Products/Debug/PackageFrameworks -F /Users/admin/builder/spi-builder-workspace/.derivedData/Build/Products/Debug/PackageFrameworks -F /Users/admin/builder/spi-builder-workspace/.derivedData/Build/Products/Debug/PackageFrameworks -F /Users/admin/builder/spi-builder-workspace/.derivedData/Build/Products/Debug -F /Applications/Xcode-15.2.0.app/Contents/Developer/Platforms/MacOSX.platform/Developer/Library/Frameworks -no-color-diagnostics -enable-testing -g -module-cache-path /Users/admin/builder/spi-builder-workspace/.derivedData/ModuleCache.noindex -profile-generate -profile-coverage-mapping -swift-version 5 -enforce-exclusivity\=checked -Onone -D SWIFT_PACKAGE -D DEBUG -D Xcode -serialize-debugging-options -package-name spi_builder_workspace -const-gather-protocols-file /Users/admin/builder/spi-builder-workspace/.derivedData/Build/Intermediates.noindex/DeclarativeTextKit.build/Debug/DeclarativeTextKitTests.build/Objects-normal/arm64/DeclarativeTextKitTests_const_extract_protocols.json -empty-abi-descriptor -validate-clang-modules-once -clang-build-session-file /Users/admin/builder/spi-builder-workspace/.derivedData/ModuleCache.noindex/Session.modulevalidation -Xcc -working-directory -Xcc /Users/admin/builder/spi-builder-workspace -resource-dir /Applications/Xcode-15.2.0.app/Contents/Developer/Toolchains/XcodeDefault.xctoolchain/usr/lib/swift -enable-anonymous-context-mangled-names -Xcc -ivfsstatcache -Xcc /Users/admin/builder/spi-builder-workspace/.derivedData/SDKStatCaches.noindex/macosx14.2-23C53-ddea79c7890ab41bba4a63928c655a96.sdkstatcache -Xcc -I/Users/admin/builder/spi-builder-workspace/.derivedData/Build/Products/Debug/include -Xcc -I/Users/admin/builder/spi-builder-workspace/.derivedData/Build/Intermediates.noindex/DeclarativeTextKit.build/Debug/DeclarativeTextKitTests.build/DerivedSources-normal/arm64 -Xcc -I/Users/admin/builder/spi-builder-workspace/.derivedData/Build/Intermediates.noindex/DeclarativeTextKit.build/Debug/DeclarativeTextKitTests.build/DerivedSources/arm64 -Xcc -I/Users/admin/builder/spi-builder-workspace/.derivedData/Build/Intermediates.noindex/DeclarativeTextKit.build/Debug/DeclarativeTextKitTests.build/DerivedSources -Xcc -DSWIFT_PACKAGE -Xcc -DDEBUG\=1 -module-name DeclarativeTextKitTests -disable-clang-spi -target-sdk-version 14.2 -target-sdk-name macosx14.2 -external-plugin-path /Applications/Xcode-15.2.0.app/Contents/Developer/Platforms/MacOSX.platform/Developer/SDKs/MacOSX14.2.sdk/usr/lib/swift/host/plugins\#/Applications/Xcode-15.2.0.app/Contents/Developer/Platforms/MacOSX.platform/Developer/SDKs/MacOSX14.2.sdk/usr/bin/swift-plugin-server -external-plugin-path /Applications/Xcode-15.2.0.app/Contents/Developer/Platforms/MacOSX.platform/Developer/SDKs/MacOSX14.2.sdk/usr/local/lib/swift/host/plugins\#/Applications/Xcode-15.2.0.app/Contents/Developer/Platforms/MacOSX.platform/Developer/SDKs/MacOSX14.2.sdk/usr/bin/swift-plugin-server -external-plugin-path /Applications/Xcode-15.2.0.app/Contents/Developer/Platforms/MacOSX.platform/Developer/usr/lib/swift/host/plugins\#/Applications/Xcode-15.2.0.app/Contents/Developer/Platforms/MacOSX.platform/Developer/usr/bin/swift-plugin-server -external-plugin-path /Applications/Xcode-15.2.0.app/Contents/Developer/Platforms/MacOSX.platform/Developer/usr/local/lib/swift/host/plugins\#/Applications/Xcode-15.2.0.app/Contents/Developer/Platforms/MacOSX.platform/Developer/usr/bin/swift-plugin-server -plugin-path /Applications/Xcode-15.2.0.app/Contents/Developer/Toolchains/XcodeDefault.xctoolchain/usr/lib/swift/host/plugins -plugin-path /Applications/Xcode-15.2.0.app/Contents/Developer/Toolchains/XcodeDefault.xctoolchain/usr/local/lib/swift/host/plugins -emit-module-doc-path /Users/admin/builder/spi-builder-workspace/.derivedData/Build/Intermediates.noindex/DeclarativeTextKit.build/Debug/DeclarativeTextKitTests.build/Objects-normal/arm64/DeclarativeTextKitTests.swiftdoc -emit-module-source-info-path /Users/admin/builder/spi-builder-workspace/.derivedData/Build/Intermediates.noindex/DeclarativeTextKit.build/Debug/DeclarativeTextKitTests.build/Objects-normal/arm64/DeclarativeTextKitTests.swiftsourceinfo -serialize-diagnostics-path /Users/admin/builder/spi-builder-workspace/.derivedData/Build/Intermediates.noindex/DeclarativeTextKit.build/Debug/DeclarativeTextKitTests.build/Objects-normal/arm64/DeclarativeTextKitTests-master-emit-module.dia -emit-dependencies-path /Users/admin/builder/spi-builder-workspace/.derivedData/Build/Intermediates.noindex/DeclarativeTextKit.build/Debug/DeclarativeTextKitTests.build/Objects-normal/arm64/DeclarativeTextKitTests-master-emit-module.d -o /Users/admin/builder/spi-builder-workspace/.derivedData/Build/Intermediates.noindex/DeclarativeTextKit.build/Debug/DeclarativeTextKitTests.build/Objects-normal/arm64/DeclarativeTextKitTests.swiftmodule -emit-abi-descriptor-path /Users/admin/builder/spi-builder-workspace/.derivedData/Build/Intermediates.noindex/DeclarativeTextKit.build/Debug/DeclarativeTextKitTests.build/Objects-normal/arm64/DeclarativeTextKitTests.abi.json
SwiftCompile normal arm64 Compiling\ SelectTests.swift /Users/admin/builder/spi-builder-workspace/Tests/DeclarativeTextKitTests/SelectTests.swift (in target 'DeclarativeTextKitTests' from project 'DeclarativeTextKit')
    cd /Users/admin/builder/spi-builder-workspace
    builtin-swiftTaskExecution -- /Applications/Xcode-15.2.0.app/Contents/Developer/Toolchains/XcodeDefault.xctoolchain/usr/bin/swift-frontend -frontend -c /Users/admin/builder/spi-builder-workspace/Tests/DeclarativeTextKitTests/AffectedRangeTests.swift /Users/admin/builder/spi-builder-workspace/Tests/DeclarativeTextKitTests/AssertModification.swift /Users/admin/builder/spi-builder-workspace/Tests/DeclarativeTextKitTests/ConditionalTests.swift /Users/admin/builder/spi-builder-workspace/Tests/DeclarativeTextKitTests/DeleteTests.swift /Users/admin/builder/spi-builder-workspace/Tests/DeclarativeTextKitTests/Helpers.swift /Users/admin/builder/spi-builder-workspace/Tests/DeclarativeTextKitTests/InsertTests.swift /Users/admin/builder/spi-builder-workspace/Tests/DeclarativeTextKitTests/LoggingUndoManager.swift /Users/admin/builder/spi-builder-workspace/Tests/DeclarativeTextKitTests/ModifyingTests.swift /Users/admin/builder/spi-builder-workspace/Tests/DeclarativeTextKitTests/ScopedBufferSliceTests.swift -primary-file /Users/admin/builder/spi-builder-workspace/Tests/DeclarativeTextKitTests/SelectTests.swift /Users/admin/builder/spi-builder-workspace/Tests/DeclarativeTextKitTests/UndoableBufferTests.swift /Users/admin/builder/spi-builder-workspace/Tests/DeclarativeTextKitTests/UseCaseTests.swift -emit-dependencies-path /Users/admin/builder/spi-builder-workspace/.derivedData/Build/Intermediates.noindex/DeclarativeTextKit.build/Debug/DeclarativeTextKitTests.build/Objects-normal/arm64/SelectTests.d -emit-const-values-path /Users/admin/builder/spi-builder-workspace/.derivedData/Build/Intermediates.noindex/DeclarativeTextKit.build/Debug/DeclarativeTextKitTests.build/Objects-normal/arm64/SelectTests.swiftconstvalues -emit-reference-dependencies-path /Users/admin/builder/spi-builder-workspace/.derivedData/Build/Intermediates.noindex/DeclarativeTextKit.build/Debug/DeclarativeTextKitTests.build/Objects-normal/arm64/SelectTests.swiftdeps -serialize-diagnostics-path /Users/admin/builder/spi-builder-workspace/.derivedData/Build/Intermediates.noindex/DeclarativeTextKit.build/Debug/DeclarativeTextKitTests.build/Objects-normal/arm64/SelectTests.dia -target arm64-apple-macos13.0 -Xllvm -aarch64-use-tbi -enable-objc-interop -stack-check -sdk /Applications/Xcode-15.2.0.app/Contents/Developer/Platforms/MacOSX.platform/Developer/SDKs/MacOSX14.2.sdk -I /Users/admin/builder/spi-builder-workspace/.derivedData/Build/Products/Debug -I /Applications/Xcode-15.2.0.app/Contents/Developer/Platforms/MacOSX.platform/Developer/usr/lib -F /Users/admin/builder/spi-builder-workspace/.derivedData/Build/Products/Debug/PackageFrameworks -F /Users/admin/builder/spi-builder-workspace/.derivedData/Build/Products/Debug/PackageFrameworks -F /Users/admin/builder/spi-builder-workspace/.derivedData/Build/Products/Debug/PackageFrameworks -F /Users/admin/builder/spi-builder-workspace/.derivedData/Build/Products/Debug -F /Applications/Xcode-15.2.0.app/Contents/Developer/Platforms/MacOSX.platform/Developer/Library/Frameworks -no-color-diagnostics -enable-testing -g -module-cache-path /Users/admin/builder/spi-builder-workspace/.derivedData/ModuleCache.noindex -profile-generate -profile-coverage-mapping -swift-version 5 -enforce-exclusivity\=checked -Onone -D SWIFT_PACKAGE -D DEBUG -D Xcode -serialize-debugging-options -package-name spi_builder_workspace -const-gather-protocols-file /Users/admin/builder/spi-builder-workspace/.derivedData/Build/Intermediates.noindex/DeclarativeTextKit.build/Debug/DeclarativeTextKitTests.build/Objects-normal/arm64/DeclarativeTextKitTests_const_extract_protocols.json -empty-abi-descriptor -validate-clang-modules-once -clang-build-session-file /Users/admin/builder/spi-builder-workspace/.derivedData/ModuleCache.noindex/Session.modulevalidation -Xcc -working-directory -Xcc /Users/admin/builder/spi-builder-workspace -resource-dir /Applications/Xcode-15.2.0.app/Contents/Developer/Toolchains/XcodeDefault.xctoolchain/usr/lib/swift -enable-anonymous-context-mangled-names -Xcc -ivfsstatcache -Xcc /Users/admin/builder/spi-builder-workspace/.derivedData/SDKStatCaches.noindex/macosx14.2-23C53-ddea79c7890ab41bba4a63928c655a96.sdkstatcache -Xcc -I/Users/admin/builder/spi-builder-workspace/.derivedData/Build/Products/Debug/include -Xcc -I/Users/admin/builder/spi-builder-workspace/.derivedData/Build/Intermediates.noindex/DeclarativeTextKit.build/Debug/DeclarativeTextKitTests.build/DerivedSources-normal/arm64 -Xcc -I/Users/admin/builder/spi-builder-workspace/.derivedData/Build/Intermediates.noindex/DeclarativeTextKit.build/Debug/DeclarativeTextKitTests.build/DerivedSources/arm64 -Xcc -I/Users/admin/builder/spi-builder-workspace/.derivedData/Build/Intermediates.noindex/DeclarativeTextKit.build/Debug/DeclarativeTextKitTests.build/DerivedSources -Xcc -DSWIFT_PACKAGE -Xcc -DDEBUG\=1 -module-name DeclarativeTextKitTests -frontend-parseable-output -disable-clang-spi -target-sdk-version 14.2 -target-sdk-name macosx14.2 -external-plugin-path /Applications/Xcode-15.2.0.app/Contents/Developer/Platforms/MacOSX.platform/Developer/SDKs/MacOSX14.2.sdk/usr/lib/swift/host/plugins\#/Applications/Xcode-15.2.0.app/Contents/Developer/Platforms/MacOSX.platform/Developer/SDKs/MacOSX14.2.sdk/usr/bin/swift-plugin-server -external-plugin-path /Applications/Xcode-15.2.0.app/Contents/Developer/Platforms/MacOSX.platform/Developer/SDKs/MacOSX14.2.sdk/usr/local/lib/swift/host/plugins\#/Applications/Xcode-15.2.0.app/Contents/Developer/Platforms/MacOSX.platform/Developer/SDKs/MacOSX14.2.sdk/usr/bin/swift-plugin-server -external-plugin-path /Applications/Xcode-15.2.0.app/Contents/Developer/Platforms/MacOSX.platform/Developer/usr/lib/swift/host/plugins\#/Applications/Xcode-15.2.0.app/Contents/Developer/Platforms/MacOSX.platform/Developer/usr/bin/swift-plugin-server -external-plugin-path /Applications/Xcode-15.2.0.app/Contents/Developer/Platforms/MacOSX.platform/Developer/usr/local/lib/swift/host/plugins\#/Applications/Xcode-15.2.0.app/Contents/Developer/Platforms/MacOSX.platform/Developer/usr/bin/swift-plugin-server -plugin-path /Applications/Xcode-15.2.0.app/Contents/Developer/Toolchains/XcodeDefault.xctoolchain/usr/lib/swift/host/plugins -plugin-path /Applications/Xcode-15.2.0.app/Contents/Developer/Toolchains/XcodeDefault.xctoolchain/usr/local/lib/swift/host/plugins -o /Users/admin/builder/spi-builder-workspace/.derivedData/Build/Intermediates.noindex/DeclarativeTextKit.build/Debug/DeclarativeTextKitTests.build/Objects-normal/arm64/SelectTests.o -index-unit-output-path /DeclarativeTextKit.build/Debug/DeclarativeTextKitTests.build/Objects-normal/arm64/SelectTests.o -index-store-path /Users/admin/builder/spi-builder-workspace/.derivedData/Index.noindex/DataStore -index-system-modules
SwiftCompile normal arm64 /Users/admin/builder/spi-builder-workspace/Tests/DeclarativeTextKitTests/SelectTests.swift (in target 'DeclarativeTextKitTests' from project 'DeclarativeTextKit')
    cd /Users/admin/builder/spi-builder-workspace
    /Applications/Xcode-15.2.0.app/Contents/Developer/Toolchains/XcodeDefault.xctoolchain/usr/bin/swift-frontend -c /Users/admin/builder/spi-builder-workspace/Tests/DeclarativeTextKitTests/AffectedRangeTests.swift /Users/admin/builder/spi-builder-workspace/Tests/DeclarativeTextKitTests/AssertModification.swift /Users/admin/builder/spi-builder-workspace/Tests/DeclarativeTextKitTests/ConditionalTests.swift /Users/admin/builder/spi-builder-workspace/Tests/DeclarativeTextKitTests/DeleteTests.swift /Users/admin/builder/spi-builder-workspace/Tests/DeclarativeTextKitTests/Helpers.swift /Users/admin/builder/spi-builder-workspace/Tests/DeclarativeTextKitTests/InsertTests.swift /Users/admin/builder/spi-builder-workspace/Tests/DeclarativeTextKitTests/LoggingUndoManager.swift /Users/admin/builder/spi-builder-workspace/Tests/DeclarativeTextKitTests/ModifyingTests.swift /Users/admin/builder/spi-builder-workspace/Tests/DeclarativeTextKitTests/ScopedBufferSliceTests.swift -primary-file /Users/admin/builder/spi-builder-workspace/Tests/DeclarativeTextKitTests/SelectTests.swift /Users/admin/builder/spi-builder-workspace/Tests/DeclarativeTextKitTests/UndoableBufferTests.swift /Users/admin/builder/spi-builder-workspace/Tests/DeclarativeTextKitTests/UseCaseTests.swift -emit-dependencies-path /Users/admin/builder/spi-builder-workspace/.derivedData/Build/Intermediates.noindex/DeclarativeTextKit.build/Debug/DeclarativeTextKitTests.build/Objects-normal/arm64/SelectTests.d -emit-const-values-path /Users/admin/builder/spi-builder-workspace/.derivedData/Build/Intermediates.noindex/DeclarativeTextKit.build/Debug/DeclarativeTextKitTests.build/Objects-normal/arm64/SelectTests.swiftconstvalues -emit-reference-dependencies-path /Users/admin/builder/spi-builder-workspace/.derivedData/Build/Intermediates.noindex/DeclarativeTextKit.build/Debug/DeclarativeTextKitTests.build/Objects-normal/arm64/SelectTests.swiftdeps -serialize-diagnostics-path /Users/admin/builder/spi-builder-workspace/.derivedData/Build/Intermediates.noindex/DeclarativeTextKit.build/Debug/DeclarativeTextKitTests.build/Objects-normal/arm64/SelectTests.dia -target arm64-apple-macos13.0 -Xllvm -aarch64-use-tbi -enable-objc-interop -stack-check -sdk /Applications/Xcode-15.2.0.app/Contents/Developer/Platforms/MacOSX.platform/Developer/SDKs/MacOSX14.2.sdk -I /Users/admin/builder/spi-builder-workspace/.derivedData/Build/Products/Debug -I /Applications/Xcode-15.2.0.app/Contents/Developer/Platforms/MacOSX.platform/Developer/usr/lib -F /Users/admin/builder/spi-builder-workspace/.derivedData/Build/Products/Debug/PackageFrameworks -F /Users/admin/builder/spi-builder-workspace/.derivedData/Build/Products/Debug/PackageFrameworks -F /Users/admin/builder/spi-builder-workspace/.derivedData/Build/Products/Debug/PackageFrameworks -F /Users/admin/builder/spi-builder-workspace/.derivedData/Build/Products/Debug -F /Applications/Xcode-15.2.0.app/Contents/Developer/Platforms/MacOSX.platform/Developer/Library/Frameworks -no-color-diagnostics -enable-testing -g -module-cache-path /Users/admin/builder/spi-builder-workspace/.derivedData/ModuleCache.noindex -profile-generate -profile-coverage-mapping -swift-version 5 -enforce-exclusivity\=checked -Onone -D SWIFT_PACKAGE -D DEBUG -D Xcode -serialize-debugging-options -package-name spi_builder_workspace -const-gather-protocols-file /Users/admin/builder/spi-builder-workspace/.derivedData/Build/Intermediates.noindex/DeclarativeTextKit.build/Debug/DeclarativeTextKitTests.build/Objects-normal/arm64/DeclarativeTextKitTests_const_extract_protocols.json -empty-abi-descriptor -validate-clang-modules-once -clang-build-session-file /Users/admin/builder/spi-builder-workspace/.derivedData/ModuleCache.noindex/Session.modulevalidation -Xcc -working-directory -Xcc /Users/admin/builder/spi-builder-workspace -resource-dir /Applications/Xcode-15.2.0.app/Contents/Developer/Toolchains/XcodeDefault.xctoolchain/usr/lib/swift -enable-anonymous-context-mangled-names -Xcc -ivfsstatcache -Xcc /Users/admin/builder/spi-builder-workspace/.derivedData/SDKStatCaches.noindex/macosx14.2-23C53-ddea79c7890ab41bba4a63928c655a96.sdkstatcache -Xcc -I/Users/admin/builder/spi-builder-workspace/.derivedData/Build/Products/Debug/include -Xcc -I/Users/admin/builder/spi-builder-workspace/.derivedData/Build/Intermediates.noindex/DeclarativeTextKit.build/Debug/DeclarativeTextKitTests.build/DerivedSources-normal/arm64 -Xcc -I/Users/admin/builder/spi-builder-workspace/.derivedData/Build/Intermediates.noindex/DeclarativeTextKit.build/Debug/DeclarativeTextKitTests.build/DerivedSources/arm64 -Xcc -I/Users/admin/builder/spi-builder-workspace/.derivedData/Build/Intermediates.noindex/DeclarativeTextKit.build/Debug/DeclarativeTextKitTests.build/DerivedSources -Xcc -DSWIFT_PACKAGE -Xcc -DDEBUG\=1 -module-name DeclarativeTextKitTests -frontend-parseable-output -disable-clang-spi -target-sdk-version 14.2 -target-sdk-name macosx14.2 -external-plugin-path /Applications/Xcode-15.2.0.app/Contents/Developer/Platforms/MacOSX.platform/Developer/SDKs/MacOSX14.2.sdk/usr/lib/swift/host/plugins\#/Applications/Xcode-15.2.0.app/Contents/Developer/Platforms/MacOSX.platform/Developer/SDKs/MacOSX14.2.sdk/usr/bin/swift-plugin-server -external-plugin-path /Applications/Xcode-15.2.0.app/Contents/Developer/Platforms/MacOSX.platform/Developer/SDKs/MacOSX14.2.sdk/usr/local/lib/swift/host/plugins\#/Applications/Xcode-15.2.0.app/Contents/Developer/Platforms/MacOSX.platform/Developer/SDKs/MacOSX14.2.sdk/usr/bin/swift-plugin-server -external-plugin-path /Applications/Xcode-15.2.0.app/Contents/Developer/Platforms/MacOSX.platform/Developer/usr/lib/swift/host/plugins\#/Applications/Xcode-15.2.0.app/Contents/Developer/Platforms/MacOSX.platform/Developer/usr/bin/swift-plugin-server -external-plugin-path /Applications/Xcode-15.2.0.app/Contents/Developer/Platforms/MacOSX.platform/Developer/usr/local/lib/swift/host/plugins\#/Applications/Xcode-15.2.0.app/Contents/Developer/Platforms/MacOSX.platform/Developer/usr/bin/swift-plugin-server -plugin-path /Applications/Xcode-15.2.0.app/Contents/Developer/Toolchains/XcodeDefault.xctoolchain/usr/lib/swift/host/plugins -plugin-path /Applications/Xcode-15.2.0.app/Contents/Developer/Toolchains/XcodeDefault.xctoolchain/usr/local/lib/swift/host/plugins -o /Users/admin/builder/spi-builder-workspace/.derivedData/Build/Intermediates.noindex/DeclarativeTextKit.build/Debug/DeclarativeTextKitTests.build/Objects-normal/arm64/SelectTests.o -index-unit-output-path /DeclarativeTextKit.build/Debug/DeclarativeTextKitTests.build/Objects-normal/arm64/SelectTests.o -index-store-path /Users/admin/builder/spi-builder-workspace/.derivedData/Index.noindex/DataStore -index-system-modules
SwiftCompile normal arm64 Compiling\ ConditionalTests.swift /Users/admin/builder/spi-builder-workspace/Tests/DeclarativeTextKitTests/ConditionalTests.swift (in target 'DeclarativeTextKitTests' from project 'DeclarativeTextKit')
    cd /Users/admin/builder/spi-builder-workspace
    builtin-swiftTaskExecution -- /Applications/Xcode-15.2.0.app/Contents/Developer/Toolchains/XcodeDefault.xctoolchain/usr/bin/swift-frontend -frontend -c /Users/admin/builder/spi-builder-workspace/Tests/DeclarativeTextKitTests/AffectedRangeTests.swift /Users/admin/builder/spi-builder-workspace/Tests/DeclarativeTextKitTests/AssertModification.swift -primary-file /Users/admin/builder/spi-builder-workspace/Tests/DeclarativeTextKitTests/ConditionalTests.swift /Users/admin/builder/spi-builder-workspace/Tests/DeclarativeTextKitTests/DeleteTests.swift /Users/admin/builder/spi-builder-workspace/Tests/DeclarativeTextKitTests/Helpers.swift /Users/admin/builder/spi-builder-workspace/Tests/DeclarativeTextKitTests/InsertTests.swift /Users/admin/builder/spi-builder-workspace/Tests/DeclarativeTextKitTests/LoggingUndoManager.swift /Users/admin/builder/spi-builder-workspace/Tests/DeclarativeTextKitTests/ModifyingTests.swift /Users/admin/builder/spi-builder-workspace/Tests/DeclarativeTextKitTests/ScopedBufferSliceTests.swift /Users/admin/builder/spi-builder-workspace/Tests/DeclarativeTextKitTests/SelectTests.swift /Users/admin/builder/spi-builder-workspace/Tests/DeclarativeTextKitTests/UndoableBufferTests.swift /Users/admin/builder/spi-builder-workspace/Tests/DeclarativeTextKitTests/UseCaseTests.swift -emit-dependencies-path /Users/admin/builder/spi-builder-workspace/.derivedData/Build/Intermediates.noindex/DeclarativeTextKit.build/Debug/DeclarativeTextKitTests.build/Objects-normal/arm64/ConditionalTests.d -emit-const-values-path /Users/admin/builder/spi-builder-workspace/.derivedData/Build/Intermediates.noindex/DeclarativeTextKit.build/Debug/DeclarativeTextKitTests.build/Objects-normal/arm64/ConditionalTests.swiftconstvalues -emit-reference-dependencies-path /Users/admin/builder/spi-builder-workspace/.derivedData/Build/Intermediates.noindex/DeclarativeTextKit.build/Debug/DeclarativeTextKitTests.build/Objects-normal/arm64/ConditionalTests.swiftdeps -serialize-diagnostics-path /Users/admin/builder/spi-builder-workspace/.derivedData/Build/Intermediates.noindex/DeclarativeTextKit.build/Debug/DeclarativeTextKitTests.build/Objects-normal/arm64/ConditionalTests.dia -target arm64-apple-macos13.0 -Xllvm -aarch64-use-tbi -enable-objc-interop -stack-check -sdk /Applications/Xcode-15.2.0.app/Contents/Developer/Platforms/MacOSX.platform/Developer/SDKs/MacOSX14.2.sdk -I /Users/admin/builder/spi-builder-workspace/.derivedData/Build/Products/Debug -I /Applications/Xcode-15.2.0.app/Contents/Developer/Platforms/MacOSX.platform/Developer/usr/lib -F /Users/admin/builder/spi-builder-workspace/.derivedData/Build/Products/Debug/PackageFrameworks -F /Users/admin/builder/spi-builder-workspace/.derivedData/Build/Products/Debug/PackageFrameworks -F /Users/admin/builder/spi-builder-workspace/.derivedData/Build/Products/Debug/PackageFrameworks -F /Users/admin/builder/spi-builder-workspace/.derivedData/Build/Products/Debug -F /Applications/Xcode-15.2.0.app/Contents/Developer/Platforms/MacOSX.platform/Developer/Library/Frameworks -no-color-diagnostics -enable-testing -g -module-cache-path /Users/admin/builder/spi-builder-workspace/.derivedData/ModuleCache.noindex -profile-generate -profile-coverage-mapping -swift-version 5 -enforce-exclusivity\=checked -Onone -D SWIFT_PACKAGE -D DEBUG -D Xcode -serialize-debugging-options -package-name spi_builder_workspace -const-gather-protocols-file /Users/admin/builder/spi-builder-workspace/.derivedData/Build/Intermediates.noindex/DeclarativeTextKit.build/Debug/DeclarativeTextKitTests.build/Objects-normal/arm64/DeclarativeTextKitTests_const_extract_protocols.json -empty-abi-descriptor -validate-clang-modules-once -clang-build-session-file /Users/admin/builder/spi-builder-workspace/.derivedData/ModuleCache.noindex/Session.modulevalidation -Xcc -working-directory -Xcc /Users/admin/builder/spi-builder-workspace -resource-dir /Applications/Xcode-15.2.0.app/Contents/Developer/Toolchains/XcodeDefault.xctoolchain/usr/lib/swift -enable-anonymous-context-mangled-names -Xcc -ivfsstatcache -Xcc /Users/admin/builder/spi-builder-workspace/.derivedData/SDKStatCaches.noindex/macosx14.2-23C53-ddea79c7890ab41bba4a63928c655a96.sdkstatcache -Xcc -I/Users/admin/builder/spi-builder-workspace/.derivedData/Build/Products/Debug/include -Xcc -I/Users/admin/builder/spi-builder-workspace/.derivedData/Build/Intermediates.noindex/DeclarativeTextKit.build/Debug/DeclarativeTextKitTests.build/DerivedSources-normal/arm64 -Xcc -I/Users/admin/builder/spi-builder-workspace/.derivedData/Build/Intermediates.noindex/DeclarativeTextKit.build/Debug/DeclarativeTextKitTests.build/DerivedSources/arm64 -Xcc -I/Users/admin/builder/spi-builder-workspace/.derivedData/Build/Intermediates.noindex/DeclarativeTextKit.build/Debug/DeclarativeTextKitTests.build/DerivedSources -Xcc -DSWIFT_PACKAGE -Xcc -DDEBUG\=1 -module-name DeclarativeTextKitTests -frontend-parseable-output -disable-clang-spi -target-sdk-version 14.2 -target-sdk-name macosx14.2 -external-plugin-path /Applications/Xcode-15.2.0.app/Contents/Developer/Platforms/MacOSX.platform/Developer/SDKs/MacOSX14.2.sdk/usr/lib/swift/host/plugins\#/Applications/Xcode-15.2.0.app/Contents/Developer/Platforms/MacOSX.platform/Developer/SDKs/MacOSX14.2.sdk/usr/bin/swift-plugin-server -external-plugin-path /Applications/Xcode-15.2.0.app/Contents/Developer/Platforms/MacOSX.platform/Developer/SDKs/MacOSX14.2.sdk/usr/local/lib/swift/host/plugins\#/Applications/Xcode-15.2.0.app/Contents/Developer/Platforms/MacOSX.platform/Developer/SDKs/MacOSX14.2.sdk/usr/bin/swift-plugin-server -external-plugin-path /Applications/Xcode-15.2.0.app/Contents/Developer/Platforms/MacOSX.platform/Developer/usr/lib/swift/host/plugins\#/Applications/Xcode-15.2.0.app/Contents/Developer/Platforms/MacOSX.platform/Developer/usr/bin/swift-plugin-server -external-plugin-path /Applications/Xcode-15.2.0.app/Contents/Developer/Platforms/MacOSX.platform/Developer/usr/local/lib/swift/host/plugins\#/Applications/Xcode-15.2.0.app/Contents/Developer/Platforms/MacOSX.platform/Developer/usr/bin/swift-plugin-server -plugin-path /Applications/Xcode-15.2.0.app/Contents/Developer/Toolchains/XcodeDefault.xctoolchain/usr/lib/swift/host/plugins -plugin-path /Applications/Xcode-15.2.0.app/Contents/Developer/Toolchains/XcodeDefault.xctoolchain/usr/local/lib/swift/host/plugins -o /Users/admin/builder/spi-builder-workspace/.derivedData/Build/Intermediates.noindex/DeclarativeTextKit.build/Debug/DeclarativeTextKitTests.build/Objects-normal/arm64/ConditionalTests.o -index-unit-output-path /DeclarativeTextKit.build/Debug/DeclarativeTextKitTests.build/Objects-normal/arm64/ConditionalTests.o -index-store-path /Users/admin/builder/spi-builder-workspace/.derivedData/Index.noindex/DataStore -index-system-modules
SwiftCompile normal arm64 /Users/admin/builder/spi-builder-workspace/Tests/DeclarativeTextKitTests/ConditionalTests.swift (in target 'DeclarativeTextKitTests' from project 'DeclarativeTextKit')
    cd /Users/admin/builder/spi-builder-workspace
    /Applications/Xcode-15.2.0.app/Contents/Developer/Toolchains/XcodeDefault.xctoolchain/usr/bin/swift-frontend -c /Users/admin/builder/spi-builder-workspace/Tests/DeclarativeTextKitTests/AffectedRangeTests.swift /Users/admin/builder/spi-builder-workspace/Tests/DeclarativeTextKitTests/AssertModification.swift -primary-file /Users/admin/builder/spi-builder-workspace/Tests/DeclarativeTextKitTests/ConditionalTests.swift /Users/admin/builder/spi-builder-workspace/Tests/DeclarativeTextKitTests/DeleteTests.swift /Users/admin/builder/spi-builder-workspace/Tests/DeclarativeTextKitTests/Helpers.swift /Users/admin/builder/spi-builder-workspace/Tests/DeclarativeTextKitTests/InsertTests.swift /Users/admin/builder/spi-builder-workspace/Tests/DeclarativeTextKitTests/LoggingUndoManager.swift /Users/admin/builder/spi-builder-workspace/Tests/DeclarativeTextKitTests/ModifyingTests.swift /Users/admin/builder/spi-builder-workspace/Tests/DeclarativeTextKitTests/ScopedBufferSliceTests.swift /Users/admin/builder/spi-builder-workspace/Tests/DeclarativeTextKitTests/SelectTests.swift /Users/admin/builder/spi-builder-workspace/Tests/DeclarativeTextKitTests/UndoableBufferTests.swift /Users/admin/builder/spi-builder-workspace/Tests/DeclarativeTextKitTests/UseCaseTests.swift -emit-dependencies-path /Users/admin/builder/spi-builder-workspace/.derivedData/Build/Intermediates.noindex/DeclarativeTextKit.build/Debug/DeclarativeTextKitTests.build/Objects-normal/arm64/ConditionalTests.d -emit-const-values-path /Users/admin/builder/spi-builder-workspace/.derivedData/Build/Intermediates.noindex/DeclarativeTextKit.build/Debug/DeclarativeTextKitTests.build/Objects-normal/arm64/ConditionalTests.swiftconstvalues -emit-reference-dependencies-path /Users/admin/builder/spi-builder-workspace/.derivedData/Build/Intermediates.noindex/DeclarativeTextKit.build/Debug/DeclarativeTextKitTests.build/Objects-normal/arm64/ConditionalTests.swiftdeps -serialize-diagnostics-path /Users/admin/builder/spi-builder-workspace/.derivedData/Build/Intermediates.noindex/DeclarativeTextKit.build/Debug/DeclarativeTextKitTests.build/Objects-normal/arm64/ConditionalTests.dia -target arm64-apple-macos13.0 -Xllvm -aarch64-use-tbi -enable-objc-interop -stack-check -sdk /Applications/Xcode-15.2.0.app/Contents/Developer/Platforms/MacOSX.platform/Developer/SDKs/MacOSX14.2.sdk -I /Users/admin/builder/spi-builder-workspace/.derivedData/Build/Products/Debug -I /Applications/Xcode-15.2.0.app/Contents/Developer/Platforms/MacOSX.platform/Developer/usr/lib -F /Users/admin/builder/spi-builder-workspace/.derivedData/Build/Products/Debug/PackageFrameworks -F /Users/admin/builder/spi-builder-workspace/.derivedData/Build/Products/Debug/PackageFrameworks -F /Users/admin/builder/spi-builder-workspace/.derivedData/Build/Products/Debug/PackageFrameworks -F /Users/admin/builder/spi-builder-workspace/.derivedData/Build/Products/Debug -F /Applications/Xcode-15.2.0.app/Contents/Developer/Platforms/MacOSX.platform/Developer/Library/Frameworks -no-color-diagnostics -enable-testing -g -module-cache-path /Users/admin/builder/spi-builder-workspace/.derivedData/ModuleCache.noindex -profile-generate -profile-coverage-mapping -swift-version 5 -enforce-exclusivity\=checked -Onone -D SWIFT_PACKAGE -D DEBUG -D Xcode -serialize-debugging-options -package-name spi_builder_workspace -const-gather-protocols-file /Users/admin/builder/spi-builder-workspace/.derivedData/Build/Intermediates.noindex/DeclarativeTextKit.build/Debug/DeclarativeTextKitTests.build/Objects-normal/arm64/DeclarativeTextKitTests_const_extract_protocols.json -empty-abi-descriptor -validate-clang-modules-once -clang-build-session-file /Users/admin/builder/spi-builder-workspace/.derivedData/ModuleCache.noindex/Session.modulevalidation -Xcc -working-directory -Xcc /Users/admin/builder/spi-builder-workspace -resource-dir /Applications/Xcode-15.2.0.app/Contents/Developer/Toolchains/XcodeDefault.xctoolchain/usr/lib/swift -enable-anonymous-context-mangled-names -Xcc -ivfsstatcache -Xcc /Users/admin/builder/spi-builder-workspace/.derivedData/SDKStatCaches.noindex/macosx14.2-23C53-ddea79c7890ab41bba4a63928c655a96.sdkstatcache -Xcc -I/Users/admin/builder/spi-builder-workspace/.derivedData/Build/Products/Debug/include -Xcc -I/Users/admin/builder/spi-builder-workspace/.derivedData/Build/Intermediates.noindex/DeclarativeTextKit.build/Debug/DeclarativeTextKitTests.build/DerivedSources-normal/arm64 -Xcc -I/Users/admin/builder/spi-builder-workspace/.derivedData/Build/Intermediates.noindex/DeclarativeTextKit.build/Debug/DeclarativeTextKitTests.build/DerivedSources/arm64 -Xcc -I/Users/admin/builder/spi-builder-workspace/.derivedData/Build/Intermediates.noindex/DeclarativeTextKit.build/Debug/DeclarativeTextKitTests.build/DerivedSources -Xcc -DSWIFT_PACKAGE -Xcc -DDEBUG\=1 -module-name DeclarativeTextKitTests -frontend-parseable-output -disable-clang-spi -target-sdk-version 14.2 -target-sdk-name macosx14.2 -external-plugin-path /Applications/Xcode-15.2.0.app/Contents/Developer/Platforms/MacOSX.platform/Developer/SDKs/MacOSX14.2.sdk/usr/lib/swift/host/plugins\#/Applications/Xcode-15.2.0.app/Contents/Developer/Platforms/MacOSX.platform/Developer/SDKs/MacOSX14.2.sdk/usr/bin/swift-plugin-server -external-plugin-path /Applications/Xcode-15.2.0.app/Contents/Developer/Platforms/MacOSX.platform/Developer/SDKs/MacOSX14.2.sdk/usr/local/lib/swift/host/plugins\#/Applications/Xcode-15.2.0.app/Contents/Developer/Platforms/MacOSX.platform/Developer/SDKs/MacOSX14.2.sdk/usr/bin/swift-plugin-server -external-plugin-path /Applications/Xcode-15.2.0.app/Contents/Developer/Platforms/MacOSX.platform/Developer/usr/lib/swift/host/plugins\#/Applications/Xcode-15.2.0.app/Contents/Developer/Platforms/MacOSX.platform/Developer/usr/bin/swift-plugin-server -external-plugin-path /Applications/Xcode-15.2.0.app/Contents/Developer/Platforms/MacOSX.platform/Developer/usr/local/lib/swift/host/plugins\#/Applications/Xcode-15.2.0.app/Contents/Developer/Platforms/MacOSX.platform/Developer/usr/bin/swift-plugin-server -plugin-path /Applications/Xcode-15.2.0.app/Contents/Developer/Toolchains/XcodeDefault.xctoolchain/usr/lib/swift/host/plugins -plugin-path /Applications/Xcode-15.2.0.app/Contents/Developer/Toolchains/XcodeDefault.xctoolchain/usr/local/lib/swift/host/plugins -o /Users/admin/builder/spi-builder-workspace/.derivedData/Build/Intermediates.noindex/DeclarativeTextKit.build/Debug/DeclarativeTextKitTests.build/Objects-normal/arm64/ConditionalTests.o -index-unit-output-path /DeclarativeTextKit.build/Debug/DeclarativeTextKitTests.build/Objects-normal/arm64/ConditionalTests.o -index-store-path /Users/admin/builder/spi-builder-workspace/.derivedData/Index.noindex/DataStore -index-system-modules
SwiftCompile normal arm64 Compiling\ ScopedBufferSliceTests.swift /Users/admin/builder/spi-builder-workspace/Tests/DeclarativeTextKitTests/ScopedBufferSliceTests.swift (in target 'DeclarativeTextKitTests' from project 'DeclarativeTextKit')
    cd /Users/admin/builder/spi-builder-workspace
    builtin-swiftTaskExecution -- /Applications/Xcode-15.2.0.app/Contents/Developer/Toolchains/XcodeDefault.xctoolchain/usr/bin/swift-frontend -frontend -c /Users/admin/builder/spi-builder-workspace/Tests/DeclarativeTextKitTests/AffectedRangeTests.swift /Users/admin/builder/spi-builder-workspace/Tests/DeclarativeTextKitTests/AssertModification.swift /Users/admin/builder/spi-builder-workspace/Tests/DeclarativeTextKitTests/ConditionalTests.swift /Users/admin/builder/spi-builder-workspace/Tests/DeclarativeTextKitTests/DeleteTests.swift /Users/admin/builder/spi-builder-workspace/Tests/DeclarativeTextKitTests/Helpers.swift /Users/admin/builder/spi-builder-workspace/Tests/DeclarativeTextKitTests/InsertTests.swift /Users/admin/builder/spi-builder-workspace/Tests/DeclarativeTextKitTests/LoggingUndoManager.swift /Users/admin/builder/spi-builder-workspace/Tests/DeclarativeTextKitTests/ModifyingTests.swift -primary-file /Users/admin/builder/spi-builder-workspace/Tests/DeclarativeTextKitTests/ScopedBufferSliceTests.swift /Users/admin/builder/spi-builder-workspace/Tests/DeclarativeTextKitTests/SelectTests.swift /Users/admin/builder/spi-builder-workspace/Tests/DeclarativeTextKitTests/UndoableBufferTests.swift /Users/admin/builder/spi-builder-workspace/Tests/DeclarativeTextKitTests/UseCaseTests.swift -emit-dependencies-path /Users/admin/builder/spi-builder-workspace/.derivedData/Build/Intermediates.noindex/DeclarativeTextKit.build/Debug/DeclarativeTextKitTests.build/Objects-normal/arm64/ScopedBufferSliceTests.d -emit-const-values-path /Users/admin/builder/spi-builder-workspace/.derivedData/Build/Intermediates.noindex/DeclarativeTextKit.build/Debug/DeclarativeTextKitTests.build/Objects-normal/arm64/ScopedBufferSliceTests.swiftconstvalues -emit-reference-dependencies-path /Users/admin/builder/spi-builder-workspace/.derivedData/Build/Intermediates.noindex/DeclarativeTextKit.build/Debug/DeclarativeTextKitTests.build/Objects-normal/arm64/ScopedBufferSliceTests.swiftdeps -serialize-diagnostics-path /Users/admin/builder/spi-builder-workspace/.derivedData/Build/Intermediates.noindex/DeclarativeTextKit.build/Debug/DeclarativeTextKitTests.build/Objects-normal/arm64/ScopedBufferSliceTests.dia -target arm64-apple-macos13.0 -Xllvm -aarch64-use-tbi -enable-objc-interop -stack-check -sdk /Applications/Xcode-15.2.0.app/Contents/Developer/Platforms/MacOSX.platform/Developer/SDKs/MacOSX14.2.sdk -I /Users/admin/builder/spi-builder-workspace/.derivedData/Build/Products/Debug -I /Applications/Xcode-15.2.0.app/Contents/Developer/Platforms/MacOSX.platform/Developer/usr/lib -F /Users/admin/builder/spi-builder-workspace/.derivedData/Build/Products/Debug/PackageFrameworks -F /Users/admin/builder/spi-builder-workspace/.derivedData/Build/Products/Debug/PackageFrameworks -F /Users/admin/builder/spi-builder-workspace/.derivedData/Build/Products/Debug/PackageFrameworks -F /Users/admin/builder/spi-builder-workspace/.derivedData/Build/Products/Debug -F /Applications/Xcode-15.2.0.app/Contents/Developer/Platforms/MacOSX.platform/Developer/Library/Frameworks -no-color-diagnostics -enable-testing -g -module-cache-path /Users/admin/builder/spi-builder-workspace/.derivedData/ModuleCache.noindex -profile-generate -profile-coverage-mapping -swift-version 5 -enforce-exclusivity\=checked -Onone -D SWIFT_PACKAGE -D DEBUG -D Xcode -serialize-debugging-options -package-name spi_builder_workspace -const-gather-protocols-file /Users/admin/builder/spi-builder-workspace/.derivedData/Build/Intermediates.noindex/DeclarativeTextKit.build/Debug/DeclarativeTextKitTests.build/Objects-normal/arm64/DeclarativeTextKitTests_const_extract_protocols.json -empty-abi-descriptor -validate-clang-modules-once -clang-build-session-file /Users/admin/builder/spi-builder-workspace/.derivedData/ModuleCache.noindex/Session.modulevalidation -Xcc -working-directory -Xcc /Users/admin/builder/spi-builder-workspace -resource-dir /Applications/Xcode-15.2.0.app/Contents/Developer/Toolchains/XcodeDefault.xctoolchain/usr/lib/swift -enable-anonymous-context-mangled-names -Xcc -ivfsstatcache -Xcc /Users/admin/builder/spi-builder-workspace/.derivedData/SDKStatCaches.noindex/macosx14.2-23C53-ddea79c7890ab41bba4a63928c655a96.sdkstatcache -Xcc -I/Users/admin/builder/spi-builder-workspace/.derivedData/Build/Products/Debug/include -Xcc -I/Users/admin/builder/spi-builder-workspace/.derivedData/Build/Intermediates.noindex/DeclarativeTextKit.build/Debug/DeclarativeTextKitTests.build/DerivedSources-normal/arm64 -Xcc -I/Users/admin/builder/spi-builder-workspace/.derivedData/Build/Intermediates.noindex/DeclarativeTextKit.build/Debug/DeclarativeTextKitTests.build/DerivedSources/arm64 -Xcc -I/Users/admin/builder/spi-builder-workspace/.derivedData/Build/Intermediates.noindex/DeclarativeTextKit.build/Debug/DeclarativeTextKitTests.build/DerivedSources -Xcc -DSWIFT_PACKAGE -Xcc -DDEBUG\=1 -module-name DeclarativeTextKitTests -frontend-parseable-output -disable-clang-spi -target-sdk-version 14.2 -target-sdk-name macosx14.2 -external-plugin-path /Applications/Xcode-15.2.0.app/Contents/Developer/Platforms/MacOSX.platform/Developer/SDKs/MacOSX14.2.sdk/usr/lib/swift/host/plugins\#/Applications/Xcode-15.2.0.app/Contents/Developer/Platforms/MacOSX.platform/Developer/SDKs/MacOSX14.2.sdk/usr/bin/swift-plugin-server -external-plugin-path /Applications/Xcode-15.2.0.app/Contents/Developer/Platforms/MacOSX.platform/Developer/SDKs/MacOSX14.2.sdk/usr/local/lib/swift/host/plugins\#/Applications/Xcode-15.2.0.app/Contents/Developer/Platforms/MacOSX.platform/Developer/SDKs/MacOSX14.2.sdk/usr/bin/swift-plugin-server -external-plugin-path /Applications/Xcode-15.2.0.app/Contents/Developer/Platforms/MacOSX.platform/Developer/usr/lib/swift/host/plugins\#/Applications/Xcode-15.2.0.app/Contents/Developer/Platforms/MacOSX.platform/Developer/usr/bin/swift-plugin-server -external-plugin-path /Applications/Xcode-15.2.0.app/Contents/Developer/Platforms/MacOSX.platform/Developer/usr/local/lib/swift/host/plugins\#/Applications/Xcode-15.2.0.app/Contents/Developer/Platforms/MacOSX.platform/Developer/usr/bin/swift-plugin-server -plugin-path /Applications/Xcode-15.2.0.app/Contents/Developer/Toolchains/XcodeDefault.xctoolchain/usr/lib/swift/host/plugins -plugin-path /Applications/Xcode-15.2.0.app/Contents/Developer/Toolchains/XcodeDefault.xctoolchain/usr/local/lib/swift/host/plugins -o /Users/admin/builder/spi-builder-workspace/.derivedData/Build/Intermediates.noindex/DeclarativeTextKit.build/Debug/DeclarativeTextKitTests.build/Objects-normal/arm64/ScopedBufferSliceTests.o -index-unit-output-path /DeclarativeTextKit.build/Debug/DeclarativeTextKitTests.build/Objects-normal/arm64/ScopedBufferSliceTests.o -index-store-path /Users/admin/builder/spi-builder-workspace/.derivedData/Index.noindex/DataStore -index-system-modules
SwiftCompile normal arm64 /Users/admin/builder/spi-builder-workspace/Tests/DeclarativeTextKitTests/ScopedBufferSliceTests.swift (in target 'DeclarativeTextKitTests' from project 'DeclarativeTextKit')
    cd /Users/admin/builder/spi-builder-workspace
    /Applications/Xcode-15.2.0.app/Contents/Developer/Toolchains/XcodeDefault.xctoolchain/usr/bin/swift-frontend -c /Users/admin/builder/spi-builder-workspace/Tests/DeclarativeTextKitTests/AffectedRangeTests.swift /Users/admin/builder/spi-builder-workspace/Tests/DeclarativeTextKitTests/AssertModification.swift /Users/admin/builder/spi-builder-workspace/Tests/DeclarativeTextKitTests/ConditionalTests.swift /Users/admin/builder/spi-builder-workspace/Tests/DeclarativeTextKitTests/DeleteTests.swift /Users/admin/builder/spi-builder-workspace/Tests/DeclarativeTextKitTests/Helpers.swift /Users/admin/builder/spi-builder-workspace/Tests/DeclarativeTextKitTests/InsertTests.swift /Users/admin/builder/spi-builder-workspace/Tests/DeclarativeTextKitTests/LoggingUndoManager.swift /Users/admin/builder/spi-builder-workspace/Tests/DeclarativeTextKitTests/ModifyingTests.swift -primary-file /Users/admin/builder/spi-builder-workspace/Tests/DeclarativeTextKitTests/ScopedBufferSliceTests.swift /Users/admin/builder/spi-builder-workspace/Tests/DeclarativeTextKitTests/SelectTests.swift /Users/admin/builder/spi-builder-workspace/Tests/DeclarativeTextKitTests/UndoableBufferTests.swift /Users/admin/builder/spi-builder-workspace/Tests/DeclarativeTextKitTests/UseCaseTests.swift -emit-dependencies-path /Users/admin/builder/spi-builder-workspace/.derivedData/Build/Intermediates.noindex/DeclarativeTextKit.build/Debug/DeclarativeTextKitTests.build/Objects-normal/arm64/ScopedBufferSliceTests.d -emit-const-values-path /Users/admin/builder/spi-builder-workspace/.derivedData/Build/Intermediates.noindex/DeclarativeTextKit.build/Debug/DeclarativeTextKitTests.build/Objects-normal/arm64/ScopedBufferSliceTests.swiftconstvalues -emit-reference-dependencies-path /Users/admin/builder/spi-builder-workspace/.derivedData/Build/Intermediates.noindex/DeclarativeTextKit.build/Debug/DeclarativeTextKitTests.build/Objects-normal/arm64/ScopedBufferSliceTests.swiftdeps -serialize-diagnostics-path /Users/admin/builder/spi-builder-workspace/.derivedData/Build/Intermediates.noindex/DeclarativeTextKit.build/Debug/DeclarativeTextKitTests.build/Objects-normal/arm64/ScopedBufferSliceTests.dia -target arm64-apple-macos13.0 -Xllvm -aarch64-use-tbi -enable-objc-interop -stack-check -sdk /Applications/Xcode-15.2.0.app/Contents/Developer/Platforms/MacOSX.platform/Developer/SDKs/MacOSX14.2.sdk -I /Users/admin/builder/spi-builder-workspace/.derivedData/Build/Products/Debug -I /Applications/Xcode-15.2.0.app/Contents/Developer/Platforms/MacOSX.platform/Developer/usr/lib -F /Users/admin/builder/spi-builder-workspace/.derivedData/Build/Products/Debug/PackageFrameworks -F /Users/admin/builder/spi-builder-workspace/.derivedData/Build/Products/Debug/PackageFrameworks -F /Users/admin/builder/spi-builder-workspace/.derivedData/Build/Products/Debug/PackageFrameworks -F /Users/admin/builder/spi-builder-workspace/.derivedData/Build/Products/Debug -F /Applications/Xcode-15.2.0.app/Contents/Developer/Platforms/MacOSX.platform/Developer/Library/Frameworks -no-color-diagnostics -enable-testing -g -module-cache-path /Users/admin/builder/spi-builder-workspace/.derivedData/ModuleCache.noindex -profile-generate -profile-coverage-mapping -swift-version 5 -enforce-exclusivity\=checked -Onone -D SWIFT_PACKAGE -D DEBUG -D Xcode -serialize-debugging-options -package-name spi_builder_workspace -const-gather-protocols-file /Users/admin/builder/spi-builder-workspace/.derivedData/Build/Intermediates.noindex/DeclarativeTextKit.build/Debug/DeclarativeTextKitTests.build/Objects-normal/arm64/DeclarativeTextKitTests_const_extract_protocols.json -empty-abi-descriptor -validate-clang-modules-once -clang-build-session-file /Users/admin/builder/spi-builder-workspace/.derivedData/ModuleCache.noindex/Session.modulevalidation -Xcc -working-directory -Xcc /Users/admin/builder/spi-builder-workspace -resource-dir /Applications/Xcode-15.2.0.app/Contents/Developer/Toolchains/XcodeDefault.xctoolchain/usr/lib/swift -enable-anonymous-context-mangled-names -Xcc -ivfsstatcache -Xcc /Users/admin/builder/spi-builder-workspace/.derivedData/SDKStatCaches.noindex/macosx14.2-23C53-ddea79c7890ab41bba4a63928c655a96.sdkstatcache -Xcc -I/Users/admin/builder/spi-builder-workspace/.derivedData/Build/Products/Debug/include -Xcc -I/Users/admin/builder/spi-builder-workspace/.derivedData/Build/Intermediates.noindex/DeclarativeTextKit.build/Debug/DeclarativeTextKitTests.build/DerivedSources-normal/arm64 -Xcc -I/Users/admin/builder/spi-builder-workspace/.derivedData/Build/Intermediates.noindex/DeclarativeTextKit.build/Debug/DeclarativeTextKitTests.build/DerivedSources/arm64 -Xcc -I/Users/admin/builder/spi-builder-workspace/.derivedData/Build/Intermediates.noindex/DeclarativeTextKit.build/Debug/DeclarativeTextKitTests.build/DerivedSources -Xcc -DSWIFT_PACKAGE -Xcc -DDEBUG\=1 -module-name DeclarativeTextKitTests -frontend-parseable-output -disable-clang-spi -target-sdk-version 14.2 -target-sdk-name macosx14.2 -external-plugin-path /Applications/Xcode-15.2.0.app/Contents/Developer/Platforms/MacOSX.platform/Developer/SDKs/MacOSX14.2.sdk/usr/lib/swift/host/plugins\#/Applications/Xcode-15.2.0.app/Contents/Developer/Platforms/MacOSX.platform/Developer/SDKs/MacOSX14.2.sdk/usr/bin/swift-plugin-server -external-plugin-path /Applications/Xcode-15.2.0.app/Contents/Developer/Platforms/MacOSX.platform/Developer/SDKs/MacOSX14.2.sdk/usr/local/lib/swift/host/plugins\#/Applications/Xcode-15.2.0.app/Contents/Developer/Platforms/MacOSX.platform/Developer/SDKs/MacOSX14.2.sdk/usr/bin/swift-plugin-server -external-plugin-path /Applications/Xcode-15.2.0.app/Contents/Developer/Platforms/MacOSX.platform/Developer/usr/lib/swift/host/plugins\#/Applications/Xcode-15.2.0.app/Contents/Developer/Platforms/MacOSX.platform/Developer/usr/bin/swift-plugin-server -external-plugin-path /Applications/Xcode-15.2.0.app/Contents/Developer/Platforms/MacOSX.platform/Developer/usr/local/lib/swift/host/plugins\#/Applications/Xcode-15.2.0.app/Contents/Developer/Platforms/MacOSX.platform/Developer/usr/bin/swift-plugin-server -plugin-path /Applications/Xcode-15.2.0.app/Contents/Developer/Toolchains/XcodeDefault.xctoolchain/usr/lib/swift/host/plugins -plugin-path /Applications/Xcode-15.2.0.app/Contents/Developer/Toolchains/XcodeDefault.xctoolchain/usr/local/lib/swift/host/plugins -o /Users/admin/builder/spi-builder-workspace/.derivedData/Build/Intermediates.noindex/DeclarativeTextKit.build/Debug/DeclarativeTextKitTests.build/Objects-normal/arm64/ScopedBufferSliceTests.o -index-unit-output-path /DeclarativeTextKit.build/Debug/DeclarativeTextKitTests.build/Objects-normal/arm64/ScopedBufferSliceTests.o -index-store-path /Users/admin/builder/spi-builder-workspace/.derivedData/Index.noindex/DataStore -index-system-modules
SwiftCompile normal arm64 Compiling\ UseCaseTests.swift /Users/admin/builder/spi-builder-workspace/Tests/DeclarativeTextKitTests/UseCaseTests.swift (in target 'DeclarativeTextKitTests' from project 'DeclarativeTextKit')
    cd /Users/admin/builder/spi-builder-workspace
    builtin-swiftTaskExecution -- /Applications/Xcode-15.2.0.app/Contents/Developer/Toolchains/XcodeDefault.xctoolchain/usr/bin/swift-frontend -frontend -c /Users/admin/builder/spi-builder-workspace/Tests/DeclarativeTextKitTests/AffectedRangeTests.swift /Users/admin/builder/spi-builder-workspace/Tests/DeclarativeTextKitTests/AssertModification.swift /Users/admin/builder/spi-builder-workspace/Tests/DeclarativeTextKitTests/ConditionalTests.swift /Users/admin/builder/spi-builder-workspace/Tests/DeclarativeTextKitTests/DeleteTests.swift /Users/admin/builder/spi-builder-workspace/Tests/DeclarativeTextKitTests/Helpers.swift /Users/admin/builder/spi-builder-workspace/Tests/DeclarativeTextKitTests/InsertTests.swift /Users/admin/builder/spi-builder-workspace/Tests/DeclarativeTextKitTests/LoggingUndoManager.swift /Users/admin/builder/spi-builder-workspace/Tests/DeclarativeTextKitTests/ModifyingTests.swift /Users/admin/builder/spi-builder-workspace/Tests/DeclarativeTextKitTests/ScopedBufferSliceTests.swift /Users/admin/builder/spi-builder-workspace/Tests/DeclarativeTextKitTests/SelectTests.swift /Users/admin/builder/spi-builder-workspace/Tests/DeclarativeTextKitTests/UndoableBufferTests.swift -primary-file /Users/admin/builder/spi-builder-workspace/Tests/DeclarativeTextKitTests/UseCaseTests.swift -emit-dependencies-path /Users/admin/builder/spi-builder-workspace/.derivedData/Build/Intermediates.noindex/DeclarativeTextKit.build/Debug/DeclarativeTextKitTests.build/Objects-normal/arm64/UseCaseTests.d -emit-const-values-path /Users/admin/builder/spi-builder-workspace/.derivedData/Build/Intermediates.noindex/DeclarativeTextKit.build/Debug/DeclarativeTextKitTests.build/Objects-normal/arm64/UseCaseTests.swiftconstvalues -emit-reference-dependencies-path /Users/admin/builder/spi-builder-workspace/.derivedData/Build/Intermediates.noindex/DeclarativeTextKit.build/Debug/DeclarativeTextKitTests.build/Objects-normal/arm64/UseCaseTests.swiftdeps -serialize-diagnostics-path /Users/admin/builder/spi-builder-workspace/.derivedData/Build/Intermediates.noindex/DeclarativeTextKit.build/Debug/DeclarativeTextKitTests.build/Objects-normal/arm64/UseCaseTests.dia -target arm64-apple-macos13.0 -Xllvm -aarch64-use-tbi -enable-objc-interop -stack-check -sdk /Applications/Xcode-15.2.0.app/Contents/Developer/Platforms/MacOSX.platform/Developer/SDKs/MacOSX14.2.sdk -I /Users/admin/builder/spi-builder-workspace/.derivedData/Build/Products/Debug -I /Applications/Xcode-15.2.0.app/Contents/Developer/Platforms/MacOSX.platform/Developer/usr/lib -F /Users/admin/builder/spi-builder-workspace/.derivedData/Build/Products/Debug/PackageFrameworks -F /Users/admin/builder/spi-builder-workspace/.derivedData/Build/Products/Debug/PackageFrameworks -F /Users/admin/builder/spi-builder-workspace/.derivedData/Build/Products/Debug/PackageFrameworks -F /Users/admin/builder/spi-builder-workspace/.derivedData/Build/Products/Debug -F /Applications/Xcode-15.2.0.app/Contents/Developer/Platforms/MacOSX.platform/Developer/Library/Frameworks -no-color-diagnostics -enable-testing -g -module-cache-path /Users/admin/builder/spi-builder-workspace/.derivedData/ModuleCache.noindex -profile-generate -profile-coverage-mapping -swift-version 5 -enforce-exclusivity\=checked -Onone -D SWIFT_PACKAGE -D DEBUG -D Xcode -serialize-debugging-options -package-name spi_builder_workspace -const-gather-protocols-file /Users/admin/builder/spi-builder-workspace/.derivedData/Build/Intermediates.noindex/DeclarativeTextKit.build/Debug/DeclarativeTextKitTests.build/Objects-normal/arm64/DeclarativeTextKitTests_const_extract_protocols.json -empty-abi-descriptor -validate-clang-modules-once -clang-build-session-file /Users/admin/builder/spi-builder-workspace/.derivedData/ModuleCache.noindex/Session.modulevalidation -Xcc -working-directory -Xcc /Users/admin/builder/spi-builder-workspace -resource-dir /Applications/Xcode-15.2.0.app/Contents/Developer/Toolchains/XcodeDefault.xctoolchain/usr/lib/swift -enable-anonymous-context-mangled-names -Xcc -ivfsstatcache -Xcc /Users/admin/builder/spi-builder-workspace/.derivedData/SDKStatCaches.noindex/macosx14.2-23C53-ddea79c7890ab41bba4a63928c655a96.sdkstatcache -Xcc -I/Users/admin/builder/spi-builder-workspace/.derivedData/Build/Products/Debug/include -Xcc -I/Users/admin/builder/spi-builder-workspace/.derivedData/Build/Intermediates.noindex/DeclarativeTextKit.build/Debug/DeclarativeTextKitTests.build/DerivedSources-normal/arm64 -Xcc -I/Users/admin/builder/spi-builder-workspace/.derivedData/Build/Intermediates.noindex/DeclarativeTextKit.build/Debug/DeclarativeTextKitTests.build/DerivedSources/arm64 -Xcc -I/Users/admin/builder/spi-builder-workspace/.derivedData/Build/Intermediates.noindex/DeclarativeTextKit.build/Debug/DeclarativeTextKitTests.build/DerivedSources -Xcc -DSWIFT_PACKAGE -Xcc -DDEBUG\=1 -module-name DeclarativeTextKitTests -frontend-parseable-output -disable-clang-spi -target-sdk-version 14.2 -target-sdk-name macosx14.2 -external-plugin-path /Applications/Xcode-15.2.0.app/Contents/Developer/Platforms/MacOSX.platform/Developer/SDKs/MacOSX14.2.sdk/usr/lib/swift/host/plugins\#/Applications/Xcode-15.2.0.app/Contents/Developer/Platforms/MacOSX.platform/Developer/SDKs/MacOSX14.2.sdk/usr/bin/swift-plugin-server -external-plugin-path /Applications/Xcode-15.2.0.app/Contents/Developer/Platforms/MacOSX.platform/Developer/SDKs/MacOSX14.2.sdk/usr/local/lib/swift/host/plugins\#/Applications/Xcode-15.2.0.app/Contents/Developer/Platforms/MacOSX.platform/Developer/SDKs/MacOSX14.2.sdk/usr/bin/swift-plugin-server -external-plugin-path /Applications/Xcode-15.2.0.app/Contents/Developer/Platforms/MacOSX.platform/Developer/usr/lib/swift/host/plugins\#/Applications/Xcode-15.2.0.app/Contents/Developer/Platforms/MacOSX.platform/Developer/usr/bin/swift-plugin-server -external-plugin-path /Applications/Xcode-15.2.0.app/Contents/Developer/Platforms/MacOSX.platform/Developer/usr/local/lib/swift/host/plugins\#/Applications/Xcode-15.2.0.app/Contents/Developer/Platforms/MacOSX.platform/Developer/usr/bin/swift-plugin-server -plugin-path /Applications/Xcode-15.2.0.app/Contents/Developer/Toolchains/XcodeDefault.xctoolchain/usr/lib/swift/host/plugins -plugin-path /Applications/Xcode-15.2.0.app/Contents/Developer/Toolchains/XcodeDefault.xctoolchain/usr/local/lib/swift/host/plugins -o /Users/admin/builder/spi-builder-workspace/.derivedData/Build/Intermediates.noindex/DeclarativeTextKit.build/Debug/DeclarativeTextKitTests.build/Objects-normal/arm64/UseCaseTests.o -index-unit-output-path /DeclarativeTextKit.build/Debug/DeclarativeTextKitTests.build/Objects-normal/arm64/UseCaseTests.o -index-store-path /Users/admin/builder/spi-builder-workspace/.derivedData/Index.noindex/DataStore -index-system-modules
SwiftCompile normal arm64 /Users/admin/builder/spi-builder-workspace/Tests/DeclarativeTextKitTests/UseCaseTests.swift (in target 'DeclarativeTextKitTests' from project 'DeclarativeTextKit')
    cd /Users/admin/builder/spi-builder-workspace
    /Applications/Xcode-15.2.0.app/Contents/Developer/Toolchains/XcodeDefault.xctoolchain/usr/bin/swift-frontend -c /Users/admin/builder/spi-builder-workspace/Tests/DeclarativeTextKitTests/AffectedRangeTests.swift /Users/admin/builder/spi-builder-workspace/Tests/DeclarativeTextKitTests/AssertModification.swift /Users/admin/builder/spi-builder-workspace/Tests/DeclarativeTextKitTests/ConditionalTests.swift /Users/admin/builder/spi-builder-workspace/Tests/DeclarativeTextKitTests/DeleteTests.swift /Users/admin/builder/spi-builder-workspace/Tests/DeclarativeTextKitTests/Helpers.swift /Users/admin/builder/spi-builder-workspace/Tests/DeclarativeTextKitTests/InsertTests.swift /Users/admin/builder/spi-builder-workspace/Tests/DeclarativeTextKitTests/LoggingUndoManager.swift /Users/admin/builder/spi-builder-workspace/Tests/DeclarativeTextKitTests/ModifyingTests.swift /Users/admin/builder/spi-builder-workspace/Tests/DeclarativeTextKitTests/ScopedBufferSliceTests.swift /Users/admin/builder/spi-builder-workspace/Tests/DeclarativeTextKitTests/SelectTests.swift /Users/admin/builder/spi-builder-workspace/Tests/DeclarativeTextKitTests/UndoableBufferTests.swift -primary-file /Users/admin/builder/spi-builder-workspace/Tests/DeclarativeTextKitTests/UseCaseTests.swift -emit-dependencies-path /Users/admin/builder/spi-builder-workspace/.derivedData/Build/Intermediates.noindex/DeclarativeTextKit.build/Debug/DeclarativeTextKitTests.build/Objects-normal/arm64/UseCaseTests.d -emit-const-values-path /Users/admin/builder/spi-builder-workspace/.derivedData/Build/Intermediates.noindex/DeclarativeTextKit.build/Debug/DeclarativeTextKitTests.build/Objects-normal/arm64/UseCaseTests.swiftconstvalues -emit-reference-dependencies-path /Users/admin/builder/spi-builder-workspace/.derivedData/Build/Intermediates.noindex/DeclarativeTextKit.build/Debug/DeclarativeTextKitTests.build/Objects-normal/arm64/UseCaseTests.swiftdeps -serialize-diagnostics-path /Users/admin/builder/spi-builder-workspace/.derivedData/Build/Intermediates.noindex/DeclarativeTextKit.build/Debug/DeclarativeTextKitTests.build/Objects-normal/arm64/UseCaseTests.dia -target arm64-apple-macos13.0 -Xllvm -aarch64-use-tbi -enable-objc-interop -stack-check -sdk /Applications/Xcode-15.2.0.app/Contents/Developer/Platforms/MacOSX.platform/Developer/SDKs/MacOSX14.2.sdk -I /Users/admin/builder/spi-builder-workspace/.derivedData/Build/Products/Debug -I /Applications/Xcode-15.2.0.app/Contents/Developer/Platforms/MacOSX.platform/Developer/usr/lib -F /Users/admin/builder/spi-builder-workspace/.derivedData/Build/Products/Debug/PackageFrameworks -F /Users/admin/builder/spi-builder-workspace/.derivedData/Build/Products/Debug/PackageFrameworks -F /Users/admin/builder/spi-builder-workspace/.derivedData/Build/Products/Debug/PackageFrameworks -F /Users/admin/builder/spi-builder-workspace/.derivedData/Build/Products/Debug -F /Applications/Xcode-15.2.0.app/Contents/Developer/Platforms/MacOSX.platform/Developer/Library/Frameworks -no-color-diagnostics -enable-testing -g -module-cache-path /Users/admin/builder/spi-builder-workspace/.derivedData/ModuleCache.noindex -profile-generate -profile-coverage-mapping -swift-version 5 -enforce-exclusivity\=checked -Onone -D SWIFT_PACKAGE -D DEBUG -D Xcode -serialize-debugging-options -package-name spi_builder_workspace -const-gather-protocols-file /Users/admin/builder/spi-builder-workspace/.derivedData/Build/Intermediates.noindex/DeclarativeTextKit.build/Debug/DeclarativeTextKitTests.build/Objects-normal/arm64/DeclarativeTextKitTests_const_extract_protocols.json -empty-abi-descriptor -validate-clang-modules-once -clang-build-session-file /Users/admin/builder/spi-builder-workspace/.derivedData/ModuleCache.noindex/Session.modulevalidation -Xcc -working-directory -Xcc /Users/admin/builder/spi-builder-workspace -resource-dir /Applications/Xcode-15.2.0.app/Contents/Developer/Toolchains/XcodeDefault.xctoolchain/usr/lib/swift -enable-anonymous-context-mangled-names -Xcc -ivfsstatcache -Xcc /Users/admin/builder/spi-builder-workspace/.derivedData/SDKStatCaches.noindex/macosx14.2-23C53-ddea79c7890ab41bba4a63928c655a96.sdkstatcache -Xcc -I/Users/admin/builder/spi-builder-workspace/.derivedData/Build/Products/Debug/include -Xcc -I/Users/admin/builder/spi-builder-workspace/.derivedData/Build/Intermediates.noindex/DeclarativeTextKit.build/Debug/DeclarativeTextKitTests.build/DerivedSources-normal/arm64 -Xcc -I/Users/admin/builder/spi-builder-workspace/.derivedData/Build/Intermediates.noindex/DeclarativeTextKit.build/Debug/DeclarativeTextKitTests.build/DerivedSources/arm64 -Xcc -I/Users/admin/builder/spi-builder-workspace/.derivedData/Build/Intermediates.noindex/DeclarativeTextKit.build/Debug/DeclarativeTextKitTests.build/DerivedSources -Xcc -DSWIFT_PACKAGE -Xcc -DDEBUG\=1 -module-name DeclarativeTextKitTests -frontend-parseable-output -disable-clang-spi -target-sdk-version 14.2 -target-sdk-name macosx14.2 -external-plugin-path /Applications/Xcode-15.2.0.app/Contents/Developer/Platforms/MacOSX.platform/Developer/SDKs/MacOSX14.2.sdk/usr/lib/swift/host/plugins\#/Applications/Xcode-15.2.0.app/Contents/Developer/Platforms/MacOSX.platform/Developer/SDKs/MacOSX14.2.sdk/usr/bin/swift-plugin-server -external-plugin-path /Applications/Xcode-15.2.0.app/Contents/Developer/Platforms/MacOSX.platform/Developer/SDKs/MacOSX14.2.sdk/usr/local/lib/swift/host/plugins\#/Applications/Xcode-15.2.0.app/Contents/Developer/Platforms/MacOSX.platform/Developer/SDKs/MacOSX14.2.sdk/usr/bin/swift-plugin-server -external-plugin-path /Applications/Xcode-15.2.0.app/Contents/Developer/Platforms/MacOSX.platform/Developer/usr/lib/swift/host/plugins\#/Applications/Xcode-15.2.0.app/Contents/Developer/Platforms/MacOSX.platform/Developer/usr/bin/swift-plugin-server -external-plugin-path /Applications/Xcode-15.2.0.app/Contents/Developer/Platforms/MacOSX.platform/Developer/usr/local/lib/swift/host/plugins\#/Applications/Xcode-15.2.0.app/Contents/Developer/Platforms/MacOSX.platform/Developer/usr/bin/swift-plugin-server -plugin-path /Applications/Xcode-15.2.0.app/Contents/Developer/Toolchains/XcodeDefault.xctoolchain/usr/lib/swift/host/plugins -plugin-path /Applications/Xcode-15.2.0.app/Contents/Developer/Toolchains/XcodeDefault.xctoolchain/usr/local/lib/swift/host/plugins -o /Users/admin/builder/spi-builder-workspace/.derivedData/Build/Intermediates.noindex/DeclarativeTextKit.build/Debug/DeclarativeTextKitTests.build/Objects-normal/arm64/UseCaseTests.o -index-unit-output-path /DeclarativeTextKit.build/Debug/DeclarativeTextKitTests.build/Objects-normal/arm64/UseCaseTests.o -index-store-path /Users/admin/builder/spi-builder-workspace/.derivedData/Index.noindex/DataStore -index-system-modules
/Users/admin/builder/spi-builder-workspace/Tests/DeclarativeTextKitTests/UseCaseTests.swift:76:48: error: value of type 'UndoManager' has no member 'undoCount'
            XCTAssertEqual(buffer.undoManager?.undoCount, 0)
                           ~~~~~~~~~~~~~~~~~~~ ^~~~~~~~~
/Users/admin/builder/spi-builder-workspace/Tests/DeclarativeTextKitTests/UseCaseTests.swift:97:48: error: value of type 'UndoManager' has no member 'undoCount'
            XCTAssertEqual(buffer.undoManager?.undoCount, 1)
                           ~~~~~~~~~~~~~~~~~~~ ^~~~~~~~~
/Users/admin/builder/spi-builder-workspace/Tests/DeclarativeTextKitTests/UseCaseTests.swift:116:48: error: value of type 'UndoManager' has no member 'undoCount'
            XCTAssertEqual(buffer.undoManager?.undoCount, 2)
                           ~~~~~~~~~~~~~~~~~~~ ^~~~~~~~~
SwiftCompile normal arm64 Compiling\ DeleteTests.swift /Users/admin/builder/spi-builder-workspace/Tests/DeclarativeTextKitTests/DeleteTests.swift (in target 'DeclarativeTextKitTests' from project 'DeclarativeTextKit')
    cd /Users/admin/builder/spi-builder-workspace
    builtin-swiftTaskExecution -- /Applications/Xcode-15.2.0.app/Contents/Developer/Toolchains/XcodeDefault.xctoolchain/usr/bin/swift-frontend -frontend -c /Users/admin/builder/spi-builder-workspace/Tests/DeclarativeTextKitTests/AffectedRangeTests.swift /Users/admin/builder/spi-builder-workspace/Tests/DeclarativeTextKitTests/AssertModification.swift /Users/admin/builder/spi-builder-workspace/Tests/DeclarativeTextKitTests/ConditionalTests.swift -primary-file /Users/admin/builder/spi-builder-workspace/Tests/DeclarativeTextKitTests/DeleteTests.swift /Users/admin/builder/spi-builder-workspace/Tests/DeclarativeTextKitTests/Helpers.swift /Users/admin/builder/spi-builder-workspace/Tests/DeclarativeTextKitTests/InsertTests.swift /Users/admin/builder/spi-builder-workspace/Tests/DeclarativeTextKitTests/LoggingUndoManager.swift /Users/admin/builder/spi-builder-workspace/Tests/DeclarativeTextKitTests/ModifyingTests.swift /Users/admin/builder/spi-builder-workspace/Tests/DeclarativeTextKitTests/ScopedBufferSliceTests.swift /Users/admin/builder/spi-builder-workspace/Tests/DeclarativeTextKitTests/SelectTests.swift /Users/admin/builder/spi-builder-workspace/Tests/DeclarativeTextKitTests/UndoableBufferTests.swift /Users/admin/builder/spi-builder-workspace/Tests/DeclarativeTextKitTests/UseCaseTests.swift -emit-dependencies-path /Users/admin/builder/spi-builder-workspace/.derivedData/Build/Intermediates.noindex/DeclarativeTextKit.build/Debug/DeclarativeTextKitTests.build/Objects-normal/arm64/DeleteTests.d -emit-const-values-path /Users/admin/builder/spi-builder-workspace/.derivedData/Build/Intermediates.noindex/DeclarativeTextKit.build/Debug/DeclarativeTextKitTests.build/Objects-normal/arm64/DeleteTests.swiftconstvalues -emit-reference-dependencies-path /Users/admin/builder/spi-builder-workspace/.derivedData/Build/Intermediates.noindex/DeclarativeTextKit.build/Debug/DeclarativeTextKitTests.build/Objects-normal/arm64/DeleteTests.swiftdeps -serialize-diagnostics-path /Users/admin/builder/spi-builder-workspace/.derivedData/Build/Intermediates.noindex/DeclarativeTextKit.build/Debug/DeclarativeTextKitTests.build/Objects-normal/arm64/DeleteTests.dia -target arm64-apple-macos13.0 -Xllvm -aarch64-use-tbi -enable-objc-interop -stack-check -sdk /Applications/Xcode-15.2.0.app/Contents/Developer/Platforms/MacOSX.platform/Developer/SDKs/MacOSX14.2.sdk -I /Users/admin/builder/spi-builder-workspace/.derivedData/Build/Products/Debug -I /Applications/Xcode-15.2.0.app/Contents/Developer/Platforms/MacOSX.platform/Developer/usr/lib -F /Users/admin/builder/spi-builder-workspace/.derivedData/Build/Products/Debug/PackageFrameworks -F /Users/admin/builder/spi-builder-workspace/.derivedData/Build/Products/Debug/PackageFrameworks -F /Users/admin/builder/spi-builder-workspace/.derivedData/Build/Products/Debug/PackageFrameworks -F /Users/admin/builder/spi-builder-workspace/.derivedData/Build/Products/Debug -F /Applications/Xcode-15.2.0.app/Contents/Developer/Platforms/MacOSX.platform/Developer/Library/Frameworks -no-color-diagnostics -enable-testing -g -module-cache-path /Users/admin/builder/spi-builder-workspace/.derivedData/ModuleCache.noindex -profile-generate -profile-coverage-mapping -swift-version 5 -enforce-exclusivity\=checked -Onone -D SWIFT_PACKAGE -D DEBUG -D Xcode -serialize-debugging-options -package-name spi_builder_workspace -const-gather-protocols-file /Users/admin/builder/spi-builder-workspace/.derivedData/Build/Intermediates.noindex/DeclarativeTextKit.build/Debug/DeclarativeTextKitTests.build/Objects-normal/arm64/DeclarativeTextKitTests_const_extract_protocols.json -empty-abi-descriptor -validate-clang-modules-once -clang-build-session-file /Users/admin/builder/spi-builder-workspace/.derivedData/ModuleCache.noindex/Session.modulevalidation -Xcc -working-directory -Xcc /Users/admin/builder/spi-builder-workspace -resource-dir /Applications/Xcode-15.2.0.app/Contents/Developer/Toolchains/XcodeDefault.xctoolchain/usr/lib/swift -enable-anonymous-context-mangled-names -Xcc -ivfsstatcache -Xcc /Users/admin/builder/spi-builder-workspace/.derivedData/SDKStatCaches.noindex/macosx14.2-23C53-ddea79c7890ab41bba4a63928c655a96.sdkstatcache -Xcc -I/Users/admin/builder/spi-builder-workspace/.derivedData/Build/Products/Debug/include -Xcc -I/Users/admin/builder/spi-builder-workspace/.derivedData/Build/Intermediates.noindex/DeclarativeTextKit.build/Debug/DeclarativeTextKitTests.build/DerivedSources-normal/arm64 -Xcc -I/Users/admin/builder/spi-builder-workspace/.derivedData/Build/Intermediates.noindex/DeclarativeTextKit.build/Debug/DeclarativeTextKitTests.build/DerivedSources/arm64 -Xcc -I/Users/admin/builder/spi-builder-workspace/.derivedData/Build/Intermediates.noindex/DeclarativeTextKit.build/Debug/DeclarativeTextKitTests.build/DerivedSources -Xcc -DSWIFT_PACKAGE -Xcc -DDEBUG\=1 -module-name DeclarativeTextKitTests -frontend-parseable-output -disable-clang-spi -target-sdk-version 14.2 -target-sdk-name macosx14.2 -external-plugin-path /Applications/Xcode-15.2.0.app/Contents/Developer/Platforms/MacOSX.platform/Developer/SDKs/MacOSX14.2.sdk/usr/lib/swift/host/plugins\#/Applications/Xcode-15.2.0.app/Contents/Developer/Platforms/MacOSX.platform/Developer/SDKs/MacOSX14.2.sdk/usr/bin/swift-plugin-server -external-plugin-path /Applications/Xcode-15.2.0.app/Contents/Developer/Platforms/MacOSX.platform/Developer/SDKs/MacOSX14.2.sdk/usr/local/lib/swift/host/plugins\#/Applications/Xcode-15.2.0.app/Contents/Developer/Platforms/MacOSX.platform/Developer/SDKs/MacOSX14.2.sdk/usr/bin/swift-plugin-server -external-plugin-path /Applications/Xcode-15.2.0.app/Contents/Developer/Platforms/MacOSX.platform/Developer/usr/lib/swift/host/plugins\#/Applications/Xcode-15.2.0.app/Contents/Developer/Platforms/MacOSX.platform/Developer/usr/bin/swift-plugin-server -external-plugin-path /Applications/Xcode-15.2.0.app/Contents/Developer/Platforms/MacOSX.platform/Developer/usr/local/lib/swift/host/plugins\#/Applications/Xcode-15.2.0.app/Contents/Developer/Platforms/MacOSX.platform/Developer/usr/bin/swift-plugin-server -plugin-path /Applications/Xcode-15.2.0.app/Contents/Developer/Toolchains/XcodeDefault.xctoolchain/usr/lib/swift/host/plugins -plugin-path /Applications/Xcode-15.2.0.app/Contents/Developer/Toolchains/XcodeDefault.xctoolchain/usr/local/lib/swift/host/plugins -o /Users/admin/builder/spi-builder-workspace/.derivedData/Build/Intermediates.noindex/DeclarativeTextKit.build/Debug/DeclarativeTextKitTests.build/Objects-normal/arm64/DeleteTests.o -index-unit-output-path /DeclarativeTextKit.build/Debug/DeclarativeTextKitTests.build/Objects-normal/arm64/DeleteTests.o -index-store-path /Users/admin/builder/spi-builder-workspace/.derivedData/Index.noindex/DataStore -index-system-modules
SwiftCompile normal arm64 /Users/admin/builder/spi-builder-workspace/Tests/DeclarativeTextKitTests/DeleteTests.swift (in target 'DeclarativeTextKitTests' from project 'DeclarativeTextKit')
    cd /Users/admin/builder/spi-builder-workspace
    /Applications/Xcode-15.2.0.app/Contents/Developer/Toolchains/XcodeDefault.xctoolchain/usr/bin/swift-frontend -c /Users/admin/builder/spi-builder-workspace/Tests/DeclarativeTextKitTests/AffectedRangeTests.swift /Users/admin/builder/spi-builder-workspace/Tests/DeclarativeTextKitTests/AssertModification.swift /Users/admin/builder/spi-builder-workspace/Tests/DeclarativeTextKitTests/ConditionalTests.swift -primary-file /Users/admin/builder/spi-builder-workspace/Tests/DeclarativeTextKitTests/DeleteTests.swift /Users/admin/builder/spi-builder-workspace/Tests/DeclarativeTextKitTests/Helpers.swift /Users/admin/builder/spi-builder-workspace/Tests/DeclarativeTextKitTests/InsertTests.swift /Users/admin/builder/spi-builder-workspace/Tests/DeclarativeTextKitTests/LoggingUndoManager.swift /Users/admin/builder/spi-builder-workspace/Tests/DeclarativeTextKitTests/ModifyingTests.swift /Users/admin/builder/spi-builder-workspace/Tests/DeclarativeTextKitTests/ScopedBufferSliceTests.swift /Users/admin/builder/spi-builder-workspace/Tests/DeclarativeTextKitTests/SelectTests.swift /Users/admin/builder/spi-builder-workspace/Tests/DeclarativeTextKitTests/UndoableBufferTests.swift /Users/admin/builder/spi-builder-workspace/Tests/DeclarativeTextKitTests/UseCaseTests.swift -emit-dependencies-path /Users/admin/builder/spi-builder-workspace/.derivedData/Build/Intermediates.noindex/DeclarativeTextKit.build/Debug/DeclarativeTextKitTests.build/Objects-normal/arm64/DeleteTests.d -emit-const-values-path /Users/admin/builder/spi-builder-workspace/.derivedData/Build/Intermediates.noindex/DeclarativeTextKit.build/Debug/DeclarativeTextKitTests.build/Objects-normal/arm64/DeleteTests.swiftconstvalues -emit-reference-dependencies-path /Users/admin/builder/spi-builder-workspace/.derivedData/Build/Intermediates.noindex/DeclarativeTextKit.build/Debug/DeclarativeTextKitTests.build/Objects-normal/arm64/DeleteTests.swiftdeps -serialize-diagnostics-path /Users/admin/builder/spi-builder-workspace/.derivedData/Build/Intermediates.noindex/DeclarativeTextKit.build/Debug/DeclarativeTextKitTests.build/Objects-normal/arm64/DeleteTests.dia -target arm64-apple-macos13.0 -Xllvm -aarch64-use-tbi -enable-objc-interop -stack-check -sdk /Applications/Xcode-15.2.0.app/Contents/Developer/Platforms/MacOSX.platform/Developer/SDKs/MacOSX14.2.sdk -I /Users/admin/builder/spi-builder-workspace/.derivedData/Build/Products/Debug -I /Applications/Xcode-15.2.0.app/Contents/Developer/Platforms/MacOSX.platform/Developer/usr/lib -F /Users/admin/builder/spi-builder-workspace/.derivedData/Build/Products/Debug/PackageFrameworks -F /Users/admin/builder/spi-builder-workspace/.derivedData/Build/Products/Debug/PackageFrameworks -F /Users/admin/builder/spi-builder-workspace/.derivedData/Build/Products/Debug/PackageFrameworks -F /Users/admin/builder/spi-builder-workspace/.derivedData/Build/Products/Debug -F /Applications/Xcode-15.2.0.app/Contents/Developer/Platforms/MacOSX.platform/Developer/Library/Frameworks -no-color-diagnostics -enable-testing -g -module-cache-path /Users/admin/builder/spi-builder-workspace/.derivedData/ModuleCache.noindex -profile-generate -profile-coverage-mapping -swift-version 5 -enforce-exclusivity\=checked -Onone -D SWIFT_PACKAGE -D DEBUG -D Xcode -serialize-debugging-options -package-name spi_builder_workspace -const-gather-protocols-file /Users/admin/builder/spi-builder-workspace/.derivedData/Build/Intermediates.noindex/DeclarativeTextKit.build/Debug/DeclarativeTextKitTests.build/Objects-normal/arm64/DeclarativeTextKitTests_const_extract_protocols.json -empty-abi-descriptor -validate-clang-modules-once -clang-build-session-file /Users/admin/builder/spi-builder-workspace/.derivedData/ModuleCache.noindex/Session.modulevalidation -Xcc -working-directory -Xcc /Users/admin/builder/spi-builder-workspace -resource-dir /Applications/Xcode-15.2.0.app/Contents/Developer/Toolchains/XcodeDefault.xctoolchain/usr/lib/swift -enable-anonymous-context-mangled-names -Xcc -ivfsstatcache -Xcc /Users/admin/builder/spi-builder-workspace/.derivedData/SDKStatCaches.noindex/macosx14.2-23C53-ddea79c7890ab41bba4a63928c655a96.sdkstatcache -Xcc -I/Users/admin/builder/spi-builder-workspace/.derivedData/Build/Products/Debug/include -Xcc -I/Users/admin/builder/spi-builder-workspace/.derivedData/Build/Intermediates.noindex/DeclarativeTextKit.build/Debug/DeclarativeTextKitTests.build/DerivedSources-normal/arm64 -Xcc -I/Users/admin/builder/spi-builder-workspace/.derivedData/Build/Intermediates.noindex/DeclarativeTextKit.build/Debug/DeclarativeTextKitTests.build/DerivedSources/arm64 -Xcc -I/Users/admin/builder/spi-builder-workspace/.derivedData/Build/Intermediates.noindex/DeclarativeTextKit.build/Debug/DeclarativeTextKitTests.build/DerivedSources -Xcc -DSWIFT_PACKAGE -Xcc -DDEBUG\=1 -module-name DeclarativeTextKitTests -frontend-parseable-output -disable-clang-spi -target-sdk-version 14.2 -target-sdk-name macosx14.2 -external-plugin-path /Applications/Xcode-15.2.0.app/Contents/Developer/Platforms/MacOSX.platform/Developer/SDKs/MacOSX14.2.sdk/usr/lib/swift/host/plugins\#/Applications/Xcode-15.2.0.app/Contents/Developer/Platforms/MacOSX.platform/Developer/SDKs/MacOSX14.2.sdk/usr/bin/swift-plugin-server -external-plugin-path /Applications/Xcode-15.2.0.app/Contents/Developer/Platforms/MacOSX.platform/Developer/SDKs/MacOSX14.2.sdk/usr/local/lib/swift/host/plugins\#/Applications/Xcode-15.2.0.app/Contents/Developer/Platforms/MacOSX.platform/Developer/SDKs/MacOSX14.2.sdk/usr/bin/swift-plugin-server -external-plugin-path /Applications/Xcode-15.2.0.app/Contents/Developer/Platforms/MacOSX.platform/Developer/usr/lib/swift/host/plugins\#/Applications/Xcode-15.2.0.app/Contents/Developer/Platforms/MacOSX.platform/Developer/usr/bin/swift-plugin-server -external-plugin-path /Applications/Xcode-15.2.0.app/Contents/Developer/Platforms/MacOSX.platform/Developer/usr/local/lib/swift/host/plugins\#/Applications/Xcode-15.2.0.app/Contents/Developer/Platforms/MacOSX.platform/Developer/usr/bin/swift-plugin-server -plugin-path /Applications/Xcode-15.2.0.app/Contents/Developer/Toolchains/XcodeDefault.xctoolchain/usr/lib/swift/host/plugins -plugin-path /Applications/Xcode-15.2.0.app/Contents/Developer/Toolchains/XcodeDefault.xctoolchain/usr/local/lib/swift/host/plugins -o /Users/admin/builder/spi-builder-workspace/.derivedData/Build/Intermediates.noindex/DeclarativeTextKit.build/Debug/DeclarativeTextKitTests.build/Objects-normal/arm64/DeleteTests.o -index-unit-output-path /DeclarativeTextKit.build/Debug/DeclarativeTextKitTests.build/Objects-normal/arm64/DeleteTests.o -index-store-path /Users/admin/builder/spi-builder-workspace/.derivedData/Index.noindex/DataStore -index-system-modules
--- xcodebuild: WARNING: Using the first of multiple matching destinations:
{ platform:macOS, arch:arm64, id:0000FE00-8C151E3703BE51BE }
{ platform:macOS, arch:arm64, variant:Mac Catalyst, id:0000FE00-8C151E3703BE51BE }
{ platform:macOS, arch:arm64, variant:DriverKit, id:0000FE00-8C151E3703BE51BE }
{ platform:macOS, arch:arm64, variant:Designed for [iPad,iPhone], id:0000FE00-8C151E3703BE51BE }
** BUILD FAILED **
The following build commands failed:
	SwiftCompile normal arm64 Compiling\ UseCaseTests.swift /Users/admin/builder/spi-builder-workspace/Tests/DeclarativeTextKitTests/UseCaseTests.swift (in target 'DeclarativeTextKitTests' from project 'DeclarativeTextKit')
	SwiftCompile normal arm64 /Users/admin/builder/spi-builder-workspace/Tests/DeclarativeTextKitTests/UseCaseTests.swift (in target 'DeclarativeTextKitTests' from project 'DeclarativeTextKit')
(2 failures)
BUILD FAILURE 5.9 macosXcodebuild